You are viewing a plain text version of this content. The canonical link for it is here.
Posted to dev@lucene.apache.org by Policeman Jenkins Server <je...@thetaphi.de> on 2014/06/24 00:39:02 UTC

[JENKINS] Lucene-Solr-4.x-Windows (64bit/jdk1.7.0_60) - Build # 4047 - Failure!

Build: http://jenkins.thetaphi.de/job/Lucene-Solr-4.x-Windows/4047/
Java: 64bit/jdk1.7.0_60 -XX:-UseCompressedOops -XX:+UseG1GC

1 tests failed.
REGRESSION:  org.apache.lucene.index.TestConcurrentMergeScheduler.testTotalBytesSize

Error Message:


Stack Trace:
java.lang.AssertionError
	at __randomizedtesting.SeedInfo.seed([E514CC01D224ED97:F0F79C983D8CCA4E]:0)
	at org.junit.Assert.fail(Assert.java:92)
	at org.junit.Assert.assertTrue(Assert.java:43)
	at org.junit.Assert.assertTrue(Assert.java:54)
	at org.apache.lucene.index.TestConcurrentMergeScheduler.testTotalBytesSize(TestConcurrentMergeScheduler.java:366)
	at sun.reflect.NativeMethodAccessorImpl.invoke0(Native Method)
	at sun.reflect.NativeMethodAccessorImpl.invoke(NativeMethodAccessorImpl.java:57)
	at sun.reflect.DelegatingMethodAccessorImpl.invoke(DelegatingMethodAccessorImpl.java:43)
	at java.lang.reflect.Method.invoke(Method.java:606)
	at com.carrotsearch.randomizedtesting.RandomizedRunner.invoke(RandomizedRunner.java:1618)
	at com.carrotsearch.randomizedtesting.RandomizedRunner$6.evaluate(RandomizedRunner.java:827)
	at com.carrotsearch.randomizedtesting.RandomizedRunner$7.evaluate(RandomizedRunner.java:863)
	at com.carrotsearch.randomizedtesting.RandomizedRunner$8.evaluate(RandomizedRunner.java:877)
	at org.apache.lucene.util.TestRuleSetupTeardownChained$1.evaluate(TestRuleSetupTeardownChained.java:50)
	at org.apache.lucene.util.TestRuleFieldCacheSanity$1.evaluate(TestRuleFieldCacheSanity.java:51)
	at org.apache.lucene.util.AbstractBeforeAfterRule$1.evaluate(AbstractBeforeAfterRule.java:46)
	at com.carrotsearch.randomizedtesting.rules.SystemPropertiesInvariantRule$1.evaluate(SystemPropertiesInvariantRule.java:55)
	at org.apache.lucene.util.TestRuleThreadAndTestName$1.evaluate(TestRuleThreadAndTestName.java:49)
	at org.apache.lucene.util.TestRuleIgnoreAfterMaxFailures$1.evaluate(TestRuleIgnoreAfterMaxFailures.java:65)
	at org.apache.lucene.util.TestRuleMarkFailure$1.evaluate(TestRuleMarkFailure.java:48)
	at com.carrotsearch.randomizedtesting.rules.StatementAdapter.evaluate(StatementAdapter.java:36)
	at com.carrotsearch.randomizedtesting.ThreadLeakControl$StatementRunner.run(ThreadLeakControl.java:360)
	at com.carrotsearch.randomizedtesting.ThreadLeakControl.forkTimeoutingTask(ThreadLeakControl.java:793)
	at com.carrotsearch.randomizedtesting.ThreadLeakControl$3.evaluate(ThreadLeakControl.java:453)
	at com.carrotsearch.randomizedtesting.RandomizedRunner.runSingleTest(RandomizedRunner.java:836)
	at com.carrotsearch.randomizedtesting.RandomizedRunner$3.evaluate(RandomizedRunner.java:738)
	at com.carrotsearch.randomizedtesting.RandomizedRunner$4.evaluate(RandomizedRunner.java:772)
	at com.carrotsearch.randomizedtesting.RandomizedRunner$5.evaluate(RandomizedRunner.java:783)
	at org.apache.lucene.util.AbstractBeforeAfterRule$1.evaluate(AbstractBeforeAfterRule.java:46)
	at org.apache.lucene.util.TestRuleStoreClassName$1.evaluate(TestRuleStoreClassName.java:42)
	at com.carrotsearch.randomizedtesting.rules.SystemPropertiesInvariantRule$1.evaluate(SystemPropertiesInvariantRule.java:55)
	at com.carrotsearch.randomizedtesting.rules.NoShadowingOrOverridesOnMethodsRule$1.evaluate(NoShadowingOrOverridesOnMethodsRule.java:39)
	at com.carrotsearch.randomizedtesting.rules.NoShadowingOrOverridesOnMethodsRule$1.evaluate(NoShadowingOrOverridesOnMethodsRule.java:39)
	at com.carrotsearch.randomizedtesting.rules.StatementAdapter.evaluate(StatementAdapter.java:36)
	at com.carrotsearch.randomizedtesting.rules.StatementAdapter.evaluate(StatementAdapter.java:36)
	at com.carrotsearch.randomizedtesting.rules.StatementAdapter.evaluate(StatementAdapter.java:36)
	at org.apache.lucene.util.TestRuleAssertionsRequired$1.evaluate(TestRuleAssertionsRequired.java:43)
	at org.apache.lucene.util.TestRuleMarkFailure$1.evaluate(TestRuleMarkFailure.java:48)
	at org.apache.lucene.util.TestRuleIgnoreAfterMaxFailures$1.evaluate(TestRuleIgnoreAfterMaxFailures.java:65)
	at org.apache.lucene.util.TestRuleIgnoreTestSuites$1.evaluate(TestRuleIgnoreTestSuites.java:55)
	at com.carrotsearch.randomizedtesting.rules.StatementAdapter.evaluate(StatementAdapter.java:36)
	at com.carrotsearch.randomizedtesting.ThreadLeakControl$StatementRunner.run(ThreadLeakControl.java:360)
	at java.lang.Thread.run(Thread.java:745)




Build Log:
[...truncated 555 lines...]
   [junit4] Suite: org.apache.lucene.index.TestConcurrentMergeScheduler
   [junit4]   2> NOTE: reproduce with: ant test  -Dtestcase=TestConcurrentMergeScheduler -Dtests.method=testTotalBytesSize -Dtests.seed=E514CC01D224ED97 -Dtests.slow=true -Dtests.locale=th_TH -Dtests.timezone=America/Argentina/La_Rioja -Dtests.file.encoding=US-ASCII
   [junit4] FAILURE 0.37s | TestConcurrentMergeScheduler.testTotalBytesSize <<<
   [junit4]    > Throwable #1: java.lang.AssertionError
   [junit4]    > 	at __randomizedtesting.SeedInfo.seed([E514CC01D224ED97:F0F79C983D8CCA4E]:0)
   [junit4]    > 	at org.apache.lucene.index.TestConcurrentMergeScheduler.testTotalBytesSize(TestConcurrentMergeScheduler.java:366)
   [junit4]    > 	at java.lang.Thread.run(Thread.java:745)
   [junit4]   2> Jun 23, 2014 10:24:02 PM com.carrotsearch.randomizedtesting.ThreadLeakControl checkThreadLeaks
   [junit4]   2> WARNING: Will linger awaiting termination of 4 leaked thread(s).
   [junit4]   2> NOTE: test params are: codec=Lucene49: {field=PostingsFormat(name=SimpleText), content=PostingsFormat(name=FSTPulsing41), id=PostingsFormat(name=MockSep)}, docValues:{}, sim=RandomSimilarityProvider(queryNorm=true,coord=yes): {content=DFR GL3(800.0)}, locale=th_TH, timezone=America/Argentina/La_Rioja
   [junit4]   2> NOTE: Windows 7 6.1 amd64/Oracle Corporation 1.7.0_60 (64-bit)/cpus=2,threads=1,free=146852696,total=470810624
   [junit4]   2> NOTE: All tests run in this JVM: [TestTwoPhaseCommitTool, TestSimpleExplanationsOfNonMatches, TestSameScoresWithThreads, TestTermRangeQuery, TestSpansAdvanced, TestSumDocFreq, TestGraphTokenizers, TestRAMDirectory, TestCodecHoldsOpenFiles, TestFieldCacheRewriteMethod, TestUniqueTermCount, TestBitVector, TestDeterminism, TestWAH8DocIdSet, TestBinaryTerms, TestIndexWriter, TestSortDocValues, TestAutomatonQueryUnicode, TestCompiledAutomaton, TestElevationComparator, TestNoMergeScheduler, TestConcurrentMergeScheduler]
   [junit4] Completed in 7.46s, 7 tests, 1 failure <<< FAILURES!

[...truncated 1419 lines...]
BUILD FAILED
C:\Users\JenkinsSlave\workspace\Lucene-Solr-4.x-Windows\build.xml:467: The following error occurred while executing this line:
C:\Users\JenkinsSlave\workspace\Lucene-Solr-4.x-Windows\build.xml:447: The following error occurred while executing this line:
C:\Users\JenkinsSlave\workspace\Lucene-Solr-4.x-Windows\build.xml:45: The following error occurred while executing this line:
C:\Users\JenkinsSlave\workspace\Lucene-Solr-4.x-Windows\extra-targets.xml:37: The following error occurred while executing this line:
C:\Users\JenkinsSlave\workspace\Lucene-Solr-4.x-Windows\lucene\build.xml:49: The following error occurred while executing this line:
C:\Users\JenkinsSlave\workspace\Lucene-Solr-4.x-Windows\lucene\common-build.xml:1297: The following error occurred while executing this line:
C:\Users\JenkinsSlave\workspace\Lucene-Solr-4.x-Windows\lucene\common-build.xml:921: There were test failures: 413 suites, 3505 tests, 1 failure, 136 ignored (125 assumptions)

Total time: 16 minutes 23 seconds
Build step 'Invoke Ant' marked build as failure
Description set: Java: 64bit/jdk1.7.0_60 -XX:-UseCompressedOops -XX:+UseG1GC
Archiving artifacts
Recording test results
Email was triggered for: Failure - Any
Sending email for trigger: Failure - Any



Re: [JENKINS] Lucene-Solr-4.x-Windows (64bit/jdk1.7.0_60) - Build # 4047 - Failure!

Posted by Michael McCandless <lu...@mikemccandless.com>.
I committed a fix.

Mike McCandless

http://blog.mikemccandless.com


On Mon, Jun 23, 2014 at 11:39 PM, Policeman Jenkins Server
<je...@thetaphi.de> wrote:
> Build: http://jenkins.thetaphi.de/job/Lucene-Solr-4.x-Windows/4047/
> Java: 64bit/jdk1.7.0_60 -XX:-UseCompressedOops -XX:+UseG1GC
>
> 1 tests failed.
> REGRESSION:  org.apache.lucene.index.TestConcurrentMergeScheduler.testTotalBytesSize
>
> Error Message:
>
>
> Stack Trace:
> java.lang.AssertionError
>         at __randomizedtesting.SeedInfo.seed([E514CC01D224ED97:F0F79C983D8CCA4E]:0)
>         at org.junit.Assert.fail(Assert.java:92)
>         at org.junit.Assert.assertTrue(Assert.java:43)
>         at org.junit.Assert.assertTrue(Assert.java:54)
>         at org.apache.lucene.index.TestConcurrentMergeScheduler.testTotalBytesSize(TestConcurrentMergeScheduler.java:366)
>         at sun.reflect.NativeMethodAccessorImpl.invoke0(Native Method)
>         at sun.reflect.NativeMethodAccessorImpl.invoke(NativeMethodAccessorImpl.java:57)
>         at sun.reflect.DelegatingMethodAccessorImpl.invoke(DelegatingMethodAccessorImpl.java:43)
>         at java.lang.reflect.Method.invoke(Method.java:606)
>         at com.carrotsearch.randomizedtesting.RandomizedRunner.invoke(RandomizedRunner.java:1618)
>         at com.carrotsearch.randomizedtesting.RandomizedRunner$6.evaluate(RandomizedRunner.java:827)
>         at com.carrotsearch.randomizedtesting.RandomizedRunner$7.evaluate(RandomizedRunner.java:863)
>         at com.carrotsearch.randomizedtesting.RandomizedRunner$8.evaluate(RandomizedRunner.java:877)
>         at org.apache.lucene.util.TestRuleSetupTeardownChained$1.evaluate(TestRuleSetupTeardownChained.java:50)
>         at org.apache.lucene.util.TestRuleFieldCacheSanity$1.evaluate(TestRuleFieldCacheSanity.java:51)
>         at org.apache.lucene.util.AbstractBeforeAfterRule$1.evaluate(AbstractBeforeAfterRule.java:46)
>         at com.carrotsearch.randomizedtesting.rules.SystemPropertiesInvariantRule$1.evaluate(SystemPropertiesInvariantRule.java:55)
>         at org.apache.lucene.util.TestRuleThreadAndTestName$1.evaluate(TestRuleThreadAndTestName.java:49)
>         at org.apache.lucene.util.TestRuleIgnoreAfterMaxFailures$1.evaluate(TestRuleIgnoreAfterMaxFailures.java:65)
>         at org.apache.lucene.util.TestRuleMarkFailure$1.evaluate(TestRuleMarkFailure.java:48)
>         at com.carrotsearch.randomizedtesting.rules.StatementAdapter.evaluate(StatementAdapter.java:36)
>         at com.carrotsearch.randomizedtesting.ThreadLeakControl$StatementRunner.run(ThreadLeakControl.java:360)
>         at com.carrotsearch.randomizedtesting.ThreadLeakControl.forkTimeoutingTask(ThreadLeakControl.java:793)
>         at com.carrotsearch.randomizedtesting.ThreadLeakControl$3.evaluate(ThreadLeakControl.java:453)
>         at com.carrotsearch.randomizedtesting.RandomizedRunner.runSingleTest(RandomizedRunner.java:836)
>         at com.carrotsearch.randomizedtesting.RandomizedRunner$3.evaluate(RandomizedRunner.java:738)
>         at com.carrotsearch.randomizedtesting.RandomizedRunner$4.evaluate(RandomizedRunner.java:772)
>         at com.carrotsearch.randomizedtesting.RandomizedRunner$5.evaluate(RandomizedRunner.java:783)
>         at org.apache.lucene.util.AbstractBeforeAfterRule$1.evaluate(AbstractBeforeAfterRule.java:46)
>         at org.apache.lucene.util.TestRuleStoreClassName$1.evaluate(TestRuleStoreClassName.java:42)
>         at com.carrotsearch.randomizedtesting.rules.SystemPropertiesInvariantRule$1.evaluate(SystemPropertiesInvariantRule.java:55)
>         at com.carrotsearch.randomizedtesting.rules.NoShadowingOrOverridesOnMethodsRule$1.evaluate(NoShadowingOrOverridesOnMethodsRule.java:39)
>         at com.carrotsearch.randomizedtesting.rules.NoShadowingOrOverridesOnMethodsRule$1.evaluate(NoShadowingOrOverridesOnMethodsRule.java:39)
>         at com.carrotsearch.randomizedtesting.rules.StatementAdapter.evaluate(StatementAdapter.java:36)
>         at com.carrotsearch.randomizedtesting.rules.StatementAdapter.evaluate(StatementAdapter.java:36)
>         at com.carrotsearch.randomizedtesting.rules.StatementAdapter.evaluate(StatementAdapter.java:36)
>         at org.apache.lucene.util.TestRuleAssertionsRequired$1.evaluate(TestRuleAssertionsRequired.java:43)
>         at org.apache.lucene.util.TestRuleMarkFailure$1.evaluate(TestRuleMarkFailure.java:48)
>         at org.apache.lucene.util.TestRuleIgnoreAfterMaxFailures$1.evaluate(TestRuleIgnoreAfterMaxFailures.java:65)
>         at org.apache.lucene.util.TestRuleIgnoreTestSuites$1.evaluate(TestRuleIgnoreTestSuites.java:55)
>         at com.carrotsearch.randomizedtesting.rules.StatementAdapter.evaluate(StatementAdapter.java:36)
>         at com.carrotsearch.randomizedtesting.ThreadLeakControl$StatementRunner.run(ThreadLeakControl.java:360)
>         at java.lang.Thread.run(Thread.java:745)
>
>
>
>
> Build Log:
> [...truncated 555 lines...]
>    [junit4] Suite: org.apache.lucene.index.TestConcurrentMergeScheduler
>    [junit4]   2> NOTE: reproduce with: ant test  -Dtestcase=TestConcurrentMergeScheduler -Dtests.method=testTotalBytesSize -Dtests.seed=E514CC01D224ED97 -Dtests.slow=true -Dtests.locale=th_TH -Dtests.timezone=America/Argentina/La_Rioja -Dtests.file.encoding=US-ASCII
>    [junit4] FAILURE 0.37s | TestConcurrentMergeScheduler.testTotalBytesSize <<<
>    [junit4]    > Throwable #1: java.lang.AssertionError
>    [junit4]    >        at __randomizedtesting.SeedInfo.seed([E514CC01D224ED97:F0F79C983D8CCA4E]:0)
>    [junit4]    >        at org.apache.lucene.index.TestConcurrentMergeScheduler.testTotalBytesSize(TestConcurrentMergeScheduler.java:366)
>    [junit4]    >        at java.lang.Thread.run(Thread.java:745)
>    [junit4]   2> Jun 23, 2014 10:24:02 PM com.carrotsearch.randomizedtesting.ThreadLeakControl checkThreadLeaks
>    [junit4]   2> WARNING: Will linger awaiting termination of 4 leaked thread(s).
>    [junit4]   2> NOTE: test params are: codec=Lucene49: {field=PostingsFormat(name=SimpleText), content=PostingsFormat(name=FSTPulsing41), id=PostingsFormat(name=MockSep)}, docValues:{}, sim=RandomSimilarityProvider(queryNorm=true,coord=yes): {content=DFR GL3(800.0)}, locale=th_TH, timezone=America/Argentina/La_Rioja
>    [junit4]   2> NOTE: Windows 7 6.1 amd64/Oracle Corporation 1.7.0_60 (64-bit)/cpus=2,threads=1,free=146852696,total=470810624
>    [junit4]   2> NOTE: All tests run in this JVM: [TestTwoPhaseCommitTool, TestSimpleExplanationsOfNonMatches, TestSameScoresWithThreads, TestTermRangeQuery, TestSpansAdvanced, TestSumDocFreq, TestGraphTokenizers, TestRAMDirectory, TestCodecHoldsOpenFiles, TestFieldCacheRewriteMethod, TestUniqueTermCount, TestBitVector, TestDeterminism, TestWAH8DocIdSet, TestBinaryTerms, TestIndexWriter, TestSortDocValues, TestAutomatonQueryUnicode, TestCompiledAutomaton, TestElevationComparator, TestNoMergeScheduler, TestConcurrentMergeScheduler]
>    [junit4] Completed in 7.46s, 7 tests, 1 failure <<< FAILURES!
>
> [...truncated 1419 lines...]
> BUILD FAILED
> C:\Users\JenkinsSlave\workspace\Lucene-Solr-4.x-Windows\build.xml:467: The following error occurred while executing this line:
> C:\Users\JenkinsSlave\workspace\Lucene-Solr-4.x-Windows\build.xml:447: The following error occurred while executing this line:
> C:\Users\JenkinsSlave\workspace\Lucene-Solr-4.x-Windows\build.xml:45: The following error occurred while executing this line:
> C:\Users\JenkinsSlave\workspace\Lucene-Solr-4.x-Windows\extra-targets.xml:37: The following error occurred while executing this line:
> C:\Users\JenkinsSlave\workspace\Lucene-Solr-4.x-Windows\lucene\build.xml:49: The following error occurred while executing this line:
> C:\Users\JenkinsSlave\workspace\Lucene-Solr-4.x-Windows\lucene\common-build.xml:1297: The following error occurred while executing this line:
> C:\Users\JenkinsSlave\workspace\Lucene-Solr-4.x-Windows\lucene\common-build.xml:921: There were test failures: 413 suites, 3505 tests, 1 failure, 136 ignored (125 assumptions)
>
> Total time: 16 minutes 23 seconds
> Build step 'Invoke Ant' marked build as failure
> Description set: Java: 64bit/jdk1.7.0_60 -XX:-UseCompressedOops -XX:+UseG1GC
> Archiving artifacts
> Recording test results
> Email was triggered for: Failure - Any
> Sending email for trigger: Failure - Any
>
>
>
>
> ---------------------------------------------------------------------
> To unsubscribe, e-mail: dev-unsubscribe@lucene.apache.org
> For additional commands, e-mail: dev-help@lucene.apache.org

---------------------------------------------------------------------
To unsubscribe, e-mail: dev-unsubscribe@lucene.apache.org
For additional commands, e-mail: dev-help@lucene.apache.org