You are viewing a plain text version of this content. The canonical link for it is here.
Posted to issues@arrow.apache.org by "Antoine Pitrou (JIRA)" <ji...@apache.org> on 2019/05/09 16:33:00 UTC
[jira] [Commented] (ARROW-5296) [Java] Sporadic Flight test
failures
[ https://issues.apache.org/jira/browse/ARROW-5296?page=com.atlassian.jira.plugin.system.issuetabpanels:comment-tabpanel&focusedCommentId=16836520#comment-16836520 ]
Antoine Pitrou commented on ARROW-5296:
---------------------------------------
[~lidavidm]
> [Java] Sporadic Flight test failures
> ------------------------------------
>
> Key: ARROW-5296
> URL: https://issues.apache.org/jira/browse/ARROW-5296
> Project: Apache Arrow
> Issue Type: Bug
> Components: FlightRPC, Java
> Reporter: Antoine Pitrou
> Priority: Major
>
> Some of the timeout based tests may fail when CI is a bit loaded, for example:
> https://travis-ci.org/apache/arrow/jobs/530352133#L4377
> {code}
> [ERROR] timeoutFires(org.apache.arrow.flight.TestCallOptions) Time elapsed: 1.025 s <<< FAILURE!
> java.lang.AssertionError: DEADLINE_EXCEEDED
> at org.apache.arrow.flight.TestCallOptions.lambda$timeoutFires$0(TestCallOptions.java:44)
> at org.apache.arrow.flight.TestCallOptions.test(TestCallOptions.java:70)
> at org.apache.arrow.flight.TestCallOptions.timeoutFires(TestCallOptions.java:37)
> {code}
--
This message was sent by Atlassian JIRA
(v7.6.3#76005)