You are viewing a plain text version of this content. The canonical link for it is here.
Posted to commits@karaf.apache.org by Apache Jenkins Server <je...@builds.apache.org> on 2011/10/17 12:25:56 UTC
Build failed in Jenkins: Karaf-2.2.x #262
See <https://builds.apache.org/job/Karaf-2.2.x/262/>
------------------------------------------
[...truncated 9703 lines...]
[INFO] [clean:clean {execution: default-clean}]
[INFO] [bundle:cleanVersions {execution: cleanVersions}]
[INFO] [remote-resources:process {execution: default}]
Downloading: http://svn.apache.org/repos/asf/servicemix/m2-repo/org/apache/felix/org.apache.felix.main/3.0.2/org.apache.felix.main-3.0.2.pom
[INFO] Unable to find resource 'org.apache.felix:org.apache.felix.main:pom:3.0.2' in repository servicemix (http://svn.apache.org/repos/asf/servicemix/m2-repo)
Downloading: http://repo1.maven.org/maven2/org/apache/felix/org.apache.felix.main/3.0.2/org.apache.felix.main-3.0.2.pom
Downloading: http://svn.apache.org/repos/asf/servicemix/m2-repo/org/ops4j/pax/exam/pax-exam-container-default/1.2.4/pax-exam-container-default-1.2.4.pom
[INFO] Unable to find resource 'org.ops4j.pax.exam:pax-exam-container-default:pom:1.2.4' in repository servicemix (http://svn.apache.org/repos/asf/servicemix/m2-repo)
Downloading: http://repo1.maven.org/maven2/org/ops4j/pax/exam/pax-exam-container-default/1.2.4/pax-exam-container-default-1.2.4.pom
Downloading: http://svn.apache.org/repos/asf/servicemix/m2-repo/org/ops4j/pax/exam/1.2.4/exam-1.2.4.pom
[INFO] Unable to find resource 'org.ops4j.pax:exam:pom:1.2.4' in repository servicemix (http://svn.apache.org/repos/asf/servicemix/m2-repo)
Downloading: http://repo1.maven.org/maven2/org/ops4j/pax/exam/1.2.4/exam-1.2.4.pom
Downloading: http://svn.apache.org/repos/asf/servicemix/m2-repo/org/ops4j/pax/exam/pax-exam/1.2.4/pax-exam-1.2.4.pom
[INFO] Unable to find resource 'org.ops4j.pax.exam:pax-exam:pom:1.2.4' in repository servicemix (http://svn.apache.org/repos/asf/servicemix/m2-repo)
Downloading: http://repo1.maven.org/maven2/org/ops4j/pax/exam/pax-exam/1.2.4/pax-exam-1.2.4.pom
Downloading: http://svn.apache.org/repos/asf/servicemix/m2-repo/org/ops4j/pax/exam/pax-exam-spi/1.2.4/pax-exam-spi-1.2.4.pom
[INFO] Unable to find resource 'org.ops4j.pax.exam:pax-exam-spi:pom:1.2.4' in repository servicemix (http://svn.apache.org/repos/asf/servicemix/m2-repo)
Downloading: http://repo1.maven.org/maven2/org/ops4j/pax/exam/pax-exam-spi/1.2.4/pax-exam-spi-1.2.4.pom
Downloading: http://svn.apache.org/repos/asf/servicemix/m2-repo/org/ops4j/pax/exam/pax-exam-container-rbc-client/1.2.4/pax-exam-container-rbc-client-1.2.4.pom
[INFO] Unable to find resource 'org.ops4j.pax.exam:pax-exam-container-rbc-client:pom:1.2.4' in repository servicemix (http://svn.apache.org/repos/asf/servicemix/m2-repo)
Downloading: http://repo1.maven.org/maven2/org/ops4j/pax/exam/pax-exam-container-rbc-client/1.2.4/pax-exam-container-rbc-client-1.2.4.pom
Downloading: http://svn.apache.org/repos/asf/servicemix/m2-repo/org/ops4j/pax/exam/pax-exam-container-rbc/1.2.4/pax-exam-container-rbc-1.2.4.pom
[INFO] Unable to find resource 'org.ops4j.pax.exam:pax-exam-container-rbc:pom:1.2.4' in repository servicemix (http://svn.apache.org/repos/asf/servicemix/m2-repo)
Downloading: http://repo1.maven.org/maven2/org/ops4j/pax/exam/pax-exam-container-rbc/1.2.4/pax-exam-container-rbc-1.2.4.pom
Downloading: http://svn.apache.org/repos/asf/servicemix/m2-repo/commons-logging/commons-logging/1.1/commons-logging-1.1.pom
[INFO] Unable to find resource 'commons-logging:commons-logging:pom:1.1' in repository servicemix (http://svn.apache.org/repos/asf/servicemix/m2-repo)
Downloading: http://repo1.maven.org/maven2/commons-logging/commons-logging/1.1/commons-logging-1.1.pom
Downloading: http://svn.apache.org/repos/asf/servicemix/m2-repo/org/ops4j/base/ops4j-base-net/1.2.2/ops4j-base-net-1.2.2.pom
[INFO] Unable to find resource 'org.ops4j.base:ops4j-base-net:pom:1.2.2' in repository servicemix (http://svn.apache.org/repos/asf/servicemix/m2-repo)
Downloading: http://repo1.maven.org/maven2/org/ops4j/base/ops4j-base-net/1.2.2/ops4j-base-net-1.2.2.pom
Downloading: http://svn.apache.org/repos/asf/servicemix/m2-repo/org/ops4j/pax/runner/pax-runner-no-jcl/1.6.2/pax-runner-no-jcl-1.6.2.pom
[INFO] Unable to find resource 'org.ops4j.pax.runner:pax-runner-no-jcl:pom:1.6.2' in repository servicemix (http://svn.apache.org/repos/asf/servicemix/m2-repo)
Downloading: http://repo1.maven.org/maven2/org/ops4j/pax/runner/pax-runner-no-jcl/1.6.2/pax-runner-no-jcl-1.6.2.pom
Downloading: http://svn.apache.org/repos/asf/servicemix/m2-repo/org/ops4j/pax/runner/1.6.2/runner-1.6.2.pom
[INFO] Unable to find resource 'org.ops4j.pax:runner:pom:1.6.2' in repository servicemix (http://svn.apache.org/repos/asf/servicemix/m2-repo)
Downloading: http://repo1.maven.org/maven2/org/ops4j/pax/runner/1.6.2/runner-1.6.2.pom
Downloading: http://svn.apache.org/repos/asf/servicemix/m2-repo/org/ops4j/pax/exam/pax-exam-container-default/1.2.4/pax-exam-container-default-1.2.4.jar
Downloading: http://svn.apache.org/repos/asf/servicemix/m2-repo/commons-logging/commons-logging/1.1/commons-logging-1.1.jar
Downloading: http://svn.apache.org/repos/asf/servicemix/m2-repo/org/ops4j/base/ops4j-base-net/1.2.2/ops4j-base-net-1.2.2.jar
Downloading: http://svn.apache.org/repos/asf/servicemix/m2-repo/org/ops4j/pax/runner/pax-runner-no-jcl/1.6.2/pax-runner-no-jcl-1.6.2.jar
Downloading: http://svn.apache.org/repos/asf/servicemix/m2-repo/org/apache/felix/org.apache.felix.main/3.0.2/org.apache.felix.main-3.0.2.jar
[INFO] Unable to find resource 'commons-logging:commons-logging:jar:1.1' in repository servicemix (http://svn.apache.org/repos/asf/servicemix/m2-repo)
[INFO] Unable to find resource 'org.apache.felix:org.apache.felix.main:jar:3.0.2' in repository servicemix (http://svn.apache.org/repos/asf/servicemix/m2-repo)
[INFO] Unable to find resource 'org.ops4j.base:ops4j-base-net:jar:1.2.2' in repository servicemix (http://svn.apache.org/repos/asf/servicemix/m2-repo)
[INFO] Unable to find resource 'org.ops4j.pax.runner:pax-runner-no-jcl:jar:1.6.2' in repository servicemix (http://svn.apache.org/repos/asf/servicemix/m2-repo)
Downloading: http://repo1.maven.org/maven2/org/apache/felix/org.apache.felix.main/3.0.2/org.apache.felix.main-3.0.2.jar
[INFO] Unable to find resource 'org.ops4j.pax.exam:pax-exam-container-default:jar:1.2.4' in repository servicemix (http://svn.apache.org/repos/asf/servicemix/m2-repo)
Downloading: http://repo1.maven.org/maven2/commons-logging/commons-logging/1.1/commons-logging-1.1.jar
Downloading: http://repo1.maven.org/maven2/org/ops4j/pax/runner/pax-runner-no-jcl/1.6.2/pax-runner-no-jcl-1.6.2.jar
Downloading: http://repo1.maven.org/maven2/org/ops4j/pax/exam/pax-exam-container-default/1.2.4/pax-exam-container-default-1.2.4.jar
Downloading: http://repo1.maven.org/maven2/org/ops4j/base/ops4j-base-net/1.2.2/ops4j-base-net-1.2.2.jar
Downloading: http://svn.apache.org/repos/asf/servicemix/m2-repo/org/ops4j/pax/exam/pax-exam/1.2.4/pax-exam-1.2.4.jar
[INFO] Unable to find resource 'org.ops4j.pax.exam:pax-exam:jar:1.2.4' in repository servicemix (http://svn.apache.org/repos/asf/servicemix/m2-repo)
Downloading: http://repo1.maven.org/maven2/org/ops4j/pax/exam/pax-exam/1.2.4/pax-exam-1.2.4.jar
Downloading: http://svn.apache.org/repos/asf/servicemix/m2-repo/org/ops4j/pax/exam/pax-exam-spi/1.2.4/pax-exam-spi-1.2.4.jar
[INFO] Unable to find resource 'org.ops4j.pax.exam:pax-exam-spi:jar:1.2.4' in repository servicemix (http://svn.apache.org/repos/asf/servicemix/m2-repo)
Downloading: http://repo1.maven.org/maven2/org/ops4j/pax/exam/pax-exam-spi/1.2.4/pax-exam-spi-1.2.4.jar
Downloading: http://svn.apache.org/repos/asf/servicemix/m2-repo/org/ops4j/pax/exam/pax-exam-container-rbc-client/1.2.4/pax-exam-container-rbc-client-1.2.4.jar
[INFO] Unable to find resource 'org.ops4j.pax.exam:pax-exam-container-rbc-client:jar:1.2.4' in repository servicemix (http://svn.apache.org/repos/asf/servicemix/m2-repo)
Downloading: http://repo1.maven.org/maven2/org/ops4j/pax/exam/pax-exam-container-rbc-client/1.2.4/pax-exam-container-rbc-client-1.2.4.jar
Downloading: http://svn.apache.org/repos/asf/servicemix/m2-repo/org/ops4j/pax/exam/pax-exam-container-rbc/1.2.4/pax-exam-container-rbc-1.2.4.jar
[INFO] Unable to find resource 'org.ops4j.pax.exam:pax-exam-container-rbc:jar:1.2.4' in repository servicemix (http://svn.apache.org/repos/asf/servicemix/m2-repo)
Downloading: http://repo1.maven.org/maven2/org/ops4j/pax/exam/pax-exam-container-rbc/1.2.4/pax-exam-container-rbc-1.2.4.jar
[INFO] [antrun:run {execution: copy-notice}]
[INFO] Executing tasks
main:
[copy] Warning: Could not find file <https://builds.apache.org/job/Karaf-2.2.x/ws/karaf/itests/dependencies/NOTICE> to copy.
[INFO] Executed tasks
[INFO] [site:attach-descriptor {execution: default-attach-descriptor}]
[INFO] [install:install {execution: default-install}]
[INFO] Installing <https://builds.apache.org/job/Karaf-2.2.x/ws/karaf/itests/dependencies/pom.xml> to <https://builds.apache.org/job/Karaf-2.2.x/ws/.repository/org/apache/karaf/itests/dependencies/2.2.5-SNAPSHOT/dependencies-2.2.5-SNAPSHOT.pom>
[JENKINS] Archiving <https://builds.apache.org/job/Karaf-2.2.x/ws/karaf/itests/dependencies/pom.xml> to /home/hudson/hudson/jobs/Karaf-2.2.x/modules/org.apache.karaf.itests$dependencies/builds/2011-10-17_10-07-01/archive/org.apache.karaf.itests/dependencies/2.2.5-SNAPSHOT/dependencies-2.2.5-SNAPSHOT.pom
[INFO] ------------------------------------------------------------------------
[INFO] Building Apache Karaf :: Tooling :: Testing environment
[INFO] task-segment: [clean, install]
[INFO] ------------------------------------------------------------------------
Downloading: http://repo1.maven.org/maven2/org/apache/servicemix/tooling/depends-maven-plugin/1.2/depends-maven-plugin-1.2.pom
Downloading: http://repo1.maven.org/maven2/org/apache/servicemix/tooling/maven-plugins-pom/3/maven-plugins-pom-3.pom
Downloading: http://repo1.maven.org/maven2/org/apache/servicemix/servicemix-pom/4/servicemix-pom-4.pom
Downloading: http://repo1.maven.org/maven2/org/apache/servicemix/tooling/depends-maven-plugin/1.2/depends-maven-plugin-1.2.jar
[INFO] [clean:clean {execution: default-clean}]
[INFO] [bundle:cleanVersions {execution: cleanVersions}]
[INFO] [remote-resources:process {execution: default}]
Downloading: http://svn.apache.org/repos/asf/servicemix/m2-repo/org/ops4j/pax/exam/pax-exam-junit/1.2.4/pax-exam-junit-1.2.4.pom
[INFO] Unable to find resource 'org.ops4j.pax.exam:pax-exam-junit:pom:1.2.4' in repository servicemix (http://svn.apache.org/repos/asf/servicemix/m2-repo)
Downloading: http://repo1.maven.org/maven2/org/ops4j/pax/exam/pax-exam-junit/1.2.4/pax-exam-junit-1.2.4.pom
Downloading: http://svn.apache.org/repos/asf/servicemix/m2-repo/org/ops4j/pax/exam/pax-exam-runtime/1.2.4/pax-exam-runtime-1.2.4.pom
[INFO] Unable to find resource 'org.ops4j.pax.exam:pax-exam-runtime:pom:1.2.4' in repository servicemix (http://svn.apache.org/repos/asf/servicemix/m2-repo)
Downloading: http://repo1.maven.org/maven2/org/ops4j/pax/exam/pax-exam-runtime/1.2.4/pax-exam-runtime-1.2.4.pom
Downloading: http://svn.apache.org/repos/asf/servicemix/m2-repo/commons-discovery/commons-discovery/0.4/commons-discovery-0.4.pom
[INFO] Unable to find resource 'commons-discovery:commons-discovery:pom:0.4' in repository servicemix (http://svn.apache.org/repos/asf/servicemix/m2-repo)
Downloading: http://repo1.maven.org/maven2/commons-discovery/commons-discovery/0.4/commons-discovery-0.4.pom
Downloading: http://svn.apache.org/repos/asf/servicemix/m2-repo/org/ops4j/pax/exam/pax-exam-junit-extender/1.2.4/pax-exam-junit-extender-1.2.4.pom
[INFO] Unable to find resource 'org.ops4j.pax.exam:pax-exam-junit-extender:pom:1.2.4' in repository servicemix (http://svn.apache.org/repos/asf/servicemix/m2-repo)
Downloading: http://repo1.maven.org/maven2/org/ops4j/pax/exam/pax-exam-junit-extender/1.2.4/pax-exam-junit-extender-1.2.4.pom
Downloading: http://svn.apache.org/repos/asf/servicemix/m2-repo/junit/junit/4.4/junit-4.4.pom
[INFO] Unable to find resource 'junit:junit:pom:4.4' in repository servicemix (http://svn.apache.org/repos/asf/servicemix/m2-repo)
Downloading: http://repo1.maven.org/maven2/junit/junit/4.4/junit-4.4.pom
Downloading: http://svn.apache.org/repos/asf/servicemix/m2-repo/org/ops4j/pax/exam/pax-exam-junit-extender-impl/1.2.4/pax-exam-junit-extender-impl-1.2.4.pom
[INFO] Unable to find resource 'org.ops4j.pax.exam:pax-exam-junit-extender-impl:pom:1.2.4' in repository servicemix (http://svn.apache.org/repos/asf/servicemix/m2-repo)
Downloading: http://repo1.maven.org/maven2/org/ops4j/pax/exam/pax-exam-junit-extender-impl/1.2.4/pax-exam-junit-extender-impl-1.2.4.pom
Downloading: http://svn.apache.org/repos/asf/servicemix/m2-repo/commons-discovery/commons-discovery/0.4/commons-discovery-0.4.jar
Downloading: http://svn.apache.org/repos/asf/servicemix/m2-repo/org/ops4j/pax/exam/pax-exam-junit/1.2.4/pax-exam-junit-1.2.4.jar
[INFO] Unable to find resource 'commons-discovery:commons-discovery:jar:0.4' in repository servicemix (http://svn.apache.org/repos/asf/servicemix/m2-repo)
Downloading: http://repo1.maven.org/maven2/commons-discovery/commons-discovery/0.4/commons-discovery-0.4.jar
[INFO] Unable to find resource 'org.ops4j.pax.exam:pax-exam-junit:jar:1.2.4' in repository servicemix (http://svn.apache.org/repos/asf/servicemix/m2-repo)
Downloading: http://repo1.maven.org/maven2/org/ops4j/pax/exam/pax-exam-junit/1.2.4/pax-exam-junit-1.2.4.jar
Downloading: http://svn.apache.org/repos/asf/servicemix/m2-repo/org/ops4j/pax/exam/pax-exam-runtime/1.2.4/pax-exam-runtime-1.2.4.jar
[INFO] Unable to find resource 'org.ops4j.pax.exam:pax-exam-runtime:jar:1.2.4' in repository servicemix (http://svn.apache.org/repos/asf/servicemix/m2-repo)
Downloading: http://repo1.maven.org/maven2/org/ops4j/pax/exam/pax-exam-runtime/1.2.4/pax-exam-runtime-1.2.4.jar
Downloading: http://svn.apache.org/repos/asf/servicemix/m2-repo/org/ops4j/pax/exam/pax-exam-junit-extender/1.2.4/pax-exam-junit-extender-1.2.4.jar
[INFO] Unable to find resource 'org.ops4j.pax.exam:pax-exam-junit-extender:jar:1.2.4' in repository servicemix (http://svn.apache.org/repos/asf/servicemix/m2-repo)
Downloading: http://repo1.maven.org/maven2/org/ops4j/pax/exam/pax-exam-junit-extender/1.2.4/pax-exam-junit-extender-1.2.4.jar
Downloading: http://svn.apache.org/repos/asf/servicemix/m2-repo/org/ops4j/pax/exam/pax-exam-junit-extender-impl/1.2.4/pax-exam-junit-extender-impl-1.2.4.jar
[INFO] Unable to find resource 'org.ops4j.pax.exam:pax-exam-junit-extender-impl:jar:1.2.4' in repository servicemix (http://svn.apache.org/repos/asf/servicemix/m2-repo)
Downloading: http://repo1.maven.org/maven2/org/ops4j/pax/exam/pax-exam-junit-extender-impl/1.2.4/pax-exam-junit-extender-impl-1.2.4.jar
[INFO] [antrun:run {execution: copy-notice}]
[INFO] Executing tasks
main:
[copy] Warning: Could not find file <https://builds.apache.org/job/Karaf-2.2.x/ws/karaf/tooling/testing/NOTICE> to copy.
[INFO] Executed tasks
[INFO] [depends:generate-depends-file {execution: generate-depends-file}]
[INFO] Created: <https://builds.apache.org/job/Karaf-2.2.x/ws/karaf/tooling/testing/target/classes/META-INF/maven/dependencies.properties>
[debug] execute contextualize
[INFO] [resources:resources {execution: default-resources}]
[INFO] Using 'UTF-8' encoding to copy filtered resources.
[INFO] skip non existing resourceDirectory <https://builds.apache.org/job/Karaf-2.2.x/ws/karaf/tooling/testing/src/main/resources>
[INFO] Copying 3 resources
[INFO] [compiler:compile {execution: default-compile}]
[INFO] Compiling 3 source files to <https://builds.apache.org/job/Karaf-2.2.x/ws/karaf/tooling/testing/target/classes>
[debug] execute contextualize
[INFO] [resources:copy-resources {execution: copy-filtered}]
[INFO] Using 'UTF-8' encoding to copy filtered resources.
[INFO] Copying 4 resources
[debug] execute contextualize
[INFO] [resources:testResources {execution: default-testResources}]
[INFO] Using 'UTF-8' encoding to copy filtered resources.
[INFO] skip non existing resourceDirectory <https://builds.apache.org/job/Karaf-2.2.x/ws/karaf/tooling/testing/src/test/resources>
[INFO] Copying 3 resources
[INFO] [compiler:testCompile {execution: default-testCompile}]
[INFO] No sources to compile
[INFO] [surefire:test {execution: default-test}]
[INFO] Surefire report directory: <https://builds.apache.org/job/Karaf-2.2.x/ws/karaf/tooling/testing/target/surefire-reports>
-------------------------------------------------------
T E S T S
-------------------------------------------------------
Results :
Tests run: 0, Failures: 0, Errors: 0, Skipped: 0
[JENKINS] Recording test results
Oct 17, 2011 10:25:53 AM hudson.remoting.Channel$ReaderThread run
SEVERE: I/O error in channel channel
java.io.StreamCorruptedException
at java.io.ObjectInputStream.readObject0(ObjectInputStream.java:1332)
at java.io.ObjectInputStream.readObject(ObjectInputStream.java:348)
at hudson.remoting.Channel$ReaderThread.run(Channel.java:1087)
channel stopped
[INFO] ------------------------------------------------------------------------
[ERROR] FATAL ERROR
[INFO] ------------------------------------------------------------------------
[INFO] null
[INFO] ------------------------------------------------------------------------
[INFO] Trace
java.lang.reflect.UndeclaredThrowableException
at $Proxy2.isArchivingDisabled(Unknown Source)
at hudson.maven.MavenBuildProxy$Filter.isArchivingDisabled(MavenBuildProxy.java:224)
at hudson.maven.reporters.MavenArtifact.archive(MavenArtifact.java:216)
at hudson.maven.reporters.MavenArtifactArchiver.postBuild(MavenArtifactArchiver.java:106)
at hudson.maven.MavenModuleSetBuild$Builder.postModule(MavenModuleSetBuild.java:1109)
at hudson.maven.MavenBuilder$Adapter.fireLeaveModule(MavenBuilder.java:349)
at hudson.maven.MavenBuilder$Adapter.postBuild(MavenBuilder.java:307)
at org.apache.maven.lifecycle.LifecycleExecutorInterceptor.execute(LifecycleExecutorInterceptor.java:68)
at org.apache.maven.DefaultMaven.doExecute(DefaultMaven.java:328)
at org.apache.maven.DefaultMaven.execute(DefaultMaven.java:138)
at org.apache.maven.cli.MavenCli.main(MavenCli.java:362)
at sun.reflect.NativeMethodAccessorImpl.invoke0(Native Method)
at sun.reflect.NativeMethodAccessorImpl.invoke(NativeMethodAccessorImpl.java:39)
at sun.reflect.DelegatingMethodAccessorImpl.invoke(DelegatingMethodAccessorImpl.java:25)
at java.lang.reflect.Method.invoke(Method.java:592)
at org.codehaus.classworlds.Launcher.launchEnhanced(Launcher.java:315)
at org.codehaus.classworlds.Launcher.launch(Launcher.java:255)
at hudson.maven.agent.Main.launch(Main.java:185)
at hudson.maven.MavenBuilder.call(MavenBuilder.java:160)
at hudson.maven.MavenModuleSetBuild$Builder.call(MavenModuleSetBuild.java:1059)
at hudson.maven.MavenModuleSetBuild$Builder.call(MavenModuleSetBuild.java:990)
at hudson.remoting.UserRequest.perform(UserRequest.java:118)
at hudson.remoting.UserRequest.perform(UserRequest.java:48)
at hudson.remoting.Request$2.run(Request.java:287)
at java.util.concurrent.Executors$RunnableAdapter.call(Executors.java:417)
at java.util.concurrent.FutureTask$Sync.innerRun(FutureTask.java:269)
at java.util.concurrent.FutureTask.run(FutureTask.java:123)
at java.util.concurrent.ThreadPoolExecutor$Worker.runTask(ThreadPoolExecutor.java:651)
at java.util.concurrent.ThreadPoolExecutor$Worker.run(ThreadPoolExecutor.java:676)
at java.lang.Thread.run(Thread.java:595)
Caused by: hudson.remoting.ChannelClosedException: channel is already closed
at hudson.remoting.Channel.send(Channel.java:499)
at hudson.remoting.Request.call(Request.java:110)
at hudson.remoting.Channel.call(Channel.java:681)
at hudson.remoting.RemoteInvocationHandler.invoke(RemoteInvocationHandler.java:158)
... 30 more
Caused by: java.io.StreamCorruptedException
at java.io.ObjectInputStream.readObject0(ObjectInputStream.java:1332)
at java.io.ObjectInputStream.readObject(ObjectInputStream.java:348)
at hudson.remoting.Channel$ReaderThread.run(Channel.java:1087)
[INFO] ------------------------------------------------------------------------
[INFO] Total time: 18 minutes 23 seconds
[INFO] Finished at: Mon Oct 17 10:25:53 UTC 2011
ERROR: Maven JVM terminated unexpectedly with exit code 0
Jenkins build is back to normal : Karaf-2.2.x #264
Posted by Apache Jenkins Server <je...@builds.apache.org>.
See <https://builds.apache.org/job/Karaf-2.2.x/264/changes>
Build failed in Jenkins: Karaf-2.2.x #263
Posted by Apache Jenkins Server <je...@builds.apache.org>.
See <https://builds.apache.org/job/Karaf-2.2.x/263/changes>
Changes:
[jbonofre] [KARAF-945] Use singular for shell command aliases
------------------------------------------
[...truncated 2336 lines...]
[INFO] Unable to find resource 'org.codehaus.plexus:plexus-container-default:pom:1.0-alpha-9-stable-1' in repository servicemix (http://svn.apache.org/repos/asf/servicemix/m2-repo)
Downloading: http://repo1.maven.org/maven2/org/codehaus/plexus/plexus-container-default/1.0-alpha-9-stable-1/plexus-container-default-1.0-alpha-9-stable-1.pom
Downloading: http://svn.apache.org/repos/asf/servicemix/m2-repo/org/codehaus/plexus/plexus-containers/1.0.3/plexus-containers-1.0.3.pom
[INFO] Unable to find resource 'org.codehaus.plexus:plexus-containers:pom:1.0.3' in repository servicemix (http://svn.apache.org/repos/asf/servicemix/m2-repo)
Downloading: http://repo1.maven.org/maven2/org/codehaus/plexus/plexus-containers/1.0.3/plexus-containers-1.0.3.pom
Downloading: http://svn.apache.org/repos/asf/servicemix/m2-repo/junit/junit/3.8.1/junit-3.8.1.pom
[INFO] Unable to find resource 'junit:junit:pom:3.8.1' in repository servicemix (http://svn.apache.org/repos/asf/servicemix/m2-repo)
Downloading: http://repo1.maven.org/maven2/junit/junit/3.8.1/junit-3.8.1.pom
Downloading: http://svn.apache.org/repos/asf/servicemix/m2-repo/org/codehaus/plexus/plexus-utils/1.0.4/plexus-utils-1.0.4.pom
[INFO] Unable to find resource 'org.codehaus.plexus:plexus-utils:pom:1.0.4' in repository servicemix (http://svn.apache.org/repos/asf/servicemix/m2-repo)
Downloading: http://repo1.maven.org/maven2/org/codehaus/plexus/plexus-utils/1.0.4/plexus-utils-1.0.4.pom
Downloading: http://svn.apache.org/repos/asf/servicemix/m2-repo/classworlds/classworlds/1.1-alpha-2/classworlds-1.1-alpha-2.pom
[INFO] Unable to find resource 'classworlds:classworlds:pom:1.1-alpha-2' in repository servicemix (http://svn.apache.org/repos/asf/servicemix/m2-repo)
Downloading: http://repo1.maven.org/maven2/classworlds/classworlds/1.1-alpha-2/classworlds-1.1-alpha-2.pom
Downloading: http://svn.apache.org/repos/asf/servicemix/m2-repo/org/apache/maven/maven-profile/2.0.7/maven-profile-2.0.7.pom
[INFO] Unable to find resource 'org.apache.maven:maven-profile:pom:2.0.7' in repository servicemix (http://svn.apache.org/repos/asf/servicemix/m2-repo)
Downloading: http://repo1.maven.org/maven2/org/apache/maven/maven-profile/2.0.7/maven-profile-2.0.7.pom
Downloading: http://svn.apache.org/repos/asf/servicemix/m2-repo/org/apache/maven/maven-artifact-manager/2.0.7/maven-artifact-manager-2.0.7.pom
[INFO] Unable to find resource 'org.apache.maven:maven-artifact-manager:pom:2.0.7' in repository servicemix (http://svn.apache.org/repos/asf/servicemix/m2-repo)
Downloading: http://repo1.maven.org/maven2/org/apache/maven/maven-artifact-manager/2.0.7/maven-artifact-manager-2.0.7.pom
Downloading: http://svn.apache.org/repos/asf/servicemix/m2-repo/org/apache/maven/maven-repository-metadata/2.0.7/maven-repository-metadata-2.0.7.pom
[INFO] Unable to find resource 'org.apache.maven:maven-repository-metadata:pom:2.0.7' in repository servicemix (http://svn.apache.org/repos/asf/servicemix/m2-repo)
Downloading: http://repo1.maven.org/maven2/org/apache/maven/maven-repository-metadata/2.0.7/maven-repository-metadata-2.0.7.pom
Downloading: http://svn.apache.org/repos/asf/servicemix/m2-repo/org/apache/maven/maven-artifact/2.0.7/maven-artifact-2.0.7.pom
[INFO] Unable to find resource 'org.apache.maven:maven-artifact:pom:2.0.7' in repository servicemix (http://svn.apache.org/repos/asf/servicemix/m2-repo)
Downloading: http://repo1.maven.org/maven2/org/apache/maven/maven-artifact/2.0.7/maven-artifact-2.0.7.pom
Downloading: http://svn.apache.org/repos/asf/servicemix/m2-repo/org/apache/maven/wagon/wagon-provider-api/1.0-beta-2/wagon-provider-api-1.0-beta-2.pom
[INFO] Unable to find resource 'org.apache.maven.wagon:wagon-provider-api:pom:1.0-beta-2' in repository servicemix (http://svn.apache.org/repos/asf/servicemix/m2-repo)
Downloading: http://repo1.maven.org/maven2/org/apache/maven/wagon/wagon-provider-api/1.0-beta-2/wagon-provider-api-1.0-beta-2.pom
Downloading: http://svn.apache.org/repos/asf/servicemix/m2-repo/org/apache/maven/wagon/wagon/1.0-beta-2/wagon-1.0-beta-2.pom
[INFO] Unable to find resource 'org.apache.maven.wagon:wagon:pom:1.0-beta-2' in repository servicemix (http://svn.apache.org/repos/asf/servicemix/m2-repo)
Downloading: http://repo1.maven.org/maven2/org/apache/maven/wagon/wagon/1.0-beta-2/wagon-1.0-beta-2.pom
Downloading: http://svn.apache.org/repos/asf/servicemix/m2-repo/org/apache/maven/maven-parent/4/maven-parent-4.pom
[INFO] Unable to find resource 'org.apache.maven:maven-parent:pom:4' in repository servicemix (http://svn.apache.org/repos/asf/servicemix/m2-repo)
Downloading: http://repo1.maven.org/maven2/org/apache/maven/maven-parent/4/maven-parent-4.pom
Downloading: http://svn.apache.org/repos/asf/servicemix/m2-repo/org/apache/maven/maven-plugin-registry/2.0.7/maven-plugin-registry-2.0.7.pom
[INFO] Unable to find resource 'org.apache.maven:maven-plugin-registry:pom:2.0.7' in repository servicemix (http://svn.apache.org/repos/asf/servicemix/m2-repo)
Downloading: http://repo1.maven.org/maven2/org/apache/maven/maven-plugin-registry/2.0.7/maven-plugin-registry-2.0.7.pom
Downloading: http://repo1.maven.org/maven2/org/apache/maven/maven-plugin-api/2.0.7/maven-plugin-api-2.0.7.pom
Downloading: http://repo1.maven.org/maven2/org/apache/maven/maven-archiver/2.2/maven-archiver-2.2.pom
Downloading: http://repo1.maven.org/maven2/org/apache/maven/shared/maven-shared-components/3/maven-shared-components-3.pom
Downloading: http://svn.apache.org/repos/asf/servicemix/m2-repo/org/apache/maven/maven-project/2.0/maven-project-2.0.pom
[INFO] Unable to find resource 'org.apache.maven:maven-project:pom:2.0' in repository servicemix (http://svn.apache.org/repos/asf/servicemix/m2-repo)
Downloading: http://repo1.maven.org/maven2/org/apache/maven/maven-project/2.0/maven-project-2.0.pom
Downloading: http://svn.apache.org/repos/asf/servicemix/m2-repo/org/apache/maven/maven/2.0/maven-2.0.pom
[INFO] Unable to find resource 'org.apache.maven:maven:pom:2.0' in repository servicemix (http://svn.apache.org/repos/asf/servicemix/m2-repo)
Downloading: http://repo1.maven.org/maven2/org/apache/maven/maven/2.0/maven-2.0.pom
Downloading: http://svn.apache.org/repos/asf/servicemix/m2-repo/org/codehaus/plexus/plexus-archiver/1.0-alpha-7/plexus-archiver-1.0-alpha-7.pom
[INFO] Unable to find resource 'org.codehaus.plexus:plexus-archiver:pom:1.0-alpha-7' in repository servicemix (http://svn.apache.org/repos/asf/servicemix/m2-repo)
Downloading: http://repo1.maven.org/maven2/org/codehaus/plexus/plexus-archiver/1.0-alpha-7/plexus-archiver-1.0-alpha-7.pom
Downloading: http://svn.apache.org/repos/asf/servicemix/m2-repo/org/codehaus/plexus/plexus-components/1.1.6/plexus-components-1.1.6.pom
[INFO] Unable to find resource 'org.codehaus.plexus:plexus-components:pom:1.1.6' in repository servicemix (http://svn.apache.org/repos/asf/servicemix/m2-repo)
Downloading: http://repo1.maven.org/maven2/org/codehaus/plexus/plexus-components/1.1.6/plexus-components-1.1.6.pom
Downloading: http://svn.apache.org/repos/asf/servicemix/m2-repo/org/codehaus/plexus/plexus/1.0.8/plexus-1.0.8.pom
[INFO] Unable to find resource 'org.codehaus.plexus:plexus:pom:1.0.8' in repository servicemix (http://svn.apache.org/repos/asf/servicemix/m2-repo)
Downloading: http://repo1.maven.org/maven2/org/codehaus/plexus/plexus/1.0.8/plexus-1.0.8.pom
Downloading: http://svn.apache.org/repos/asf/servicemix/m2-repo/org/codehaus/plexus/plexus-utils/1.2/plexus-utils-1.2.pom
[INFO] Unable to find resource 'org.codehaus.plexus:plexus-utils:pom:1.2' in repository servicemix (http://svn.apache.org/repos/asf/servicemix/m2-repo)
Downloading: http://repo1.maven.org/maven2/org/codehaus/plexus/plexus-utils/1.2/plexus-utils-1.2.pom
Downloading: http://svn.apache.org/repos/asf/servicemix/m2-repo/org/codehaus/plexus/plexus/1.0.5/plexus-1.0.5.pom
[INFO] Unable to find resource 'org.codehaus.plexus:plexus:pom:1.0.5' in repository servicemix (http://svn.apache.org/repos/asf/servicemix/m2-repo)
Downloading: http://repo1.maven.org/maven2/org/codehaus/plexus/plexus/1.0.5/plexus-1.0.5.pom
Downloading: http://svn.apache.org/repos/asf/servicemix/m2-repo/org/codehaus/plexus/plexus-container-default/1.0-alpha-8/plexus-container-default-1.0-alpha-8.pom
[INFO] Unable to find resource 'org.codehaus.plexus:plexus-container-default:pom:1.0-alpha-8' in repository servicemix (http://svn.apache.org/repos/asf/servicemix/m2-repo)
Downloading: http://repo1.maven.org/maven2/org/codehaus/plexus/plexus-container-default/1.0-alpha-8/plexus-container-default-1.0-alpha-8.pom
Downloading: http://svn.apache.org/repos/asf/servicemix/m2-repo/org/apache/maven/maven-artifact/2.0/maven-artifact-2.0.pom
[INFO] Unable to find resource 'org.apache.maven:maven-artifact:pom:2.0' in repository servicemix (http://svn.apache.org/repos/asf/servicemix/m2-repo)
Downloading: http://repo1.maven.org/maven2/org/apache/maven/maven-artifact/2.0/maven-artifact-2.0.pom
Downloading: http://repo1.maven.org/maven2/org/apache/maven/shared/maven-dependency-tree/1.2/maven-dependency-tree-1.2.pom
Downloading: http://repo1.maven.org/maven2/org/apache/maven/shared/maven-shared-components/9/maven-shared-components-9.pom
Downloading: http://repo1.maven.org/maven2/org/apache/maven/maven-parent/8/maven-parent-8.pom
Downloading: http://svn.apache.org/repos/asf/servicemix/m2-repo/org/apache/maven/maven-project/2.0.8/maven-project-2.0.8.pom
[INFO] Unable to find resource 'org.apache.maven:maven-project:pom:2.0.8' in repository servicemix (http://svn.apache.org/repos/asf/servicemix/m2-repo)
Downloading: http://repo1.maven.org/maven2/org/apache/maven/maven-project/2.0.8/maven-project-2.0.8.pom
Downloading: http://svn.apache.org/repos/asf/servicemix/m2-repo/org/apache/maven/maven/2.0.8/maven-2.0.8.pom
[INFO] Unable to find resource 'org.apache.maven:maven:pom:2.0.8' in repository servicemix (http://svn.apache.org/repos/asf/servicemix/m2-repo)
Downloading: http://repo1.maven.org/maven2/org/apache/maven/maven/2.0.8/maven-2.0.8.pom
Downloading: http://svn.apache.org/repos/asf/servicemix/m2-repo/org/apache/maven/maven-parent/6/maven-parent-6.pom
[INFO] Unable to find resource 'org.apache.maven:maven-parent:pom:6' in repository servicemix (http://svn.apache.org/repos/asf/servicemix/m2-repo)
Downloading: http://repo1.maven.org/maven2/org/apache/maven/maven-parent/6/maven-parent-6.pom
Downloading: http://repo1.maven.org/maven2/org/codehaus/plexus/plexus-utils/1.4.7/plexus-utils-1.4.7.pom
Downloading: http://repo1.maven.org/maven2/biz/aQute/bndlib/1.15.0/bndlib-1.15.0.jar
Downloading: http://repo1.maven.org/maven2/org/apache/maven/shared/maven-dependency-tree/1.2/maven-dependency-tree-1.2.jar
Downloading: http://svn.apache.org/repos/asf/servicemix/m2-repo/xmlpull/xmlpull/1.1.3.1/xmlpull-1.1.3.1.jar
Downloading: http://svn.apache.org/repos/asf/servicemix/m2-repo/org/easymock/easymock/2.4/easymock-2.4.jar
Downloading: http://svn.apache.org/repos/asf/servicemix/m2-repo/org/osgi/org.osgi.core/4.1.0/org.osgi.core-4.1.0.jar
[INFO] Unable to find resource 'org.easymock:easymock:jar:2.4' in repository servicemix (http://svn.apache.org/repos/asf/servicemix/m2-repo)
Downloading: http://repo1.maven.org/maven2/org/easymock/easymock/2.4/easymock-2.4.jar
[INFO] Unable to find resource 'org.osgi:org.osgi.core:jar:4.1.0' in repository servicemix (http://svn.apache.org/repos/asf/servicemix/m2-repo)
[INFO] Unable to find resource 'xmlpull:xmlpull:jar:1.1.3.1' in repository servicemix (http://svn.apache.org/repos/asf/servicemix/m2-repo)
Downloading: http://repo1.maven.org/maven2/xmlpull/xmlpull/1.1.3.1/xmlpull-1.1.3.1.jar
Downloading: http://repo1.maven.org/maven2/org/osgi/org.osgi.core/4.1.0/org.osgi.core-4.1.0.jar
Downloading: http://repo1.maven.org/maven2/org/apache/felix/org.apache.felix.bundlerepository/1.6.2/org.apache.felix.bundlerepository-1.6.2.jar
Downloading: http://repo1.maven.org/maven2/net/sf/kxml/kxml2/2.2.2/kxml2-2.2.2.jar
Downloading: http://repo1.maven.org/maven2/org/apache/maven/maven-archiver/2.2/maven-archiver-2.2.jar
Downloading: http://repo1.maven.org/maven2/org/codehaus/plexus/plexus-utils/1.4.7/plexus-utils-1.4.7.jar
Downloading: http://repo1.maven.org/maven2/org/apache/felix/org.osgi.core/1.0.0/org.osgi.core-1.0.0.jar
Downloading: http://repo1.maven.org/maven2/org/codehaus/plexus/plexus-archiver/1.0-alpha-7/plexus-archiver-1.0-alpha-7.jar
Downloading: http://repo1.maven.org/maven2/org/apache/felix/org.osgi.service.obr/1.0.1/org.osgi.service.obr-1.0.1.jar
[INFO] ------------------------------------------------------------------------
[INFO] Building Apache Karaf
[INFO] task-segment: [clean, install]
[INFO] ------------------------------------------------------------------------
Downloading: http://repo1.maven.org/maven2/org/apache/maven/plugins/maven-clean-plugin/2.4.1/maven-clean-plugin-2.4.1.pom
Downloading: http://repo1.maven.org/maven2/org/apache/maven/plugins/maven-plugins/18/maven-plugins-18.pom
Downloading: http://repo1.maven.org/maven2/org/apache/maven/maven-parent/16/maven-parent-16.pom
Downloading: http://repo1.maven.org/maven2/org/apache/apache/7/apache-7.pom
Downloading: http://repo1.maven.org/maven2/org/apache/maven/plugins/maven-clean-plugin/2.4.1/maven-clean-plugin-2.4.1.jar
Downloading: http://repo1.maven.org/maven2/org/apache/maven/plugins/maven-compiler-plugin/2.3.2/maven-compiler-plugin-2.3.2.pom
Downloading: http://repo1.maven.org/maven2/org/apache/maven/plugins/maven-compiler-plugin/2.3.2/maven-compiler-plugin-2.3.2.jar
Downloading: http://repo1.maven.org/maven2/org/apache/maven/plugins/maven-remote-resources-plugin/1.2.1/maven-remote-resources-plugin-1.2.1.pom
Downloading: http://repo1.maven.org/maven2/org/apache/maven/plugins/maven-plugins/19/maven-plugins-19.pom
Downloading: http://repo1.maven.org/maven2/org/apache/maven/maven-parent/19/maven-parent-19.pom
Downloading: http://repo1.maven.org/maven2/org/apache/apache/9/apache-9.pom
Downloading: http://repo1.maven.org/maven2/org/apache/maven/plugins/maven-remote-resources-plugin/1.2.1/maven-remote-resources-plugin-1.2.1.jar
Downloading: http://repo1.maven.org/maven2/org/apache/maven/plugins/maven-antrun-plugin/1.6/maven-antrun-plugin-1.6.pom
Downloading: http://repo1.maven.org/maven2/org/apache/maven/plugins/maven-antrun-plugin/1.6/maven-antrun-plugin-1.6.jar
Downloading: http://repo1.maven.org/maven2/org/apache/maven/plugins/maven-resources-plugin/2.5/maven-resources-plugin-2.5.pom
Downloading: http://repo1.maven.org/maven2/org/apache/maven/plugins/maven-resources-plugin/2.5/maven-resources-plugin-2.5.jar
Downloading: http://repo1.maven.org/maven2/org/apache/maven/maven-plugin-api/2.0.6/maven-plugin-api-2.0.6.pom
Downloading: http://repo1.maven.org/maven2/org/apache/maven/maven/2.0.6/maven-2.0.6.pom
Downloading: http://repo1.maven.org/maven2/org/codehaus/plexus/plexus-utils/2.0.5/plexus-utils-2.0.5.pom
Downloading: http://repo1.maven.org/maven2/org/codehaus/plexus/plexus/2.0.6/plexus-2.0.6.pom
Downloading: http://repo1.maven.org/maven2/org/codehaus/plexus/plexus-utils/2.0.5/plexus-utils-2.0.5.jar
Oct 18, 2011 9:04:33 AM hudson.remoting.Channel$ReaderThread run
SEVERE: I/O error in channel channel
java.io.StreamCorruptedException
at java.io.ObjectInputStream.readObject0(ObjectInputStream.java:1332)
at java.io.ObjectInputStream.readObject(ObjectInputStream.java:348)
at hudson.remoting.Channel$ReaderThread.run(Channel.java:1087)
channel stopped
[INFO] ------------------------------------------------------------------------
[ERROR] FATAL ERROR
[INFO] ------------------------------------------------------------------------
[INFO] null
[INFO] ------------------------------------------------------------------------
[INFO] Trace
java.lang.reflect.UndeclaredThrowableException
at hudson.remoting.$Proxy1.fetch2(Unknown Source)
at hudson.remoting.RemoteClassLoader.findClass(RemoteClassLoader.java:122)
at java.lang.ClassLoader.loadClass(ClassLoader.java:307)
at java.lang.ClassLoader.loadClass(ClassLoader.java:252)
at java.lang.ClassLoader.loadClassInternal(ClassLoader.java:320)
at hudson.maven.reporters.MavenArtifactArchiver.postBuild(MavenArtifactArchiver.java:99)
at hudson.maven.MavenModuleSetBuild$Builder.postModule(MavenModuleSetBuild.java:1109)
at hudson.maven.MavenBuilder$Adapter.fireLeaveModule(MavenBuilder.java:349)
at hudson.maven.MavenBuilder$Adapter.postBuild(MavenBuilder.java:307)
at org.apache.maven.lifecycle.LifecycleExecutorInterceptor.execute(LifecycleExecutorInterceptor.java:68)
at org.apache.maven.DefaultMaven.doExecute(DefaultMaven.java:328)
at org.apache.maven.DefaultMaven.execute(DefaultMaven.java:138)
at org.apache.maven.cli.MavenCli.main(MavenCli.java:362)
at sun.reflect.NativeMethodAccessorImpl.invoke0(Native Method)
at sun.reflect.NativeMethodAccessorImpl.invoke(NativeMethodAccessorImpl.java:39)
at sun.reflect.DelegatingMethodAccessorImpl.invoke(DelegatingMethodAccessorImpl.java:25)
at java.lang.reflect.Method.invoke(Method.java:592)
at org.codehaus.classworlds.Launcher.launchEnhanced(Launcher.java:315)
at org.codehaus.classworlds.Launcher.launch(Launcher.java:255)
at hudson.maven.agent.Main.launch(Main.java:185)
at hudson.maven.MavenBuilder.call(MavenBuilder.java:160)
at hudson.maven.MavenModuleSetBuild$Builder.call(MavenModuleSetBuild.java:1059)
at hudson.maven.MavenModuleSetBuild$Builder.call(MavenModuleSetBuild.java:990)
at hudson.remoting.UserRequest.perform(UserRequest.java:118)
at hudson.remoting.UserRequest.perform(UserRequest.java:48)
at hudson.remoting.Request$2.run(Request.java:287)
at java.util.concurrent.Executors$RunnableAdapter.call(Executors.java:417)
at java.util.concurrent.FutureTask$Sync.innerRun(FutureTask.java:269)
at java.util.concurrent.FutureTask.run(FutureTask.java:123)
at java.util.concurrent.ThreadPoolExecutor$Worker.runTask(ThreadPoolExecutor.java:651)
at java.util.concurrent.ThreadPoolExecutor$Worker.run(ThreadPoolExecutor.java:676)
at java.lang.Thread.run(Thread.java:595)
Caused by: hudson.remoting.ChannelClosedException: channel is already closed
at hudson.remoting.Channel.send(Channel.java:499)
at hudson.remoting.Request.call(Request.java:110)
at hudson.remoting.RemoteInvocationHandler.invoke(RemoteInvocationHandler.java:160)
... 32 more
Caused by: java.io.StreamCorruptedException
at java.io.ObjectInputStream.readObject0(ObjectInputStream.java:1332)
at java.io.ObjectInputStream.readObject(ObjectInputStream.java:348)
at hudson.remoting.Channel$ReaderThread.run(Channel.java:1087)
[INFO] ------------------------------------------------------------------------
[INFO] Total time: 52 seconds
[INFO] Finished at: Tue Oct 18 09:04:33 UTC 2011
ERROR: Maven JVM terminated unexpectedly with exit code 0