You are viewing a plain text version of this content. The canonical link for it is here.
Posted to builds@cassandra.apache.org by Apache Jenkins Server <je...@builds.apache.org> on 2022/11/08 05:51:44 UTC
Build complete: Cassandra-4.0 #497 [UNSTABLE] 7dbbe6907be58138f2c88d0adaab5c99a038e2b1
-------------------------------------------------------------------------------
Build Cassandra-4.0 #497 Still Unstable
URL: https://ci-cassandra.apache.org/job/Cassandra-4.0/497/
-------------------------------------------------------------------------------
Changes:
[a.penya.garcia] CircleCI: Fix j11_utests_fqltool executor
-------------------------------------------------------------------------------
Failed Tests:
6 tests failed.
FAILED: dtest-upgrade.upgrade_tests.cql_tests.TestCQLNodes3RF3_Upgrade_indev_3_11_x_To_indev_4_0_x.test_NPE_during_select_with_token
FAILED: dtest-upgrade.upgrade_tests.cql_tests.TestCQLNodes3RF3_Upgrade_indev_3_0_x_To_indev_4_0_x.test_count
FAILED: dtest.materialized_views_test.TestMaterializedViewsConsistency.test_multi_partition_consistent_reads_after_write
FAILED: org.apache.cassandra.cql3.ViewComplexTest.testMVWithDifferentColumnsWithFlush[2]-compression
FAILED: org.apache.cassandra.service.ClientWarningsTest.testTombstoneWarning[1]
FAILED: org.apache.cassandra.net.ProxyHandlerConnectionsTest.testExpireSome
-------------------------------------------------------------------------------
For complete test report and logs see https://nightlies.apache.org/cassandra/Cassandra-4.0/497/