You are viewing a plain text version of this content. The canonical link for it is here.
Posted to commits@deltaspike.apache.org by Apache Jenkins Server <je...@builds.apache.org> on 2016/05/06 07:44:39 UTC
Build failed in Jenkins: DeltaSpike OWB (nightly) #1275
See <https://builds.apache.org/job/DeltaSpike%20OWB%20(nightly)/1275/>
------------------------------------------
Started by upstream project "DeltaSpike for CDI 1.0" build number 20
originally caused by:
Started by an SCM change
[EnvInject] - Loading node environment variables.
Building remotely on ubuntu-6 (docker Ubuntu ubuntu yahoo-not-h2) in workspace <https://builds.apache.org/job/DeltaSpike%20OWB%20(nightly)/ws/>
> git rev-parse --is-inside-work-tree # timeout=10
Fetching changes from the remote Git repository
> git config remote.origin.url https://git-wip-us.apache.org/repos/asf/deltaspike.git # timeout=10
Fetching upstream changes from https://git-wip-us.apache.org/repos/asf/deltaspike.git
> git --version # timeout=10
> git -c core.askpass=true fetch --tags --progress https://git-wip-us.apache.org/repos/asf/deltaspike.git +refs/heads/*:refs/remotes/origin/*
> git rev-parse origin/master^{commit} # timeout=10
Checking out Revision d2558b7ddf682e41bc829d69bbdafa4927c23887 (origin/master)
> git config core.sparsecheckout # timeout=10
> git checkout -f d2558b7ddf682e41bc829d69bbdafa4927c23887
> git rev-list d2558b7ddf682e41bc829d69bbdafa4927c23887 # timeout=10
Parsing POMs
Modules changed, recalculating dependency graph
Established TCP socket on 32833
maven3-agent.jar already up to date
maven3-interceptor.jar already up to date
maven3-interceptor-commons.jar already up to date
[deltaspike] $ /home/jenkins/tools/java/latest1.6/bin/java -Xmx2g -Xms256m -XX:MaxPermSize=512m -cp /home/jenkins/jenkins-slave/maven3-agent.jar:/home/jenkins/tools/maven/apache-maven-3.0.4/boot/plexus-classworlds-2.4.jar org.jvnet.hudson.maven3.agent.Maven3Main /home/jenkins/tools/maven/apache-maven-3.0.4 /home/jenkins/jenkins-slave/slave.jar /home/jenkins/jenkins-slave/maven3-interceptor.jar /home/jenkins/jenkins-slave/maven3-interceptor-commons.jar 32833
ERROR: Failed to parse POMs
java.io.IOException: Cannot run program "/home/jenkins/tools/java/latest1.6/bin/java" (in directory "<https://builds.apache.org/job/DeltaSpike%20OWB%20(nightly)/ws/deltaspike")>: error=11, Resource temporarily unavailable
at java.lang.ProcessBuilder.start(ProcessBuilder.java:1041)
at hudson.Proc$LocalProc.<init>(Proc.java:244)
at hudson.Proc$LocalProc.<init>(Proc.java:216)
at hudson.Launcher$LocalLauncher.launch(Launcher.java:815)
at hudson.Launcher$ProcStarter.start(Launcher.java:381)
at hudson.Launcher$RemoteLaunchCallable.call(Launcher.java:1148)
at hudson.Launcher$RemoteLaunchCallable.call(Launcher.java:1113)
at hudson.remoting.UserRequest.perform(UserRequest.java:120)
at hudson.remoting.UserRequest.perform(UserRequest.java:48)
at hudson.remoting.Request$2.run(Request.java:326)
at hudson.remoting.InterceptingExecutorService$1.call(InterceptingExecutorService.java:68)
at java.util.concurrent.FutureTask.run(FutureTask.java:262)
at java.util.concurrent.ThreadPoolExecutor.runWorker(ThreadPoolExecutor.java:1145)
at java.util.concurrent.ThreadPoolExecutor$Worker.run(ThreadPoolExecutor.java:615)
at java.lang.Thread.run(Thread.java:745)
at ......remote call to ubuntu-6(Native Method)
at hudson.remoting.Channel.attachCallSiteStackTrace(Channel.java:1416)
at hudson.remoting.UserResponse.retrieve(UserRequest.java:220)
at hudson.remoting.Channel.call(Channel.java:781)
at hudson.Launcher$RemoteLauncher.launch(Launcher.java:928)
at hudson.Launcher$ProcStarter.start(Launcher.java:381)
at hudson.maven.AbstractMavenProcessFactory.newProcess(AbstractMavenProcessFactory.java:281)
at hudson.maven.ProcessCache.get(ProcessCache.java:236)
at hudson.maven.MavenModuleSetBuild$MavenModuleSetBuildExecution.doRun(MavenModuleSetBuild.java:778)
at hudson.model.AbstractBuild$AbstractBuildExecution.run(AbstractBuild.java:534)
at hudson.model.Run.execute(Run.java:1738)
at hudson.maven.MavenModuleSetBuild.run(MavenModuleSetBuild.java:531)
at hudson.model.ResourceController.execute(ResourceController.java:98)
at hudson.model.Executor.run(Executor.java:410)
Caused by: java.io.IOException: error=11, Resource temporarily unavailable
at java.lang.UNIXProcess.forkAndExec(Native Method)
at java.lang.UNIXProcess.<init>(UNIXProcess.java:186)
at java.lang.ProcessImpl.start(ProcessImpl.java:130)
at java.lang.ProcessBuilder.start(ProcessBuilder.java:1022)
at hudson.Proc$LocalProc.<init>(Proc.java:244)
at hudson.Proc$LocalProc.<init>(Proc.java:216)
at hudson.Launcher$LocalLauncher.launch(Launcher.java:815)
at hudson.Launcher$ProcStarter.start(Launcher.java:381)
at hudson.Launcher$RemoteLaunchCallable.call(Launcher.java:1148)
at hudson.Launcher$RemoteLaunchCallable.call(Launcher.java:1113)
at hudson.remoting.UserRequest.perform(UserRequest.java:120)
at hudson.remoting.UserRequest.perform(UserRequest.java:48)
at hudson.remoting.Request$2.run(Request.java:326)
at hudson.remoting.InterceptingExecutorService$1.call(InterceptingExecutorService.java:68)
at java.util.concurrent.FutureTask.run(FutureTask.java:262)
at java.util.concurrent.ThreadPoolExecutor.runWorker(ThreadPoolExecutor.java:1145)
at java.util.concurrent.ThreadPoolExecutor$Worker.run(ThreadPoolExecutor.java:615)
at java.lang.Thread.run(Thread.java:745)
Jenkins build is back to normal : DeltaSpike OWB (nightly) #1278
Posted by Apache Jenkins Server <je...@builds.apache.org>.
See <https://builds.apache.org/job/DeltaSpike%20OWB%20(nightly)/1278/changes>
Build failed in Jenkins: DeltaSpike OWB (nightly) #1277
Posted by Apache Jenkins Server <je...@builds.apache.org>.
See <https://builds.apache.org/job/DeltaSpike%20OWB%20(nightly)/1277/>
------------------------------------------
[...truncated 5229 lines...]
[ERROR] symbol : variable Simple_
[ERROR] location: class org.apache.deltaspike.data.test.service.SimpleCriteriaRepository
[ERROR] <https://builds.apache.org/job/DeltaSpike%20OWB%20(nightly)/ws/deltaspike/modules/data/impl/src/test/java/org/apache/deltaspike/data/test/service/SimpleCriteriaRepository.java>:[132,26] cannot find symbol
[ERROR] symbol : variable Simple_
[ERROR] location: class org.apache.deltaspike.data.test.service.SimpleCriteriaRepository
[ERROR] <https://builds.apache.org/job/DeltaSpike%20OWB%20(nightly)/ws/deltaspike/modules/data/impl/src/test/java/org/apache/deltaspike/data/test/service/SimpleCriteriaRepository.java>:[131,27] cannot find symbol
[ERROR] symbol : variable Simple_
[ERROR] location: class org.apache.deltaspike.data.test.service.SimpleCriteriaRepository
[ERROR] <https://builds.apache.org/job/DeltaSpike%20OWB%20(nightly)/ws/deltaspike/modules/data/impl/src/test/java/org/apache/deltaspike/data/test/service/SimpleCriteriaRepository.java>:[141,20] cannot find symbol
[ERROR] symbol : variable Simple_
[ERROR] location: class org.apache.deltaspike.data.test.service.SimpleCriteriaRepository
[ERROR] <https://builds.apache.org/job/DeltaSpike%20OWB%20(nightly)/ws/deltaspike/modules/data/impl/src/test/java/org/apache/deltaspike/data/test/service/SimpleCriteriaRepository.java>:[139,34] cannot find symbol
[ERROR] symbol : variable Simple_
[ERROR] location: class org.apache.deltaspike.data.test.service.SimpleCriteriaRepository
[ERROR] <https://builds.apache.org/job/DeltaSpike%20OWB%20(nightly)/ws/deltaspike/modules/data/impl/src/test/java/org/apache/deltaspike/data/test/service/SimpleCriteriaRepository.java>:[139,54] cannot find symbol
[ERROR] symbol : variable Simple_
[ERROR] location: class org.apache.deltaspike.data.test.service.SimpleCriteriaRepository
[ERROR] <https://builds.apache.org/job/DeltaSpike%20OWB%20(nightly)/ws/deltaspike/modules/data/impl/src/test/java/org/apache/deltaspike/data/test/service/SimpleCriteriaRepository.java>:[140,63] cannot find symbol
[ERROR] symbol : variable Simple_
[ERROR] location: class org.apache.deltaspike.data.test.service.SimpleCriteriaRepository
[ERROR] <https://builds.apache.org/job/DeltaSpike%20OWB%20(nightly)/ws/deltaspike/modules/data/impl/src/test/java/org/apache/deltaspike/data/test/service/ParentRepository.java>:[48,22] cannot find symbol
[ERROR] symbol : variable Parent_
[ERROR] location: class org.apache.deltaspike.data.test.service.ParentRepository
[ERROR] <https://builds.apache.org/job/DeltaSpike%20OWB%20(nightly)/ws/deltaspike/modules/data/impl/src/test/java/org/apache/deltaspike/data/test/service/ParentRepository.java>:[50,36] cannot find symbol
[ERROR] symbol : variable OneToMany_
[ERROR] location: class org.apache.deltaspike.data.test.service.ParentRepository
[ERROR] <https://builds.apache.org/job/DeltaSpike%20OWB%20(nightly)/ws/deltaspike/modules/data/impl/src/test/java/org/apache/deltaspike/data/test/service/ParentRepository.java>:[44,22] cannot find symbol
[ERROR] symbol : variable Parent_
[ERROR] location: class org.apache.deltaspike.data.test.service.ParentRepository
[ERROR] <https://builds.apache.org/job/DeltaSpike%20OWB%20(nightly)/ws/deltaspike/modules/data/impl/src/test/java/org/apache/deltaspike/data/test/service/ParentRepository.java>:[46,36] cannot find symbol
[ERROR] symbol : variable OneToOne_
[ERROR] location: class org.apache.deltaspike.data.test.service.ParentRepository
[ERROR] <https://builds.apache.org/job/DeltaSpike%20OWB%20(nightly)/ws/deltaspike/modules/data/impl/src/test/java/org/apache/deltaspike/data/test/service/ParentRepository.java>:[43,20] cannot find symbol
[ERROR] symbol : variable Parent_
[ERROR] location: class org.apache.deltaspike.data.test.service.ParentRepository
[ERROR] <https://builds.apache.org/job/DeltaSpike%20OWB%20(nightly)/ws/deltaspike/modules/data/impl/src/test/java/org/apache/deltaspike/data/test/service/ParentRepository.java>:[61,20] cannot find symbol
[ERROR] symbol : variable Parent_
[ERROR] location: class org.apache.deltaspike.data.test.service.ParentRepository
[ERROR] <https://builds.apache.org/job/DeltaSpike%20OWB%20(nightly)/ws/deltaspike/modules/data/impl/src/test/java/org/apache/deltaspike/data/test/service/ParentRepository.java>:[60,20] cannot find symbol
[ERROR] symbol : variable Parent_
[ERROR] location: class org.apache.deltaspike.data.test.service.ParentRepository
[ERROR] <https://builds.apache.org/job/DeltaSpike%20OWB%20(nightly)/ws/deltaspike/modules/data/impl/src/test/java/org/apache/deltaspike/data/test/service/ParentRepository.java>:[59,20] cannot find symbol
[ERROR] symbol : variable Parent_
[ERROR] location: class org.apache.deltaspike.data.test.service.ParentRepository
[ERROR] <https://builds.apache.org/job/DeltaSpike%20OWB%20(nightly)/ws/deltaspike/modules/data/impl/src/test/java/org/apache/deltaspike/data/test/service/ParentRepository.java>:[70,23] cannot find symbol
[ERROR] symbol : variable Parent_
[ERROR] location: class org.apache.deltaspike.data.test.service.ParentRepository
[ERROR] <https://builds.apache.org/job/DeltaSpike%20OWB%20(nightly)/ws/deltaspike/modules/data/impl/src/test/java/org/apache/deltaspike/data/test/service/ParentRepository.java>:[69,20] cannot find symbol
[ERROR] symbol : variable Parent_
[ERROR] location: class org.apache.deltaspike.data.test.service.ParentRepository
[ERROR] <https://builds.apache.org/job/DeltaSpike%20OWB%20(nightly)/ws/deltaspike/modules/data/impl/src/test/java/org/apache/deltaspike/data/test/service/ParentRepository.java>:[79,20] cannot find symbol
[ERROR] symbol : variable Parent_
[ERROR] location: class org.apache.deltaspike.data.test.service.ParentRepository
[ERROR] <https://builds.apache.org/job/DeltaSpike%20OWB%20(nightly)/ws/deltaspike/modules/data/impl/src/test/java/org/apache/deltaspike/data/test/service/ParentRepository.java>:[91,41] cannot find symbol
[ERROR] symbol : variable Parent_
[ERROR] location: class org.apache.deltaspike.data.test.service.ParentRepository
[ERROR] <https://builds.apache.org/job/DeltaSpike%20OWB%20(nightly)/ws/deltaspike/modules/data/impl/src/test/java/org/apache/deltaspike/data/test/service/ParentRepository.java>:[90,36] cannot find symbol
[ERROR] symbol : variable Parent_
[ERROR] location: class org.apache.deltaspike.data.test.service.ParentRepository
[ERROR] <https://builds.apache.org/job/DeltaSpike%20OWB%20(nightly)/ws/deltaspike/modules/data/impl/src/test/java/org/apache/deltaspike/data/test/service/ParentRepository.java>:[94,41] cannot find symbol
[ERROR] symbol : variable Parent_
[ERROR] location: class org.apache.deltaspike.data.test.service.ParentRepository
[ERROR] <https://builds.apache.org/job/DeltaSpike%20OWB%20(nightly)/ws/deltaspike/modules/data/impl/src/test/java/org/apache/deltaspike/data/test/service/ParentRepository.java>:[93,36] cannot find symbol
[ERROR] symbol : variable Parent_
[ERROR] location: class org.apache.deltaspike.data.test.service.ParentRepository
[ERROR] <https://builds.apache.org/job/DeltaSpike%20OWB%20(nightly)/ws/deltaspike/modules/data/impl/src/test/java/org/apache/deltaspike/data/test/service/ParentRepository.java>:[96,36] cannot find symbol
[ERROR] symbol : variable Parent_
[ERROR] location: class org.apache.deltaspike.data.test.service.ParentRepository
[ERROR] <https://builds.apache.org/job/DeltaSpike%20OWB%20(nightly)/ws/deltaspike/modules/data/impl/src/test/java/org/apache/deltaspike/data/test/service/ParentRepository.java>:[105,26] cannot find symbol
[ERROR] symbol : variable Parent_
[ERROR] location: class org.apache.deltaspike.data.test.service.ParentRepository
[ERROR] <https://builds.apache.org/job/DeltaSpike%20OWB%20(nightly)/ws/deltaspike/modules/data/impl/src/test/java/org/apache/deltaspike/data/impl/mapping/MappedRepositoryTest.java>:[154,36] package Simple_ does not exist
[ERROR] <https://builds.apache.org/job/DeltaSpike%20OWB%20(nightly)/ws/deltaspike/modules/data/impl/src/test/java/org/apache/deltaspike/data/impl/handler/EntityRepositoryHandlerTest.java>:[179,48] cannot find symbol
[ERROR] symbol : variable Simple_
[ERROR] location: class org.apache.deltaspike.data.impl.handler.EntityRepositoryHandlerTest
[ERROR] <https://builds.apache.org/job/DeltaSpike%20OWB%20(nightly)/ws/deltaspike/modules/data/impl/src/test/java/org/apache/deltaspike/data/impl/handler/EntityRepositoryHandlerTest.java>:[196,54] cannot find symbol
[ERROR] symbol : variable Simple_
[ERROR] location: class org.apache.deltaspike.data.impl.handler.EntityRepositoryHandlerTest
[ERROR] <https://builds.apache.org/job/DeltaSpike%20OWB%20(nightly)/ws/deltaspike/modules/data/impl/src/test/java/org/apache/deltaspike/data/impl/handler/EntityRepositoryHandlerTest.java>:[196,68] cannot find symbol
[ERROR] symbol : variable Simple_
[ERROR] location: class org.apache.deltaspike.data.impl.handler.EntityRepositoryHandlerTest
[ERROR] <https://builds.apache.org/job/DeltaSpike%20OWB%20(nightly)/ws/deltaspike/modules/data/impl/src/test/java/org/apache/deltaspike/data/impl/handler/EntityRepositoryHandlerTest.java>:[260,53] cannot find symbol
[ERROR] symbol : variable Simple_
[ERROR] location: class org.apache.deltaspike.data.impl.handler.EntityRepositoryHandlerTest
[ERROR] <https://builds.apache.org/job/DeltaSpike%20OWB%20(nightly)/ws/deltaspike/modules/data/impl/src/test/java/org/apache/deltaspike/data/impl/handler/EntityRepositoryHandlerTest.java>:[276,60] cannot find symbol
[ERROR] symbol : variable Simple_
[ERROR] location: class org.apache.deltaspike.data.impl.handler.EntityRepositoryHandlerTest
[ERROR] <https://builds.apache.org/job/DeltaSpike%20OWB%20(nightly)/ws/deltaspike/modules/data/impl/src/test/java/org/apache/deltaspike/data/impl/handler/EntityRepositoryHandlerTest.java>:[293,53] cannot find symbol
[ERROR] symbol : variable Simple_
[ERROR] location: class org.apache.deltaspike.data.impl.handler.EntityRepositoryHandlerTest
[ERROR] <https://builds.apache.org/job/DeltaSpike%20OWB%20(nightly)/ws/deltaspike/modules/data/impl/src/test/java/org/apache/deltaspike/data/impl/handler/EntityRepositoryHandlerTest.java>:[293,67] cannot find symbol
[ERROR] symbol : variable Simple_
[ERROR] location: class org.apache.deltaspike.data.impl.handler.EntityRepositoryHandlerTest
[ERROR] <https://builds.apache.org/job/DeltaSpike%20OWB%20(nightly)/ws/deltaspike/modules/data/impl/src/test/java/org/apache/deltaspike/data/impl/handler/EntityRepositoryHandlerTest.java>:[321,41] cannot find symbol
[ERROR] symbol : variable Simple_
[ERROR] location: class org.apache.deltaspike.data.impl.handler.EntityRepositoryHandlerTest
[ERROR] <https://builds.apache.org/job/DeltaSpike%20OWB%20(nightly)/ws/deltaspike/modules/data/impl/src/test/java/org/apache/deltaspike/data/impl/handler/EntityRepositoryHandlerTest.java>:[321,55] cannot find symbol
[ERROR] symbol : variable Simple_
[ERROR] location: class org.apache.deltaspike.data.impl.handler.EntityRepositoryHandlerTest
[ERROR] <https://builds.apache.org/job/DeltaSpike%20OWB%20(nightly)/ws/deltaspike/modules/data/impl/src/test/java/org/apache/deltaspike/data/impl/handler/EntityRepositoryHandlerTest.java>:[353,45] cannot find symbol
[ERROR] symbol : variable Simple_
[ERROR] location: class org.apache.deltaspike.data.impl.handler.EntityRepositoryHandlerTest
[ERROR] -> [Help 1]
[ERROR]
[ERROR] To see the full stack trace of the errors, re-run Maven with the -e switch.
[ERROR] Re-run Maven using the -X switch to enable full debug logging.
[ERROR]
[ERROR] For more information about the errors and possible solutions, please read the following articles:
[ERROR] [Help 1] http://cwiki.apache.org/confluence/display/MAVEN/MojoFailureException
[ERROR]
[ERROR] After correcting the problems, you can resume the build with the command
[ERROR] mvn <goals> -rf :deltaspike-data-module-impl
[JENKINS] Archiving <https://builds.apache.org/job/DeltaSpike%20OWB%20(nightly)/ws/deltaspike/examples/jse-examples/pom.xml> to org.apache.deltaspike.examples/deltaspike-jse-example/1.6.2-SNAPSHOT/deltaspike-jse-example-1.6.2-SNAPSHOT.pom
[JENKINS] Archiving <https://builds.apache.org/job/DeltaSpike%20OWB%20(nightly)/ws/deltaspike/examples/security-requested-page-after-login-cdi/pom.xml> to org.apache.deltaspike.examples/deltaspike-security-requested-page-after-login-cdi/1.6.2-SNAPSHOT/deltaspike-security-requested-page-after-login-cdi-1.6.2-SNAPSHOT.pom
[JENKINS] Archiving <https://builds.apache.org/job/DeltaSpike%20OWB%20(nightly)/ws/deltaspike/test-utils/pom.xml> to org.apache.deltaspike.test/test-utils/1.6.2-SNAPSHOT/test-utils-1.6.2-SNAPSHOT.pom
[JENKINS] Archiving <https://builds.apache.org/job/DeltaSpike%20OWB%20(nightly)/ws/deltaspike/test-utils/target/test-utils-1.6.2-SNAPSHOT.jar> to org.apache.deltaspike.test/test-utils/1.6.2-SNAPSHOT/test-utils-1.6.2-SNAPSHOT.jar
[JENKINS] Archiving <https://builds.apache.org/job/DeltaSpike%20OWB%20(nightly)/ws/deltaspike/test-utils/target/test-utils-1.6.2-SNAPSHOT-sources.jar> to org.apache.deltaspike.test/test-utils/1.6.2-SNAPSHOT/test-utils-1.6.2-SNAPSHOT-sources.jar
[JENKINS] Archiving <https://builds.apache.org/job/DeltaSpike%20OWB%20(nightly)/ws/documentation/pom.xml> to org.apache.deltaspike/deltaspike-documentation/1.6.2-SNAPSHOT/deltaspike-documentation-1.6.2-SNAPSHOT.pom
No prior successful build to compare, so performing full copy of artifacts
[JENKINS] Archiving <https://builds.apache.org/job/DeltaSpike%20OWB%20(nightly)/ws/deltaspike/modules/data/impl/pom.xml> to org.apache.deltaspike.modules/deltaspike-data-module-impl/1.6.2-SNAPSHOT/deltaspike-data-module-impl-1.6.2-SNAPSHOT.pom
[JENKINS] Archiving <https://builds.apache.org/job/DeltaSpike%20OWB%20(nightly)/ws/deltaspike/modules/data/api/pom.xml> to org.apache.deltaspike.modules/deltaspike-data-module-api/1.6.2-SNAPSHOT/deltaspike-data-module-api-1.6.2-SNAPSHOT.pom
[JENKINS] Archiving <https://builds.apache.org/job/DeltaSpike%20OWB%20(nightly)/ws/deltaspike/modules/data/api/target/deltaspike-data-module-api-1.6.2-SNAPSHOT.jar> to org.apache.deltaspike.modules/deltaspike-data-module-api/1.6.2-SNAPSHOT/deltaspike-data-module-api-1.6.2-SNAPSHOT.jar
[JENKINS] Archiving <https://builds.apache.org/job/DeltaSpike%20OWB%20(nightly)/ws/deltaspike/modules/data/api/target/deltaspike-data-module-api-1.6.2-SNAPSHOT-tests.jar> to org.apache.deltaspike.modules/deltaspike-data-module-api/1.6.2-SNAPSHOT/deltaspike-data-module-api-1.6.2-SNAPSHOT-tests.jar
[JENKINS] Archiving <https://builds.apache.org/job/DeltaSpike%20OWB%20(nightly)/ws/deltaspike/modules/data/api/target/deltaspike-data-module-api-1.6.2-SNAPSHOT-sources.jar> to org.apache.deltaspike.modules/deltaspike-data-module-api/1.6.2-SNAPSHOT/deltaspike-data-module-api-1.6.2-SNAPSHOT-sources.jar
[JENKINS] Archiving <https://builds.apache.org/job/DeltaSpike%20OWB%20(nightly)/ws/deltaspike/core/impl/pom.xml> to org.apache.deltaspike.core/deltaspike-core-impl/1.6.2-SNAPSHOT/deltaspike-core-impl-1.6.2-SNAPSHOT.pom
[JENKINS] Archiving <https://builds.apache.org/job/DeltaSpike%20OWB%20(nightly)/ws/deltaspike/core/impl/target/deltaspike-core-impl-1.6.2-SNAPSHOT.jar> to org.apache.deltaspike.core/deltaspike-core-impl/1.6.2-SNAPSHOT/deltaspike-core-impl-1.6.2-SNAPSHOT.jar
[JENKINS] Archiving <https://builds.apache.org/job/DeltaSpike%20OWB%20(nightly)/ws/deltaspike/core/impl/target/deltaspike-core-impl-1.6.2-SNAPSHOT-tests.jar> to org.apache.deltaspike.core/deltaspike-core-impl/1.6.2-SNAPSHOT/deltaspike-core-impl-1.6.2-SNAPSHOT-tests.jar
[JENKINS] Archiving <https://builds.apache.org/job/DeltaSpike%20OWB%20(nightly)/ws/deltaspike/core/impl/target/deltaspike-core-impl-1.6.2-SNAPSHOT-sources.jar> to org.apache.deltaspike.core/deltaspike-core-impl/1.6.2-SNAPSHOT/deltaspike-core-impl-1.6.2-SNAPSHOT-sources.jar
[JENKINS] Archiving <https://builds.apache.org/job/DeltaSpike%20OWB%20(nightly)/ws/deltaspike/modules/pom.xml> to org.apache.deltaspike.modules/modules-project/1.6.2-SNAPSHOT/modules-project-1.6.2-SNAPSHOT.pom
[JENKINS] Archiving <https://builds.apache.org/job/DeltaSpike%20OWB%20(nightly)/ws/deltaspike/modules/target/modules-project-1.6.2-SNAPSHOT-tests.jar> to org.apache.deltaspike.modules/modules-project/1.6.2-SNAPSHOT/modules-project-1.6.2-SNAPSHOT-tests.jar
[JENKINS] Archiving <https://builds.apache.org/job/DeltaSpike%20OWB%20(nightly)/ws/deltaspike/modules/test-control/pom.xml> to org.apache.deltaspike.modules/test-control-module-project/1.6.2-SNAPSHOT/test-control-module-project-1.6.2-SNAPSHOT.pom
[JENKINS] Archiving <https://builds.apache.org/job/DeltaSpike%20OWB%20(nightly)/ws/deltaspike/examples/jsf-examples/pom.xml> to org.apache.deltaspike.examples/deltaspike-jsf-example/1.6.2-SNAPSHOT/deltaspike-jsf-example-1.6.2-SNAPSHOT.pom
[JENKINS] Archiving <https://builds.apache.org/job/DeltaSpike%20OWB%20(nightly)/ws/deltaspike/cdictrl/servlet/pom.xml> to org.apache.deltaspike.cdictrl/deltaspike-cdictrl-servlet/1.6.2-SNAPSHOT/deltaspike-cdictrl-servlet-1.6.2-SNAPSHOT.pom
[JENKINS] Archiving <https://builds.apache.org/job/DeltaSpike%20OWB%20(nightly)/ws/deltaspike/cdictrl/servlet/target/deltaspike-cdictrl-servlet-1.6.2-SNAPSHOT.jar> to org.apache.deltaspike.cdictrl/deltaspike-cdictrl-servlet/1.6.2-SNAPSHOT/deltaspike-cdictrl-servlet-1.6.2-SNAPSHOT.jar
[JENKINS] Archiving <https://builds.apache.org/job/DeltaSpike%20OWB%20(nightly)/ws/deltaspike/cdictrl/servlet/target/deltaspike-cdictrl-servlet-1.6.2-SNAPSHOT-sources.jar> to org.apache.deltaspike.cdictrl/deltaspike-cdictrl-servlet/1.6.2-SNAPSHOT/deltaspike-cdictrl-servlet-1.6.2-SNAPSHOT-sources.jar
[JENKINS] Archiving <https://builds.apache.org/job/DeltaSpike%20OWB%20(nightly)/ws/deltaspike/cdictrl/api/pom.xml> to org.apache.deltaspike.cdictrl/deltaspike-cdictrl-api/1.6.2-SNAPSHOT/deltaspike-cdictrl-api-1.6.2-SNAPSHOT.pom
[JENKINS] Archiving <https://builds.apache.org/job/DeltaSpike%20OWB%20(nightly)/ws/deltaspike/cdictrl/api/target/deltaspike-cdictrl-api-1.6.2-SNAPSHOT.jar> to org.apache.deltaspike.cdictrl/deltaspike-cdictrl-api/1.6.2-SNAPSHOT/deltaspike-cdictrl-api-1.6.2-SNAPSHOT.jar
[JENKINS] Archiving <https://builds.apache.org/job/DeltaSpike%20OWB%20(nightly)/ws/deltaspike/cdictrl/api/target/deltaspike-cdictrl-api-1.6.2-SNAPSHOT-sources.jar> to org.apache.deltaspike.cdictrl/deltaspike-cdictrl-api/1.6.2-SNAPSHOT/deltaspike-cdictrl-api-1.6.2-SNAPSHOT-sources.jar
[JENKINS] Archiving <https://builds.apache.org/job/DeltaSpike%20OWB%20(nightly)/ws/deltaspike/examples/scheduler-playground/pom.xml> to org.apache.deltaspike.examples/deltaspike-scheduler-example/1.6.2-SNAPSHOT/deltaspike-scheduler-example-1.6.2-SNAPSHOT.pom
[JENKINS] Archiving <https://builds.apache.org/job/DeltaSpike%20OWB%20(nightly)/ws/deltaspike/checkstyle-rules/pom.xml> to org.apache.deltaspike/checkstyle-rules/1.6.2-SNAPSHOT/checkstyle-rules-1.6.2-SNAPSHOT.pom
[JENKINS] Archiving <https://builds.apache.org/job/DeltaSpike%20OWB%20(nightly)/ws/deltaspike/checkstyle-rules/target/checkstyle-rules-1.6.2-SNAPSHOT.jar> to org.apache.deltaspike/checkstyle-rules/1.6.2-SNAPSHOT/checkstyle-rules-1.6.2-SNAPSHOT.jar
[JENKINS] Archiving <https://builds.apache.org/job/DeltaSpike%20OWB%20(nightly)/ws/deltaspike/parent/code/pom.xml> to org.apache.deltaspike/parent-code/1.6.2-SNAPSHOT/parent-code-1.6.2-SNAPSHOT.pom
[JENKINS] Archiving <https://builds.apache.org/job/DeltaSpike%20OWB%20(nightly)/ws/deltaspike/parent/code/target/parent-code-1.6.2-SNAPSHOT-tests.jar> to org.apache.deltaspike/parent-code/1.6.2-SNAPSHOT/parent-code-1.6.2-SNAPSHOT-tests.jar
Compressed 87.71 KB of artifacts by 36.5% relative to #1276
[JENKINS] Archiving <https://builds.apache.org/job/DeltaSpike%20OWB%20(nightly)/ws/deltaspike/modules/jsf/impl/pom.xml> to org.apache.deltaspike.modules/deltaspike-jsf-module-impl/1.6.2-SNAPSHOT/deltaspike-jsf-module-impl-1.6.2-SNAPSHOT.pom
[JENKINS] Archiving <https://builds.apache.org/job/DeltaSpike%20OWB%20(nightly)/ws/deltaspike/modules/jsf/impl/target/deltaspike-jsf-module-impl-1.6.2-SNAPSHOT.jar> to org.apache.deltaspike.modules/deltaspike-jsf-module-impl/1.6.2-SNAPSHOT/deltaspike-jsf-module-impl-1.6.2-SNAPSHOT.jar
[JENKINS] Archiving <https://builds.apache.org/job/DeltaSpike%20OWB%20(nightly)/ws/deltaspike/modules/jsf/impl/target/deltaspike-jsf-module-impl-1.6.2-SNAPSHOT-tests.jar> to org.apache.deltaspike.modules/deltaspike-jsf-module-impl/1.6.2-SNAPSHOT/deltaspike-jsf-module-impl-1.6.2-SNAPSHOT-tests.jar
[JENKINS] Archiving <https://builds.apache.org/job/DeltaSpike%20OWB%20(nightly)/ws/deltaspike/modules/jsf/impl/target/deltaspike-jsf-module-impl-1.6.2-SNAPSHOT-sources.jar> to org.apache.deltaspike.modules/deltaspike-jsf-module-impl/1.6.2-SNAPSHOT/deltaspike-jsf-module-impl-1.6.2-SNAPSHOT-sources.jar
[JENKINS] Archiving <https://builds.apache.org/job/DeltaSpike%20OWB%20(nightly)/ws/deltaspike/modules/partial-bean/pom.xml> to org.apache.deltaspike.modules/partial-bean-module-project/1.6.2-SNAPSHOT/partial-bean-module-project-1.6.2-SNAPSHOT.pom
[JENKINS] Archiving <https://builds.apache.org/job/DeltaSpike%20OWB%20(nightly)/ws/deltaspike/modules/partial-bean/target/partial-bean-module-project-1.6.2-SNAPSHOT-tests.jar> to org.apache.deltaspike.modules/partial-bean-module-project/1.6.2-SNAPSHOT/partial-bean-module-project-1.6.2-SNAPSHOT-tests.jar
[JENKINS] Archiving <https://builds.apache.org/job/DeltaSpike%20OWB%20(nightly)/ws/deltaspike/examples/pom.xml> to org.apache.deltaspike.examples/examples-project/1.6.2-SNAPSHOT/examples-project-1.6.2-SNAPSHOT.pom
[JENKINS] Archiving <https://builds.apache.org/job/DeltaSpike%20OWB%20(nightly)/ws/deltaspike/modules/jsf/pom.xml> to org.apache.deltaspike.modules/jsf-module-project/1.6.2-SNAPSHOT/jsf-module-project-1.6.2-SNAPSHOT.pom
[JENKINS] Archiving <https://builds.apache.org/job/DeltaSpike%20OWB%20(nightly)/ws/deltaspike/modules/jsf/target/jsf-module-project-1.6.2-SNAPSHOT-tests.jar> to org.apache.deltaspike.modules/jsf-module-project/1.6.2-SNAPSHOT/jsf-module-project-1.6.2-SNAPSHOT-tests.jar
[JENKINS] Archiving <https://builds.apache.org/job/DeltaSpike%20OWB%20(nightly)/ws/deltaspike/cdictrl/tck/pom.xml> to org.apache.deltaspike.test/deltaspike-cdictrl-tck/1.6.2-SNAPSHOT/deltaspike-cdictrl-tck-1.6.2-SNAPSHOT.pom
[JENKINS] Archiving <https://builds.apache.org/job/DeltaSpike%20OWB%20(nightly)/ws/deltaspike/cdictrl/tck/target/deltaspike-cdictrl-tck-1.6.2-SNAPSHOT.jar> to org.apache.deltaspike.test/deltaspike-cdictrl-tck/1.6.2-SNAPSHOT/deltaspike-cdictrl-tck-1.6.2-SNAPSHOT.jar
[JENKINS] Archiving <https://builds.apache.org/job/DeltaSpike%20OWB%20(nightly)/ws/deltaspike/cdictrl/tck/target/deltaspike-cdictrl-tck-1.6.2-SNAPSHOT-sources.jar> to org.apache.deltaspike.test/deltaspike-cdictrl-tck/1.6.2-SNAPSHOT/deltaspike-cdictrl-tck-1.6.2-SNAPSHOT-sources.jar
[JENKINS] Archiving <https://builds.apache.org/job/DeltaSpike%20OWB%20(nightly)/ws/deltaspike/modules/jsf/api/pom.xml> to org.apache.deltaspike.modules/deltaspike-jsf-module-api/1.6.2-SNAPSHOT/deltaspike-jsf-module-api-1.6.2-SNAPSHOT.pom
[JENKINS] Archiving <https://builds.apache.org/job/DeltaSpike%20OWB%20(nightly)/ws/deltaspike/modules/jsf/api/target/deltaspike-jsf-module-api-1.6.2-SNAPSHOT.jar> to org.apache.deltaspike.modules/deltaspike-jsf-module-api/1.6.2-SNAPSHOT/deltaspike-jsf-module-api-1.6.2-SNAPSHOT.jar
[JENKINS] Archiving <https://builds.apache.org/job/DeltaSpike%20OWB%20(nightly)/ws/deltaspike/modules/jsf/api/target/deltaspike-jsf-module-api-1.6.2-SNAPSHOT-tests.jar> to org.apache.deltaspike.modules/deltaspike-jsf-module-api/1.6.2-SNAPSHOT/deltaspike-jsf-module-api-1.6.2-SNAPSHOT-tests.jar
[JENKINS] Archiving <https://builds.apache.org/job/DeltaSpike%20OWB%20(nightly)/ws/deltaspike/modules/jsf/api/target/deltaspike-jsf-module-api-1.6.2-SNAPSHOT-sources.jar> to org.apache.deltaspike.modules/deltaspike-jsf-module-api/1.6.2-SNAPSHOT/deltaspike-jsf-module-api-1.6.2-SNAPSHOT-sources.jar
[JENKINS] Archiving <https://builds.apache.org/job/DeltaSpike%20OWB%20(nightly)/ws/deltaspike/modules/security/pom.xml> to org.apache.deltaspike.modules/security-module-project/1.6.2-SNAPSHOT/security-module-project-1.6.2-SNAPSHOT.pom
[JENKINS] Archiving <https://builds.apache.org/job/DeltaSpike%20OWB%20(nightly)/ws/deltaspike/modules/security/target/security-module-project-1.6.2-SNAPSHOT-tests.jar> to org.apache.deltaspike.modules/security-module-project/1.6.2-SNAPSHOT/security-module-project-1.6.2-SNAPSHOT-tests.jar
[JENKINS] Archiving <https://builds.apache.org/job/DeltaSpike%20OWB%20(nightly)/ws/deltaspike/modules/bean-validation/pom.xml> to org.apache.deltaspike.modules/bean-validation-module-project/1.6.2-SNAPSHOT/bean-validation-module-project-1.6.2-SNAPSHOT.pom
[JENKINS] Archiving <https://builds.apache.org/job/DeltaSpike%20OWB%20(nightly)/ws/deltaspike/modules/bean-validation/target/bean-validation-module-project-1.6.2-SNAPSHOT-tests.jar> to org.apache.deltaspike.modules/bean-validation-module-project/1.6.2-SNAPSHOT/bean-validation-module-project-1.6.2-SNAPSHOT-tests.jar
[JENKINS] Archiving <https://builds.apache.org/job/DeltaSpike%20OWB%20(nightly)/ws/deltaspike/modules/partial-bean/impl/pom.xml> to org.apache.deltaspike.modules/deltaspike-partial-bean-module-impl/1.6.2-SNAPSHOT/deltaspike-partial-bean-module-impl-1.6.2-SNAPSHOT.pom
[JENKINS] Archiving <https://builds.apache.org/job/DeltaSpike%20OWB%20(nightly)/ws/deltaspike/modules/partial-bean/impl/target/deltaspike-partial-bean-module-impl-1.6.2-SNAPSHOT.jar> to org.apache.deltaspike.modules/deltaspike-partial-bean-module-impl/1.6.2-SNAPSHOT/deltaspike-partial-bean-module-impl-1.6.2-SNAPSHOT.jar
[JENKINS] Archiving <https://builds.apache.org/job/DeltaSpike%20OWB%20(nightly)/ws/deltaspike/modules/partial-bean/impl/target/deltaspike-partial-bean-module-impl-1.6.2-SNAPSHOT-tests.jar> to org.apache.deltaspike.modules/deltaspike-partial-bean-module-impl/1.6.2-SNAPSHOT/deltaspike-partial-bean-module-impl-1.6.2-SNAPSHOT-tests.jar
[JENKINS] Archiving <https://builds.apache.org/job/DeltaSpike%20OWB%20(nightly)/ws/deltaspike/modules/partial-bean/impl/target/deltaspike-partial-bean-module-impl-1.6.2-SNAPSHOT-sources.jar> to org.apache.deltaspike.modules/deltaspike-partial-bean-module-impl/1.6.2-SNAPSHOT/deltaspike-partial-bean-module-impl-1.6.2-SNAPSHOT-sources.jar
[JENKINS] Archiving <https://builds.apache.org/job/DeltaSpike%20OWB%20(nightly)/ws/deltaspike/modules/proxy/api/pom.xml> to org.apache.deltaspike.modules/deltaspike-proxy-module-api/1.6.2-SNAPSHOT/deltaspike-proxy-module-api-1.6.2-SNAPSHOT.pom
[JENKINS] Archiving <https://builds.apache.org/job/DeltaSpike%20OWB%20(nightly)/ws/deltaspike/modules/proxy/api/target/deltaspike-proxy-module-api-1.6.2-SNAPSHOT.jar> to org.apache.deltaspike.modules/deltaspike-proxy-module-api/1.6.2-SNAPSHOT/deltaspike-proxy-module-api-1.6.2-SNAPSHOT.jar
[JENKINS] Archiving <https://builds.apache.org/job/DeltaSpike%20OWB%20(nightly)/ws/deltaspike/modules/proxy/api/target/deltaspike-proxy-module-api-1.6.2-SNAPSHOT-tests.jar> to org.apache.deltaspike.modules/deltaspike-proxy-module-api/1.6.2-SNAPSHOT/deltaspike-proxy-module-api-1.6.2-SNAPSHOT-tests.jar
[JENKINS] Archiving <https://builds.apache.org/job/DeltaSpike%20OWB%20(nightly)/ws/deltaspike/modules/proxy/api/target/deltaspike-proxy-module-api-1.6.2-SNAPSHOT-sources.jar> to org.apache.deltaspike.modules/deltaspike-proxy-module-api/1.6.2-SNAPSHOT/deltaspike-proxy-module-api-1.6.2-SNAPSHOT-sources.jar
[JENKINS] Archiving <https://builds.apache.org/job/DeltaSpike%20OWB%20(nightly)/ws/deltaspike/modules/jpa/api/pom.xml> to org.apache.deltaspike.modules/deltaspike-jpa-module-api/1.6.2-SNAPSHOT/deltaspike-jpa-module-api-1.6.2-SNAPSHOT.pom
[JENKINS] Archiving <https://builds.apache.org/job/DeltaSpike%20OWB%20(nightly)/ws/deltaspike/modules/jpa/api/target/deltaspike-jpa-module-api-1.6.2-SNAPSHOT.jar> to org.apache.deltaspike.modules/deltaspike-jpa-module-api/1.6.2-SNAPSHOT/deltaspike-jpa-module-api-1.6.2-SNAPSHOT.jar
[JENKINS] Archiving <https://builds.apache.org/job/DeltaSpike%20OWB%20(nightly)/ws/deltaspike/modules/jpa/api/target/deltaspike-jpa-module-api-1.6.2-SNAPSHOT-tests.jar> to org.apache.deltaspike.modules/deltaspike-jpa-module-api/1.6.2-SNAPSHOT/deltaspike-jpa-module-api-1.6.2-SNAPSHOT-tests.jar
[JENKINS] Archiving <https://builds.apache.org/job/DeltaSpike%20OWB%20(nightly)/ws/deltaspike/modules/jpa/api/target/deltaspike-jpa-module-api-1.6.2-SNAPSHOT-sources.jar> to org.apache.deltaspike.modules/deltaspike-jpa-module-api/1.6.2-SNAPSHOT/deltaspike-jpa-module-api-1.6.2-SNAPSHOT-sources.jar
[JENKINS] Archiving <https://builds.apache.org/job/DeltaSpike%20OWB%20(nightly)/ws/deltaspike/modules/servlet/api/pom.xml> to org.apache.deltaspike.modules/deltaspike-servlet-module-api/1.6.2-SNAPSHOT/deltaspike-servlet-module-api-1.6.2-SNAPSHOT.pom
[JENKINS] Archiving <https://builds.apache.org/job/DeltaSpike%20OWB%20(nightly)/ws/deltaspike/modules/servlet/api/target/deltaspike-servlet-module-api-1.6.2-SNAPSHOT.jar> to org.apache.deltaspike.modules/deltaspike-servlet-module-api/1.6.2-SNAPSHOT/deltaspike-servlet-module-api-1.6.2-SNAPSHOT.jar
[JENKINS] Archiving <https://builds.apache.org/job/DeltaSpike%20OWB%20(nightly)/ws/deltaspike/modules/servlet/api/target/deltaspike-servlet-module-api-1.6.2-SNAPSHOT-tests.jar> to org.apache.deltaspike.modules/deltaspike-servlet-module-api/1.6.2-SNAPSHOT/deltaspike-servlet-module-api-1.6.2-SNAPSHOT-tests.jar
[JENKINS] Archiving <https://builds.apache.org/job/DeltaSpike%20OWB%20(nightly)/ws/deltaspike/modules/servlet/api/target/deltaspike-servlet-module-api-1.6.2-SNAPSHOT-sources.jar> to org.apache.deltaspike.modules/deltaspike-servlet-module-api/1.6.2-SNAPSHOT/deltaspike-servlet-module-api-1.6.2-SNAPSHOT-sources.jar
[JENKINS] Archiving <https://builds.apache.org/job/DeltaSpike%20OWB%20(nightly)/ws/deltaspike/modules/jpa/pom.xml> to org.apache.deltaspike.modules/jpa-module-project/1.6.2-SNAPSHOT/jpa-module-project-1.6.2-SNAPSHOT.pom
[JENKINS] Archiving <https://builds.apache.org/job/DeltaSpike%20OWB%20(nightly)/ws/deltaspike/modules/jpa/target/jpa-module-project-1.6.2-SNAPSHOT-tests.jar> to org.apache.deltaspike.modules/jpa-module-project/1.6.2-SNAPSHOT/jpa-module-project-1.6.2-SNAPSHOT-tests.jar
[JENKINS] Archiving <https://builds.apache.org/job/DeltaSpike%20OWB%20(nightly)/ws/deltaspike/cdictrl/pom.xml> to org.apache.deltaspike.cdictrl/cdictrl-project/1.6.2-SNAPSHOT/cdictrl-project-1.6.2-SNAPSHOT.pom
[JENKINS] Archiving <https://builds.apache.org/job/DeltaSpike%20OWB%20(nightly)/ws/deltaspike/modules/scheduler/api/pom.xml> to org.apache.deltaspike.modules/deltaspike-scheduler-module-api/1.6.2-SNAPSHOT/deltaspike-scheduler-module-api-1.6.2-SNAPSHOT.pom
[JENKINS] Archiving <https://builds.apache.org/job/DeltaSpike%20OWB%20(nightly)/ws/deltaspike/modules/test-control/impl/pom.xml> to org.apache.deltaspike.modules/deltaspike-test-control-module-impl/1.6.2-SNAPSHOT/deltaspike-test-control-module-impl-1.6.2-SNAPSHOT.pom
[JENKINS] Archiving <https://builds.apache.org/job/DeltaSpike%20OWB%20(nightly)/ws/deltaspike/modules/servlet/pom.xml> to org.apache.deltaspike.modules/servlet-module-project/1.6.2-SNAPSHOT/servlet-module-project-1.6.2-SNAPSHOT.pom
[JENKINS] Archiving <https://builds.apache.org/job/DeltaSpike%20OWB%20(nightly)/ws/deltaspike/modules/servlet/target/servlet-module-project-1.6.2-SNAPSHOT-tests.jar> to org.apache.deltaspike.modules/servlet-module-project/1.6.2-SNAPSHOT/servlet-module-project-1.6.2-SNAPSHOT-tests.jar
[JENKINS] Archiving <https://builds.apache.org/job/DeltaSpike%20OWB%20(nightly)/ws/deltaspike/modules/test-control/api/pom.xml> to org.apache.deltaspike.modules/deltaspike-test-control-module-api/1.6.2-SNAPSHOT/deltaspike-test-control-module-api-1.6.2-SNAPSHOT.pom
[JENKINS] Archiving <https://builds.apache.org/job/DeltaSpike%20OWB%20(nightly)/ws/deltaspike/modules/jsf/impl-ee6/pom.xml> to org.apache.deltaspike.modules/deltaspike-jsf-module-impl-ee6/1.6.2-SNAPSHOT/deltaspike-jsf-module-impl-ee6-1.6.2-SNAPSHOT.pom
[JENKINS] Archiving <https://builds.apache.org/job/DeltaSpike%20OWB%20(nightly)/ws/deltaspike/modules/jsf/impl-ee6/target/deltaspike-jsf-module-impl-ee6-1.6.2-SNAPSHOT.jar> to org.apache.deltaspike.modules/deltaspike-jsf-module-impl-ee6/1.6.2-SNAPSHOT/deltaspike-jsf-module-impl-ee6-1.6.2-SNAPSHOT.jar
[JENKINS] Archiving <https://builds.apache.org/job/DeltaSpike%20OWB%20(nightly)/ws/deltaspike/modules/jsf/impl-ee6/target/deltaspike-jsf-module-impl-ee6-1.6.2-SNAPSHOT-tests.jar> to org.apache.deltaspike.modules/deltaspike-jsf-module-impl-ee6/1.6.2-SNAPSHOT/deltaspike-jsf-module-impl-ee6-1.6.2-SNAPSHOT-tests.jar
[JENKINS] Archiving <https://builds.apache.org/job/DeltaSpike%20OWB%20(nightly)/ws/deltaspike/modules/jsf/impl-ee6/target/deltaspike-jsf-module-impl-ee6-1.6.2-SNAPSHOT-sources.jar> to org.apache.deltaspike.modules/deltaspike-jsf-module-impl-ee6/1.6.2-SNAPSHOT/deltaspike-jsf-module-impl-ee6-1.6.2-SNAPSHOT-sources.jar
[JENKINS] Archiving <https://builds.apache.org/job/DeltaSpike%20OWB%20(nightly)/ws/deltaspike/modules/proxy/pom.xml> to org.apache.deltaspike.modules/proxy-module-project/1.6.2-SNAPSHOT/proxy-module-project-1.6.2-SNAPSHOT.pom
[JENKINS] Archiving <https://builds.apache.org/job/DeltaSpike%20OWB%20(nightly)/ws/deltaspike/modules/proxy/target/proxy-module-project-1.6.2-SNAPSHOT-tests.jar> to org.apache.deltaspike.modules/proxy-module-project/1.6.2-SNAPSHOT/proxy-module-project-1.6.2-SNAPSHOT-tests.jar
[JENKINS] Archiving <https://builds.apache.org/job/DeltaSpike%20OWB%20(nightly)/ws/deltaspike/modules/partial-bean/api/pom.xml> to org.apache.deltaspike.modules/deltaspike-partial-bean-module-api/1.6.2-SNAPSHOT/deltaspike-partial-bean-module-api-1.6.2-SNAPSHOT.pom
[JENKINS] Archiving <https://builds.apache.org/job/DeltaSpike%20OWB%20(nightly)/ws/deltaspike/modules/partial-bean/api/target/deltaspike-partial-bean-module-api-1.6.2-SNAPSHOT.jar> to org.apache.deltaspike.modules/deltaspike-partial-bean-module-api/1.6.2-SNAPSHOT/deltaspike-partial-bean-module-api-1.6.2-SNAPSHOT.jar
[JENKINS] Archiving <https://builds.apache.org/job/DeltaSpike%20OWB%20(nightly)/ws/deltaspike/modules/partial-bean/api/target/deltaspike-partial-bean-module-api-1.6.2-SNAPSHOT-tests.jar> to org.apache.deltaspike.modules/deltaspike-partial-bean-module-api/1.6.2-SNAPSHOT/deltaspike-partial-bean-module-api-1.6.2-SNAPSHOT-tests.jar
[JENKINS] Archiving <https://builds.apache.org/job/DeltaSpike%20OWB%20(nightly)/ws/deltaspike/modules/partial-bean/api/target/deltaspike-partial-bean-module-api-1.6.2-SNAPSHOT-sources.jar> to org.apache.deltaspike.modules/deltaspike-partial-bean-module-api/1.6.2-SNAPSHOT/deltaspike-partial-bean-module-api-1.6.2-SNAPSHOT-sources.jar
[JENKINS] Archiving <https://builds.apache.org/job/DeltaSpike%20OWB%20(nightly)/ws/deltaspike/modules/scheduler/impl/pom.xml> to org.apache.deltaspike.modules/deltaspike-scheduler-module-impl/1.6.2-SNAPSHOT/deltaspike-scheduler-module-impl-1.6.2-SNAPSHOT.pom
[JENKINS] Archiving <https://builds.apache.org/job/DeltaSpike%20OWB%20(nightly)/ws/deltaspike/parent/pom.xml> to org.apache.deltaspike/parent/1.6.2-SNAPSHOT/parent-1.6.2-SNAPSHOT.pom
Compressed 40.15 KB of artifacts by 79.7% relative to #1276
[JENKINS] Archiving <https://builds.apache.org/job/DeltaSpike%20OWB%20(nightly)/ws/deltaspike/core/pom.xml> to org.apache.deltaspike.core/core-project/1.6.2-SNAPSHOT/core-project-1.6.2-SNAPSHOT.pom
[JENKINS] Archiving <https://builds.apache.org/job/DeltaSpike%20OWB%20(nightly)/ws/deltaspike/core/target/core-project-1.6.2-SNAPSHOT-tests.jar> to org.apache.deltaspike.core/core-project/1.6.2-SNAPSHOT/core-project-1.6.2-SNAPSHOT-tests.jar
[JENKINS] Archiving <https://builds.apache.org/job/DeltaSpike%20OWB%20(nightly)/ws/deltaspike/modules/bean-validation/api/pom.xml> to org.apache.deltaspike.modules/deltaspike-bean-validation-module-api/1.6.2-SNAPSHOT/deltaspike-bean-validation-module-api-1.6.2-SNAPSHOT.pom
[JENKINS] Archiving <https://builds.apache.org/job/DeltaSpike%20OWB%20(nightly)/ws/deltaspike/modules/bean-validation/api/target/deltaspike-bean-validation-module-api-1.6.2-SNAPSHOT.jar> to org.apache.deltaspike.modules/deltaspike-bean-validation-module-api/1.6.2-SNAPSHOT/deltaspike-bean-validation-module-api-1.6.2-SNAPSHOT.jar
[JENKINS] Archiving <https://builds.apache.org/job/DeltaSpike%20OWB%20(nightly)/ws/deltaspike/modules/bean-validation/api/target/deltaspike-bean-validation-module-api-1.6.2-SNAPSHOT-tests.jar> to org.apache.deltaspike.modules/deltaspike-bean-validation-module-api/1.6.2-SNAPSHOT/deltaspike-bean-validation-module-api-1.6.2-SNAPSHOT-tests.jar
[JENKINS] Archiving <https://builds.apache.org/job/DeltaSpike%20OWB%20(nightly)/ws/deltaspike/modules/bean-validation/api/target/deltaspike-bean-validation-module-api-1.6.2-SNAPSHOT-sources.jar> to org.apache.deltaspike.modules/deltaspike-bean-validation-module-api/1.6.2-SNAPSHOT/deltaspike-bean-validation-module-api-1.6.2-SNAPSHOT-sources.jar
[JENKINS] Archiving <https://builds.apache.org/job/DeltaSpike%20OWB%20(nightly)/ws/deltaspike/core/api/pom.xml> to org.apache.deltaspike.core/deltaspike-core-api/1.6.2-SNAPSHOT/deltaspike-core-api-1.6.2-SNAPSHOT.pom
[JENKINS] Archiving <https://builds.apache.org/job/DeltaSpike%20OWB%20(nightly)/ws/deltaspike/core/api/target/deltaspike-core-api-1.6.2-SNAPSHOT.jar> to org.apache.deltaspike.core/deltaspike-core-api/1.6.2-SNAPSHOT/deltaspike-core-api-1.6.2-SNAPSHOT.jar
[JENKINS] Archiving <https://builds.apache.org/job/DeltaSpike%20OWB%20(nightly)/ws/deltaspike/core/api/target/deltaspike-core-api-1.6.2-SNAPSHOT-tests.jar> to org.apache.deltaspike.core/deltaspike-core-api/1.6.2-SNAPSHOT/deltaspike-core-api-1.6.2-SNAPSHOT-tests.jar
[JENKINS] Archiving <https://builds.apache.org/job/DeltaSpike%20OWB%20(nightly)/ws/deltaspike/core/api/target/deltaspike-core-api-1.6.2-SNAPSHOT-sources.jar> to org.apache.deltaspike.core/deltaspike-core-api/1.6.2-SNAPSHOT/deltaspike-core-api-1.6.2-SNAPSHOT-sources.jar
[JENKINS] Archiving <https://builds.apache.org/job/DeltaSpike%20OWB%20(nightly)/ws/deltaspike/modules/security/impl/pom.xml> to org.apache.deltaspike.modules/deltaspike-security-module-impl/1.6.2-SNAPSHOT/deltaspike-security-module-impl-1.6.2-SNAPSHOT.pom
[JENKINS] Archiving <https://builds.apache.org/job/DeltaSpike%20OWB%20(nightly)/ws/deltaspike/modules/security/impl/target/deltaspike-security-module-impl-1.6.2-SNAPSHOT.jar> to org.apache.deltaspike.modules/deltaspike-security-module-impl/1.6.2-SNAPSHOT/deltaspike-security-module-impl-1.6.2-SNAPSHOT.jar
[JENKINS] Archiving <https://builds.apache.org/job/DeltaSpike%20OWB%20(nightly)/ws/deltaspike/modules/security/impl/target/deltaspike-security-module-impl-1.6.2-SNAPSHOT-tests.jar> to org.apache.deltaspike.modules/deltaspike-security-module-impl/1.6.2-SNAPSHOT/deltaspike-security-module-impl-1.6.2-SNAPSHOT-tests.jar
[JENKINS] Archiving <https://builds.apache.org/job/DeltaSpike%20OWB%20(nightly)/ws/deltaspike/modules/security/impl/target/deltaspike-security-module-impl-1.6.2-SNAPSHOT-sources.jar> to org.apache.deltaspike.modules/deltaspike-security-module-impl/1.6.2-SNAPSHOT/deltaspike-security-module-impl-1.6.2-SNAPSHOT-sources.jar
[JENKINS] Archiving <https://builds.apache.org/job/DeltaSpike%20OWB%20(nightly)/ws/deltaspike/modules/scheduler/pom.xml> to org.apache.deltaspike.modules/scheduler-module-project/1.6.2-SNAPSHOT/scheduler-module-project-1.6.2-SNAPSHOT.pom
[JENKINS] Archiving <https://builds.apache.org/job/DeltaSpike%20OWB%20(nightly)/ws/site/pom.xml> to org.apache.deltaspike/deltaspike-site/1.6.2-SNAPSHOT/deltaspike-site-1.6.2-SNAPSHOT.pom
No prior successful build to compare, so performing full copy of artifacts
[JENKINS] Archiving <https://builds.apache.org/job/DeltaSpike%20OWB%20(nightly)/ws/deltaspike/modules/proxy/impl-asm5/pom.xml> to org.apache.deltaspike.modules/deltaspike-proxy-module-impl-asm5/1.6.2-SNAPSHOT/deltaspike-proxy-module-impl-asm5-1.6.2-SNAPSHOT.pom
[JENKINS] Archiving <https://builds.apache.org/job/DeltaSpike%20OWB%20(nightly)/ws/deltaspike/modules/proxy/impl-asm5/target/deltaspike-proxy-module-impl-asm5-1.6.2-SNAPSHOT.jar> to org.apache.deltaspike.modules/deltaspike-proxy-module-impl-asm5/1.6.2-SNAPSHOT/deltaspike-proxy-module-impl-asm5-1.6.2-SNAPSHOT.jar
[JENKINS] Archiving <https://builds.apache.org/job/DeltaSpike%20OWB%20(nightly)/ws/deltaspike/modules/proxy/impl-asm5/target/deltaspike-proxy-module-impl-asm5-1.6.2-SNAPSHOT-tests.jar> to org.apache.deltaspike.modules/deltaspike-proxy-module-impl-asm5/1.6.2-SNAPSHOT/deltaspike-proxy-module-impl-asm5-1.6.2-SNAPSHOT-tests.jar
[JENKINS] Archiving <https://builds.apache.org/job/DeltaSpike%20OWB%20(nightly)/ws/deltaspike/modules/proxy/impl-asm5/target/deltaspike-proxy-module-impl-asm5-1.6.2-SNAPSHOT-sources.jar> to org.apache.deltaspike.modules/deltaspike-proxy-module-impl-asm5/1.6.2-SNAPSHOT/deltaspike-proxy-module-impl-asm5-1.6.2-SNAPSHOT-sources.jar
[JENKINS] Archiving <https://builds.apache.org/job/DeltaSpike%20OWB%20(nightly)/ws/deltaspike/examples/jsf-playground/pom.xml> to org.apache.deltaspike.examples/deltaspike-jsf-playground/1.6.2-SNAPSHOT/deltaspike-jsf-playground-1.6.2-SNAPSHOT.pom
[JENKINS] Archiving <https://builds.apache.org/job/DeltaSpike%20OWB%20(nightly)/ws/deltaspike/modules/servlet/impl/pom.xml> to org.apache.deltaspike.modules/deltaspike-servlet-module-impl/1.6.2-SNAPSHOT/deltaspike-servlet-module-impl-1.6.2-SNAPSHOT.pom
[JENKINS] Archiving <https://builds.apache.org/job/DeltaSpike%20OWB%20(nightly)/ws/deltaspike/modules/servlet/impl/target/deltaspike-servlet-module-impl-1.6.2-SNAPSHOT.jar> to org.apache.deltaspike.modules/deltaspike-servlet-module-impl/1.6.2-SNAPSHOT/deltaspike-servlet-module-impl-1.6.2-SNAPSHOT.jar
[JENKINS] Archiving <https://builds.apache.org/job/DeltaSpike%20OWB%20(nightly)/ws/deltaspike/modules/servlet/impl/target/deltaspike-servlet-module-impl-1.6.2-SNAPSHOT-tests.jar> to org.apache.deltaspike.modules/deltaspike-servlet-module-impl/1.6.2-SNAPSHOT/deltaspike-servlet-module-impl-1.6.2-SNAPSHOT-tests.jar
[JENKINS] Archiving <https://builds.apache.org/job/DeltaSpike%20OWB%20(nightly)/ws/deltaspike/modules/servlet/impl/target/deltaspike-servlet-module-impl-1.6.2-SNAPSHOT-sources.jar> to org.apache.deltaspike.modules/deltaspike-servlet-module-impl/1.6.2-SNAPSHOT/deltaspike-servlet-module-impl-1.6.2-SNAPSHOT-sources.jar
[JENKINS] Archiving <https://builds.apache.org/job/DeltaSpike%20OWB%20(nightly)/ws/deltaspike/modules/bean-validation/impl/pom.xml> to org.apache.deltaspike.modules/deltaspike-bean-validation-module-impl/1.6.2-SNAPSHOT/deltaspike-bean-validation-module-impl-1.6.2-SNAPSHOT.pom
[JENKINS] Archiving <https://builds.apache.org/job/DeltaSpike%20OWB%20(nightly)/ws/deltaspike/modules/bean-validation/impl/target/deltaspike-bean-validation-module-impl-1.6.2-SNAPSHOT.jar> to org.apache.deltaspike.modules/deltaspike-bean-validation-module-impl/1.6.2-SNAPSHOT/deltaspike-bean-validation-module-impl-1.6.2-SNAPSHOT.jar
[JENKINS] Archiving <https://builds.apache.org/job/DeltaSpike%20OWB%20(nightly)/ws/deltaspike/modules/bean-validation/impl/target/deltaspike-bean-validation-module-impl-1.6.2-SNAPSHOT-tests.jar> to org.apache.deltaspike.modules/deltaspike-bean-validation-module-impl/1.6.2-SNAPSHOT/deltaspike-bean-validation-module-impl-1.6.2-SNAPSHOT-tests.jar
[JENKINS] Archiving <https://builds.apache.org/job/DeltaSpike%20OWB%20(nightly)/ws/deltaspike/modules/bean-validation/impl/target/deltaspike-bean-validation-module-impl-1.6.2-SNAPSHOT-sources.jar> to org.apache.deltaspike.modules/deltaspike-bean-validation-module-impl/1.6.2-SNAPSHOT/deltaspike-bean-validation-module-impl-1.6.2-SNAPSHOT-sources.jar
[JENKINS] Archiving <https://builds.apache.org/job/DeltaSpike%20OWB%20(nightly)/ws/deltaspike/cdictrl/impl-owb/pom.xml> to org.apache.deltaspike.cdictrl/deltaspike-cdictrl-owb/1.6.2-SNAPSHOT/deltaspike-cdictrl-owb-1.6.2-SNAPSHOT.pom
[JENKINS] Archiving <https://builds.apache.org/job/DeltaSpike%20OWB%20(nightly)/ws/deltaspike/cdictrl/impl-owb/target/deltaspike-cdictrl-owb-1.6.2-SNAPSHOT.jar> to org.apache.deltaspike.cdictrl/deltaspike-cdictrl-owb/1.6.2-SNAPSHOT/deltaspike-cdictrl-owb-1.6.2-SNAPSHOT.jar
[JENKINS] Archiving <https://builds.apache.org/job/DeltaSpike%20OWB%20(nightly)/ws/deltaspike/cdictrl/impl-owb/target/deltaspike-cdictrl-owb-1.6.2-SNAPSHOT-sources.jar> to org.apache.deltaspike.cdictrl/deltaspike-cdictrl-owb/1.6.2-SNAPSHOT/deltaspike-cdictrl-owb-1.6.2-SNAPSHOT-sources.jar
[JENKINS] Archiving <https://builds.apache.org/job/DeltaSpike%20OWB%20(nightly)/ws/pom.xml> to org.apache.deltaspike/deltaspike/1.6.2-SNAPSHOT/deltaspike-1.6.2-SNAPSHOT.pom
No prior successful build to compare, so performing full copy of artifacts
[JENKINS] Archiving <https://builds.apache.org/job/DeltaSpike%20OWB%20(nightly)/ws/deltaspike/modules/jpa/impl/pom.xml> to org.apache.deltaspike.modules/deltaspike-jpa-module-impl/1.6.2-SNAPSHOT/deltaspike-jpa-module-impl-1.6.2-SNAPSHOT.pom
[JENKINS] Archiving <https://builds.apache.org/job/DeltaSpike%20OWB%20(nightly)/ws/deltaspike/modules/jpa/impl/target/deltaspike-jpa-module-impl-1.6.2-SNAPSHOT.jar> to org.apache.deltaspike.modules/deltaspike-jpa-module-impl/1.6.2-SNAPSHOT/deltaspike-jpa-module-impl-1.6.2-SNAPSHOT.jar
[JENKINS] Archiving <https://builds.apache.org/job/DeltaSpike%20OWB%20(nightly)/ws/deltaspike/modules/jpa/impl/target/deltaspike-jpa-module-impl-1.6.2-SNAPSHOT-tests.jar> to org.apache.deltaspike.modules/deltaspike-jpa-module-impl/1.6.2-SNAPSHOT/deltaspike-jpa-module-impl-1.6.2-SNAPSHOT-tests.jar
[JENKINS] Archiving <https://builds.apache.org/job/DeltaSpike%20OWB%20(nightly)/ws/deltaspike/modules/jpa/impl/target/deltaspike-jpa-module-impl-1.6.2-SNAPSHOT-sources.jar> to org.apache.deltaspike.modules/deltaspike-jpa-module-impl/1.6.2-SNAPSHOT/deltaspike-jpa-module-impl-1.6.2-SNAPSHOT-sources.jar
[JENKINS] Archiving <https://builds.apache.org/job/DeltaSpike%20OWB%20(nightly)/ws/deltaspike/modules/data/pom.xml> to org.apache.deltaspike.modules/data-module-project/1.6.2-SNAPSHOT/data-module-project-1.6.2-SNAPSHOT.pom
[JENKINS] Archiving <https://builds.apache.org/job/DeltaSpike%20OWB%20(nightly)/ws/deltaspike/modules/data/target/data-module-project-1.6.2-SNAPSHOT-tests.jar> to org.apache.deltaspike.modules/data-module-project/1.6.2-SNAPSHOT/data-module-project-1.6.2-SNAPSHOT-tests.jar
[JENKINS] Archiving <https://builds.apache.org/job/DeltaSpike%20OWB%20(nightly)/ws/deltaspike/examples/security-requested-page-after-login-picketlink/pom.xml> to org.apache.deltaspike.examples/deltaspike-security-requested-page-after-login-picketlink/1.6.2-SNAPSHOT/deltaspike-security-requested-page-after-login-picketlink-1.6.2-SNAPSHOT.pom
[JENKINS] Archiving <https://builds.apache.org/job/DeltaSpike%20OWB%20(nightly)/ws/deltaspike/pom.xml> to org.apache.deltaspike/deltaspike-project/1.6.2-SNAPSHOT/deltaspike-project-1.6.2-SNAPSHOT.pom
[JENKINS] Archiving <https://builds.apache.org/job/DeltaSpike%20OWB%20(nightly)/ws/deltaspike/modules/security/api/pom.xml> to org.apache.deltaspike.modules/deltaspike-security-module-api/1.6.2-SNAPSHOT/deltaspike-security-module-api-1.6.2-SNAPSHOT.pom
[JENKINS] Archiving <https://builds.apache.org/job/DeltaSpike%20OWB%20(nightly)/ws/deltaspike/modules/security/api/target/deltaspike-security-module-api-1.6.2-SNAPSHOT.jar> to org.apache.deltaspike.modules/deltaspike-security-module-api/1.6.2-SNAPSHOT/deltaspike-security-module-api-1.6.2-SNAPSHOT.jar
[JENKINS] Archiving <https://builds.apache.org/job/DeltaSpike%20OWB%20(nightly)/ws/deltaspike/modules/security/api/target/deltaspike-security-module-api-1.6.2-SNAPSHOT-tests.jar> to org.apache.deltaspike.modules/deltaspike-security-module-api/1.6.2-SNAPSHOT/deltaspike-security-module-api-1.6.2-SNAPSHOT-tests.jar
[JENKINS] Archiving <https://builds.apache.org/job/DeltaSpike%20OWB%20(nightly)/ws/deltaspike/modules/security/api/target/deltaspike-security-module-api-1.6.2-SNAPSHOT-sources.jar> to org.apache.deltaspike.modules/deltaspike-security-module-api/1.6.2-SNAPSHOT/deltaspike-security-module-api-1.6.2-SNAPSHOT-sources.jar
channel stopped
Build failed in Jenkins: DeltaSpike OWB (nightly) #1276
Posted by Apache Jenkins Server <je...@builds.apache.org>.
See <https://builds.apache.org/job/DeltaSpike%20OWB%20(nightly)/1276/changes>
Changes:
[manovotn] DELTASPIKE-1141 fix EnableInterceptorsTest for CDI 1.0/Weld 1.x
------------------------------------------
[...truncated 5200 lines...]
[ERROR] location: class org.apache.deltaspike.data.test.service.SimpleCriteriaRepository
[ERROR] <https://builds.apache.org/job/DeltaSpike%20OWB%20(nightly)/ws/deltaspike/modules/data/impl/src/test/java/org/apache/deltaspike/data/test/service/SimpleCriteriaRepository.java>:[122,34] cannot find symbol
[ERROR] symbol : variable Simple_
[ERROR] location: class org.apache.deltaspike.data.test.service.SimpleCriteriaRepository
[ERROR] <https://builds.apache.org/job/DeltaSpike%20OWB%20(nightly)/ws/deltaspike/modules/data/impl/src/test/java/org/apache/deltaspike/data/test/service/SimpleCriteriaRepository.java>:[122,62] cannot find symbol
[ERROR] symbol : variable Simple_
[ERROR] location: class org.apache.deltaspike.data.test.service.SimpleCriteriaRepository
[ERROR] <https://builds.apache.org/job/DeltaSpike%20OWB%20(nightly)/ws/deltaspike/modules/data/impl/src/test/java/org/apache/deltaspike/data/test/service/SimpleCriteriaRepository.java>:[132,26] cannot find symbol
[ERROR] symbol : variable Simple_
[ERROR] location: class org.apache.deltaspike.data.test.service.SimpleCriteriaRepository
[ERROR] <https://builds.apache.org/job/DeltaSpike%20OWB%20(nightly)/ws/deltaspike/modules/data/impl/src/test/java/org/apache/deltaspike/data/test/service/SimpleCriteriaRepository.java>:[131,27] cannot find symbol
[ERROR] symbol : variable Simple_
[ERROR] location: class org.apache.deltaspike.data.test.service.SimpleCriteriaRepository
[ERROR] <https://builds.apache.org/job/DeltaSpike%20OWB%20(nightly)/ws/deltaspike/modules/data/impl/src/test/java/org/apache/deltaspike/data/test/service/SimpleCriteriaRepository.java>:[141,20] cannot find symbol
[ERROR] symbol : variable Simple_
[ERROR] location: class org.apache.deltaspike.data.test.service.SimpleCriteriaRepository
[ERROR] <https://builds.apache.org/job/DeltaSpike%20OWB%20(nightly)/ws/deltaspike/modules/data/impl/src/test/java/org/apache/deltaspike/data/test/service/SimpleCriteriaRepository.java>:[139,34] cannot find symbol
[ERROR] symbol : variable Simple_
[ERROR] location: class org.apache.deltaspike.data.test.service.SimpleCriteriaRepository
[ERROR] <https://builds.apache.org/job/DeltaSpike%20OWB%20(nightly)/ws/deltaspike/modules/data/impl/src/test/java/org/apache/deltaspike/data/test/service/SimpleCriteriaRepository.java>:[139,54] cannot find symbol
[ERROR] symbol : variable Simple_
[ERROR] location: class org.apache.deltaspike.data.test.service.SimpleCriteriaRepository
[ERROR] <https://builds.apache.org/job/DeltaSpike%20OWB%20(nightly)/ws/deltaspike/modules/data/impl/src/test/java/org/apache/deltaspike/data/test/service/SimpleCriteriaRepository.java>:[140,63] cannot find symbol
[ERROR] symbol : variable Simple_
[ERROR] location: class org.apache.deltaspike.data.test.service.SimpleCriteriaRepository
[ERROR] <https://builds.apache.org/job/DeltaSpike%20OWB%20(nightly)/ws/deltaspike/modules/data/impl/src/test/java/org/apache/deltaspike/data/test/service/ParentRepository.java>:[48,22] cannot find symbol
[ERROR] symbol : variable Parent_
[ERROR] location: class org.apache.deltaspike.data.test.service.ParentRepository
[ERROR] <https://builds.apache.org/job/DeltaSpike%20OWB%20(nightly)/ws/deltaspike/modules/data/impl/src/test/java/org/apache/deltaspike/data/test/service/ParentRepository.java>:[50,36] cannot find symbol
[ERROR] symbol : variable OneToMany_
[ERROR] location: class org.apache.deltaspike.data.test.service.ParentRepository
[ERROR] <https://builds.apache.org/job/DeltaSpike%20OWB%20(nightly)/ws/deltaspike/modules/data/impl/src/test/java/org/apache/deltaspike/data/test/service/ParentRepository.java>:[44,22] cannot find symbol
[ERROR] symbol : variable Parent_
[ERROR] location: class org.apache.deltaspike.data.test.service.ParentRepository
[ERROR] <https://builds.apache.org/job/DeltaSpike%20OWB%20(nightly)/ws/deltaspike/modules/data/impl/src/test/java/org/apache/deltaspike/data/test/service/ParentRepository.java>:[46,36] cannot find symbol
[ERROR] symbol : variable OneToOne_
[ERROR] location: class org.apache.deltaspike.data.test.service.ParentRepository
[ERROR] <https://builds.apache.org/job/DeltaSpike%20OWB%20(nightly)/ws/deltaspike/modules/data/impl/src/test/java/org/apache/deltaspike/data/test/service/ParentRepository.java>:[43,20] cannot find symbol
[ERROR] symbol : variable Parent_
[ERROR] location: class org.apache.deltaspike.data.test.service.ParentRepository
[ERROR] <https://builds.apache.org/job/DeltaSpike%20OWB%20(nightly)/ws/deltaspike/modules/data/impl/src/test/java/org/apache/deltaspike/data/test/service/ParentRepository.java>:[61,20] cannot find symbol
[ERROR] symbol : variable Parent_
[ERROR] location: class org.apache.deltaspike.data.test.service.ParentRepository
[ERROR] <https://builds.apache.org/job/DeltaSpike%20OWB%20(nightly)/ws/deltaspike/modules/data/impl/src/test/java/org/apache/deltaspike/data/test/service/ParentRepository.java>:[60,20] cannot find symbol
[ERROR] symbol : variable Parent_
[ERROR] location: class org.apache.deltaspike.data.test.service.ParentRepository
[ERROR] <https://builds.apache.org/job/DeltaSpike%20OWB%20(nightly)/ws/deltaspike/modules/data/impl/src/test/java/org/apache/deltaspike/data/test/service/ParentRepository.java>:[59,20] cannot find symbol
[ERROR] symbol : variable Parent_
[ERROR] location: class org.apache.deltaspike.data.test.service.ParentRepository
[ERROR] <https://builds.apache.org/job/DeltaSpike%20OWB%20(nightly)/ws/deltaspike/modules/data/impl/src/test/java/org/apache/deltaspike/data/test/service/ParentRepository.java>:[70,23] cannot find symbol
[ERROR] symbol : variable Parent_
[ERROR] location: class org.apache.deltaspike.data.test.service.ParentRepository
[ERROR] <https://builds.apache.org/job/DeltaSpike%20OWB%20(nightly)/ws/deltaspike/modules/data/impl/src/test/java/org/apache/deltaspike/data/test/service/ParentRepository.java>:[69,20] cannot find symbol
[ERROR] symbol : variable Parent_
[ERROR] location: class org.apache.deltaspike.data.test.service.ParentRepository
[ERROR] <https://builds.apache.org/job/DeltaSpike%20OWB%20(nightly)/ws/deltaspike/modules/data/impl/src/test/java/org/apache/deltaspike/data/test/service/ParentRepository.java>:[79,20] cannot find symbol
[ERROR] symbol : variable Parent_
[ERROR] location: class org.apache.deltaspike.data.test.service.ParentRepository
[ERROR] <https://builds.apache.org/job/DeltaSpike%20OWB%20(nightly)/ws/deltaspike/modules/data/impl/src/test/java/org/apache/deltaspike/data/test/service/ParentRepository.java>:[91,41] cannot find symbol
[ERROR] symbol : variable Parent_
[ERROR] location: class org.apache.deltaspike.data.test.service.ParentRepository
[ERROR] <https://builds.apache.org/job/DeltaSpike%20OWB%20(nightly)/ws/deltaspike/modules/data/impl/src/test/java/org/apache/deltaspike/data/test/service/ParentRepository.java>:[90,36] cannot find symbol
[ERROR] symbol : variable Parent_
[ERROR] location: class org.apache.deltaspike.data.test.service.ParentRepository
[ERROR] <https://builds.apache.org/job/DeltaSpike%20OWB%20(nightly)/ws/deltaspike/modules/data/impl/src/test/java/org/apache/deltaspike/data/test/service/ParentRepository.java>:[94,41] cannot find symbol
[ERROR] symbol : variable Parent_
[ERROR] location: class org.apache.deltaspike.data.test.service.ParentRepository
[ERROR] <https://builds.apache.org/job/DeltaSpike%20OWB%20(nightly)/ws/deltaspike/modules/data/impl/src/test/java/org/apache/deltaspike/data/test/service/ParentRepository.java>:[93,36] cannot find symbol
[ERROR] symbol : variable Parent_
[ERROR] location: class org.apache.deltaspike.data.test.service.ParentRepository
[ERROR] <https://builds.apache.org/job/DeltaSpike%20OWB%20(nightly)/ws/deltaspike/modules/data/impl/src/test/java/org/apache/deltaspike/data/test/service/ParentRepository.java>:[96,36] cannot find symbol
[ERROR] symbol : variable Parent_
[ERROR] location: class org.apache.deltaspike.data.test.service.ParentRepository
[ERROR] <https://builds.apache.org/job/DeltaSpike%20OWB%20(nightly)/ws/deltaspike/modules/data/impl/src/test/java/org/apache/deltaspike/data/test/service/ParentRepository.java>:[105,26] cannot find symbol
[ERROR] symbol : variable Parent_
[ERROR] location: class org.apache.deltaspike.data.test.service.ParentRepository
[ERROR] <https://builds.apache.org/job/DeltaSpike%20OWB%20(nightly)/ws/deltaspike/modules/data/impl/src/test/java/org/apache/deltaspike/data/impl/mapping/MappedRepositoryTest.java>:[154,36] package Simple_ does not exist
[ERROR] <https://builds.apache.org/job/DeltaSpike%20OWB%20(nightly)/ws/deltaspike/modules/data/impl/src/test/java/org/apache/deltaspike/data/impl/handler/EntityRepositoryHandlerTest.java>:[179,48] cannot find symbol
[ERROR] symbol : variable Simple_
[ERROR] location: class org.apache.deltaspike.data.impl.handler.EntityRepositoryHandlerTest
[ERROR] <https://builds.apache.org/job/DeltaSpike%20OWB%20(nightly)/ws/deltaspike/modules/data/impl/src/test/java/org/apache/deltaspike/data/impl/handler/EntityRepositoryHandlerTest.java>:[196,54] cannot find symbol
[ERROR] symbol : variable Simple_
[ERROR] location: class org.apache.deltaspike.data.impl.handler.EntityRepositoryHandlerTest
[ERROR] <https://builds.apache.org/job/DeltaSpike%20OWB%20(nightly)/ws/deltaspike/modules/data/impl/src/test/java/org/apache/deltaspike/data/impl/handler/EntityRepositoryHandlerTest.java>:[196,68] cannot find symbol
[ERROR] symbol : variable Simple_
[ERROR] location: class org.apache.deltaspike.data.impl.handler.EntityRepositoryHandlerTest
[ERROR] <https://builds.apache.org/job/DeltaSpike%20OWB%20(nightly)/ws/deltaspike/modules/data/impl/src/test/java/org/apache/deltaspike/data/impl/handler/EntityRepositoryHandlerTest.java>:[260,53] cannot find symbol
[ERROR] symbol : variable Simple_
[ERROR] location: class org.apache.deltaspike.data.impl.handler.EntityRepositoryHandlerTest
[ERROR] <https://builds.apache.org/job/DeltaSpike%20OWB%20(nightly)/ws/deltaspike/modules/data/impl/src/test/java/org/apache/deltaspike/data/impl/handler/EntityRepositoryHandlerTest.java>:[276,60] cannot find symbol
[ERROR] symbol : variable Simple_
[ERROR] location: class org.apache.deltaspike.data.impl.handler.EntityRepositoryHandlerTest
[ERROR] <https://builds.apache.org/job/DeltaSpike%20OWB%20(nightly)/ws/deltaspike/modules/data/impl/src/test/java/org/apache/deltaspike/data/impl/handler/EntityRepositoryHandlerTest.java>:[293,53] cannot find symbol
[ERROR] symbol : variable Simple_
[ERROR] location: class org.apache.deltaspike.data.impl.handler.EntityRepositoryHandlerTest
[ERROR] <https://builds.apache.org/job/DeltaSpike%20OWB%20(nightly)/ws/deltaspike/modules/data/impl/src/test/java/org/apache/deltaspike/data/impl/handler/EntityRepositoryHandlerTest.java>:[293,67] cannot find symbol
[ERROR] symbol : variable Simple_
[ERROR] location: class org.apache.deltaspike.data.impl.handler.EntityRepositoryHandlerTest
[ERROR] <https://builds.apache.org/job/DeltaSpike%20OWB%20(nightly)/ws/deltaspike/modules/data/impl/src/test/java/org/apache/deltaspike/data/impl/handler/EntityRepositoryHandlerTest.java>:[321,41] cannot find symbol
[ERROR] symbol : variable Simple_
[ERROR] location: class org.apache.deltaspike.data.impl.handler.EntityRepositoryHandlerTest
[ERROR] <https://builds.apache.org/job/DeltaSpike%20OWB%20(nightly)/ws/deltaspike/modules/data/impl/src/test/java/org/apache/deltaspike/data/impl/handler/EntityRepositoryHandlerTest.java>:[321,55] cannot find symbol
[ERROR] symbol : variable Simple_
[ERROR] location: class org.apache.deltaspike.data.impl.handler.EntityRepositoryHandlerTest
[ERROR] <https://builds.apache.org/job/DeltaSpike%20OWB%20(nightly)/ws/deltaspike/modules/data/impl/src/test/java/org/apache/deltaspike/data/impl/handler/EntityRepositoryHandlerTest.java>:[353,45] cannot find symbol
[ERROR] symbol : variable Simple_
[ERROR] location: class org.apache.deltaspike.data.impl.handler.EntityRepositoryHandlerTest
[ERROR] -> [Help 1]
[ERROR]
[ERROR] To see the full stack trace of the errors, re-run Maven with the -e switch.
[ERROR] Re-run Maven using the -X switch to enable full debug logging.
[ERROR]
[ERROR] For more information about the errors and possible solutions, please read the following articles:
[ERROR] [Help 1] http://cwiki.apache.org/confluence/display/MAVEN/MojoFailureException
[ERROR]
[ERROR] After correcting the problems, you can resume the build with the command
[ERROR] mvn <goals> -rf :deltaspike-data-module-impl
[JENKINS] Archiving <https://builds.apache.org/job/DeltaSpike%20OWB%20(nightly)/ws/deltaspike/examples/jse-examples/pom.xml> to org.apache.deltaspike.examples/deltaspike-jse-example/1.6.2-SNAPSHOT/deltaspike-jse-example-1.6.2-SNAPSHOT.pom
[JENKINS] Archiving <https://builds.apache.org/job/DeltaSpike%20OWB%20(nightly)/ws/deltaspike/examples/security-requested-page-after-login-cdi/pom.xml> to org.apache.deltaspike.examples/deltaspike-security-requested-page-after-login-cdi/1.6.2-SNAPSHOT/deltaspike-security-requested-page-after-login-cdi-1.6.2-SNAPSHOT.pom
[JENKINS] Archiving <https://builds.apache.org/job/DeltaSpike%20OWB%20(nightly)/ws/deltaspike/test-utils/pom.xml> to org.apache.deltaspike.test/test-utils/1.6.2-SNAPSHOT/test-utils-1.6.2-SNAPSHOT.pom
[JENKINS] Archiving <https://builds.apache.org/job/DeltaSpike%20OWB%20(nightly)/ws/deltaspike/test-utils/target/test-utils-1.6.2-SNAPSHOT.jar> to org.apache.deltaspike.test/test-utils/1.6.2-SNAPSHOT/test-utils-1.6.2-SNAPSHOT.jar
[JENKINS] Archiving <https://builds.apache.org/job/DeltaSpike%20OWB%20(nightly)/ws/deltaspike/test-utils/target/test-utils-1.6.2-SNAPSHOT-sources.jar> to org.apache.deltaspike.test/test-utils/1.6.2-SNAPSHOT/test-utils-1.6.2-SNAPSHOT-sources.jar
[JENKINS] Archiving <https://builds.apache.org/job/DeltaSpike%20OWB%20(nightly)/ws/deltaspike/modules/data/impl/pom.xml> to org.apache.deltaspike.modules/deltaspike-data-module-impl/1.6.2-SNAPSHOT/deltaspike-data-module-impl-1.6.2-SNAPSHOT.pom
[JENKINS] Archiving <https://builds.apache.org/job/DeltaSpike%20OWB%20(nightly)/ws/deltaspike/modules/data/api/pom.xml> to org.apache.deltaspike.modules/deltaspike-data-module-api/1.6.2-SNAPSHOT/deltaspike-data-module-api-1.6.2-SNAPSHOT.pom
[JENKINS] Archiving <https://builds.apache.org/job/DeltaSpike%20OWB%20(nightly)/ws/deltaspike/modules/data/api/target/deltaspike-data-module-api-1.6.2-SNAPSHOT.jar> to org.apache.deltaspike.modules/deltaspike-data-module-api/1.6.2-SNAPSHOT/deltaspike-data-module-api-1.6.2-SNAPSHOT.jar
[JENKINS] Archiving <https://builds.apache.org/job/DeltaSpike%20OWB%20(nightly)/ws/deltaspike/modules/data/api/target/deltaspike-data-module-api-1.6.2-SNAPSHOT-tests.jar> to org.apache.deltaspike.modules/deltaspike-data-module-api/1.6.2-SNAPSHOT/deltaspike-data-module-api-1.6.2-SNAPSHOT-tests.jar
[JENKINS] Archiving <https://builds.apache.org/job/DeltaSpike%20OWB%20(nightly)/ws/deltaspike/modules/data/api/target/deltaspike-data-module-api-1.6.2-SNAPSHOT-sources.jar> to org.apache.deltaspike.modules/deltaspike-data-module-api/1.6.2-SNAPSHOT/deltaspike-data-module-api-1.6.2-SNAPSHOT-sources.jar
[JENKINS] Archiving <https://builds.apache.org/job/DeltaSpike%20OWB%20(nightly)/ws/deltaspike/core/impl/pom.xml> to org.apache.deltaspike.core/deltaspike-core-impl/1.6.2-SNAPSHOT/deltaspike-core-impl-1.6.2-SNAPSHOT.pom
[JENKINS] Archiving <https://builds.apache.org/job/DeltaSpike%20OWB%20(nightly)/ws/deltaspike/core/impl/target/deltaspike-core-impl-1.6.2-SNAPSHOT.jar> to org.apache.deltaspike.core/deltaspike-core-impl/1.6.2-SNAPSHOT/deltaspike-core-impl-1.6.2-SNAPSHOT.jar
[JENKINS] Archiving <https://builds.apache.org/job/DeltaSpike%20OWB%20(nightly)/ws/deltaspike/core/impl/target/deltaspike-core-impl-1.6.2-SNAPSHOT-tests.jar> to org.apache.deltaspike.core/deltaspike-core-impl/1.6.2-SNAPSHOT/deltaspike-core-impl-1.6.2-SNAPSHOT-tests.jar
[JENKINS] Archiving <https://builds.apache.org/job/DeltaSpike%20OWB%20(nightly)/ws/deltaspike/core/impl/target/deltaspike-core-impl-1.6.2-SNAPSHOT-sources.jar> to org.apache.deltaspike.core/deltaspike-core-impl/1.6.2-SNAPSHOT/deltaspike-core-impl-1.6.2-SNAPSHOT-sources.jar
[JENKINS] Archiving <https://builds.apache.org/job/DeltaSpike%20OWB%20(nightly)/ws/deltaspike/modules/pom.xml> to org.apache.deltaspike.modules/modules-project/1.6.2-SNAPSHOT/modules-project-1.6.2-SNAPSHOT.pom
[JENKINS] Archiving <https://builds.apache.org/job/DeltaSpike%20OWB%20(nightly)/ws/deltaspike/modules/target/modules-project-1.6.2-SNAPSHOT-tests.jar> to org.apache.deltaspike.modules/modules-project/1.6.2-SNAPSHOT/modules-project-1.6.2-SNAPSHOT-tests.jar
[JENKINS] Archiving <https://builds.apache.org/job/DeltaSpike%20OWB%20(nightly)/ws/deltaspike/modules/test-control/pom.xml> to org.apache.deltaspike.modules/test-control-module-project/1.6.2-SNAPSHOT/test-control-module-project-1.6.2-SNAPSHOT.pom
[JENKINS] Archiving <https://builds.apache.org/job/DeltaSpike%20OWB%20(nightly)/ws/deltaspike/examples/jsf-examples/pom.xml> to org.apache.deltaspike.examples/deltaspike-jsf-example/1.6.2-SNAPSHOT/deltaspike-jsf-example-1.6.2-SNAPSHOT.pom
[JENKINS] Archiving <https://builds.apache.org/job/DeltaSpike%20OWB%20(nightly)/ws/deltaspike/cdictrl/api/pom.xml> to org.apache.deltaspike.cdictrl/deltaspike-cdictrl-api/1.6.2-SNAPSHOT/deltaspike-cdictrl-api-1.6.2-SNAPSHOT.pom
[JENKINS] Archiving <https://builds.apache.org/job/DeltaSpike%20OWB%20(nightly)/ws/deltaspike/cdictrl/api/target/deltaspike-cdictrl-api-1.6.2-SNAPSHOT.jar> to org.apache.deltaspike.cdictrl/deltaspike-cdictrl-api/1.6.2-SNAPSHOT/deltaspike-cdictrl-api-1.6.2-SNAPSHOT.jar
[JENKINS] Archiving <https://builds.apache.org/job/DeltaSpike%20OWB%20(nightly)/ws/deltaspike/cdictrl/api/target/deltaspike-cdictrl-api-1.6.2-SNAPSHOT-sources.jar> to org.apache.deltaspike.cdictrl/deltaspike-cdictrl-api/1.6.2-SNAPSHOT/deltaspike-cdictrl-api-1.6.2-SNAPSHOT-sources.jar
[JENKINS] Archiving <https://builds.apache.org/job/DeltaSpike%20OWB%20(nightly)/ws/deltaspike/cdictrl/servlet/pom.xml> to org.apache.deltaspike.cdictrl/deltaspike-cdictrl-servlet/1.6.2-SNAPSHOT/deltaspike-cdictrl-servlet-1.6.2-SNAPSHOT.pom
[JENKINS] Archiving <https://builds.apache.org/job/DeltaSpike%20OWB%20(nightly)/ws/deltaspike/cdictrl/servlet/target/deltaspike-cdictrl-servlet-1.6.2-SNAPSHOT.jar> to org.apache.deltaspike.cdictrl/deltaspike-cdictrl-servlet/1.6.2-SNAPSHOT/deltaspike-cdictrl-servlet-1.6.2-SNAPSHOT.jar
[JENKINS] Archiving <https://builds.apache.org/job/DeltaSpike%20OWB%20(nightly)/ws/deltaspike/cdictrl/servlet/target/deltaspike-cdictrl-servlet-1.6.2-SNAPSHOT-sources.jar> to org.apache.deltaspike.cdictrl/deltaspike-cdictrl-servlet/1.6.2-SNAPSHOT/deltaspike-cdictrl-servlet-1.6.2-SNAPSHOT-sources.jar
[JENKINS] Archiving <https://builds.apache.org/job/DeltaSpike%20OWB%20(nightly)/ws/deltaspike/examples/scheduler-playground/pom.xml> to org.apache.deltaspike.examples/deltaspike-scheduler-example/1.6.2-SNAPSHOT/deltaspike-scheduler-example-1.6.2-SNAPSHOT.pom
[JENKINS] Archiving <https://builds.apache.org/job/DeltaSpike%20OWB%20(nightly)/ws/deltaspike/checkstyle-rules/pom.xml> to org.apache.deltaspike/checkstyle-rules/1.6.2-SNAPSHOT/checkstyle-rules-1.6.2-SNAPSHOT.pom
[JENKINS] Archiving <https://builds.apache.org/job/DeltaSpike%20OWB%20(nightly)/ws/deltaspike/checkstyle-rules/target/checkstyle-rules-1.6.2-SNAPSHOT.jar> to org.apache.deltaspike/checkstyle-rules/1.6.2-SNAPSHOT/checkstyle-rules-1.6.2-SNAPSHOT.jar
[JENKINS] Archiving <https://builds.apache.org/job/DeltaSpike%20OWB%20(nightly)/ws/deltaspike/parent/code/pom.xml> to org.apache.deltaspike/parent-code/1.6.2-SNAPSHOT/parent-code-1.6.2-SNAPSHOT.pom
[JENKINS] Archiving <https://builds.apache.org/job/DeltaSpike%20OWB%20(nightly)/ws/deltaspike/parent/code/target/parent-code-1.6.2-SNAPSHOT-tests.jar> to org.apache.deltaspike/parent-code/1.6.2-SNAPSHOT/parent-code-1.6.2-SNAPSHOT-tests.jar
Compressed 87.71 KB of artifacts by 36.5% relative to #1274
[JENKINS] Archiving <https://builds.apache.org/job/DeltaSpike%20OWB%20(nightly)/ws/deltaspike/modules/jsf/impl/pom.xml> to org.apache.deltaspike.modules/deltaspike-jsf-module-impl/1.6.2-SNAPSHOT/deltaspike-jsf-module-impl-1.6.2-SNAPSHOT.pom
[JENKINS] Archiving <https://builds.apache.org/job/DeltaSpike%20OWB%20(nightly)/ws/deltaspike/modules/jsf/impl/target/deltaspike-jsf-module-impl-1.6.2-SNAPSHOT.jar> to org.apache.deltaspike.modules/deltaspike-jsf-module-impl/1.6.2-SNAPSHOT/deltaspike-jsf-module-impl-1.6.2-SNAPSHOT.jar
[JENKINS] Archiving <https://builds.apache.org/job/DeltaSpike%20OWB%20(nightly)/ws/deltaspike/modules/jsf/impl/target/deltaspike-jsf-module-impl-1.6.2-SNAPSHOT-tests.jar> to org.apache.deltaspike.modules/deltaspike-jsf-module-impl/1.6.2-SNAPSHOT/deltaspike-jsf-module-impl-1.6.2-SNAPSHOT-tests.jar
[JENKINS] Archiving <https://builds.apache.org/job/DeltaSpike%20OWB%20(nightly)/ws/deltaspike/modules/jsf/impl/target/deltaspike-jsf-module-impl-1.6.2-SNAPSHOT-sources.jar> to org.apache.deltaspike.modules/deltaspike-jsf-module-impl/1.6.2-SNAPSHOT/deltaspike-jsf-module-impl-1.6.2-SNAPSHOT-sources.jar
[JENKINS] Archiving <https://builds.apache.org/job/DeltaSpike%20OWB%20(nightly)/ws/deltaspike/modules/partial-bean/pom.xml> to org.apache.deltaspike.modules/partial-bean-module-project/1.6.2-SNAPSHOT/partial-bean-module-project-1.6.2-SNAPSHOT.pom
[JENKINS] Archiving <https://builds.apache.org/job/DeltaSpike%20OWB%20(nightly)/ws/deltaspike/modules/partial-bean/target/partial-bean-module-project-1.6.2-SNAPSHOT-tests.jar> to org.apache.deltaspike.modules/partial-bean-module-project/1.6.2-SNAPSHOT/partial-bean-module-project-1.6.2-SNAPSHOT-tests.jar
[JENKINS] Archiving <https://builds.apache.org/job/DeltaSpike%20OWB%20(nightly)/ws/deltaspike/examples/pom.xml> to org.apache.deltaspike.examples/examples-project/1.6.2-SNAPSHOT/examples-project-1.6.2-SNAPSHOT.pom
[JENKINS] Archiving <https://builds.apache.org/job/DeltaSpike%20OWB%20(nightly)/ws/deltaspike/modules/jsf/pom.xml> to org.apache.deltaspike.modules/jsf-module-project/1.6.2-SNAPSHOT/jsf-module-project-1.6.2-SNAPSHOT.pom
[JENKINS] Archiving <https://builds.apache.org/job/DeltaSpike%20OWB%20(nightly)/ws/deltaspike/modules/jsf/target/jsf-module-project-1.6.2-SNAPSHOT-tests.jar> to org.apache.deltaspike.modules/jsf-module-project/1.6.2-SNAPSHOT/jsf-module-project-1.6.2-SNAPSHOT-tests.jar
[JENKINS] Archiving <https://builds.apache.org/job/DeltaSpike%20OWB%20(nightly)/ws/deltaspike/cdictrl/tck/pom.xml> to org.apache.deltaspike.test/deltaspike-cdictrl-tck/1.6.2-SNAPSHOT/deltaspike-cdictrl-tck-1.6.2-SNAPSHOT.pom
[JENKINS] Archiving <https://builds.apache.org/job/DeltaSpike%20OWB%20(nightly)/ws/deltaspike/cdictrl/tck/target/deltaspike-cdictrl-tck-1.6.2-SNAPSHOT.jar> to org.apache.deltaspike.test/deltaspike-cdictrl-tck/1.6.2-SNAPSHOT/deltaspike-cdictrl-tck-1.6.2-SNAPSHOT.jar
[JENKINS] Archiving <https://builds.apache.org/job/DeltaSpike%20OWB%20(nightly)/ws/deltaspike/cdictrl/tck/target/deltaspike-cdictrl-tck-1.6.2-SNAPSHOT-sources.jar> to org.apache.deltaspike.test/deltaspike-cdictrl-tck/1.6.2-SNAPSHOT/deltaspike-cdictrl-tck-1.6.2-SNAPSHOT-sources.jar
[JENKINS] Archiving <https://builds.apache.org/job/DeltaSpike%20OWB%20(nightly)/ws/deltaspike/modules/jsf/api/pom.xml> to org.apache.deltaspike.modules/deltaspike-jsf-module-api/1.6.2-SNAPSHOT/deltaspike-jsf-module-api-1.6.2-SNAPSHOT.pom
[JENKINS] Archiving <https://builds.apache.org/job/DeltaSpike%20OWB%20(nightly)/ws/deltaspike/modules/jsf/api/target/deltaspike-jsf-module-api-1.6.2-SNAPSHOT.jar> to org.apache.deltaspike.modules/deltaspike-jsf-module-api/1.6.2-SNAPSHOT/deltaspike-jsf-module-api-1.6.2-SNAPSHOT.jar
[JENKINS] Archiving <https://builds.apache.org/job/DeltaSpike%20OWB%20(nightly)/ws/deltaspike/modules/jsf/api/target/deltaspike-jsf-module-api-1.6.2-SNAPSHOT-tests.jar> to org.apache.deltaspike.modules/deltaspike-jsf-module-api/1.6.2-SNAPSHOT/deltaspike-jsf-module-api-1.6.2-SNAPSHOT-tests.jar
[JENKINS] Archiving <https://builds.apache.org/job/DeltaSpike%20OWB%20(nightly)/ws/deltaspike/modules/jsf/api/target/deltaspike-jsf-module-api-1.6.2-SNAPSHOT-sources.jar> to org.apache.deltaspike.modules/deltaspike-jsf-module-api/1.6.2-SNAPSHOT/deltaspike-jsf-module-api-1.6.2-SNAPSHOT-sources.jar
[JENKINS] Archiving <https://builds.apache.org/job/DeltaSpike%20OWB%20(nightly)/ws/deltaspike/modules/security/pom.xml> to org.apache.deltaspike.modules/security-module-project/1.6.2-SNAPSHOT/security-module-project-1.6.2-SNAPSHOT.pom
[JENKINS] Archiving <https://builds.apache.org/job/DeltaSpike%20OWB%20(nightly)/ws/deltaspike/modules/security/target/security-module-project-1.6.2-SNAPSHOT-tests.jar> to org.apache.deltaspike.modules/security-module-project/1.6.2-SNAPSHOT/security-module-project-1.6.2-SNAPSHOT-tests.jar
[JENKINS] Archiving <https://builds.apache.org/job/DeltaSpike%20OWB%20(nightly)/ws/deltaspike/modules/bean-validation/pom.xml> to org.apache.deltaspike.modules/bean-validation-module-project/1.6.2-SNAPSHOT/bean-validation-module-project-1.6.2-SNAPSHOT.pom
[JENKINS] Archiving <https://builds.apache.org/job/DeltaSpike%20OWB%20(nightly)/ws/deltaspike/modules/bean-validation/target/bean-validation-module-project-1.6.2-SNAPSHOT-tests.jar> to org.apache.deltaspike.modules/bean-validation-module-project/1.6.2-SNAPSHOT/bean-validation-module-project-1.6.2-SNAPSHOT-tests.jar
[JENKINS] Archiving <https://builds.apache.org/job/DeltaSpike%20OWB%20(nightly)/ws/deltaspike/modules/partial-bean/impl/pom.xml> to org.apache.deltaspike.modules/deltaspike-partial-bean-module-impl/1.6.2-SNAPSHOT/deltaspike-partial-bean-module-impl-1.6.2-SNAPSHOT.pom
[JENKINS] Archiving <https://builds.apache.org/job/DeltaSpike%20OWB%20(nightly)/ws/deltaspike/modules/partial-bean/impl/target/deltaspike-partial-bean-module-impl-1.6.2-SNAPSHOT.jar> to org.apache.deltaspike.modules/deltaspike-partial-bean-module-impl/1.6.2-SNAPSHOT/deltaspike-partial-bean-module-impl-1.6.2-SNAPSHOT.jar
[JENKINS] Archiving <https://builds.apache.org/job/DeltaSpike%20OWB%20(nightly)/ws/deltaspike/modules/partial-bean/impl/target/deltaspike-partial-bean-module-impl-1.6.2-SNAPSHOT-tests.jar> to org.apache.deltaspike.modules/deltaspike-partial-bean-module-impl/1.6.2-SNAPSHOT/deltaspike-partial-bean-module-impl-1.6.2-SNAPSHOT-tests.jar
[JENKINS] Archiving <https://builds.apache.org/job/DeltaSpike%20OWB%20(nightly)/ws/deltaspike/modules/partial-bean/impl/target/deltaspike-partial-bean-module-impl-1.6.2-SNAPSHOT-sources.jar> to org.apache.deltaspike.modules/deltaspike-partial-bean-module-impl/1.6.2-SNAPSHOT/deltaspike-partial-bean-module-impl-1.6.2-SNAPSHOT-sources.jar
[JENKINS] Archiving <https://builds.apache.org/job/DeltaSpike%20OWB%20(nightly)/ws/deltaspike/modules/proxy/api/pom.xml> to org.apache.deltaspike.modules/deltaspike-proxy-module-api/1.6.2-SNAPSHOT/deltaspike-proxy-module-api-1.6.2-SNAPSHOT.pom
[JENKINS] Archiving <https://builds.apache.org/job/DeltaSpike%20OWB%20(nightly)/ws/deltaspike/modules/proxy/api/target/deltaspike-proxy-module-api-1.6.2-SNAPSHOT.jar> to org.apache.deltaspike.modules/deltaspike-proxy-module-api/1.6.2-SNAPSHOT/deltaspike-proxy-module-api-1.6.2-SNAPSHOT.jar
[JENKINS] Archiving <https://builds.apache.org/job/DeltaSpike%20OWB%20(nightly)/ws/deltaspike/modules/proxy/api/target/deltaspike-proxy-module-api-1.6.2-SNAPSHOT-tests.jar> to org.apache.deltaspike.modules/deltaspike-proxy-module-api/1.6.2-SNAPSHOT/deltaspike-proxy-module-api-1.6.2-SNAPSHOT-tests.jar
[JENKINS] Archiving <https://builds.apache.org/job/DeltaSpike%20OWB%20(nightly)/ws/deltaspike/modules/proxy/api/target/deltaspike-proxy-module-api-1.6.2-SNAPSHOT-sources.jar> to org.apache.deltaspike.modules/deltaspike-proxy-module-api/1.6.2-SNAPSHOT/deltaspike-proxy-module-api-1.6.2-SNAPSHOT-sources.jar
[JENKINS] Archiving <https://builds.apache.org/job/DeltaSpike%20OWB%20(nightly)/ws/deltaspike/modules/jpa/api/pom.xml> to org.apache.deltaspike.modules/deltaspike-jpa-module-api/1.6.2-SNAPSHOT/deltaspike-jpa-module-api-1.6.2-SNAPSHOT.pom
[JENKINS] Archiving <https://builds.apache.org/job/DeltaSpike%20OWB%20(nightly)/ws/deltaspike/modules/jpa/api/target/deltaspike-jpa-module-api-1.6.2-SNAPSHOT.jar> to org.apache.deltaspike.modules/deltaspike-jpa-module-api/1.6.2-SNAPSHOT/deltaspike-jpa-module-api-1.6.2-SNAPSHOT.jar
[JENKINS] Archiving <https://builds.apache.org/job/DeltaSpike%20OWB%20(nightly)/ws/deltaspike/modules/jpa/api/target/deltaspike-jpa-module-api-1.6.2-SNAPSHOT-tests.jar> to org.apache.deltaspike.modules/deltaspike-jpa-module-api/1.6.2-SNAPSHOT/deltaspike-jpa-module-api-1.6.2-SNAPSHOT-tests.jar
[JENKINS] Archiving <https://builds.apache.org/job/DeltaSpike%20OWB%20(nightly)/ws/deltaspike/modules/jpa/api/target/deltaspike-jpa-module-api-1.6.2-SNAPSHOT-sources.jar> to org.apache.deltaspike.modules/deltaspike-jpa-module-api/1.6.2-SNAPSHOT/deltaspike-jpa-module-api-1.6.2-SNAPSHOT-sources.jar
[JENKINS] Archiving <https://builds.apache.org/job/DeltaSpike%20OWB%20(nightly)/ws/deltaspike/modules/servlet/api/pom.xml> to org.apache.deltaspike.modules/deltaspike-servlet-module-api/1.6.2-SNAPSHOT/deltaspike-servlet-module-api-1.6.2-SNAPSHOT.pom
[JENKINS] Archiving <https://builds.apache.org/job/DeltaSpike%20OWB%20(nightly)/ws/deltaspike/modules/servlet/api/target/deltaspike-servlet-module-api-1.6.2-SNAPSHOT.jar> to org.apache.deltaspike.modules/deltaspike-servlet-module-api/1.6.2-SNAPSHOT/deltaspike-servlet-module-api-1.6.2-SNAPSHOT.jar
[JENKINS] Archiving <https://builds.apache.org/job/DeltaSpike%20OWB%20(nightly)/ws/deltaspike/modules/servlet/api/target/deltaspike-servlet-module-api-1.6.2-SNAPSHOT-tests.jar> to org.apache.deltaspike.modules/deltaspike-servlet-module-api/1.6.2-SNAPSHOT/deltaspike-servlet-module-api-1.6.2-SNAPSHOT-tests.jar
[JENKINS] Archiving <https://builds.apache.org/job/DeltaSpike%20OWB%20(nightly)/ws/deltaspike/modules/servlet/api/target/deltaspike-servlet-module-api-1.6.2-SNAPSHOT-sources.jar> to org.apache.deltaspike.modules/deltaspike-servlet-module-api/1.6.2-SNAPSHOT/deltaspike-servlet-module-api-1.6.2-SNAPSHOT-sources.jar
[JENKINS] Archiving <https://builds.apache.org/job/DeltaSpike%20OWB%20(nightly)/ws/deltaspike/modules/jpa/pom.xml> to org.apache.deltaspike.modules/jpa-module-project/1.6.2-SNAPSHOT/jpa-module-project-1.6.2-SNAPSHOT.pom
[JENKINS] Archiving <https://builds.apache.org/job/DeltaSpike%20OWB%20(nightly)/ws/deltaspike/modules/jpa/target/jpa-module-project-1.6.2-SNAPSHOT-tests.jar> to org.apache.deltaspike.modules/jpa-module-project/1.6.2-SNAPSHOT/jpa-module-project-1.6.2-SNAPSHOT-tests.jar
[JENKINS] Archiving <https://builds.apache.org/job/DeltaSpike%20OWB%20(nightly)/ws/deltaspike/cdictrl/pom.xml> to org.apache.deltaspike.cdictrl/cdictrl-project/1.6.2-SNAPSHOT/cdictrl-project-1.6.2-SNAPSHOT.pom
[JENKINS] Archiving <https://builds.apache.org/job/DeltaSpike%20OWB%20(nightly)/ws/deltaspike/modules/scheduler/api/pom.xml> to org.apache.deltaspike.modules/deltaspike-scheduler-module-api/1.6.2-SNAPSHOT/deltaspike-scheduler-module-api-1.6.2-SNAPSHOT.pom
[JENKINS] Archiving <https://builds.apache.org/job/DeltaSpike%20OWB%20(nightly)/ws/deltaspike/modules/test-control/impl/pom.xml> to org.apache.deltaspike.modules/deltaspike-test-control-module-impl/1.6.2-SNAPSHOT/deltaspike-test-control-module-impl-1.6.2-SNAPSHOT.pom
[JENKINS] Archiving <https://builds.apache.org/job/DeltaSpike%20OWB%20(nightly)/ws/deltaspike/modules/servlet/pom.xml> to org.apache.deltaspike.modules/servlet-module-project/1.6.2-SNAPSHOT/servlet-module-project-1.6.2-SNAPSHOT.pom
[JENKINS] Archiving <https://builds.apache.org/job/DeltaSpike%20OWB%20(nightly)/ws/deltaspike/modules/servlet/target/servlet-module-project-1.6.2-SNAPSHOT-tests.jar> to org.apache.deltaspike.modules/servlet-module-project/1.6.2-SNAPSHOT/servlet-module-project-1.6.2-SNAPSHOT-tests.jar
[JENKINS] Archiving <https://builds.apache.org/job/DeltaSpike%20OWB%20(nightly)/ws/deltaspike/modules/test-control/api/pom.xml> to org.apache.deltaspike.modules/deltaspike-test-control-module-api/1.6.2-SNAPSHOT/deltaspike-test-control-module-api-1.6.2-SNAPSHOT.pom
[JENKINS] Archiving <https://builds.apache.org/job/DeltaSpike%20OWB%20(nightly)/ws/deltaspike/modules/jsf/impl-ee6/pom.xml> to org.apache.deltaspike.modules/deltaspike-jsf-module-impl-ee6/1.6.2-SNAPSHOT/deltaspike-jsf-module-impl-ee6-1.6.2-SNAPSHOT.pom
[JENKINS] Archiving <https://builds.apache.org/job/DeltaSpike%20OWB%20(nightly)/ws/deltaspike/modules/jsf/impl-ee6/target/deltaspike-jsf-module-impl-ee6-1.6.2-SNAPSHOT.jar> to org.apache.deltaspike.modules/deltaspike-jsf-module-impl-ee6/1.6.2-SNAPSHOT/deltaspike-jsf-module-impl-ee6-1.6.2-SNAPSHOT.jar
[JENKINS] Archiving <https://builds.apache.org/job/DeltaSpike%20OWB%20(nightly)/ws/deltaspike/modules/jsf/impl-ee6/target/deltaspike-jsf-module-impl-ee6-1.6.2-SNAPSHOT-tests.jar> to org.apache.deltaspike.modules/deltaspike-jsf-module-impl-ee6/1.6.2-SNAPSHOT/deltaspike-jsf-module-impl-ee6-1.6.2-SNAPSHOT-tests.jar
[JENKINS] Archiving <https://builds.apache.org/job/DeltaSpike%20OWB%20(nightly)/ws/deltaspike/modules/jsf/impl-ee6/target/deltaspike-jsf-module-impl-ee6-1.6.2-SNAPSHOT-sources.jar> to org.apache.deltaspike.modules/deltaspike-jsf-module-impl-ee6/1.6.2-SNAPSHOT/deltaspike-jsf-module-impl-ee6-1.6.2-SNAPSHOT-sources.jar
[JENKINS] Archiving <https://builds.apache.org/job/DeltaSpike%20OWB%20(nightly)/ws/deltaspike/modules/proxy/pom.xml> to org.apache.deltaspike.modules/proxy-module-project/1.6.2-SNAPSHOT/proxy-module-project-1.6.2-SNAPSHOT.pom
[JENKINS] Archiving <https://builds.apache.org/job/DeltaSpike%20OWB%20(nightly)/ws/deltaspike/modules/proxy/target/proxy-module-project-1.6.2-SNAPSHOT-tests.jar> to org.apache.deltaspike.modules/proxy-module-project/1.6.2-SNAPSHOT/proxy-module-project-1.6.2-SNAPSHOT-tests.jar
[JENKINS] Archiving <https://builds.apache.org/job/DeltaSpike%20OWB%20(nightly)/ws/deltaspike/modules/partial-bean/api/pom.xml> to org.apache.deltaspike.modules/deltaspike-partial-bean-module-api/1.6.2-SNAPSHOT/deltaspike-partial-bean-module-api-1.6.2-SNAPSHOT.pom
[JENKINS] Archiving <https://builds.apache.org/job/DeltaSpike%20OWB%20(nightly)/ws/deltaspike/modules/partial-bean/api/target/deltaspike-partial-bean-module-api-1.6.2-SNAPSHOT.jar> to org.apache.deltaspike.modules/deltaspike-partial-bean-module-api/1.6.2-SNAPSHOT/deltaspike-partial-bean-module-api-1.6.2-SNAPSHOT.jar
[JENKINS] Archiving <https://builds.apache.org/job/DeltaSpike%20OWB%20(nightly)/ws/deltaspike/modules/partial-bean/api/target/deltaspike-partial-bean-module-api-1.6.2-SNAPSHOT-tests.jar> to org.apache.deltaspike.modules/deltaspike-partial-bean-module-api/1.6.2-SNAPSHOT/deltaspike-partial-bean-module-api-1.6.2-SNAPSHOT-tests.jar
[JENKINS] Archiving <https://builds.apache.org/job/DeltaSpike%20OWB%20(nightly)/ws/deltaspike/modules/partial-bean/api/target/deltaspike-partial-bean-module-api-1.6.2-SNAPSHOT-sources.jar> to org.apache.deltaspike.modules/deltaspike-partial-bean-module-api/1.6.2-SNAPSHOT/deltaspike-partial-bean-module-api-1.6.2-SNAPSHOT-sources.jar
[JENKINS] Archiving <https://builds.apache.org/job/DeltaSpike%20OWB%20(nightly)/ws/deltaspike/modules/scheduler/impl/pom.xml> to org.apache.deltaspike.modules/deltaspike-scheduler-module-impl/1.6.2-SNAPSHOT/deltaspike-scheduler-module-impl-1.6.2-SNAPSHOT.pom
[JENKINS] Archiving <https://builds.apache.org/job/DeltaSpike%20OWB%20(nightly)/ws/deltaspike/parent/pom.xml> to org.apache.deltaspike/parent/1.6.2-SNAPSHOT/parent-1.6.2-SNAPSHOT.pom
Compressed 40.15 KB of artifacts by 79.7% relative to #1274
[JENKINS] Archiving <https://builds.apache.org/job/DeltaSpike%20OWB%20(nightly)/ws/deltaspike/core/pom.xml> to org.apache.deltaspike.core/core-project/1.6.2-SNAPSHOT/core-project-1.6.2-SNAPSHOT.pom
[JENKINS] Archiving <https://builds.apache.org/job/DeltaSpike%20OWB%20(nightly)/ws/deltaspike/core/target/core-project-1.6.2-SNAPSHOT-tests.jar> to org.apache.deltaspike.core/core-project/1.6.2-SNAPSHOT/core-project-1.6.2-SNAPSHOT-tests.jar
[JENKINS] Archiving <https://builds.apache.org/job/DeltaSpike%20OWB%20(nightly)/ws/deltaspike/modules/bean-validation/api/pom.xml> to org.apache.deltaspike.modules/deltaspike-bean-validation-module-api/1.6.2-SNAPSHOT/deltaspike-bean-validation-module-api-1.6.2-SNAPSHOT.pom
[JENKINS] Archiving <https://builds.apache.org/job/DeltaSpike%20OWB%20(nightly)/ws/deltaspike/modules/bean-validation/api/target/deltaspike-bean-validation-module-api-1.6.2-SNAPSHOT.jar> to org.apache.deltaspike.modules/deltaspike-bean-validation-module-api/1.6.2-SNAPSHOT/deltaspike-bean-validation-module-api-1.6.2-SNAPSHOT.jar
[JENKINS] Archiving <https://builds.apache.org/job/DeltaSpike%20OWB%20(nightly)/ws/deltaspike/modules/bean-validation/api/target/deltaspike-bean-validation-module-api-1.6.2-SNAPSHOT-tests.jar> to org.apache.deltaspike.modules/deltaspike-bean-validation-module-api/1.6.2-SNAPSHOT/deltaspike-bean-validation-module-api-1.6.2-SNAPSHOT-tests.jar
[JENKINS] Archiving <https://builds.apache.org/job/DeltaSpike%20OWB%20(nightly)/ws/deltaspike/modules/bean-validation/api/target/deltaspike-bean-validation-module-api-1.6.2-SNAPSHOT-sources.jar> to org.apache.deltaspike.modules/deltaspike-bean-validation-module-api/1.6.2-SNAPSHOT/deltaspike-bean-validation-module-api-1.6.2-SNAPSHOT-sources.jar
[JENKINS] Archiving <https://builds.apache.org/job/DeltaSpike%20OWB%20(nightly)/ws/deltaspike/core/api/pom.xml> to org.apache.deltaspike.core/deltaspike-core-api/1.6.2-SNAPSHOT/deltaspike-core-api-1.6.2-SNAPSHOT.pom
[JENKINS] Archiving <https://builds.apache.org/job/DeltaSpike%20OWB%20(nightly)/ws/deltaspike/core/api/target/deltaspike-core-api-1.6.2-SNAPSHOT.jar> to org.apache.deltaspike.core/deltaspike-core-api/1.6.2-SNAPSHOT/deltaspike-core-api-1.6.2-SNAPSHOT.jar
[JENKINS] Archiving <https://builds.apache.org/job/DeltaSpike%20OWB%20(nightly)/ws/deltaspike/core/api/target/deltaspike-core-api-1.6.2-SNAPSHOT-tests.jar> to org.apache.deltaspike.core/deltaspike-core-api/1.6.2-SNAPSHOT/deltaspike-core-api-1.6.2-SNAPSHOT-tests.jar
[JENKINS] Archiving <https://builds.apache.org/job/DeltaSpike%20OWB%20(nightly)/ws/deltaspike/core/api/target/deltaspike-core-api-1.6.2-SNAPSHOT-sources.jar> to org.apache.deltaspike.core/deltaspike-core-api/1.6.2-SNAPSHOT/deltaspike-core-api-1.6.2-SNAPSHOT-sources.jar
[JENKINS] Archiving <https://builds.apache.org/job/DeltaSpike%20OWB%20(nightly)/ws/deltaspike/modules/security/impl/pom.xml> to org.apache.deltaspike.modules/deltaspike-security-module-impl/1.6.2-SNAPSHOT/deltaspike-security-module-impl-1.6.2-SNAPSHOT.pom
[JENKINS] Archiving <https://builds.apache.org/job/DeltaSpike%20OWB%20(nightly)/ws/deltaspike/modules/security/impl/target/deltaspike-security-module-impl-1.6.2-SNAPSHOT.jar> to org.apache.deltaspike.modules/deltaspike-security-module-impl/1.6.2-SNAPSHOT/deltaspike-security-module-impl-1.6.2-SNAPSHOT.jar
[JENKINS] Archiving <https://builds.apache.org/job/DeltaSpike%20OWB%20(nightly)/ws/deltaspike/modules/security/impl/target/deltaspike-security-module-impl-1.6.2-SNAPSHOT-tests.jar> to org.apache.deltaspike.modules/deltaspike-security-module-impl/1.6.2-SNAPSHOT/deltaspike-security-module-impl-1.6.2-SNAPSHOT-tests.jar
[JENKINS] Archiving <https://builds.apache.org/job/DeltaSpike%20OWB%20(nightly)/ws/deltaspike/modules/security/impl/target/deltaspike-security-module-impl-1.6.2-SNAPSHOT-sources.jar> to org.apache.deltaspike.modules/deltaspike-security-module-impl/1.6.2-SNAPSHOT/deltaspike-security-module-impl-1.6.2-SNAPSHOT-sources.jar
[JENKINS] Archiving <https://builds.apache.org/job/DeltaSpike%20OWB%20(nightly)/ws/deltaspike/modules/scheduler/pom.xml> to org.apache.deltaspike.modules/scheduler-module-project/1.6.2-SNAPSHOT/scheduler-module-project-1.6.2-SNAPSHOT.pom
[JENKINS] Archiving <https://builds.apache.org/job/DeltaSpike%20OWB%20(nightly)/ws/deltaspike/modules/proxy/impl-asm5/pom.xml> to org.apache.deltaspike.modules/deltaspike-proxy-module-impl-asm5/1.6.2-SNAPSHOT/deltaspike-proxy-module-impl-asm5-1.6.2-SNAPSHOT.pom
[JENKINS] Archiving <https://builds.apache.org/job/DeltaSpike%20OWB%20(nightly)/ws/deltaspike/modules/proxy/impl-asm5/target/deltaspike-proxy-module-impl-asm5-1.6.2-SNAPSHOT.jar> to org.apache.deltaspike.modules/deltaspike-proxy-module-impl-asm5/1.6.2-SNAPSHOT/deltaspike-proxy-module-impl-asm5-1.6.2-SNAPSHOT.jar
[JENKINS] Archiving <https://builds.apache.org/job/DeltaSpike%20OWB%20(nightly)/ws/deltaspike/modules/proxy/impl-asm5/target/deltaspike-proxy-module-impl-asm5-1.6.2-SNAPSHOT-tests.jar> to org.apache.deltaspike.modules/deltaspike-proxy-module-impl-asm5/1.6.2-SNAPSHOT/deltaspike-proxy-module-impl-asm5-1.6.2-SNAPSHOT-tests.jar
[JENKINS] Archiving <https://builds.apache.org/job/DeltaSpike%20OWB%20(nightly)/ws/deltaspike/modules/proxy/impl-asm5/target/deltaspike-proxy-module-impl-asm5-1.6.2-SNAPSHOT-sources.jar> to org.apache.deltaspike.modules/deltaspike-proxy-module-impl-asm5/1.6.2-SNAPSHOT/deltaspike-proxy-module-impl-asm5-1.6.2-SNAPSHOT-sources.jar
[JENKINS] Archiving <https://builds.apache.org/job/DeltaSpike%20OWB%20(nightly)/ws/deltaspike/examples/jsf-playground/pom.xml> to org.apache.deltaspike.examples/deltaspike-jsf-playground/1.6.2-SNAPSHOT/deltaspike-jsf-playground-1.6.2-SNAPSHOT.pom
[JENKINS] Archiving <https://builds.apache.org/job/DeltaSpike%20OWB%20(nightly)/ws/deltaspike/modules/servlet/impl/pom.xml> to org.apache.deltaspike.modules/deltaspike-servlet-module-impl/1.6.2-SNAPSHOT/deltaspike-servlet-module-impl-1.6.2-SNAPSHOT.pom
[JENKINS] Archiving <https://builds.apache.org/job/DeltaSpike%20OWB%20(nightly)/ws/deltaspike/modules/servlet/impl/target/deltaspike-servlet-module-impl-1.6.2-SNAPSHOT.jar> to org.apache.deltaspike.modules/deltaspike-servlet-module-impl/1.6.2-SNAPSHOT/deltaspike-servlet-module-impl-1.6.2-SNAPSHOT.jar
[JENKINS] Archiving <https://builds.apache.org/job/DeltaSpike%20OWB%20(nightly)/ws/deltaspike/modules/servlet/impl/target/deltaspike-servlet-module-impl-1.6.2-SNAPSHOT-tests.jar> to org.apache.deltaspike.modules/deltaspike-servlet-module-impl/1.6.2-SNAPSHOT/deltaspike-servlet-module-impl-1.6.2-SNAPSHOT-tests.jar
[JENKINS] Archiving <https://builds.apache.org/job/DeltaSpike%20OWB%20(nightly)/ws/deltaspike/modules/servlet/impl/target/deltaspike-servlet-module-impl-1.6.2-SNAPSHOT-sources.jar> to org.apache.deltaspike.modules/deltaspike-servlet-module-impl/1.6.2-SNAPSHOT/deltaspike-servlet-module-impl-1.6.2-SNAPSHOT-sources.jar
[JENKINS] Archiving <https://builds.apache.org/job/DeltaSpike%20OWB%20(nightly)/ws/deltaspike/modules/bean-validation/impl/pom.xml> to org.apache.deltaspike.modules/deltaspike-bean-validation-module-impl/1.6.2-SNAPSHOT/deltaspike-bean-validation-module-impl-1.6.2-SNAPSHOT.pom
[JENKINS] Archiving <https://builds.apache.org/job/DeltaSpike%20OWB%20(nightly)/ws/deltaspike/modules/bean-validation/impl/target/deltaspike-bean-validation-module-impl-1.6.2-SNAPSHOT.jar> to org.apache.deltaspike.modules/deltaspike-bean-validation-module-impl/1.6.2-SNAPSHOT/deltaspike-bean-validation-module-impl-1.6.2-SNAPSHOT.jar
[JENKINS] Archiving <https://builds.apache.org/job/DeltaSpike%20OWB%20(nightly)/ws/deltaspike/modules/bean-validation/impl/target/deltaspike-bean-validation-module-impl-1.6.2-SNAPSHOT-tests.jar> to org.apache.deltaspike.modules/deltaspike-bean-validation-module-impl/1.6.2-SNAPSHOT/deltaspike-bean-validation-module-impl-1.6.2-SNAPSHOT-tests.jar
[JENKINS] Archiving <https://builds.apache.org/job/DeltaSpike%20OWB%20(nightly)/ws/deltaspike/modules/bean-validation/impl/target/deltaspike-bean-validation-module-impl-1.6.2-SNAPSHOT-sources.jar> to org.apache.deltaspike.modules/deltaspike-bean-validation-module-impl/1.6.2-SNAPSHOT/deltaspike-bean-validation-module-impl-1.6.2-SNAPSHOT-sources.jar
[JENKINS] Archiving <https://builds.apache.org/job/DeltaSpike%20OWB%20(nightly)/ws/deltaspike/cdictrl/impl-owb/pom.xml> to org.apache.deltaspike.cdictrl/deltaspike-cdictrl-owb/1.6.2-SNAPSHOT/deltaspike-cdictrl-owb-1.6.2-SNAPSHOT.pom
[JENKINS] Archiving <https://builds.apache.org/job/DeltaSpike%20OWB%20(nightly)/ws/deltaspike/cdictrl/impl-owb/target/deltaspike-cdictrl-owb-1.6.2-SNAPSHOT.jar> to org.apache.deltaspike.cdictrl/deltaspike-cdictrl-owb/1.6.2-SNAPSHOT/deltaspike-cdictrl-owb-1.6.2-SNAPSHOT.jar
[JENKINS] Archiving <https://builds.apache.org/job/DeltaSpike%20OWB%20(nightly)/ws/deltaspike/cdictrl/impl-owb/target/deltaspike-cdictrl-owb-1.6.2-SNAPSHOT-sources.jar> to org.apache.deltaspike.cdictrl/deltaspike-cdictrl-owb/1.6.2-SNAPSHOT/deltaspike-cdictrl-owb-1.6.2-SNAPSHOT-sources.jar
[JENKINS] Archiving <https://builds.apache.org/job/DeltaSpike%20OWB%20(nightly)/ws/deltaspike/modules/jpa/impl/pom.xml> to org.apache.deltaspike.modules/deltaspike-jpa-module-impl/1.6.2-SNAPSHOT/deltaspike-jpa-module-impl-1.6.2-SNAPSHOT.pom
[JENKINS] Archiving <https://builds.apache.org/job/DeltaSpike%20OWB%20(nightly)/ws/deltaspike/modules/jpa/impl/target/deltaspike-jpa-module-impl-1.6.2-SNAPSHOT.jar> to org.apache.deltaspike.modules/deltaspike-jpa-module-impl/1.6.2-SNAPSHOT/deltaspike-jpa-module-impl-1.6.2-SNAPSHOT.jar
[JENKINS] Archiving <https://builds.apache.org/job/DeltaSpike%20OWB%20(nightly)/ws/deltaspike/modules/jpa/impl/target/deltaspike-jpa-module-impl-1.6.2-SNAPSHOT-tests.jar> to org.apache.deltaspike.modules/deltaspike-jpa-module-impl/1.6.2-SNAPSHOT/deltaspike-jpa-module-impl-1.6.2-SNAPSHOT-tests.jar
[JENKINS] Archiving <https://builds.apache.org/job/DeltaSpike%20OWB%20(nightly)/ws/deltaspike/modules/jpa/impl/target/deltaspike-jpa-module-impl-1.6.2-SNAPSHOT-sources.jar> to org.apache.deltaspike.modules/deltaspike-jpa-module-impl/1.6.2-SNAPSHOT/deltaspike-jpa-module-impl-1.6.2-SNAPSHOT-sources.jar
[JENKINS] Archiving <https://builds.apache.org/job/DeltaSpike%20OWB%20(nightly)/ws/deltaspike/modules/data/pom.xml> to org.apache.deltaspike.modules/data-module-project/1.6.2-SNAPSHOT/data-module-project-1.6.2-SNAPSHOT.pom
[JENKINS] Archiving <https://builds.apache.org/job/DeltaSpike%20OWB%20(nightly)/ws/deltaspike/modules/data/target/data-module-project-1.6.2-SNAPSHOT-tests.jar> to org.apache.deltaspike.modules/data-module-project/1.6.2-SNAPSHOT/data-module-project-1.6.2-SNAPSHOT-tests.jar
[JENKINS] Archiving <https://builds.apache.org/job/DeltaSpike%20OWB%20(nightly)/ws/deltaspike/examples/security-requested-page-after-login-picketlink/pom.xml> to org.apache.deltaspike.examples/deltaspike-security-requested-page-after-login-picketlink/1.6.2-SNAPSHOT/deltaspike-security-requested-page-after-login-picketlink-1.6.2-SNAPSHOT.pom
[JENKINS] Archiving <https://builds.apache.org/job/DeltaSpike%20OWB%20(nightly)/ws/deltaspike/pom.xml> to org.apache.deltaspike/deltaspike-project/1.6.2-SNAPSHOT/deltaspike-project-1.6.2-SNAPSHOT.pom
[JENKINS] Archiving <https://builds.apache.org/job/DeltaSpike%20OWB%20(nightly)/ws/deltaspike/modules/security/api/pom.xml> to org.apache.deltaspike.modules/deltaspike-security-module-api/1.6.2-SNAPSHOT/deltaspike-security-module-api-1.6.2-SNAPSHOT.pom
[JENKINS] Archiving <https://builds.apache.org/job/DeltaSpike%20OWB%20(nightly)/ws/deltaspike/modules/security/api/target/deltaspike-security-module-api-1.6.2-SNAPSHOT.jar> to org.apache.deltaspike.modules/deltaspike-security-module-api/1.6.2-SNAPSHOT/deltaspike-security-module-api-1.6.2-SNAPSHOT.jar
[JENKINS] Archiving <https://builds.apache.org/job/DeltaSpike%20OWB%20(nightly)/ws/deltaspike/modules/security/api/target/deltaspike-security-module-api-1.6.2-SNAPSHOT-tests.jar> to org.apache.deltaspike.modules/deltaspike-security-module-api/1.6.2-SNAPSHOT/deltaspike-security-module-api-1.6.2-SNAPSHOT-tests.jar
[JENKINS] Archiving <https://builds.apache.org/job/DeltaSpike%20OWB%20(nightly)/ws/deltaspike/modules/security/api/target/deltaspike-security-module-api-1.6.2-SNAPSHOT-sources.jar> to org.apache.deltaspike.modules/deltaspike-security-module-api/1.6.2-SNAPSHOT/deltaspike-security-module-api-1.6.2-SNAPSHOT-sources.jar
Sending e-mails to: commits@deltaspike.apache.org
channel stopped