You are viewing a plain text version of this content. The canonical link for it is here.
Posted to dev@sling.apache.org by Apache Jenkins Server <je...@builds.apache.org> on 2011/09/07 16:32:41 UTC

Build failed in Jenkins: sling-trunk-1.6 #1024

See <https://builds.apache.org/job/sling-trunk-1.6/1024/>

------------------------------------------
Started by upstream project "Jackrabbit-trunk" build number 1646
Building remotely on ubuntu1
Updating http://svn.apache.org/repos/asf/sling/trunk
At revision 1166197
no change for http://svn.apache.org/repos/asf/sling/trunk since the previous build
[locks-and-latches] Checking to see if we really have the locks
[locks-and-latches] Have all the locks, build can start
Parsing POMs
Modules changed, recalculating dependency graph
[trunk] $ /home/hudson/tools/java/latest1.6/bin/java -Xmx512M -XX:MaxPermSize=256M -enableassertions -cp /home/jenkins/jenkins-slave/maven3-agent.jar:/home/jenkins/jenkins-slave/tools/Maven_3.0.3/boot/plexus-classworlds-2.4.jar org.jvnet.hudson.maven3.agent.Maven3Main /home/jenkins/jenkins-slave/tools/Maven_3.0.3 /home/jenkins/jenkins-slave/slave.jar /home/jenkins/jenkins-slave/maven3-interceptor.jar 49678
<===[JENKchannel started
INS REMOTING CAPACITY]===>   Executing Maven:  -B -f <https://builds.apache.org/job/sling-trunk-1.6/ws/trunk/pom.xml> -DobrRepository=false clean install -DHttpTestBase.readyTimeoutSeconds=300 -PwarIntegrationTests
[INFO] Scanning for projects...
Downloading: http://repository.apache.org/snapshots/org/apache/sling/maven-launchpad-plugin/2.1.1-SNAPSHOT/maven-launchpad-plugin-2.1.1-SNAPSHOT.pom
[WARNING] The POM for org.apache.sling:maven-launchpad-plugin:jar:2.1.1-SNAPSHOT is missing, no dependency information available
Downloading: http://repository.apache.org/snapshots/org/apache/sling/maven-launchpad-plugin/2.1.1-SNAPSHOT/maven-launchpad-plugin-2.1.1-SNAPSHOT.jar
Downloading: http://repository.apache.org/snapshots/org/apache/sling/maven-launchpad-plugin/2.1.1-SNAPSHOT/maven-launchpad-plugin-2.1.1-SNAPSHOT.pom
[WARNING] The POM for org.apache.sling:maven-launchpad-plugin:jar:2.1.1-SNAPSHOT is missing, no dependency information available
Downloading: http://repository.apache.org/snapshots/org/apache/sling/maven-launchpad-plugin/2.1.1-SNAPSHOT/maven-launchpad-plugin-2.1.1-SNAPSHOT.jar
mavenExecutionResult exceptions not empty
message : Some problems were encountered while processing the POMs:
[ERROR] Unresolveable build extension: Plugin org.apache.sling:maven-launchpad-plugin:2.1.1-SNAPSHOT or one of its dependencies could not be resolved: Could not find artifact org.apache.sling:maven-launchpad-plugin:jar:2.1.1-SNAPSHOT in Nexus (http://repository.apache.org/snapshots) @ 
[ERROR] Unknown packaging: partialbundlelist @ line 32, column 16
[ERROR] Unresolveable build extension: Plugin org.apache.sling:maven-launchpad-plugin:2.1.1-SNAPSHOT or one of its dependencies could not be resolved: Could not find artifact org.apache.sling:maven-launchpad-plugin:jar:2.1.1-SNAPSHOT in Nexus (http://repository.apache.org/snapshots) @ 
[ERROR] Unresolveable build extension: Plugin org.apache.sling:maven-launchpad-plugin:2.1.1-SNAPSHOT or one of its dependencies could not be resolved: Could not find artifact org.apache.sling:maven-launchpad-plugin:jar:2.1.1-SNAPSHOT in Nexus (http://repository.apache.org/snapshots) @ 

Stack trace : 
org.apache.maven.project.ProjectBuildingException: Some problems were encountered while processing the POMs:
[ERROR] Unresolveable build extension: Plugin org.apache.sling:maven-launchpad-plugin:2.1.1-SNAPSHOT or one of its dependencies could not be resolved: Could not find artifact org.apache.sling:maven-launchpad-plugin:jar:2.1.1-SNAPSHOT in Nexus (http://repository.apache.org/snapshots) @ 
[ERROR] Unknown packaging: partialbundlelist @ line 32, column 16
[ERROR] Unresolveable build extension: Plugin org.apache.sling:maven-launchpad-plugin:2.1.1-SNAPSHOT or one of its dependencies could not be resolved: Could not find artifact org.apache.sling:maven-launchpad-plugin:jar:2.1.1-SNAPSHOT in Nexus (http://repository.apache.org/snapshots) @ 
[ERROR] Unresolveable build extension: Plugin org.apache.sling:maven-launchpad-plugin:2.1.1-SNAPSHOT or one of its dependencies could not be resolved: Could not find artifact org.apache.sling:maven-launchpad-plugin:jar:2.1.1-SNAPSHOT in Nexus (http://repository.apache.org/snapshots) @ 

	at org.apache.maven.project.DefaultProjectBuilder.build(DefaultProjectBuilder.java:339)
	at org.apache.maven.DefaultMaven.collectProjects(DefaultMaven.java:632)
	at org.apache.maven.DefaultMaven.getProjectsForMavenReactor(DefaultMaven.java:581)
	at org.apache.maven.DefaultMaven.doExecute(DefaultMaven.java:233)
	at org.apache.maven.DefaultMaven.execute(DefaultMaven.java:156)
	at org.jvnet.hudson.maven3.launcher.Maven3Launcher.main(Maven3Launcher.java:79)
	at sun.reflect.NativeMethodAccessorImpl.invoke0(Native Method)
	at sun.reflect.NativeMethodAccessorImpl.invoke(NativeMethodAccessorImpl.java:39)
	at sun.reflect.DelegatingMethodAccessorImpl.invoke(DelegatingMethodAccessorImpl.java:25)
	at java.lang.reflect.Method.invoke(Method.java:597)
	at org.codehaus.plexus.classworlds.launcher.Launcher.launchStandard(Launcher.java:329)
	at org.codehaus.plexus.classworlds.launcher.Launcher.launch(Launcher.java:239)
	at org.jvnet.hudson.maven3.agent.Maven3Main.launch(Maven3Main.java:158)
	at hudson.maven.Maven3Builder.call(Maven3Builder.java:121)
	at hudson.maven.Maven3Builder.call(Maven3Builder.java:73)
	at hudson.remoting.UserRequest.perform(UserRequest.java:118)
	at hudson.remoting.UserRequest.perform(UserRequest.java:48)
	at hudson.remoting.Request$2.run(Request.java:287)
	at java.util.concurrent.Executors$RunnableAdapter.call(Executors.java:441)
	at java.util.concurrent.FutureTask$Sync.innerRun(FutureTask.java:303)
	at java.util.concurrent.FutureTask.run(FutureTask.java:138)
	at java.util.concurrent.ThreadPoolExecutor$Worker.runTask(ThreadPoolExecutor.java:886)
	at java.util.concurrent.ThreadPoolExecutor$Worker.run(ThreadPoolExecutor.java:908)
	at java.lang.Thread.run(Thread.java:619)
channel stopped
[locks-and-latches] Releasing all the locks
[locks-and-latches] All the locks released


Jenkins build is back to normal : sling-trunk-1.6 #1028

Posted by Apache Jenkins Server <je...@builds.apache.org>.
See <https://builds.apache.org/job/sling-trunk-1.6/1028/changes>



Build failed in Jenkins: sling-trunk-1.6 #1027

Posted by Apache Jenkins Server <je...@builds.apache.org>.
See <https://builds.apache.org/job/sling-trunk-1.6/1027/changes>

Changes:

[justin] SLING-2209 - updating annotations

[justin] SLING-2208 - supporting array for javax.script.name in SlingBindingsProvider

[justin] adding misc git ignore files

------------------------------------------
[...truncated 14526 lines...]
[INFO] 
[INFO] --- maven-jar-plugin:2.3.1:jar (default-jar) @ org.apache.sling.testing.samples.integrationtests ---
[INFO] Building jar: <https://builds.apache.org/job/sling-trunk-1.6/ws/trunk/testing/samples/integration-tests/target/org.apache.sling.testing.samples.integrationtests-1.0.7-SNAPSHOT.jar>
mojo forkStarted org.apache.maven.plugins:maven-source-plugin:2.1.2(attach-sources)
forkedProjectStarted org.apache.sling:org.apache.sling.testing.samples.integrationtests1.0.7-SNAPSHOT
[INFO] 
[INFO] --- maven-enforcer-plugin:1.0:enforce (enforce-java) @ org.apache.sling.testing.samples.integrationtests ---
forkedProjectSucceeded org.apache.sling:org.apache.sling.testing.samples.integrationtests1.0.7-SNAPSHOT
[JENKINS] Archiving <https://builds.apache.org/job/sling-trunk-1.6/ws/trunk/testing/samples/integration-tests/pom.xml> to /home/hudson/hudson/jobs/sling-trunk-1.6/modules/org.apache.sling$org.apache.sling.testing.samples.integrationtests/builds/2011-09-08_01-17-15/archive/org.apache.sling/org.apache.sling.testing.samples.integrationtests/1.0.7-SNAPSHOT/org.apache.sling.testing.samples.integrationtests-1.0.7-SNAPSHOT.pom
[JENKINS] Archiving <https://builds.apache.org/job/sling-trunk-1.6/ws/trunk/testing/samples/integration-tests/target/org.apache.sling.testing.samples.integrationtests-1.0.7-SNAPSHOT.jar> to /home/hudson/hudson/jobs/sling-trunk-1.6/modules/org.apache.sling$org.apache.sling.testing.samples.integrationtests/builds/2011-09-08_01-17-15/archive/org.apache.sling/org.apache.sling.testing.samples.integrationtests/1.0.7-SNAPSHOT/org.apache.sling.testing.samples.integrationtests-1.0.7-SNAPSHOT.jar
mojo forkSucceeded org.apache.maven.plugins:maven-source-plugin:2.1.2(attach-sources)
ignoring exception during new ExecutedMojo null
[INFO] 
[INFO] --- maven-source-plugin:2.1.2:jar (attach-sources) @ org.apache.sling.testing.samples.integrationtests ---
[INFO] META-INF already added, skipping
[INFO] META-INF/LICENSE already added, skipping
[INFO] META-INF/NOTICE already added, skipping
[INFO] META-INF/DEPENDENCIES already added, skipping
[INFO] Building jar: <https://builds.apache.org/job/sling-trunk-1.6/ws/trunk/testing/samples/integration-tests/target/org.apache.sling.testing.samples.integrationtests-1.0.7-SNAPSHOT-sources.jar>
[INFO] META-INF already added, skipping
[INFO] META-INF/LICENSE already added, skipping
[INFO] META-INF/NOTICE already added, skipping
[INFO] META-INF/DEPENDENCIES already added, skipping
[INFO] 
[INFO] --- maven-failsafe-plugin:2.7.2:integration-test (integration-test) @ org.apache.sling.testing.samples.integrationtests ---
[INFO] Failsafe report directory: <https://builds.apache.org/job/sling-trunk-1.6/ws/trunk/testing/samples/integration-tests/target/failsafe-reports>

-------------------------------------------------------
 T E S T S
-------------------------------------------------------
Running org.apache.sling.testing.samples.integrationtests.http.OsgiConsoleTest
5 [main] INFO org.apache.sling.testing.tools.sling.SlingTestBase - Server base URL=http://localhost:53907
16 [main] INFO org.apache.sling.testing.tools.jarexec.JarExecutor - Executable jar options: -p 53907
16 [main] INFO org.apache.sling.testing.tools.jarexec.JarExecutor - Executing java -Xmx512m -jar <https://builds.apache.org/job/sling-trunk-1.6/ws/trunk/testing/samples/integration-tests/target/dependency/org.apache.sling.launchpad-6-standalone.jar> -p 53907
21 [main] INFO org.apache.sling.testing.tools.sling.TimeoutsProvider - Timeout factor set to 1.0 from system property sling.testing.timeout.multiplier
21 [main] INFO org.apache.sling.testing.tools.sling.SlingTestBase - Will wait up to 60 seconds for server to become ready
23 [main] INFO org.apache.sling.testing.tools.sling.SlingTestBase - Checking that GET requests return expected content (timeout=60 seconds): [/:script src="system/sling.js", /.explorer.html:href="/libs/sling/explorer/css/explorer.css", /sling-test/sling/sling-test.html:Sling client library tests]
08.09.2011 01:48:21.913 *INFO* [main] Setting sling.home=sling (default)
08.09.2011 01:48:21.913 *INFO* [main] Starting Sling in sling (<https://builds.apache.org/job/sling-trunk-1.6/ws/trunk/testing/samples/integration-tests/sling)>
08.09.2011 01:48:21.918 *INFO* [main] Checking launcher JAR in folder sling
08.09.2011 01:48:21.929 *INFO* [main] Installing new launcher: jar:<https://builds.apache.org/job/sling-trunk-1.6/ws/trunk/testing/samples/integration-tests/target/dependency/org.apache.sling.launchpad-6-standalone.jar!/resources/org.apache.sling.launchpad.base.jar,> 2.3.0 (org.apache.sling.launchpad.base.jar.1315446501928)
08.09.2011 01:48:21.930 *INFO* [main] Loading launcher class org.apache.sling.launchpad.base.app.MainDelegate from org.apache.sling.launchpad.base.jar.1315446501928
08.09.2011 01:48:21.940 *INFO* [main] Starting launcher ...
08.09.2011 01:48:21.942 *INFO* [main] HTTP server port: 53907
08.09.2011 01:48:23.183 *INFO* [main] Startup completed
60621 [main] INFO org.apache.sling.testing.tools.sling.SlingTestBase - Server not ready after 60 seconds, giving up
Tests run: 1, Failures: 1, Errors: 0, Skipped: 0, Time elapsed: 60.697 sec <<< FAILURE!
Running org.apache.sling.testing.samples.integrationtests.serverside.JSONResponseTest
60637 [main] INFO org.apache.sling.testing.tools.sling.SlingTestBase - Server base URL=http://localhost:53907
Tests run: 1, Failures: 1, Errors: 0, Skipped: 0, Time elapsed: 0.003 sec <<< FAILURE!
Running org.apache.sling.testing.samples.integrationtests.serverside.SingleServerSideMethodTest
60645 [main] INFO org.apache.sling.testing.tools.sling.SlingTestBase - Server base URL=http://localhost:53907
Tests run: 1, Failures: 1, Errors: 0, Skipped: 0, Time elapsed: 0.003 sec <<< FAILURE!
Running org.apache.sling.testing.samples.integrationtests.serverside.sling.SlingServerSideSingleMethodTest
60650 [main] INFO org.apache.sling.testing.tools.sling.SlingTestBase - Server base URL=http://localhost:53907
Tests run: 1, Failures: 1, Errors: 0, Skipped: 0, Time elapsed: 0.004 sec <<< FAILURE!
Running org.apache.sling.testing.samples.integrationtests.serverside.sling.SlingServerSideTest
60658 [main] INFO org.apache.sling.testing.tools.sling.SlingTestBase - Server base URL=http://localhost:53907
Tests run: 1, Failures: 1, Errors: 0, Skipped: 0, Time elapsed: 0.002 sec <<< FAILURE!
Running org.apache.sling.testing.samples.integrationtests.serverside.FailingTestsTest
60663 [main] INFO org.apache.sling.testing.tools.sling.SlingTestBase - Server base URL=http://localhost:53907
Tests run: 1, Failures: 1, Errors: 0, Skipped: 0, Time elapsed: 0.001 sec <<< FAILURE!
Running org.apache.sling.testing.samples.integrationtests.serverside.scriptable.ScriptableTestsTest
60675 [main] INFO org.apache.sling.testing.tools.sling.SlingTestBase - Server base URL=http://localhost:53907
60677 [main] INFO org.apache.sling.testing.tools.sling.SlingTestBase - Server base URL=http://localhost:53907
Tests run: 2, Failures: 2, Errors: 0, Skipped: 0, Time elapsed: 0.011 sec <<< FAILURE!
Running org.apache.sling.testing.samples.integrationtests.serverside.DontCareForTestsCountTest
60681 [main] INFO org.apache.sling.testing.tools.sling.SlingTestBase - Server base URL=http://localhost:53907
Tests run: 1, Failures: 1, Errors: 0, Skipped: 0, Time elapsed: 0.002 sec <<< FAILURE!
Running org.apache.sling.testing.samples.integrationtests.serverside.ServerSideSampleTest
60684 [main] INFO org.apache.sling.testing.tools.sling.SlingTestBase - Server base URL=http://localhost:53907
Tests run: 1, Failures: 1, Errors: 0, Skipped: 0, Time elapsed: 0.001 sec <<< FAILURE!

Results :

Failed tests: 
  testSomeConsolePaths(org.apache.sling.testing.samples.integrationtests.http.OsgiConsoleTest): Server not ready after 60 seconds, giving up
  testWithRetries(org.apache.sling.testing.samples.integrationtests.serverside.JSONResponseTest): Server is not ready according to previous tests
  initializationError(org.apache.sling.testing.samples.integrationtests.serverside.SingleServerSideMethodTest): Server is not ready according to previous tests
  initializationError(org.apache.sling.testing.samples.integrationtests.serverside.sling.SlingServerSideSingleMethodTest): Server is not ready according to previous tests
  initializationError(org.apache.sling.testing.samples.integrationtests.serverside.sling.SlingServerSideTest): Server is not ready according to previous tests
  testFailures(org.apache.sling.testing.samples.integrationtests.serverside.FailingTestsTest): Server is not ready according to previous tests
  testScriptableTest[0](org.apache.sling.testing.samples.integrationtests.serverside.scriptable.ScriptableTestsTest): Server is not ready according to previous tests
  testScriptableTest[1](org.apache.sling.testing.samples.integrationtests.serverside.scriptable.ScriptableTestsTest): Server is not ready according to previous tests
  initializationError(org.apache.sling.testing.samples.integrationtests.serverside.DontCareForTestsCountTest): Server is not ready according to previous tests
  initializationError(org.apache.sling.testing.samples.integrationtests.serverside.ServerSideSampleTest): Server is not ready according to previous tests

Tests run: 10, Failures: 10, Errors: 0, Skipped: 0

[WARNING] File encoding has not been set, using platform encoding ANSI_X3.4-1968, i.e. build is platform dependent!
[JENKINS] Recording test results
[INFO] [INFO] Checking legal files in: org.apache.sling.testing.samples.integrationtests-1.0.7-SNAPSHOT.jar
[INFO] Checking legal files in: org.apache.sling.testing.samples.integrationtests-1.0.7-SNAPSHOT-sources.jar

[INFO] --- ianal-maven-plugin:1.0-alpha-1:verify-legal-files (default) @ org.apache.sling.testing.samples.integrationtests ---
[INFO] [INFO] Failsafe report directory: <https://builds.apache.org/job/sling-trunk-1.6/ws/trunk/testing/samples/integration-tests/target/failsafe-reports>
[WARNING] File encoding has not been set, using platform encoding ANSI_X3.4-1968, i.e. build is platform dependent!

[INFO] --- maven-failsafe-plugin:2.7.2:verify (verify) @ org.apache.sling.testing.samples.integrationtests ---
mojoFailed org.apache.maven.plugins:maven-failsafe-plugin:2.7.2(verify)
projectFailed org.apache.sling:org.apache.sling.testing.samples.integrationtests:1.0.7-SNAPSHOT
[JENKINS] Archiving <https://builds.apache.org/job/sling-trunk-1.6/ws/trunk/testing/samples/integration-tests/target/org.apache.sling.testing.samples.integrationtests-1.0.7-SNAPSHOT-sources.jar> to /home/hudson/hudson/jobs/sling-trunk-1.6/modules/org.apache.sling$org.apache.sling.testing.samples.integrationtests/builds/2011-09-08_01-17-15/archive/org.apache.sling/org.apache.sling.testing.samples.integrationtests/1.0.7-SNAPSHOT/org.apache.sling.testing.samples.integrationtests-1.0.7-SNAPSHOT-sources.jar
sessionEnded
[INFO] ------------------------------------------------------------------------
[INFO] Reactor Summary:
[INFO] 
[INFO] Apache Sling JAR Resource Bundle .................. SUCCESS [11.443s]
[INFO] Apache Sling (Parent) ............................. SUCCESS [4.111s]
[INFO] Apache Sling Maven Plugin to create Jackrabbit OCM descriptors  SUCCESS [7.463s]
[INFO] Apache Sling Maven Plugin for Compiling JSP Sources into Bundles  SUCCESS [7.041s]
[INFO] Apache Sling Maven Plugin for Supporting Bundle Development  SUCCESS [6.134s]
[INFO] Apache Sling Launchpad Maven Plugin ............... SUCCESS [37.846s]
[INFO] Sling Launchpad Standalone Archetype .............. SUCCESS [5.305s]
[INFO] Sling Launchpad Webapp Archetype .................. SUCCESS [4.533s]
[INFO] Sling Initial Content Archetype ................... SUCCESS [4.280s]
[INFO] Sling Servlet Archetype ........................... SUCCESS [4.641s]
[INFO] Sling Bundle Archetype ............................ SUCCESS [4.498s]
[INFO] Sling JCRInstall Bundle Archetype ................. SUCCESS [4.084s]
[INFO] Apache Sling API .................................. SUCCESS [9.300s]
[INFO] Apache Sling System Bundle Extension: Java Transaction API  SUCCESS [5.054s]
[INFO] Apache Sling System Bundle Extension: XML APIs .... SUCCESS [4.746s]
[INFO] Apache Sling System Bundle Extension: Activation API  SUCCESS [4.757s]
[INFO] Apache Sling Dynamic Class Loader Support ......... SUCCESS [6.492s]
[INFO] Apache Sling JSON Library ......................... SUCCESS [6.636s]
[INFO] Apache Sling OSGi LogService Implementation ....... SUCCESS [7.638s]
[INFO] Apache Sling MIME type mapping support ............ SUCCESS [6.633s]
[INFO] Apache Sling Commons OSGi support ................. SUCCESS [6.873s]
[INFO] Apache Sling Scheduler Support .................... SUCCESS [10.196s]
[INFO] Apache Sling Testing Utilities .................... SUCCESS [16.644s]
[INFO] Apache Sling Thread Support ....................... SUCCESS [5.904s]
[INFO] Apache Sling Authentication Service ............... SUCCESS [8.346s]
[INFO] Apache Sling OpenID Authentication ................ SUCCESS [10.099s]
[INFO] Apache Sling Form Based Authentication Handler .... SUCCESS [9.187s]
[INFO] Apache Sling Authentication Selector .............. SUCCESS [6.220s]
[INFO] Apache Sling Engine Implementation ................ SUCCESS [9.898s]
[INFO] Apache Sling Repository API Bundle ................ SUCCESS [6.249s]
[INFO] Apache Sling JCR Base Bundle ...................... SUCCESS [7.224s]
[INFO] Apache Sling JCR ClassLoader ...................... SUCCESS [6.808s]
[INFO] Apache Sling Initial Content Loader ............... SUCCESS [9.048s]
[INFO] Apache Sling Jackrabbit Embedded Repository ....... SUCCESS [33.843s]
[INFO] Apache Sling Jackrabbit UserManager Support ....... SUCCESS [7.564s]
[INFO] Apache Sling Jackrabbit JSR-283 Access Control Manager Support  SUCCESS [6.706s]
[INFO] Apache Sling Object Content Mapping ............... SUCCESS [10.876s]
[INFO] Apache Sling JCR Resource Resolver ................ SUCCESS [35.120s]
[INFO] Apache Sling Simple WebDAV Access to repositories . SUCCESS [13.541s]
[INFO] Apache Sling DavEx Access to repositories ......... SUCCESS [9.796s]
[INFO] Apache Sling JCR WebConsole Bundle ................ SUCCESS [6.646s]
[INFO] Apache Sling Servlet Resolver ..................... SUCCESS [9.203s]
[INFO] Apache Sling Default GET Servlets ................. SUCCESS [8.219s]
[INFO] Apache Sling Default POST Servlets ................ SUCCESS [10.029s]
[INFO] Apache Sling Scripting Implementation API ......... SUCCESS [6.016s]
[INFO] Apache Sling Scripting Core implementation ........ SUCCESS [9.504s]
[INFO] Apache Sling Scripting JavaScript Support ......... SUCCESS [16.060s]
[INFO] Apache Sling Scripting JSP Support ................ SUCCESS [21.702s]
[INFO] Apache Sling JSP Tag Library ...................... SUCCESS [6.902s]
[INFO] Apache Sling Adapter Manager Implementation ....... SUCCESS [7.368s]
[INFO] Apache Sling Bundle Resource Provider ............. SUCCESS [6.288s]
[INFO] Apache Sling Event Support ........................ SUCCESS [4:10.291s]
[INFO] Apache Sling Filesystem Resource Provider ......... SUCCESS [7.264s]
[INFO] Apache Sling Settings ............................. SUCCESS [7.405s]
[INFO] Apache Sling Thread Dumper ........................ SUCCESS [6.304s]
[INFO] Apache Sling Web Console Branding ................. SUCCESS [6.135s]
[INFO] Apache Sling Web Console Security Provider ........ SUCCESS [7.081s]
[INFO] Apache Sling Groovy Extensions .................... SUCCESS [10.674s]
[INFO] Apache Sling Explorer ............................. SUCCESS [6.967s]
[INFO] Apache Sling Test Tools ........................... SUCCESS [7.922s]
[INFO] Apache Sling JUnit Core ........................... SUCCESS [11.291s]
[INFO] Apache Sling JUnit Scriptable Tests Provider ...... SUCCESS [7.609s]
[INFO] Apache Sling JUnit Remote Tests Runners ........... SUCCESS [7.531s]
[INFO] Apache Sling Installer ............................ SUCCESS [9.404s]
[INFO] Apache Sling File Installer ....................... SUCCESS [6.840s]
[INFO] Apache Sling JCR Installer ........................ SUCCESS [1:57.988s]
[INFO] Apache Sling Installer Configuration Admin Support  SUCCESS [6.886s]
[INFO] Apache Sling Deployment Package Installer ......... SUCCESS [6.656s]
[INFO] Apache Sling Installer Integration Tests .......... SUCCESS [1:04.834s]
[INFO] Apache Sling Launchpad API ........................ SUCCESS [6.809s]
[INFO] Apache Sling Launchpad Base ....................... SUCCESS [15.324s]
[INFO] Apache Sling Launchpad Installer .................. SUCCESS [6.632s]
[INFO] Apache Sling Launchpad Content .................... SUCCESS [7.528s]
[INFO] Apache Sling Launchpad Application Builder ........ SUCCESS [3:41.052s]
[INFO] Apache Sling Sample Server-Side Tests ............. SUCCESS [6.972s]
[INFO] Apache Sling Failing Server-Side Tests ............ SUCCESS [6.702s]
[INFO] Apache Sling Sample Integration Tests ............. FAILURE [1:14.045s]
[INFO] Apache Sling Launchpad Testing Services ........... SKIPPED
[INFO] Apache Sling Launchpad Testing Services WAR ....... SKIPPED
[INFO] Apache Sling Launchpad Test Bundles ............... SKIPPED
[INFO] Apache Sling Integration Tests .................... SKIPPED
[INFO] Apache Sling Launchpad Testing .................... SKIPPED
[INFO] Apache Sling Launchpad Testing WAR version ........ SKIPPED
[INFO] Apache Sling (Builder) ............................ SKIPPED
[INFO] ------------------------------------------------------------------------
[INFO] BUILD FAILURE
[INFO] ------------------------------------------------------------------------
[INFO] Total time: 32:02.685s
[INFO] Finished at: Thu Sep 08 01:49:27 UTC 2011
[INFO] Final Memory: 157M/365M
[INFO] ------------------------------------------------------------------------
mavenExecutionResult exceptions not empty
message : Failed to execute goal org.apache.maven.plugins:maven-failsafe-plugin:2.7.2:verify (verify) on project org.apache.sling.testing.samples.integrationtests: There are test failures.

Please refer to <https://builds.apache.org/job/sling-trunk-1.6/ws/trunk/testing/samples/integration-tests/target/failsafe-reports> for the individual test results.
cause : There are test failures.

Please refer to <https://builds.apache.org/job/sling-trunk-1.6/ws/trunk/testing/samples/integration-tests/target/failsafe-reports> for the individual test results.
Stack trace : 
org.apache.maven.lifecycle.LifecycleExecutionException: Failed to execute goal org.apache.maven.plugins:maven-failsafe-plugin:2.7.2:verify (verify) on project org.apache.sling.testing.samples.integrationtests: There are test failures.

Please refer to <https://builds.apache.org/job/sling-trunk-1.6/ws/trunk/testing/samples/integration-tests/target/failsafe-reports> for the individual test results.
	at org.apache.maven.lifecycle.internal.MojoExecutor.execute(MojoExecutor.java:213)
	at org.apache.maven.lifecycle.internal.MojoExecutor.execute(MojoExecutor.java:153)
	at org.apache.maven.lifecycle.internal.MojoExecutor.execute(MojoExecutor.java:145)
	at org.apache.maven.lifecycle.internal.LifecycleModuleBuilder.buildProject(LifecycleModuleBuilder.java:84)
	at org.apache.maven.lifecycle.internal.LifecycleModuleBuilder.buildProject(LifecycleModuleBuilder.java:59)
	at org.apache.maven.lifecycle.internal.LifecycleStarter.singleThreadedBuild(LifecycleStarter.java:183)
	at org.apache.maven.lifecycle.internal.LifecycleStarter.execute(LifecycleStarter.java:161)
	at org.apache.maven.DefaultMaven.doExecute(DefaultMaven.java:319)
	at org.apache.maven.DefaultMaven.execute(DefaultMaven.java:156)
	at org.jvnet.hudson.maven3.launcher.Maven3Launcher.main(Maven3Launcher.java:79)
	at sun.reflect.NativeMethodAccessorImpl.invoke0(Native Method)
	at sun.reflect.NativeMethodAccessorImpl.invoke(NativeMethodAccessorImpl.java:39)
	at sun.reflect.DelegatingMethodAccessorImpl.invoke(DelegatingMethodAccessorImpl.java:25)
	at java.lang.reflect.Method.invoke(Method.java:597)
	at org.codehaus.plexus.classworlds.launcher.Launcher.launchStandard(Launcher.java:329)
	at org.codehaus.plexus.classworlds.launcher.Launcher.launch(Launcher.java:239)
	at org.jvnet.hudson.maven3.agent.Maven3Main.launch(Maven3Main.java:158)
	at hudson.maven.Maven3Builder.call(Maven3Builder.java:121)
	at hudson.maven.Maven3Builder.call(Maven3Builder.java:73)
	at hudson.remoting.UserRequest.perform(UserRequest.java:118)
	at hudson.remoting.UserRequest.perform(UserRequest.java:48)
	at hudson.remoting.Request$2.run(Request.java:287)
	at java.util.concurrent.Executors$RunnableAdapter.call(Executors.java:441)
	at java.util.concurrent.FutureTask$Sync.innerRun(FutureTask.java:303)
	at java.util.concurrent.FutureTask.run(FutureTask.java:138)
	at java.util.concurrent.ThreadPoolExecutor$Worker.runTask(ThreadPoolExecutor.java:886)
	at java.util.concurrent.ThreadPoolExecutor$Worker.run(ThreadPoolExecutor.java:908)
	at java.lang.Thread.run(Thread.java:619)
Caused by: org.apache.maven.plugin.MojoFailureException: There are test failures.

Please refer to <https://builds.apache.org/job/sling-trunk-1.6/ws/trunk/testing/samples/integration-tests/target/failsafe-reports> for the individual test results.
	at org.apache.maven.plugin.surefire.SurefireHelper.reportExecution(SurefireHelper.java:74)
	at org.apache.maven.plugin.failsafe.VerifyMojo.execute(VerifyMojo.java:205)
	at org.apache.maven.plugin.DefaultBuildPluginManager.executeMojo(DefaultBuildPluginManager.java:101)
	at org.apache.maven.lifecycle.internal.MojoExecutor.execute(MojoExecutor.java:209)
	... 27 more
Maven failed with error.
Sending e-mails to: dev@sling.apache.org
channel stopped
[locks-and-latches] Releasing all the locks
[locks-and-latches] All the locks released


Build failed in Jenkins: sling-trunk-1.6 #1026

Posted by Apache Jenkins Server <je...@builds.apache.org>.
See <https://builds.apache.org/job/sling-trunk-1.6/1026/changes>

Changes:

[justin] SLING-2059 - upgrading to groovy 1.8.2; removing custom JSON Builder and rewriting integration tests to use standard groovy JSON Builder

------------------------------------------
Started by an SCM change
Building remotely on ubuntu1
Updating http://svn.apache.org/repos/asf/sling/trunk
D         bundles/extensions/groovy/src/test/java/org/apache/sling/extensions/groovy/it/JSONGroovyBuilderIT.java
D         bundles/extensions/groovy/src/test/java/org/apache/sling/extensions/groovy/it/GroovySlingResourceTypeRenderingIT.java
D         bundles/extensions/groovy/src/test/java/json/JSONAssert.java
D         bundles/extensions/groovy/src/test/groovy/org/apache/sling/extensions/groovy/json/JSONGroovyBuilderTest.groovy
D         bundles/extensions/groovy/src/test/resources/integration-test/rendering-test.gsp
D         bundles/extensions/groovy/src/test/resources/integration-test/builder.groovy
D         bundles/extensions/groovy/src/test/resources/integration-test/builder2.groovy
D         bundles/extensions/groovy/src/main/java/org/apache/sling/extensions/groovy/json/JSONGroovyBuilder.java
D         bundles/extensions/groovy/src/main/java/org/apache/sling/extensions/groovy/json/internal/JSONGroovyBuilderBindingsValuesProvider.java
A         bundles/extensions/groovy/src/main/java/org/apache/sling/extensions/groovy/json/internal/JsonBuilderBindingsValuesProvider.java
U         bundles/extensions/groovy/pom.xml
A         launchpad/integration-tests/src/main/java/org/apache/sling/launchpad/webapp/integrationtest/JSONGroovyBuilderTest.java
A         launchpad/integration-tests/src/main/java/org/apache/sling/launchpad/webapp/integrationtest/GroovySlingResourceTypeRenderingTest.java
A         launchpad/integration-tests/src/main/resources/integration-test/rendering-test.gsp
A         launchpad/integration-tests/src/main/resources/integration-test/builder_object.groovy
A         launchpad/integration-tests/src/main/resources/integration-test/builder_rich_object.groovy
A         launchpad/integration-tests/src/main/resources/integration-test/builder_array.groovy
U         launchpad/builder/src/main/bundles/list.xml
At revision 1166246
[locks-and-latches] Checking to see if we really have the locks
[locks-and-latches] Have all the locks, build can start
Parsing POMs
Modules changed, recalculating dependency graph
[trunk] $ /home/hudson/tools/java/latest1.6/bin/java -Xmx512M -XX:MaxPermSize=256M -enableassertions -cp /home/jenkins/jenkins-slave/maven3-agent.jar:/home/jenkins/jenkins-slave/tools/Maven_3.0.3/boot/plexus-classworlds-2.4.jar org.jvnet.hudson.maven3.agent.Maven3Main /home/jenkins/jenkins-slave/tools/Maven_3.0.3 /home/jenkins/jenkins-slave/slave.jar /home/jenkins/jenkins-slave/maven3-interceptor.jar 41373
<===[JENKINS REMOTING CAPACITY]===>channel started
   Executing Maven:  -B -f <https://builds.apache.org/job/sling-trunk-1.6/ws/trunk/pom.xml> -DobrRepository=false clean install -DHttpTestBase.readyTimeoutSeconds=300 -PwarIntegrationTests
[INFO] Scanning for projects...
Downloading: http://repository.apache.org/snapshots/org/apache/sling/maven-launchpad-plugin/2.1.1-SNAPSHOT/maven-launchpad-plugin-2.1.1-SNAPSHOT.pom
[WARNING] The POM for org.apache.sling:maven-launchpad-plugin:jar:2.1.1-SNAPSHOT is missing, no dependency information available
Downloading: http://repository.apache.org/snapshots/org/apache/sling/maven-launchpad-plugin/2.1.1-SNAPSHOT/maven-launchpad-plugin-2.1.1-SNAPSHOT.jar
Downloading: http://repository.apache.org/snapshots/org/apache/sling/maven-launchpad-plugin/2.1.1-SNAPSHOT/maven-launchpad-plugin-2.1.1-SNAPSHOT.pom
[WARNING] The POM for org.apache.sling:maven-launchpad-plugin:jar:2.1.1-SNAPSHOT is missing, no dependency information available
Downloading: http://repository.apache.org/snapshots/org/apache/sling/maven-launchpad-plugin/2.1.1-SNAPSHOT/maven-launchpad-plugin-2.1.1-SNAPSHOT.jar
mavenExecutionResult exceptions not empty
message : Some problems were encountered while processing the POMs:
[ERROR] Unresolveable build extension: Plugin org.apache.sling:maven-launchpad-plugin:2.1.1-SNAPSHOT or one of its dependencies could not be resolved: Could not find artifact org.apache.sling:maven-launchpad-plugin:jar:2.1.1-SNAPSHOT in Nexus (http://repository.apache.org/snapshots) @ 
[ERROR] Unknown packaging: partialbundlelist @ line 32, column 16
[ERROR] Unresolveable build extension: Plugin org.apache.sling:maven-launchpad-plugin:2.1.1-SNAPSHOT or one of its dependencies could not be resolved: Could not find artifact org.apache.sling:maven-launchpad-plugin:jar:2.1.1-SNAPSHOT in Nexus (http://repository.apache.org/snapshots) @ 
[ERROR] Unresolveable build extension: Plugin org.apache.sling:maven-launchpad-plugin:2.1.1-SNAPSHOT or one of its dependencies could not be resolved: Could not find artifact org.apache.sling:maven-launchpad-plugin:jar:2.1.1-SNAPSHOT in Nexus (http://repository.apache.org/snapshots) @ 

Stack trace : 
org.apache.maven.project.ProjectBuildingException: Some problems were encountered while processing the POMs:
[ERROR] Unresolveable build extension: Plugin org.apache.sling:maven-launchpad-plugin:2.1.1-SNAPSHOT or one of its dependencies could not be resolved: Could not find artifact org.apache.sling:maven-launchpad-plugin:jar:2.1.1-SNAPSHOT in Nexus (http://repository.apache.org/snapshots) @ 
[ERROR] Unknown packaging: partialbundlelist @ line 32, column 16
[ERROR] Unresolveable build extension: Plugin org.apache.sling:maven-launchpad-plugin:2.1.1-SNAPSHOT or one of its dependencies could not be resolved: Could not find artifact org.apache.sling:maven-launchpad-plugin:jar:2.1.1-SNAPSHOT in Nexus (http://repository.apache.org/snapshots) @ 
[ERROR] Unresolveable build extension: Plugin org.apache.sling:maven-launchpad-plugin:2.1.1-SNAPSHOT or one of its dependencies could not be resolved: Could not find artifact org.apache.sling:maven-launchpad-plugin:jar:2.1.1-SNAPSHOT in Nexus (http://repository.apache.org/snapshots) @ 

	at org.apache.maven.project.DefaultProjectBuilder.build(DefaultProjectBuilder.java:339)
	at org.apache.maven.DefaultMaven.collectProjects(DefaultMaven.java:632)
	at org.apache.maven.DefaultMaven.getProjectsForMavenReactor(DefaultMaven.java:581)
	at org.apache.maven.DefaultMaven.doExecute(DefaultMaven.java:233)
	at org.apache.maven.DefaultMaven.execute(DefaultMaven.java:156)
	at org.jvnet.hudson.maven3.launcher.Maven3Launcher.main(Maven3Launcher.java:79)
	at sun.reflect.NativeMethodAccessorImpl.invoke0(Native Method)
	at sun.reflect.NativeMethodAccessorImpl.invoke(NativeMethodAccessorImpl.java:39)
	at sun.reflect.DelegatingMethodAccessorImpl.invoke(DelegatingMethodAccessorImpl.java:25)
	at java.lang.reflect.Method.invoke(Method.java:597)
	at org.codehaus.plexus.classworlds.launcher.Launcher.launchStandard(Launcher.java:329)
	at org.codehaus.plexus.classworlds.launcher.Launcher.launch(Launcher.java:239)
	at org.jvnet.hudson.maven3.agent.Maven3Main.launch(Maven3Main.java:158)
	at hudson.maven.Maven3Builder.call(Maven3Builder.java:121)
	at hudson.maven.Maven3Builder.call(Maven3Builder.java:73)
	at hudson.remoting.UserRequest.perform(UserRequest.java:118)
	at hudson.remoting.UserRequest.perform(UserRequest.java:48)
	at hudson.remoting.Request$2.run(Request.java:287)
	at java.util.concurrent.Executors$RunnableAdapter.call(Executors.java:441)
	at java.util.concurrent.FutureTask$Sync.innerRun(FutureTask.java:303)
	at java.util.concurrent.FutureTask.run(FutureTask.java:138)
	at java.util.concurrent.ThreadPoolExecutor$Worker.runTask(ThreadPoolExecutor.java:886)
	at java.util.concurrent.ThreadPoolExecutor$Worker.run(ThreadPoolExecutor.java:908)
	at java.lang.Thread.run(Thread.java:619)
channel stopped
[locks-and-latches] Releasing all the locks
[locks-and-latches] All the locks released


Build failed in Jenkins: sling-trunk-1.6 #1025

Posted by Apache Jenkins Server <je...@builds.apache.org>.
See <https://builds.apache.org/job/sling-trunk-1.6/1025/changes>

Changes:

[justin] using latest releases

------------------------------------------
Started by an SCM change
Building remotely on ubuntu1
Updating http://svn.apache.org/repos/asf/sling/trunk
U         parent/pom.xml
U         bundles/extensions/adapter/pom.xml
U         bundles/extensions/explorer/pom.xml
U         bundles/extensions/fsresource/pom.xml
U         bundles/extensions/settings/pom.xml
U         bundles/extensions/bundleresource/pom.xml
U         bundles/extensions/event/pom.xml
U         bundles/extensions/webconsolesecurityprovider/pom.xml
U         bundles/extensions/framework-extension-xml/pom.xml
U         bundles/extensions/groovy/pom.xml
U         bundles/extensions/webconsolebranding/pom.xml
U         bundles/extensions/framework-extension-activation/pom.xml
U         bundles/extensions/framework-extension-transaction/pom.xml
U         bundles/extensions/threaddump/pom.xml
U         bundles/auth/selector/pom.xml
U         bundles/auth/form/pom.xml
U         bundles/auth/core/pom.xml
U         bundles/auth/openid/pom.xml
U         bundles/scripting/javascript/pom.xml
U         bundles/scripting/core/pom.xml
U         bundles/scripting/api/pom.xml
U         bundles/scripting/jsp/pom.xml
U         bundles/scripting/jsp-taglib/pom.xml
U         bundles/engine/pom.xml
U         bundles/servlets/get/pom.xml
U         bundles/servlets/resolver/pom.xml
U         bundles/servlets/post/pom.xml
U         bundles/api/pom.xml
U         bundles/commons/log/pom.xml
U         bundles/commons/osgi/pom.xml
U         bundles/commons/mime/pom.xml
U         bundles/commons/json/pom.xml
U         bundles/commons/threads/pom.xml
U         bundles/commons/classloader/pom.xml
U         bundles/commons/testing/pom.xml
U         bundles/commons/scheduler/pom.xml
U         bundles/jcr/jackrabbit-server/pom.xml
U         bundles/jcr/webconsole/pom.xml
U         bundles/jcr/contentloader/pom.xml
U         bundles/jcr/jackrabbit-usermanager/pom.xml
U         bundles/jcr/jackrabbit-accessmanager/pom.xml
U         bundles/jcr/davex/pom.xml
U         bundles/jcr/resource/pom.xml
U         bundles/jcr/webdav/pom.xml
U         bundles/jcr/api/pom.xml
U         bundles/jcr/base/pom.xml
U         bundles/jcr/classloader/pom.xml
U         bundles/jcr/ocm/pom.xml
U         installer/factories/configuration/pom.xml
U         installer/factories/deploymentpck/pom.xml
U         installer/core/pom.xml
U         installer/it/pom.xml
U         installer/providers/file/pom.xml
U         installer/providers/jcr/pom.xml
U         launchpad/test-services/pom.xml
U         launchpad/integration-tests/pom.xml
U         launchpad/testing-war/pom.xml
U         launchpad/builder/pom.xml
U         launchpad/test-services-war/pom.xml
U         launchpad/api/pom.xml
U         launchpad/test-bundles/pom.xml
U         launchpad/base/pom.xml
U         launchpad/content/pom.xml
U         launchpad/installer/pom.xml
U         launchpad/testing/pom.xml
U         maven/maven-jspc-plugin/pom.xml
U         maven/maven-launchpad-plugin/pom.xml
U         maven/archetypes/bundle-for-jcrinstall/pom.xml
U         maven/archetypes/initial-content/pom.xml
U         maven/archetypes/servlet/pom.xml
U         maven/archetypes/launchpad-standalone/pom.xml
U         maven/archetypes/bundle/pom.xml
U         maven/archetypes/launchpad-webapp/pom.xml
U         maven/maven-sling-plugin/pom.xml
U         maven/maven-jcrocm-plugin/pom.xml
U         testing/tools/pom.xml
U         testing/samples/sample-tests/pom.xml
U         testing/samples/integration-tests/pom.xml
U         testing/samples/failing-tests/pom.xml
U         testing/junit/core/pom.xml
U         testing/junit/scriptable/pom.xml
U         testing/junit/remote/pom.xml
At revision 1166228
[locks-and-latches] Checking to see if we really have the locks
[locks-and-latches] Have all the locks, build can start
Parsing POMs
Modules changed, recalculating dependency graph
[trunk] $ /home/hudson/tools/java/latest1.6/bin/java -Xmx512M -XX:MaxPermSize=256M -enableassertions -cp /home/jenkins/jenkins-slave/maven3-agent.jar:/home/jenkins/jenkins-slave/tools/Maven_3.0.3/boot/plexus-classworlds-2.4.jar org.jvnet.hudson.maven3.agent.Maven3Main /home/jenkins/jenkins-slave/tools/Maven_3.0.3 /home/jenkins/jenkins-slave/slave.jar /home/jenkins/jenkins-slave/maven3-interceptor.jar 38982
<===[JENKINS REMOTING CAPACITY]=channel started
==>   Executing Maven:  -B -f <https://builds.apache.org/job/sling-trunk-1.6/ws/trunk/pom.xml> -DobrRepository=false clean install -DHttpTestBase.readyTimeoutSeconds=300 -PwarIntegrationTests
[INFO] Scanning for projects...
Downloading: http://repository.apache.org/snapshots/org/apache/sling/maven-launchpad-plugin/2.1.1-SNAPSHOT/maven-launchpad-plugin-2.1.1-SNAPSHOT.pom
[WARNING] The POM for org.apache.sling:maven-launchpad-plugin:jar:2.1.1-SNAPSHOT is missing, no dependency information available
Downloading: http://repository.apache.org/snapshots/org/apache/sling/maven-launchpad-plugin/2.1.1-SNAPSHOT/maven-launchpad-plugin-2.1.1-SNAPSHOT.jar
Downloading: http://repository.apache.org/snapshots/org/apache/sling/maven-launchpad-plugin/2.1.1-SNAPSHOT/maven-launchpad-plugin-2.1.1-SNAPSHOT.pom
[WARNING] The POM for org.apache.sling:maven-launchpad-plugin:jar:2.1.1-SNAPSHOT is missing, no dependency information available
Downloading: http://repository.apache.org/snapshots/org/apache/sling/maven-launchpad-plugin/2.1.1-SNAPSHOT/maven-launchpad-plugin-2.1.1-SNAPSHOT.jar
mavenExecutionResult exceptions not empty
message : Some problems were encountered while processing the POMs:
[ERROR] Unresolveable build extension: Plugin org.apache.sling:maven-launchpad-plugin:2.1.1-SNAPSHOT or one of its dependencies could not be resolved: Could not find artifact org.apache.sling:maven-launchpad-plugin:jar:2.1.1-SNAPSHOT in Nexus (http://repository.apache.org/snapshots) @ 
[ERROR] Unknown packaging: partialbundlelist @ line 32, column 16
[ERROR] Unresolveable build extension: Plugin org.apache.sling:maven-launchpad-plugin:2.1.1-SNAPSHOT or one of its dependencies could not be resolved: Could not find artifact org.apache.sling:maven-launchpad-plugin:jar:2.1.1-SNAPSHOT in Nexus (http://repository.apache.org/snapshots) @ 
[ERROR] Unresolveable build extension: Plugin org.apache.sling:maven-launchpad-plugin:2.1.1-SNAPSHOT or one of its dependencies could not be resolved: Could not find artifact org.apache.sling:maven-launchpad-plugin:jar:2.1.1-SNAPSHOT in Nexus (http://repository.apache.org/snapshots) @ 

Stack trace : 
org.apache.maven.project.ProjectBuildingException: Some problems were encountered while processing the POMs:
[ERROR] Unresolveable build extension: Plugin org.apache.sling:maven-launchpad-plugin:2.1.1-SNAPSHOT or one of its dependencies could not be resolved: Could not find artifact org.apache.sling:maven-launchpad-plugin:jar:2.1.1-SNAPSHOT in Nexus (http://repository.apache.org/snapshots) @ 
[ERROR] Unknown packaging: partialbundlelist @ line 32, column 16
[ERROR] Unresolveable build extension: Plugin org.apache.sling:maven-launchpad-plugin:2.1.1-SNAPSHOT or one of its dependencies could not be resolved: Could not find artifact org.apache.sling:maven-launchpad-plugin:jar:2.1.1-SNAPSHOT in Nexus (http://repository.apache.org/snapshots) @ 
[ERROR] Unresolveable build extension: Plugin org.apache.sling:maven-launchpad-plugin:2.1.1-SNAPSHOT or one of its dependencies could not be resolved: Could not find artifact org.apache.sling:maven-launchpad-plugin:jar:2.1.1-SNAPSHOT in Nexus (http://repository.apache.org/snapshots) @ 

	at org.apache.maven.project.DefaultProjectBuilder.build(DefaultProjectBuilder.java:339)
	at org.apache.maven.DefaultMaven.collectProjects(DefaultMaven.java:632)
	at org.apache.maven.DefaultMaven.getProjectsForMavenReactor(DefaultMaven.java:581)
	at org.apache.maven.DefaultMaven.doExecute(DefaultMaven.java:233)
	at org.apache.maven.DefaultMaven.execute(DefaultMaven.java:156)
	at org.jvnet.hudson.maven3.launcher.Maven3Launcher.main(Maven3Launcher.java:79)
	at sun.reflect.NativeMethodAccessorImpl.invoke0(Native Method)
	at sun.reflect.NativeMethodAccessorImpl.invoke(NativeMethodAccessorImpl.java:39)
	at sun.reflect.DelegatingMethodAccessorImpl.invoke(DelegatingMethodAccessorImpl.java:25)
	at java.lang.reflect.Method.invoke(Method.java:597)
	at org.codehaus.plexus.classworlds.launcher.Launcher.launchStandard(Launcher.java:329)
	at org.codehaus.plexus.classworlds.launcher.Launcher.launch(Launcher.java:239)
	at org.jvnet.hudson.maven3.agent.Maven3Main.launch(Maven3Main.java:158)
	at hudson.maven.Maven3Builder.call(Maven3Builder.java:121)
	at hudson.maven.Maven3Builder.call(Maven3Builder.java:73)
	at hudson.remoting.UserRequest.perform(UserRequest.java:118)
	at hudson.remoting.UserRequest.perform(UserRequest.java:48)
	at hudson.remoting.Request$2.run(Request.java:287)
	at java.util.concurrent.Executors$RunnableAdapter.call(Executors.java:441)
	at java.util.concurrent.FutureTask$Sync.innerRun(FutureTask.java:303)
	at java.util.concurrent.FutureTask.run(FutureTask.java:138)
	at java.util.concurrent.ThreadPoolExecutor$Worker.runTask(ThreadPoolExecutor.java:886)
	at java.util.concurrent.ThreadPoolExecutor$Worker.run(ThreadPoolExecutor.java:908)
	at java.lang.Thread.run(Thread.java:619)
channel stopped
[locks-and-latches] Releasing all the locks
[locks-and-latches] All the locks released