You are viewing a plain text version of this content. The canonical link for it is here.
Posted to dev@lucene.apache.org by Policeman Jenkins Server <je...@thetaphi.de> on 2016/03/01 00:04:00 UTC

[JENKINS] Lucene-Solr-5.5-Linux (32bit/jdk1.7.0_80) - Build # 169 - Failure!

Build: http://jenkins.thetaphi.de/job/Lucene-Solr-5.5-Linux/169/
Java: 32bit/jdk1.7.0_80 -client -XX:+UseParallelGC

1 tests failed.
FAILED:  org.apache.solr.cloud.CollectionsAPIDistributedZkTest.test

Error Message:
expected:<3> but was:<2>

Stack Trace:
java.lang.AssertionError: expected:<3> but was:<2>
	at __randomizedtesting.SeedInfo.seed([9904A45616232EF2:11509B8CB8DF430A]:0)
	at org.junit.Assert.fail(Assert.java:93)
	at org.junit.Assert.failNotEquals(Assert.java:647)
	at org.junit.Assert.assertEquals(Assert.java:128)
	at org.junit.Assert.assertEquals(Assert.java:472)
	at org.junit.Assert.assertEquals(Assert.java:456)
	at org.apache.solr.cloud.CollectionsAPIDistributedZkTest.testCollectionsAPI(CollectionsAPIDistributedZkTest.java:800)
	at org.apache.solr.cloud.CollectionsAPIDistributedZkTest.test(CollectionsAPIDistributedZkTest.java:160)
	at sun.reflect.NativeMethodAccessorImpl.invoke0(Native Method)
	at sun.reflect.NativeMethodAccessorImpl.invoke(NativeMethodAccessorImpl.java:57)
	at sun.reflect.DelegatingMethodAccessorImpl.invoke(DelegatingMethodAccessorImpl.java:43)
	at java.lang.reflect.Method.invoke(Method.java:606)
	at com.carrotsearch.randomizedtesting.RandomizedRunner.invoke(RandomizedRunner.java:1764)
	at com.carrotsearch.randomizedtesting.RandomizedRunner$8.evaluate(RandomizedRunner.java:871)
	at com.carrotsearch.randomizedtesting.RandomizedRunner$9.evaluate(RandomizedRunner.java:907)
	at com.carrotsearch.randomizedtesting.RandomizedRunner$10.evaluate(RandomizedRunner.java:921)
	at org.apache.solr.BaseDistributedSearchTestCase$ShardsRepeatRule$ShardsFixedStatement.callStatement(BaseDistributedSearchTestCase.java:964)
	at org.apache.solr.BaseDistributedSearchTestCase$ShardsRepeatRule$ShardsStatement.evaluate(BaseDistributedSearchTestCase.java:939)
	at com.carrotsearch.randomizedtesting.rules.SystemPropertiesRestoreRule$1.evaluate(SystemPropertiesRestoreRule.java:57)
	at org.apache.lucene.util.TestRuleSetupTeardownChained$1.evaluate(TestRuleSetupTeardownChained.java:49)
	at org.apache.lucene.util.AbstractBeforeAfterRule$1.evaluate(AbstractBeforeAfterRule.java:45)
	at org.apache.lucene.util.TestRuleThreadAndTestName$1.evaluate(TestRuleThreadAndTestName.java:48)
	at org.apache.lucene.util.TestRuleIgnoreAfterMaxFailures$1.evaluate(TestRuleIgnoreAfterMaxFailures.java:64)
	at org.apache.lucene.util.TestRuleMarkFailure$1.evaluate(TestRuleMarkFailure.java:47)
	at com.carrotsearch.randomizedtesting.rules.StatementAdapter.evaluate(StatementAdapter.java:36)
	at com.carrotsearch.randomizedtesting.ThreadLeakControl$StatementRunner.run(ThreadLeakControl.java:367)
	at com.carrotsearch.randomizedtesting.ThreadLeakControl.forkTimeoutingTask(ThreadLeakControl.java:809)
	at com.carrotsearch.randomizedtesting.ThreadLeakControl$3.evaluate(ThreadLeakControl.java:460)
	at com.carrotsearch.randomizedtesting.RandomizedRunner.runSingleTest(RandomizedRunner.java:880)
	at com.carrotsearch.randomizedtesting.RandomizedRunner$5.evaluate(RandomizedRunner.java:781)
	at com.carrotsearch.randomizedtesting.RandomizedRunner$6.evaluate(RandomizedRunner.java:816)
	at com.carrotsearch.randomizedtesting.RandomizedRunner$7.evaluate(RandomizedRunner.java:827)
	at com.carrotsearch.randomizedtesting.rules.StatementAdapter.evaluate(StatementAdapter.java:36)
	at com.carrotsearch.randomizedtesting.rules.SystemPropertiesRestoreRule$1.evaluate(SystemPropertiesRestoreRule.java:57)
	at org.apache.lucene.util.AbstractBeforeAfterRule$1.evaluate(AbstractBeforeAfterRule.java:45)
	at com.carrotsearch.randomizedtesting.rules.StatementAdapter.evaluate(StatementAdapter.java:36)
	at org.apache.lucene.util.TestRuleStoreClassName$1.evaluate(TestRuleStoreClassName.java:41)
	at com.carrotsearch.randomizedtesting.rules.NoShadowingOrOverridesOnMethodsRule$1.evaluate(NoShadowingOrOverridesOnMethodsRule.java:40)
	at com.carrotsearch.randomizedtesting.rules.NoShadowingOrOverridesOnMethodsRule$1.evaluate(NoShadowingOrOverridesOnMethodsRule.java:40)
	at com.carrotsearch.randomizedtesting.rules.StatementAdapter.evaluate(StatementAdapter.java:36)
	at com.carrotsearch.randomizedtesting.rules.StatementAdapter.evaluate(StatementAdapter.java:36)
	at com.carrotsearch.randomizedtesting.rules.StatementAdapter.evaluate(StatementAdapter.java:36)
	at org.apache.lucene.util.TestRuleAssertionsRequired$1.evaluate(TestRuleAssertionsRequired.java:53)
	at org.apache.lucene.util.TestRuleMarkFailure$1.evaluate(TestRuleMarkFailure.java:47)
	at org.apache.lucene.util.TestRuleIgnoreAfterMaxFailures$1.evaluate(TestRuleIgnoreAfterMaxFailures.java:64)
	at org.apache.lucene.util.TestRuleIgnoreTestSuites$1.evaluate(TestRuleIgnoreTestSuites.java:54)
	at com.carrotsearch.randomizedtesting.rules.StatementAdapter.evaluate(StatementAdapter.java:36)
	at com.carrotsearch.randomizedtesting.ThreadLeakControl$StatementRunner.run(ThreadLeakControl.java:367)
	at java.lang.Thread.run(Thread.java:745)




Build Log:
[...truncated 11492 lines...]
   [junit4] Suite: org.apache.solr.cloud.CollectionsAPIDistributedZkTest
   [junit4]   2> Creating dataDir: /home/jenkins/workspace/Lucene-Solr-5.5-Linux/solr/build/solr-core/test/J2/temp/solr.cloud.CollectionsAPIDistributedZkTest_9904A45616232EF2-001/init-core-data-001
   [junit4]   2> 1047602 INFO  (SUITE-CollectionsAPIDistributedZkTest-seed#[9904A45616232EF2]-worker) [    ] o.a.s.SolrTestCaseJ4 Randomized ssl (false) and clientAuth (false)
   [junit4]   2> 1047602 INFO  (SUITE-CollectionsAPIDistributedZkTest-seed#[9904A45616232EF2]-worker) [    ] o.a.s.BaseDistributedSearchTestCase Setting hostContext system property: /t_ylw/vv
   [junit4]   2> 1047606 INFO  (TEST-CollectionsAPIDistributedZkTest.test-seed#[9904A45616232EF2]) [    ] o.a.s.c.ZkTestServer STARTING ZK TEST SERVER
   [junit4]   2> 1047606 INFO  (Thread-2774) [    ] o.a.s.c.ZkTestServer client port:0.0.0.0/0.0.0.0:0
   [junit4]   2> 1047606 INFO  (Thread-2774) [    ] o.a.s.c.ZkTestServer Starting server
   [junit4]   2> 1047706 INFO  (TEST-CollectionsAPIDistributedZkTest.test-seed#[9904A45616232EF2]) [    ] o.a.s.c.ZkTestServer start zk server on port:53313
   [junit4]   2> 1047706 INFO  (TEST-CollectionsAPIDistributedZkTest.test-seed#[9904A45616232EF2]) [    ] o.a.s.c.c.SolrZkClient Using default ZkCredentialsProvider
   [junit4]   2> 1047707 INFO  (TEST-CollectionsAPIDistributedZkTest.test-seed#[9904A45616232EF2]) [    ] o.a.s.c.c.ConnectionManager Waiting for client to connect to ZooKeeper
   [junit4]   2> 1047708 INFO  (zkCallback-2780-thread-1) [    ] o.a.s.c.c.ConnectionManager Watcher org.apache.solr.common.cloud.ConnectionManager@17eb683 name:ZooKeeperConnection Watcher:127.0.0.1:53313 got event WatchedEvent state:SyncConnected type:None path:null path:null type:None
   [junit4]   2> 1047708 INFO  (TEST-CollectionsAPIDistributedZkTest.test-seed#[9904A45616232EF2]) [    ] o.a.s.c.c.ConnectionManager Client is connected to ZooKeeper
   [junit4]   2> 1047709 INFO  (TEST-CollectionsAPIDistributedZkTest.test-seed#[9904A45616232EF2]) [    ] o.a.s.c.c.SolrZkClient Using default ZkACLProvider
   [junit4]   2> 1047709 INFO  (TEST-CollectionsAPIDistributedZkTest.test-seed#[9904A45616232EF2]) [    ] o.a.s.c.c.SolrZkClient makePath: /solr
   [junit4]   2> 1047710 INFO  (TEST-CollectionsAPIDistributedZkTest.test-seed#[9904A45616232EF2]) [    ] o.a.s.c.c.SolrZkClient Using default ZkCredentialsProvider
   [junit4]   2> 1047711 INFO  (TEST-CollectionsAPIDistributedZkTest.test-seed#[9904A45616232EF2]) [    ] o.a.s.c.c.ConnectionManager Waiting for client to connect to ZooKeeper
   [junit4]   2> 1047711 INFO  (zkCallback-2781-thread-1) [    ] o.a.s.c.c.ConnectionManager Watcher org.apache.solr.common.cloud.ConnectionManager@e1608a name:ZooKeeperConnection Watcher:127.0.0.1:53313/solr got event WatchedEvent state:SyncConnected type:None path:null path:null type:None
   [junit4]   2> 1047711 INFO  (TEST-CollectionsAPIDistributedZkTest.test-seed#[9904A45616232EF2]) [    ] o.a.s.c.c.ConnectionManager Client is connected to ZooKeeper
   [junit4]   2> 1047712 INFO  (TEST-CollectionsAPIDistributedZkTest.test-seed#[9904A45616232EF2]) [    ] o.a.s.c.c.SolrZkClient Using default ZkACLProvider
   [junit4]   2> 1047712 INFO  (TEST-CollectionsAPIDistributedZkTest.test-seed#[9904A45616232EF2]) [    ] o.a.s.c.c.SolrZkClient makePath: /collections/collection1
   [junit4]   2> 1047713 INFO  (TEST-CollectionsAPIDistributedZkTest.test-seed#[9904A45616232EF2]) [    ] o.a.s.c.c.SolrZkClient makePath: /collections/collection1/shards
   [junit4]   2> 1047714 INFO  (TEST-CollectionsAPIDistributedZkTest.test-seed#[9904A45616232EF2]) [    ] o.a.s.c.c.SolrZkClient makePath: /collections/control_collection
   [junit4]   2> 1047714 INFO  (TEST-CollectionsAPIDistributedZkTest.test-seed#[9904A45616232EF2]) [    ] o.a.s.c.c.SolrZkClient makePath: /collections/control_collection/shards
   [junit4]   2> 1047715 INFO  (TEST-CollectionsAPIDistributedZkTest.test-seed#[9904A45616232EF2]) [    ] o.a.s.c.AbstractZkTestCase put /home/jenkins/workspace/Lucene-Solr-5.5-Linux/solr/core/src/test-files/solr/collection1/conf/solrconfig-tlog.xml to /configs/conf1/solrconfig.xml
   [junit4]   2> 1047715 INFO  (TEST-CollectionsAPIDistributedZkTest.test-seed#[9904A45616232EF2]) [    ] o.a.s.c.c.SolrZkClient makePath: /configs/conf1/solrconfig.xml
   [junit4]   2> 1047716 INFO  (TEST-CollectionsAPIDistributedZkTest.test-seed#[9904A45616232EF2]) [    ] o.a.s.c.AbstractZkTestCase put /home/jenkins/workspace/Lucene-Solr-5.5-Linux/solr/core/src/test-files/solr/collection1/conf/schema.xml to /configs/conf1/schema.xml
   [junit4]   2> 1047716 INFO  (TEST-CollectionsAPIDistributedZkTest.test-seed#[9904A45616232EF2]) [    ] o.a.s.c.c.SolrZkClient makePath: /configs/conf1/schema.xml
   [junit4]   2> 1047717 INFO  (TEST-CollectionsAPIDistributedZkTest.test-seed#[9904A45616232EF2]) [    ] o.a.s.c.AbstractZkTestCase put /home/jenkins/workspace/Lucene-Solr-5.5-Linux/solr/core/src/test-files/solr/collection1/conf/solrconfig.snippet.randomindexconfig.xml to /configs/conf1/solrconfig.snippet.randomindexconfig.xml
   [junit4]   2> 1047718 INFO  (TEST-CollectionsAPIDistributedZkTest.test-seed#[9904A45616232EF2]) [    ] o.a.s.c.c.SolrZkClient makePath: /configs/conf1/solrconfig.snippet.randomindexconfig.xml
   [junit4]   2> 1047718 INFO  (TEST-CollectionsAPIDistributedZkTest.test-seed#[9904A45616232EF2]) [    ] o.a.s.c.AbstractZkTestCase put /home/jenkins/workspace/Lucene-Solr-5.5-Linux/solr/core/src/test-files/solr/collection1/conf/stopwords.txt to /configs/conf1/stopwords.txt
   [junit4]   2> 1047718 INFO  (TEST-CollectionsAPIDistributedZkTest.test-seed#[9904A45616232EF2]) [    ] o.a.s.c.c.SolrZkClient makePath: /configs/conf1/stopwords.txt
   [junit4]   2> 1047719 INFO  (TEST-CollectionsAPIDistributedZkTest.test-seed#[9904A45616232EF2]) [    ] o.a.s.c.AbstractZkTestCase put /home/jenkins/workspace/Lucene-Solr-5.5-Linux/solr/core/src/test-files/solr/collection1/conf/protwords.txt to /configs/conf1/protwords.txt
   [junit4]   2> 1047719 INFO  (TEST-CollectionsAPIDistributedZkTest.test-seed#[9904A45616232EF2]) [    ] o.a.s.c.c.SolrZkClient makePath: /configs/conf1/protwords.txt
   [junit4]   2> 1047720 INFO  (TEST-CollectionsAPIDistributedZkTest.test-seed#[9904A45616232EF2]) [    ] o.a.s.c.AbstractZkTestCase put /home/jenkins/workspace/Lucene-Solr-5.5-Linux/solr/core/src/test-files/solr/collection1/conf/currency.xml to /configs/conf1/currency.xml
   [junit4]   2> 1047720 INFO  (TEST-CollectionsAPIDistributedZkTest.test-seed#[9904A45616232EF2]) [    ] o.a.s.c.c.SolrZkClient makePath: /configs/conf1/currency.xml
   [junit4]   2> 1047721 INFO  (TEST-CollectionsAPIDistributedZkTest.test-seed#[9904A45616232EF2]) [    ] o.a.s.c.AbstractZkTestCase put /home/jenkins/workspace/Lucene-Solr-5.5-Linux/solr/core/src/test-files/solr/collection1/conf/enumsConfig.xml to /configs/conf1/enumsConfig.xml
   [junit4]   2> 1047721 INFO  (TEST-CollectionsAPIDistributedZkTest.test-seed#[9904A45616232EF2]) [    ] o.a.s.c.c.SolrZkClient makePath: /configs/conf1/enumsConfig.xml
   [junit4]   2> 1047722 INFO  (TEST-CollectionsAPIDistributedZkTest.test-seed#[9904A45616232EF2]) [    ] o.a.s.c.AbstractZkTestCase put /home/jenkins/workspace/Lucene-Solr-5.5-Linux/solr/core/src/test-files/solr/collection1/conf/open-exchange-rates.json to /configs/conf1/open-exchange-rates.json
   [junit4]   2> 1047722 INFO  (TEST-CollectionsAPIDistributedZkTest.test-seed#[9904A45616232EF2]) [    ] o.a.s.c.c.SolrZkClient makePath: /configs/conf1/open-exchange-rates.json
   [junit4]   2> 1047722 INFO  (TEST-CollectionsAPIDistributedZkTest.test-seed#[9904A45616232EF2]) [    ] o.a.s.c.AbstractZkTestCase put /home/jenkins/workspace/Lucene-Solr-5.5-Linux/solr/core/src/test-files/solr/collection1/conf/mapping-ISOLatin1Accent.txt to /configs/conf1/mapping-ISOLatin1Accent.txt
   [junit4]   2> 1047723 INFO  (TEST-CollectionsAPIDistributedZkTest.test-seed#[9904A45616232EF2]) [    ] o.a.s.c.c.SolrZkClient makePath: /configs/conf1/mapping-ISOLatin1Accent.txt
   [junit4]   2> 1047723 INFO  (TEST-CollectionsAPIDistributedZkTest.test-seed#[9904A45616232EF2]) [    ] o.a.s.c.AbstractZkTestCase put /home/jenkins/workspace/Lucene-Solr-5.5-Linux/solr/core/src/test-files/solr/collection1/conf/old_synonyms.txt to /configs/conf1/old_synonyms.txt
   [junit4]   2> 1047724 INFO  (TEST-CollectionsAPIDistributedZkTest.test-seed#[9904A45616232EF2]) [    ] o.a.s.c.c.SolrZkClient makePath: /configs/conf1/old_synonyms.txt
   [junit4]   2> 1047725 INFO  (TEST-CollectionsAPIDistributedZkTest.test-seed#[9904A45616232EF2]) [    ] o.a.s.c.AbstractZkTestCase put /home/jenkins/workspace/Lucene-Solr-5.5-Linux/solr/core/src/test-files/solr/collection1/conf/synonyms.txt to /configs/conf1/synonyms.txt
   [junit4]   2> 1047725 INFO  (TEST-CollectionsAPIDistributedZkTest.test-seed#[9904A45616232EF2]) [    ] o.a.s.c.c.SolrZkClient makePath: /configs/conf1/synonyms.txt
   [junit4]   2> 1047726 INFO  (TEST-CollectionsAPIDistributedZkTest.test-seed#[9904A45616232EF2]) [    ] o.a.s.c.c.SolrZkClient Using default ZkCredentialsProvider
   [junit4]   2> 1047726 INFO  (TEST-CollectionsAPIDistributedZkTest.test-seed#[9904A45616232EF2]) [    ] o.a.s.c.c.ConnectionManager Waiting for client to connect to ZooKeeper
   [junit4]   2> 1047727 INFO  (zkCallback-2782-thread-1) [    ] o.a.s.c.c.ConnectionManager Watcher org.apache.solr.common.cloud.ConnectionManager@1a9f213 name:ZooKeeperConnection Watcher:127.0.0.1:53313 got event WatchedEvent state:SyncConnected type:None path:null path:null type:None
   [junit4]   2> 1047727 INFO  (TEST-CollectionsAPIDistributedZkTest.test-seed#[9904A45616232EF2]) [    ] o.a.s.c.c.ConnectionManager Client is connected to ZooKeeper
   [junit4]   2> 1047727 INFO  (TEST-CollectionsAPIDistributedZkTest.test-seed#[9904A45616232EF2]) [    ] o.a.s.c.c.SolrZkClient Using default ZkACLProvider
   [junit4]   2> 1047727 INFO  (TEST-CollectionsAPIDistributedZkTest.test-seed#[9904A45616232EF2]) [    ] o.a.s.c.c.SolrZkClient makePath: /solr
   [junit4]   2> 1047728 INFO  (TEST-CollectionsAPIDistributedZkTest.test-seed#[9904A45616232EF2]) [    ] o.a.s.c.c.SolrZkClient Using default ZkCredentialsProvider
   [junit4]   2> 1047728 INFO  (TEST-CollectionsAPIDistributedZkTest.test-seed#[9904A45616232EF2]) [    ] o.a.s.c.c.ConnectionManager Waiting for client to connect to ZooKeeper
   [junit4]   2> 1047729 INFO  (zkCallback-2783-thread-1) [    ] o.a.s.c.c.ConnectionManager Watcher org.apache.solr.common.cloud.ConnectionManager@1d24c15 name:ZooKeeperConnection Watcher:127.0.0.1:53313/solr got event WatchedEvent state:SyncConnected type:None path:null path:null type:None
   [junit4]   2> 1047729 INFO  (TEST-CollectionsAPIDistributedZkTest.test-seed#[9904A45616232EF2]) [    ] o.a.s.c.c.ConnectionManager Client is connected to ZooKeeper
   [junit4]   2> 1047729 INFO  (TEST-CollectionsAPIDistributedZkTest.test-seed#[9904A45616232EF2]) [    ] o.a.s.c.c.SolrZkClient Using default ZkACLProvider
   [junit4]   2> 1047729 INFO  (TEST-CollectionsAPIDistributedZkTest.test-seed#[9904A45616232EF2]) [    ] o.a.s.c.AbstractZkTestCase put /home/jenkins/workspace/Lucene-Solr-5.5-Linux/solr/core/src/test-files/solr/collection1/conf/solrconfig-tlog.xml to /configs/conf2/solrconfig.xml
   [junit4]   2> 1047730 INFO  (TEST-CollectionsAPIDistributedZkTest.test-seed#[9904A45616232EF2]) [    ] o.a.s.c.c.SolrZkClient makePath: /configs/conf2/solrconfig.xml
   [junit4]   2> 1047731 INFO  (TEST-CollectionsAPIDistributedZkTest.test-seed#[9904A45616232EF2]) [    ] o.a.s.c.AbstractZkTestCase put /home/jenkins/workspace/Lucene-Solr-5.5-Linux/solr/core/src/test-files/solr/collection1/conf/schema.xml to /configs/conf2/schema.xml
   [junit4]   2> 1047731 INFO  (TEST-CollectionsAPIDistributedZkTest.test-seed#[9904A45616232EF2]) [    ] o.a.s.c.c.SolrZkClient makePath: /configs/conf2/schema.xml
   [junit4]   2> 1047732 INFO  (TEST-CollectionsAPIDistributedZkTest.test-seed#[9904A45616232EF2]) [    ] o.a.s.c.AbstractZkTestCase put /home/jenkins/workspace/Lucene-Solr-5.5-Linux/solr/core/src/test-files/solr/collection1/conf/enumsConfig.xml to /configs/conf2/enumsConfig.xml
   [junit4]   2> 1047732 INFO  (TEST-CollectionsAPIDistributedZkTest.test-seed#[9904A45616232EF2]) [    ] o.a.s.c.c.SolrZkClient makePath: /configs/conf2/enumsConfig.xml
   [junit4]   2> 1047733 INFO  (TEST-CollectionsAPIDistributedZkTest.test-seed#[9904A45616232EF2]) [    ] o.a.s.c.AbstractZkTestCase put /home/jenkins/workspace/Lucene-Solr-5.5-Linux/solr/core/src/test-files/solr/collection1/conf/solrconfig.snippet.randomindexconfig.xml to /configs/conf2/solrconfig.snippet.randomindexconfig.xml
   [junit4]   2> 1047733 INFO  (TEST-CollectionsAPIDistributedZkTest.test-seed#[9904A45616232EF2]) [    ] o.a.s.c.c.SolrZkClient makePath: /configs/conf2/solrconfig.snippet.randomindexconfig.xml
   [junit4]   2> 1047734 INFO  (TEST-CollectionsAPIDistributedZkTest.test-seed#[9904A45616232EF2]) [    ] o.a.s.c.AbstractZkTestCase put /home/jenkins/workspace/Lucene-Solr-5.5-Linux/solr/core/src/test-files/solr/collection1/conf/stopwords.txt to /configs/conf2/stopwords.txt
   [junit4]   2> 1047734 INFO  (TEST-CollectionsAPIDistributedZkTest.test-seed#[9904A45616232EF2]) [    ] o.a.s.c.c.SolrZkClient makePath: /configs/conf2/stopwords.txt
   [junit4]   2> 1047735 INFO  (TEST-CollectionsAPIDistributedZkTest.test-seed#[9904A45616232EF2]) [    ] o.a.s.c.AbstractZkTestCase put /home/jenkins/workspace/Lucene-Solr-5.5-Linux/solr/core/src/test-files/solr/collection1/conf/protwords.txt to /configs/conf2/protwords.txt
   [junit4]   2> 1047735 INFO  (TEST-CollectionsAPIDistributedZkTest.test-seed#[9904A45616232EF2]) [    ] o.a.s.c.c.SolrZkClient makePath: /configs/conf2/protwords.txt
   [junit4]   2> 1047736 INFO  (TEST-CollectionsAPIDistributedZkTest.test-seed#[9904A45616232EF2]) [    ] o.a.s.c.AbstractZkTestCase put /home/jenkins/workspace/Lucene-Solr-5.5-Linux/solr/core/src/test-files/solr/collection1/conf/currency.xml to /configs/conf2/currency.xml
   [junit4]   2> 1047736 INFO  (TEST-CollectionsAPIDistributedZkTest.test-seed#[9904A45616232EF2]) [    ] o.a.s.c.c.SolrZkClient makePath: /configs/conf2/currency.xml
   [junit4]   2> 1047737 INFO  (TEST-CollectionsAPIDistributedZkTest.test-seed#[9904A45616232EF2]) [    ] o.a.s.c.AbstractZkTestCase put /home/jenkins/workspace/Lucene-Solr-5.5-Linux/solr/core/src/test-files/solr/collection1/conf/open-exchange-rates.json to /configs/conf2/open-exchange-rates.json
   [junit4]   2> 1047737 INFO  (TEST-CollectionsAPIDistributedZkTest.test-seed#[9904A45616232EF2]) [    ] o.a.s.c.c.SolrZkClient makePath: /configs/conf2/open-exchange-rates.json
   [junit4]   2> 1047738 INFO  (TEST-CollectionsAPIDistributedZkTest.test-seed#[9904A45616232EF2]) [    ] o.a.s.c.AbstractZkTestCase put /home/jenkins/workspace/Lucene-Solr-5.5-Linux/solr/core/src/test-files/solr/collection1/conf/mapping-ISOLatin1Accent.txt to /configs/conf2/mapping-ISOLatin1Accent.txt
   [junit4]   2> 1047738 INFO  (TEST-CollectionsAPIDistributedZkTest.test-seed#[9904A45616232EF2]) [    ] o.a.s.c.c.SolrZkClient makePath: /configs/conf2/mapping-ISOLatin1Accent.txt
   [junit4]   2> 1047739 INFO  (TEST-CollectionsAPIDistributedZkTest.test-seed#[9904A45616232EF2]) [    ] o.a.s.c.AbstractZkTestCase put /home/jenkins/workspace/Lucene-Solr-5.5-Linux/solr/core/src/test-files/solr/collection1/conf/old_synonyms.txt to /configs/conf2/old_synonyms.txt
   [junit4]   2> 1047739 INFO  (TEST-CollectionsAPIDistributedZkTest.test-seed#[9904A45616232EF2]) [    ] o.a.s.c.c.SolrZkClient makePath: /configs/conf2/old_synonyms.txt
   [junit4]   2> 1047740 INFO  (TEST-CollectionsAPIDistributedZkTest.test-seed#[9904A45616232EF2]) [    ] o.a.s.c.AbstractZkTestCase put /home/jenkins/workspace/Lucene-Solr-5.5-Linux/solr/core/src/test-files/solr/collection1/conf/synonyms.txt to /configs/conf2/synonyms.txt
   [junit4]   2> 1047740 INFO  (TEST-CollectionsAPIDistributedZkTest.test-seed#[9904A45616232EF2]) [    ] o.a.s.c.c.SolrZkClient makePath: /configs/conf2/synonyms.txt
   [junit4]   2> 1047741 INFO  (TEST-CollectionsAPIDistributedZkTest.test-seed#[9904A45616232EF2]) [    ] o.a.s.c.AbstractZkTestCase put /home/jenkins/workspace/Lucene-Solr-5.5-Linux/solr/core/src/test-files/solr/collection1/conf/elevate.xml to /configs/conf2/elevate.xml
   [junit4]   2> 1047741 INFO  (TEST-CollectionsAPIDistributedZkTest.test-seed#[9904A45616232EF2]) [    ] o.a.s.c.c.SolrZkClient makePath: /configs/conf2/elevate.xml
   [junit4]   2> 1047802 INFO  (TEST-CollectionsAPIDistributedZkTest.test-seed#[9904A45616232EF2]) [    ] o.a.s.SolrTestCaseJ4 Writing core.properties file to /home/jenkins/workspace/Lucene-Solr-5.5-Linux/solr/build/solr-core/test/J2/temp/solr.cloud.CollectionsAPIDistributedZkTest_9904A45616232EF2-001/control-001/cores/collection1
   [junit4]   2> 1047803 INFO  (TEST-CollectionsAPIDistributedZkTest.test-seed#[9904A45616232EF2]) [    ] o.e.j.s.Server jetty-9.2.13.v20150730
   [junit4]   2> 1047803 INFO  (TEST-CollectionsAPIDistributedZkTest.test-seed#[9904A45616232EF2]) [    ] o.e.j.s.h.ContextHandler Started o.e.j.s.ServletContextHandler@15ef929{/t_ylw/vv,null,AVAILABLE}
   [junit4]   2> 1047804 INFO  (TEST-CollectionsAPIDistributedZkTest.test-seed#[9904A45616232EF2]) [    ] o.e.j.s.ServerConnector Started ServerConnector@119a86b{HTTP/1.1}{127.0.0.1:43877}
   [junit4]   2> 1047804 INFO  (TEST-CollectionsAPIDistributedZkTest.test-seed#[9904A45616232EF2]) [    ] o.e.j.s.Server Started @1048901ms
   [junit4]   2> 1047804 INFO  (TEST-CollectionsAPIDistributedZkTest.test-seed#[9904A45616232EF2]) [    ] o.a.s.c.s.e.JettySolrRunner Jetty properties: {solr.data.dir=/home/jenkins/workspace/Lucene-Solr-5.5-Linux/solr/build/solr-core/test/J2/temp/solr.cloud.CollectionsAPIDistributedZkTest_9904A45616232EF2-001/tempDir-001/control/data, coreRootDirectory=/home/jenkins/workspace/Lucene-Solr-5.5-Linux/solr/build/solr-core/test/J2/temp/solr.cloud.CollectionsAPIDistributedZkTest_9904A45616232EF2-001/control-001/cores, hostPort=43877, hostContext=/t_ylw/vv}
   [junit4]   2> 1047804 INFO  (TEST-CollectionsAPIDistributedZkTest.test-seed#[9904A45616232EF2]) [    ] o.a.s.s.SolrDispatchFilter SolrDispatchFilter.init(): sun.misc.Launcher$AppClassLoader@1482747
   [junit4]   2> 1047804 INFO  (TEST-CollectionsAPIDistributedZkTest.test-seed#[9904A45616232EF2]) [    ] o.a.s.c.SolrResourceLoader new SolrResourceLoader for directory: '/home/jenkins/workspace/Lucene-Solr-5.5-Linux/solr/build/solr-core/test/J2/temp/solr.cloud.CollectionsAPIDistributedZkTest_9904A45616232EF2-001/control-001'
   [junit4]   2> 1047804 INFO  (TEST-CollectionsAPIDistributedZkTest.test-seed#[9904A45616232EF2]) [    ] o.a.s.c.SolrResourceLoader JNDI not configured for solr (NoInitialContextEx)
   [junit4]   2> 1047804 INFO  (TEST-CollectionsAPIDistributedZkTest.test-seed#[9904A45616232EF2]) [    ] o.a.s.c.SolrResourceLoader solr home defaulted to 'solr/' (could not find system property or JNDI)
   [junit4]   2> 1047804 INFO  (TEST-CollectionsAPIDistributedZkTest.test-seed#[9904A45616232EF2]) [    ] o.a.s.c.c.SolrZkClient Using default ZkCredentialsProvider
   [junit4]   2> 1047805 INFO  (TEST-CollectionsAPIDistributedZkTest.test-seed#[9904A45616232EF2]) [    ] o.a.s.c.c.ConnectionManager Waiting for client to connect to ZooKeeper
   [junit4]   2> 1047805 INFO  (zkCallback-2784-thread-1) [    ] o.a.s.c.c.ConnectionManager Watcher org.apache.solr.common.cloud.ConnectionManager@1bc5d7d name:ZooKeeperConnection Watcher:127.0.0.1:53313/solr got event WatchedEvent state:SyncConnected type:None path:null path:null type:None
   [junit4]   2> 1047806 INFO  (TEST-CollectionsAPIDistributedZkTest.test-seed#[9904A45616232EF2]) [    ] o.a.s.c.c.ConnectionManager Client is connected to ZooKeeper
   [junit4]   2> 1047806 INFO  (TEST-CollectionsAPIDistributedZkTest.test-seed#[9904A45616232EF2]) [    ] o.a.s.c.c.SolrZkClient Using default ZkACLProvider
   [junit4]   2> 1047806 INFO  (TEST-CollectionsAPIDistributedZkTest.test-seed#[9904A45616232EF2]) [    ] o.a.s.s.SolrDispatchFilter Loading solr.xml from SolrHome (not found in ZooKeeper)
   [junit4]   2> 1047806 INFO  (TEST-CollectionsAPIDistributedZkTest.test-seed#[9904A45616232EF2]) [    ] o.a.s.c.SolrXmlConfig Loading container configuration from /home/jenkins/workspace/Lucene-Solr-5.5-Linux/solr/build/solr-core/test/J2/temp/solr.cloud.CollectionsAPIDistributedZkTest_9904A45616232EF2-001/control-001/solr.xml
   [junit4]   2> 1047819 INFO  (TEST-CollectionsAPIDistributedZkTest.test-seed#[9904A45616232EF2]) [    ] o.a.s.c.CorePropertiesLocator Config-defined core root directory: /home/jenkins/workspace/Lucene-Solr-5.5-Linux/solr/build/solr-core/test/J2/temp/solr.cloud.CollectionsAPIDistributedZkTest_9904A45616232EF2-001/control-001/cores
   [junit4]   2> 1047819 INFO  (TEST-CollectionsAPIDistributedZkTest.test-seed#[9904A45616232EF2]) [    ] o.a.s.c.CoreContainer New CoreContainer 8957337
   [junit4]   2> 1047819 INFO  (TEST-CollectionsAPIDistributedZkTest.test-seed#[9904A45616232EF2]) [    ] o.a.s.c.CoreContainer Loading cores into CoreContainer [instanceDir=/home/jenkins/workspace/Lucene-Solr-5.5-Linux/solr/build/solr-core/test/J2/temp/solr.cloud.CollectionsAPIDistributedZkTest_9904A45616232EF2-001/control-001]
   [junit4]   2> 1047819 WARN  (TEST-CollectionsAPIDistributedZkTest.test-seed#[9904A45616232EF2]) [    ] o.a.s.c.CoreContainer Couldn't add files from /home/jenkins/workspace/Lucene-Solr-5.5-Linux/solr/build/solr-core/test/J2/temp/solr.cloud.CollectionsAPIDistributedZkTest_9904A45616232EF2-001/control-001/lib to classpath: /home/jenkins/workspace/Lucene-Solr-5.5-Linux/solr/build/solr-core/test/J2/temp/solr.cloud.CollectionsAPIDistributedZkTest_9904A45616232EF2-001/control-001/lib
   [junit4]   2> 1047820 INFO  (TEST-CollectionsAPIDistributedZkTest.test-seed#[9904A45616232EF2]) [    ] o.a.s.h.c.HttpShardHandlerFactory created with socketTimeout : 90000,urlScheme : ,connTimeout : 15000,maxConnectionsPerHost : 20,maxConnections : 10000,corePoolSize : 0,maximumPoolSize : 2147483647,maxThreadIdleTime : 5,sizeOfQueue : -1,fairnessPolicy : false,useRetries : false,
   [junit4]   2> 1047821 INFO  (TEST-CollectionsAPIDistributedZkTest.test-seed#[9904A45616232EF2]) [    ] o.a.s.u.UpdateShardHandler Creating UpdateShardHandler HTTP client with params: socketTimeout=340000&connTimeout=45000&retry=true
   [junit4]   2> 1047822 INFO  (TEST-CollectionsAPIDistributedZkTest.test-seed#[9904A45616232EF2]) [    ] o.a.s.l.LogWatcher SLF4J impl is org.slf4j.impl.Log4jLoggerFactory
   [junit4]   2> 1047822 INFO  (TEST-CollectionsAPIDistributedZkTest.test-seed#[9904A45616232EF2]) [    ] o.a.s.l.LogWatcher Registering Log Listener [Log4j (org.slf4j.impl.Log4jLoggerFactory)]
   [junit4]   2> 1047822 INFO  (TEST-CollectionsAPIDistributedZkTest.test-seed#[9904A45616232EF2]) [    ] o.a.s.c.ZkContainer Zookeeper client=127.0.0.1:53313/solr
   [junit4]   2> 1047822 INFO  (TEST-CollectionsAPIDistributedZkTest.test-seed#[9904A45616232EF2]) [    ] o.a.s.c.ZkController zkHost includes chroot
   [junit4]   2> 1047822 INFO  (TEST-CollectionsAPIDistributedZkTest.test-seed#[9904A45616232EF2]) [    ] o.a.s.c.c.SolrZkClient Using default ZkCredentialsProvider
   [junit4]   2> 1047822 INFO  (TEST-CollectionsAPIDistributedZkTest.test-seed#[9904A45616232EF2]) [    ] o.a.s.c.c.ConnectionManager Waiting for client to connect to ZooKeeper
   [junit4]   2> 1047823 INFO  (zkCallback-2787-thread-1) [    ] o.a.s.c.c.ConnectionManager Watcher org.apache.solr.common.cloud.ConnectionManager@1f446e4 name:ZooKeeperConnection Watcher:127.0.0.1:53313 got event WatchedEvent state:SyncConnected type:None path:null path:null type:None
   [junit4]   2> 1047823 INFO  (TEST-CollectionsAPIDistributedZkTest.test-seed#[9904A45616232EF2]) [    ] o.a.s.c.c.ConnectionManager Client is connected to ZooKeeper
   [junit4]   2> 1047824 INFO  (TEST-CollectionsAPIDistributedZkTest.test-seed#[9904A45616232EF2]) [    ] o.a.s.c.c.SolrZkClient Using default ZkACLProvider
   [junit4]   2> 1047824 INFO  (TEST-CollectionsAPIDistributedZkTest.test-seed#[9904A45616232EF2]) [n:127.0.0.1:43877_t_ylw%2Fvv    ] o.a.s.c.c.ConnectionManager Waiting for client to connect to ZooKeeper
   [junit4]   2> 1047825 INFO  (zkCallback-2788-thread-1-processing-n:127.0.0.1:43877_t_ylw%2Fvv) [n:127.0.0.1:43877_t_ylw%2Fvv    ] o.a.s.c.c.ConnectionManager Watcher org.apache.solr.common.cloud.ConnectionManager@1a823ee name:ZooKeeperConnection Watcher:127.0.0.1:53313/solr got event WatchedEvent state:SyncConnected type:None path:null path:null type:None
   [junit4]   2> 1047825 INFO  (TEST-CollectionsAPIDistributedZkTest.test-seed#[9904A45616232EF2]) [n:127.0.0.1:43877_t_ylw%2Fvv    ] o.a.s.c.c.ConnectionManager Client is connected to ZooKeeper
   [junit4]   2> 1047826 INFO  (TEST-CollectionsAPIDistributedZkTest.test-seed#[9904A45616232EF2]) [n:127.0.0.1:43877_t_ylw%2Fvv    ] o.a.s.c.c.SolrZkClient makePath: /overseer/queue
   [junit4]   2> 1047827 INFO  (TEST-CollectionsAPIDistributedZkTest.test-seed#[9904A45616232EF2]) [n:127.0.0.1:43877_t_ylw%2Fvv    ] o.a.s.c.c.SolrZkClient makePath: /overseer/collection-queue-work
   [junit4]   2> 1047828 INFO  (TEST-CollectionsAPIDistributedZkTest.test-seed#[9904A45616232EF2]) [n:127.0.0.1:43877_t_ylw%2Fvv    ] o.a.s.c.c.SolrZkClient makePath: /overseer/collection-map-running
   [junit4]   2> 1047829 INFO  (TEST-CollectionsAPIDistributedZkTest.test-seed#[9904A45616232EF2]) [n:127.0.0.1:43877_t_ylw%2Fvv    ] o.a.s.c.c.SolrZkClient makePath: /overseer/collection-map-completed
   [junit4]   2> 1047830 INFO  (TEST-CollectionsAPIDistributedZkTest.test-seed#[9904A45616232EF2]) [n:127.0.0.1:43877_t_ylw%2Fvv    ] o.a.s.c.c.SolrZkClient makePath: /overseer/collection-map-failure
   [junit4]   2> 1047831 INFO  (TEST-CollectionsAPIDistributedZkTest.test-seed#[9904A45616232EF2]) [n:127.0.0.1:43877_t_ylw%2Fvv    ] o.a.s.c.c.SolrZkClient makePath: /live_nodes
   [junit4]   2> 1047832 INFO  (TEST-CollectionsAPIDistributedZkTest.test-seed#[9904A45616232EF2]) [n:127.0.0.1:43877_t_ylw%2Fvv    ] o.a.s.c.c.SolrZkClient makePath: /aliases.json
   [junit4]   2> 1047833 INFO  (TEST-CollectionsAPIDistributedZkTest.test-seed#[9904A45616232EF2]) [n:127.0.0.1:43877_t_ylw%2Fvv    ] o.a.s.c.c.SolrZkClient makePath: /clusterstate.json
   [junit4]   2> 1047833 INFO  (TEST-CollectionsAPIDistributedZkTest.test-seed#[9904A45616232EF2]) [n:127.0.0.1:43877_t_ylw%2Fvv    ] o.a.s.c.c.SolrZkClient makePath: /security.json
   [junit4]   2> 1047834 INFO  (TEST-CollectionsAPIDistributedZkTest.test-seed#[9904A45616232EF2]) [n:127.0.0.1:43877_t_ylw%2Fvv    ] o.a.s.c.ZkController Register node as live in ZooKeeper:/live_nodes/127.0.0.1:43877_t_ylw%2Fvv
   [junit4]   2> 1047834 INFO  (TEST-CollectionsAPIDistributedZkTest.test-seed#[9904A45616232EF2]) [n:127.0.0.1:43877_t_ylw%2Fvv    ] o.a.s.c.c.SolrZkClient makePath: /live_nodes/127.0.0.1:43877_t_ylw%2Fvv
   [junit4]   2> 1047835 INFO  (TEST-CollectionsAPIDistributedZkTest.test-seed#[9904A45616232EF2]) [n:127.0.0.1:43877_t_ylw%2Fvv    ] o.a.s.c.c.SolrZkClient makePath: /overseer_elect
   [junit4]   2> 1047835 INFO  (TEST-CollectionsAPIDistributedZkTest.test-seed#[9904A45616232EF2]) [n:127.0.0.1:43877_t_ylw%2Fvv    ] o.a.s.c.c.SolrZkClient makePath: /overseer_elect/election
   [junit4]   2> 1047836 INFO  (TEST-CollectionsAPIDistributedZkTest.test-seed#[9904A45616232EF2]) [n:127.0.0.1:43877_t_ylw%2Fvv    ] o.a.s.c.Overseer Overseer (id=null) closing
   [junit4]   2> 1047836 INFO  (TEST-CollectionsAPIDistributedZkTest.test-seed#[9904A45616232EF2]) [n:127.0.0.1:43877_t_ylw%2Fvv    ] o.a.s.c.LeaderElector Joined leadership election with path: /overseer_elect/election/95471943062192134-127.0.0.1:43877_t_ylw%2Fvv-n_0000000000
   [junit4]   2> 1047836 INFO  (TEST-CollectionsAPIDistributedZkTest.test-seed#[9904A45616232EF2]) [n:127.0.0.1:43877_t_ylw%2Fvv    ] o.a.s.c.OverseerElectionContext I am going to be the leader 127.0.0.1:43877_t_ylw%2Fvv
   [junit4]   2> 1047836 INFO  (TEST-CollectionsAPIDistributedZkTest.test-seed#[9904A45616232EF2]) [n:127.0.0.1:43877_t_ylw%2Fvv    ] o.a.s.c.c.SolrZkClient makePath: /overseer_elect/leader
   [junit4]   2> 1047837 INFO  (TEST-CollectionsAPIDistributedZkTest.test-seed#[9904A45616232EF2]) [n:127.0.0.1:43877_t_ylw%2Fvv    ] o.a.s.c.Overseer Overseer (id=95471943062192134-127.0.0.1:43877_t_ylw%2Fvv-n_0000000000) starting
   [junit4]   2> 1047838 INFO  (TEST-CollectionsAPIDistributedZkTest.test-seed#[9904A45616232EF2]) [n:127.0.0.1:43877_t_ylw%2Fvv    ] o.a.s.c.c.SolrZkClient makePath: /overseer/queue-work
   [junit4]   2> 1047841 INFO  (TEST-CollectionsAPIDistributedZkTest.test-seed#[9904A45616232EF2]) [n:127.0.0.1:43877_t_ylw%2Fvv    ] o.a.s.c.OverseerAutoReplicaFailoverThread Starting OverseerAutoReplicaFailoverThread autoReplicaFailoverWorkLoopDelay=10000 autoReplicaFailoverWaitAfterExpiration=10000 autoReplicaFailoverBadNodeExpiration=60000
   [junit4]   2> 1047841 INFO  (OverseerCollectionConfigSetProcessor-95471943062192134-127.0.0.1:43877_t_ylw%2Fvv-n_0000000000) [n:127.0.0.1:43877_t_ylw%2Fvv    ] o.a.s.c.OverseerTaskProcessor Process current queue of overseer operations
   [junit4]   2> 1047841 INFO  (TEST-CollectionsAPIDistributedZkTest.test-seed#[9904A45616232EF2]) [n:127.0.0.1:43877_t_ylw%2Fvv    ] o.a.s.c.c.ZkStateReader Updating cluster state from ZooKeeper... 
   [junit4]   2> 1047841 INFO  (OverseerStateUpdate-95471943062192134-127.0.0.1:43877_t_ylw%2Fvv-n_0000000000) [n:127.0.0.1:43877_t_ylw%2Fvv    ] o.a.s.c.Overseer Starting to work on the main queue
   [junit4]   2> 1047865 INFO  (TEST-CollectionsAPIDistributedZkTest.test-seed#[9904A45616232EF2]) [n:127.0.0.1:43877_t_ylw%2Fvv    ] o.a.s.c.CoreContainer Security conf doesn't exist. Skipping setup for authorization module.
   [junit4]   2> 1047865 INFO  (TEST-CollectionsAPIDistributedZkTest.test-seed#[9904A45616232EF2]) [n:127.0.0.1:43877_t_ylw%2Fvv    ] o.a.s.c.CoreContainer No authentication plugin used.
   [junit4]   2> 1047865 INFO  (TEST-CollectionsAPIDistributedZkTest.test-seed#[9904A45616232EF2]) [n:127.0.0.1:43877_t_ylw%2Fvv    ] o.a.s.c.CorePropertiesLocator Looking for core definitions underneath /home/jenkins/workspace/Lucene-Solr-5.5-Linux/solr/build/solr-core/test/J2/temp/solr.cloud.CollectionsAPIDistributedZkTest_9904A45616232EF2-001/control-001/cores
   [junit4]   2> 1047866 INFO  (TEST-CollectionsAPIDistributedZkTest.test-seed#[9904A45616232EF2]) [n:127.0.0.1:43877_t_ylw%2Fvv    ] o.a.s.c.CoreDescriptor Created CoreDescriptor: {coreNodeName=, shard=, config=solrconfig.xml, configSetProperties=configsetprops.json, name=collection1, dataDir=data/, loadOnStartup=true, transient=false, collection=control_collection, schema=schema.xml}
   [junit4]   2> 1047866 INFO  (TEST-CollectionsAPIDistributedZkTest.test-seed#[9904A45616232EF2]) [n:127.0.0.1:43877_t_ylw%2Fvv    ] o.a.s.c.CorePropertiesLocator Found core collection1 in /home/jenkins/workspace/Lucene-Solr-5.5-Linux/solr/build/solr-core/test/J2/temp/solr.cloud.CollectionsAPIDistributedZkTest_9904A45616232EF2-001/control-001/cores/collection1
   [junit4]   2> 1047866 INFO  (TEST-CollectionsAPIDistributedZkTest.test-seed#[9904A45616232EF2]) [n:127.0.0.1:43877_t_ylw%2Fvv    ] o.a.s.c.CorePropertiesLocator Found 1 core definitions
   [junit4]   2> 1047866 INFO  (TEST-CollectionsAPIDistributedZkTest.test-seed#[9904A45616232EF2]) [n:127.0.0.1:43877_t_ylw%2Fvv    ] o.a.s.s.SolrDispatchFilter user.dir=/home/jenkins/workspace/Lucene-Solr-5.5-Linux/solr/build/solr-core/test/J2
   [junit4]   2> 1047866 INFO  (TEST-CollectionsAPIDistributedZkTest.test-seed#[9904A45616232EF2]) [n:127.0.0.1:43877_t_ylw%2Fvv    ] o.a.s.s.SolrDispatchFilter SolrDispatchFilter.init() done
   [junit4]   2> 1047866 INFO  (coreLoadExecutor-3570-thread-1-processing-n:127.0.0.1:43877_t_ylw%2Fvv) [n:127.0.0.1:43877_t_ylw%2Fvv c:control_collection   x:collection1] o.a.s.c.ZkController publishing state=down
   [junit4]   2> 1047866 INFO  (coreLoadExecutor-3570-thread-1-processing-n:127.0.0.1:43877_t_ylw%2Fvv) [n:127.0.0.1:43877_t_ylw%2Fvv c:control_collection   x:collection1] o.a.s.c.ZkController numShards not found on descriptor - reading it from system property
   [junit4]   2> 1047867 INFO  (OverseerStateUpdate-95471943062192134-127.0.0.1:43877_t_ylw%2Fvv-n_0000000000) [n:127.0.0.1:43877_t_ylw%2Fvv    ] o.a.s.c.Overseer processMessage: queueSize: 1, message = {
   [junit4]   2>   "roles":null,
   [junit4]   2>   "state":"down",
   [junit4]   2>   "base_url":"http://127.0.0.1:43877/t_ylw/vv",
   [junit4]   2>   "operation":"state",
   [junit4]   2>   "shard":null,
   [junit4]   2>   "collection":"control_collection",
   [junit4]   2>   "node_name":"127.0.0.1:43877_t_ylw%2Fvv",
   [junit4]   2>   "numShards":"1",
   [junit4]   2>   "core":"collection1"} current state version: 0
   [junit4]   2> 1047868 INFO  (coreLoadExecutor-3570-thread-1-processing-n:127.0.0.1:43877_t_ylw%2Fvv) [n:127.0.0.1:43877_t_ylw%2Fvv c:control_collection   x:collection1] o.a.s.c.ZkController look for our core node name
   [junit4]   2> 1047868 INFO  (OverseerStateUpdate-95471943062192134-127.0.0.1:43877_t_ylw%2Fvv-n_0000000000) [n:127.0.0.1:43877_t_ylw%2Fvv    ] o.a.s.c.o.ReplicaMutator Update state numShards=1 message={
   [junit4]   2>   "roles":null,
   [junit4]   2>   "state":"down",
   [junit4]   2>   "base_url":"http://127.0.0.1:43877/t_ylw/vv",
   [junit4]   2>   "operation":"state",
   [junit4]   2>   "shard":null,
   [junit4]   2>   "collection":"control_collection",
   [junit4]   2>   "node_name":"127.0.0.1:43877_t_ylw%2Fvv",
   [junit4]   2>   "numShards":"1",
   [junit4]   2>   "core":"collection1"}
   [junit4]   2> 1047868 INFO  (OverseerStateUpdate-95471943062192134-127.0.0.1:43877_t_ylw%2Fvv-n_0000000000) [n:127.0.0.1:43877_t_ylw%2Fvv    ] o.a.s.c.o.ClusterStateMutator building a new cName: control_collection
   [junit4]   2> 1047868 INFO  (OverseerStateUpdate-95471943062192134-127.0.0.1:43877_t_ylw%2Fvv-n_0000000000) [n:127.0.0.1:43877_t_ylw%2Fvv    ] o.a.s.c.o.ReplicaMutator Assigning new node to shard shard=shard1
   [junit4]   2> 1047869 INFO  (zkCallback-2788-thread-1-processing-n:127.0.0.1:43877_t_ylw%2Fvv) [n:127.0.0.1:43877_t_ylw%2Fvv    ] o.a.s.c.c.ZkStateReader A cluster state change: [WatchedEvent state:SyncConnected type:NodeDataChanged path:/clusterstate.json], has occurred - updating... (live nodes size: [1])
   [junit4]   2> 1048868 INFO  (coreLoadExecutor-3570-thread-1-processing-n:127.0.0.1:43877_t_ylw%2Fvv) [n:127.0.0.1:43877_t_ylw%2Fvv c:control_collection   x:collection1] o.a.s.c.ZkController waiting to find shard id in clusterstate for collection1
   [junit4]   2> 1048868 INFO  (coreLoadExecutor-3570-thread-1-processing-n:127.0.0.1:43877_t_ylw%2Fvv) [n:127.0.0.1:43877_t_ylw%2Fvv c:control_collection   x:collection1] o.a.s.c.ZkController Check for collection zkNode:control_collection
   [junit4]   2> 1048868 INFO  (coreLoadExecutor-3570-thread-1-processing-n:127.0.0.1:43877_t_ylw%2Fvv) [n:127.0.0.1:43877_t_ylw%2Fvv c:control_collection   x:collection1] o.a.s.c.ZkController Collection zkNode exists
   [junit4]   2> 1048868 INFO  (coreLoadExecutor-3570-thread-1-processing-n:127.0.0.1:43877_t_ylw%2Fvv) [n:127.0.0.1:43877_t_ylw%2Fvv c:control_collection   x:collection1] o.a.s.c.c.ZkStateReader Load collection config from: [/collections/control_collection]
   [junit4]   2> 1048869 INFO  (coreLoadExecutor-3570-thread-1-processing-n:127.0.0.1:43877_t_ylw%2Fvv) [n:127.0.0.1:43877_t_ylw%2Fvv c:control_collection   x:collection1] o.a.s.c.c.ZkStateReader path=[/collections/control_collection] [configName]=[conf1] specified config exists in ZooKeeper
   [junit4]   2> 1048869 INFO  (coreLoadExecutor-3570-thread-1-processing-n:127.0.0.1:43877_t_ylw%2Fvv) [n:127.0.0.1:43877_t_ylw%2Fvv c:control_collection   x:collection1] o.a.s.c.SolrResourceLoader new SolrResourceLoader for directory: '/home/jenkins/workspace/Lucene-Solr-5.5-Linux/solr/build/solr-core/test/J2/temp/solr.cloud.CollectionsAPIDistributedZkTest_9904A45616232EF2-001/control-001/cores/collection1'
   [junit4]   2> 1048869 INFO  (coreLoadExecutor-3570-thread-1-processing-n:127.0.0.1:43877_t_ylw%2Fvv) [n:127.0.0.1:43877_t_ylw%2Fvv c:control_collection   x:collection1] o.a.s.c.SolrResourceLoader JNDI not configured for solr (NoInitialContextEx)
   [junit4]   2> 1048869 INFO  (coreLoadExecutor-3570-thread-1-processing-n:127.0.0.1:43877_t_ylw%2Fvv) [n:127.0.0.1:43877_t_ylw%2Fvv c:control_collection   x:collection1] o.a.s.c.SolrResourceLoader solr home defaulted to 'solr/' (could not find system property or JNDI)
   [junit4]   2> 1048871 INFO  (coreLoadExecutor-3570-thread-1-processing-n:127.0.0.1:43877_t_ylw%2Fvv) [n:127.0.0.1:43877_t_ylw%2Fvv c:control_collection   x:collection1] o.a.s.c.Config loaded config solrconfig.xml with version 0 
   [junit4]   2> 1048878 INFO  (coreLoadExecutor-3570-thread-1-processing-n:127.0.0.1:43877_t_ylw%2Fvv) [n:127.0.0.1:43877_t_ylw%2Fvv c:control_collection   x:collection1] o.a.s.c.SolrConfig current version of requestparams : -1
   [junit4]   2> 1048896 INFO  (coreLoadExecutor-3570-thread-1-processing-n:127.0.0.1:43877_t_ylw%2Fvv) [n:127.0.0.1:43877_t_ylw%2Fvv c:control_collection   x:collection1] o.a.s.c.SolrConfig Using Lucene MatchVersion: 5.5.0
   [junit4]   2> 1048935 INFO  (coreLoadExecutor-3570-thread-1-processing-n:127.0.0.1:43877_t_ylw%2Fvv) [n:127.0.0.1:43877_t_ylw%2Fvv c:control_collection   x:collection1] o.a.s.c.SolrConfig Loaded SolrConfig: solrconfig.xml
   [junit4]   2> 1048947 INFO  (coreLoadExecutor-3570-thread-1-processing-n:127.0.0.1:43877_t_ylw%2Fvv) [n:127.0.0.1:43877_t_ylw%2Fvv c:control_collection   x:collection1] o.a.s.s.IndexSchema [collection1] Schema name=test
   [junit4]   2> 1049154 INFO  (coreLoadExecutor-3570-thread-1-processing-n:127.0.0.1:43877_t_ylw%2Fvv) [n:127.0.0.1:43877_t_ylw%2Fvv c:control_collection   x:collection1] o.a.s.s.OpenExchangeRatesOrgProvider Initialized with rates=open-exchange-rates.json, refreshInterval=1440.
   [junit4]   2> 1049159 INFO  (coreLoadExecutor-3570-thread-1-processing-n:127.0.0.1:43877_t_ylw%2Fvv) [n:127.0.0.1:43877_t_ylw%2Fvv c:control_collection   x:collection1] o.a.s.s.IndexSchema default search field in schema is text
   [junit4]   2> 1049167 INFO  (coreLoadExecutor-3570-thread-1-processing-n:127.0.0.1:43877_t_ylw%2Fvv) [n:127.0.0.1:43877_t_ylw%2Fvv c:control_collection   x:collection1] o.a.s.s.IndexSchema unique key field: id
   [junit4]   2> 1049173 INFO  (coreLoadExecutor-3570-thread-1-processing-n:127.0.0.1:43877_t_ylw%2Fvv) [n:127.0.0.1:43877_t_ylw%2Fvv c:control_collection   x:collection1] o.a.s.s.FileExchangeRateProvider Reloading exchange rates from file currency.xml
   [junit4]   2> 1049176 INFO  (coreLoadExecutor-3570-thread-1-processing-n:127.0.0.1:43877_t_ylw%2Fvv) [n:127.0.0.1:43877_t_ylw%2Fvv c:control_collection   x:collection1] o.a.s.s.FileExchangeRateProvider Reloading exchange rates from file currency.xml
   [junit4]   2> 1049179 INFO  (coreLoadExecutor-3570-thread-1-processing-n:127.0.0.1:43877_t_ylw%2Fvv) [n:127.0.0.1:43877_t_ylw%2Fvv c:control_collection   x:collection1] o.a.s.s.OpenExchangeRatesOrgProvider Reloading exchange rates from open-exchange-rates.json
   [junit4]   2> 1049180 INFO  (coreLoadExecutor-3570-thread-1-processing-n:127.0.0.1:43877_t_ylw%2Fvv) [n:127.0.0.1:43877_t_ylw%2Fvv c:control_collection   x:collection1] o.a.s.s.OpenExchangeRatesOrgProvider Reloading exchange rates from open-exchange-rates.json
   [junit4]   2> 1049181 INFO  (coreLoadExecutor-3570-thread-1-processing-n:127.0.0.1:43877_t_ylw%2Fvv) [n:127.0.0.1:43877_t_ylw%2Fvv c:control_collection   x:collection1] o.a.s.c.ConfigSetProperties Did not find ConfigSet properties, assuming default properties: Can't find resource 'configsetprops.json' in classpath or '/configs/conf1', cwd=/home/jenkins/workspace/Lucene-Solr-5.5-Linux/solr/build/solr-core/test/J2
   [junit4]   2> 1049181 INFO  (coreLoadExecutor-3570-thread-1-processing-n:127.0.0.1:43877_t_ylw%2Fvv) [n:127.0.0.1:43877_t_ylw%2Fvv c:control_collection   x:collection1] o.a.s.c.CoreContainer Creating SolrCore 'collection1' using configuration from collection control_collection
   [junit4]   2> 1049181 INFO  (coreLoadExecutor-3570-thread-1-processing-n:127.0.0.1:43877_t_ylw%2Fvv) [n:127.0.0.1:43877_t_ylw%2Fvv c:control_collection s:shard1 r:core_node1 x:collection1] o.a.s.c.SolrCore org.apache.solr.core.MockDirectoryFactory
   [junit4]   2> 1049181 INFO  (coreLoadExecutor-3570-thread-1-processing-n:127.0.0.1:43877_t_ylw%2Fvv) [n:127.0.0.1:43877_t_ylw%2Fvv c:control_collection s:shard1 r:core_node1 x:collection1] o.a.s.c.SolrCore [[collection1] ] Opening new SolrCore at [/home/jenkins/workspace/Lucene-Solr-5.5-Linux/solr/build/solr-core/test/J2/temp/solr.cloud.CollectionsAPIDistributedZkTest_9904A45616232EF2-001/control-001/cores/collection1], dataDir=[/home/jenkins/workspace/Lucene-Solr-5.5-Linux/solr/build/solr-core/test/J2/temp/solr.cloud.CollectionsAPIDistributedZkTest_9904A45616232EF2-001/control-001/cores/collection1/data/]
   [junit4]   2> 1049182 INFO  (coreLoadExecutor-3570-thread-1-processing-n:127.0.0.1:43877_t_ylw%2Fvv) [n:127.0.0.1:43877_t_ylw%2Fvv c:control_collection s:shard1 r:core_node1 x:collection1] o.a.s.c.JmxMonitoredMap JMX monitoring is enabled. Adding Solr mbeans to JMX Server: com.sun.jmx.mbeanserver.JmxMBeanServer@da54c4
   [junit4]   2> 1049182 INFO  (coreLoadExecutor-3570-thread-1-processing-n:127.0.0.1:43877_t_ylw%2Fvv) [n:127.0.0.1:43877_t_ylw%2Fvv c:control_collection s:shard1 r:core_node1 x:collection1] o.a.s.c.CachingDirectoryFactory return new directory for /home/jenkins/workspace/Lucene-Solr-5.5-Linux/solr/build/solr-core/test/J2/temp/solr.cloud.CollectionsAPIDistributedZkTest_9904A45616232EF2-001/control-001/cores/collection1/data
   [junit4]   2> 1049182 INFO  (coreLoadExecutor-3570-thread-1-processing-n:127.0.0.1:43877_t_ylw%2Fvv) [n:127.0.0.1:43877_t_ylw%2Fvv c:control_collection s:shard1 r:core_node1 x:collection1] o.a.s.c.SolrCore New index directory detected: old=null new=/home/jenkins/workspace/Lucene-Solr-5.5-Linux/solr/build/solr-core/test/J2/temp/solr.cloud.CollectionsAPIDistributedZkTest_9904A45616232EF2-001/control-001/cores/collection1/data/index/
   [junit4]   2> 1049182 WARN  (coreLoadExecutor-3570-thread-1-processing-n:127.0.0.1:43877_t_ylw%2Fvv) [n:127.0.0.1:43877_t_ylw%2Fvv c:control_collection s:shard1 r:core_node1 x:collection1] o.a.s.c.SolrCore [collection1] Solr index directory '/home/jenkins/workspace/Lucene-Solr-5.5-Linux/solr/build/solr-core/test/J2/temp/solr.cloud.CollectionsAPIDistributedZkTest_9904A45616232EF2-001/control-001/cores/collection1/data/index' doesn't exist. Creating new index...
   [junit4]   2> 1049183 INFO  (coreLoadExecutor-3570-thread-1-processing-n:127.0.0.1:43877_t_ylw%2Fvv) [n:127.0.0.1:43877_t_ylw%2Fvv c:control_collection s:shard1 r:core_node1 x:collection1] o.a.s.c.CachingDirectoryFactory return new directory for /home/jenkins/workspace/Lucene-Solr-5.5-Linux/solr/build/solr-core/test/J2/temp/solr.cloud.CollectionsAPIDistributedZkTest_9904A45616232EF2-001/control-001/cores/collection1/data/index
   [junit4]   2> 1049183 INFO  (coreLoadExecutor-3570-thread-1-processing-n:127.0.0.1:43877_t_ylw%2Fvv) [n:127.0.0.1:43877_t_ylw%2Fvv c:control_collection s:shard1 r:core_node1 x:collection1] o.a.s.u.RandomMergePolicy RandomMergePolicy wrapping class org.apache.lucene.index.LogByteSizeMergePolicy: [LogByteSizeMergePolicy: minMergeSize=1677721, mergeFactor=50, maxMergeSize=2147483648, maxMergeSizeForForcedMerge=9223372036854775807, calibrateSizeByDeletes=true, maxMergeDocs=2147483647, maxCFSSegmentSizeMB=8.796093022207999E12, noCFSRatio=1.0]
   [junit4]   2> 1049183 INFO  (coreLoadExecutor-3570-thread-1-processing-n:127.0.0.1:43877_t_ylw%2Fvv) [n:127.0.0.1:43877_t_ylw%2Fvv c:control_collection s:shard1 r:core_node1 x:collection1] o.a.s.c.SolrDeletionPolicy SolrDeletionPolicy.onCommit: commits: num=1
   [junit4]   2> 	commit{dir=MockDirectoryWrapper(RAMDirectory@1535da1 lockFactory=org.apache.lucene.store.SingleInstanceLockFactory@27fad6),segFN=segments_1,generation=1}
   [junit4]   2> 1049183 INFO  (coreLoadExecutor-3570-thread-1-processing-n:127.0.0.1:43877_t_ylw%2Fvv) [n:127.0.0.1:43877_t_ylw%2Fvv c:control_collection s:shard1 r:core_node1 x:collection1] o.a.s.c.SolrDeletionPolicy newest commit generation = 1
   [junit4]   2> 1049183 INFO  (OldIndexDirectoryCleanupThreadForCore-collection1) [n:127.0.0.1:43877_t_ylw%2Fvv c:control_collection s:shard1 r:core_node1 x:collection1] o.a.s.c.SolrCore Looking for old index directories to cleanup for core collection1 in /home/jenkins/workspace/Lucene-Solr-5.5-Linux/solr/build/solr-core/test/J2/temp/solr.cloud.CollectionsAPIDistributedZkTest_9904A45616232EF2-001/control-001/cores/collection1/data/
   [junit4]   2> 1049184 WARN  (OldIndexDirectoryCleanupThreadForCore-collection1) [n:127.0.0.1:43877_t_ylw%2Fvv c:control_collection s:shard1 r:core_node1 x:collection1] o.a.s.c.DirectoryFactory /home/jenkins/workspace/Lucene-Solr-5.5-Linux/solr/build/solr-core/test/J2/temp/solr.cloud.CollectionsAPIDistributedZkTest_9904A45616232EF2-001/control-001/cores/collection1/data/ does not point to a valid data directory; skipping clean-up of old index directories.
   [junit4]   2> 1049186 INFO  (coreLoadExecutor-3570-thread-1-processing-n:127.0.0.1:43877_t_ylw%2Fvv) [n:127.0.0.1:43877_t_ylw%2Fvv c:control_collection s:shard1 r:core_node1 x:collection1] o.a.s.u.p.UpdateRequestProcessorChain creating updateRequestProcessorChain "nodistrib"
   [junit4]   2> 1049186 INFO  (coreLoadExecutor-3570-thread-1-processing-n:127.0.0.1:43877_t_ylw%2Fvv) [n:127.0.0.1:43877_t_ylw%2Fvv c:control_collection s:shard1 r:core_node1 x:collection1] o.a.s.u.p.UpdateRequestProcessorChain creating updateRequestProcessorChain "dedupe"
   [junit4]   2> 1049187 INFO  (coreLoadExecutor-3570-thread-1-processing-n:127.0.0.1:43877_t_ylw%2Fvv) [n:127.0.0.1:43877_t_ylw%2Fvv c:control_collection s:shard1 r:core_node1 x:collection1] o.a.s.u.p.UpdateRequestProcessorChain inserting DistributedUpdateProcessorFactory into updateRequestProcessorChain "dedupe"
   [junit4]   2> 1049187 INFO  (coreLoadExecutor-3570-thread-1-processing-n:127.0.0.1:43877_t_ylw%2Fvv) [n:127.0.0.1:43877_t_ylw%2Fvv c:control_collection s:shard1 r:core_node1 x:collection1] o.a.s.u.p.UpdateRequestProcessorChain creating updateRequestProcessorChain "stored_sig"
   [junit4]   2> 1049187 INFO  (coreLoadExecutor-3570-thread-1-processing-n:127.0.0.1:43877_t_ylw%2Fvv) [n:127.0.0.1:43877_t_ylw%2Fvv c:control_collection s:shard1 r:core_node1 x:collection1] o.a.s.u.p.UpdateRequestProcessorChain inserting DistributedUpdateProcessorFactory into updateRequestProcessorChain "stored_sig"
   [junit4]   2> 1049187 INFO  (coreLoadExecutor-3570-thread-1-processing-n:127.0.0.1:43877_t_ylw%2Fvv) [n:127.0.0.1:43877_t_ylw%2Fvv c:control_collection s:shard1 r:core_node1 x:collection1] o.a.s.u.p.UpdateRequestProcessorChain creating updateRequestProcessorChain "distrib-dup-test-chain-explicit"
   [junit4]   2> 1049187 INFO  (coreLoadExecutor-3570-thread-1-processing-n:127.0.0.1:43877_t_ylw%2Fvv) [n:127.0.0.1:43877_t_ylw%2Fvv c:control_collection s:shard1 r:core_node1 x:collection1] o.a.s.u.p.UpdateRequestProcessorChain creating updateRequestProcessorChain "distrib-dup-test-chain-implicit"
   [junit4]   2> 1049187 INFO  (coreLoadExecutor-3570-thread-1-processing-n:127.0.0.1:43877_t_ylw%2Fvv) [n:127.0.0.1:43877_t_ylw%2Fvv c:control_collection s:shard1 r:core_node1 x:collection1] o.a.s.u.p.UpdateRequestProcessorChain inserting DistributedUpdateProcessorFactory into updateRequestProcessorChain "distrib-dup-test-chain-implicit"
   [junit4]   2> 1049187 INFO  (coreLoadExecutor-3570-thread-1-processing-n:127.0.0.1:43877_t_ylw%2Fvv) [n:127.0.0.1:43877_t_ylw%2Fvv c:control_collection s:shard1 r:core_node1 x:collection1] o.a.s.c.SolrCore no updateRequestProcessorChain defined as default, creating implicit default
   [junit4]   2> 1049187 WARN  (coreLoadExecutor-3570-thread-1-processing-n:127.0.0.1:43877_t_ylw%2Fvv) [n:127.0.0.1:43877_t_ylw%2Fvv c:control_collection s:shard1 r:core_node1 x:collection1] o.a.s.c.RequestHandlers INVALID paramSet a in requestHandler {type = requestHandler,name = /dump,class = DumpRequestHandler,args = {defaults={a=A,b=B}}}
   [junit4]   2> 1049190 INFO  (coreLoadExecutor-3570-thread-1-processing-n:127.0.0.1:43877_t_ylw%2Fvv) [n:127.0.0.1:43877_t_ylw%2Fvv c:control_collection s:shard1 r:core_node1 x:collection1] o.a.s.h.l.XMLLoader xsltCacheLifetimeSeconds=60
   [junit4]   2> 1049191 INFO  (coreLoadExecutor-3570-thread-1-processing-n:127.0.0.1:43877_t_ylw%2Fvv) [n:127.0.0.1:43877_t_ylw%2Fvv c:control_collection s:shard1 r:core_node1 x:collection1] o.a.s.h.l.XMLLoader xsltCacheLifetimeSeconds=60
   [junit4]   2> 1049192 INFO  (coreLoadExecutor-3570-thread-1-processing-n:127.0.0.1:43877_t_ylw%2Fvv) [n:127.0.0.1:43877_t_ylw%2Fvv c:control_collection s:shard1 r:core_node1 x:collection1] o.a.s.h.l.XMLLoader xsltCacheLifetimeSeconds=60
   [junit4]   2> 1049193 INFO  (coreLoadExecutor-3570-thread-1-processing-n:127.0.0.1:43877_t_ylw%2Fvv) [n:127.0.0.1:43877_t_ylw%2Fvv c:control_collection s:shard1 r:core_node1 x:collection1] o.a.s.h.l.XMLLoader xsltCacheLifetimeSeconds=60
   [junit4]   2> 1049196 INFO  (coreLoadExecutor-3570-thread-1-processing-n:127.0.0.1:43877_t_ylw%2Fvv) [n:127.0.0.1:43877_t_ylw%2Fvv c:control_collection s:shard1 r:core_node1 x:collection1] o.a.s.c.RequestHandlers Registered paths: /dump,/admin/segments,/get,/schema,/update,/admin/luke,/admin/plugins,/update/csv,/admin/logging,/replication,/config,/admin/mbeans,/admin/properties,/update/json,standard,/admin/threads,/update/json/docs,/admin/ping,/admin/file,/admin/system
   [junit4]   2> 1049197 INFO  (coreLoadExecutor-3570-thread-1-processing-n:127.0.0.1:43877_t_ylw%2Fvv) [n:127.0.0.1:43877_t_ylw%2Fvv c:control_collection s:shard1 r:core_node1 x:collection1] o.a.s.c.SolrCore Using default statsCache cache: org.apache.solr.search.stats.LocalStatsCache
   [junit4]   2> 1049198 INFO  (coreLoadExecutor-3570-thread-1-processing-n:127.0.0.1:43877_t_ylw%2Fvv) [n:127.0.0.1:43877_t_ylw%2Fvv c:control_collection s:shard1 r:core_node1 x:collection1] o.a.s.u.UpdateHandler Using UpdateLog implementation: org.apache.solr.update.UpdateLog
   [junit4]   2> 1049198 INFO  (coreLoadExecutor-3570-thread-1-processing-n:127.0.0.1:43877_t_ylw%2Fvv) [n:127.0.0.1:43877_t_ylw%2Fvv c:control_collection s:shard1 r:core_node1 x:collection1] o.a.s.u.UpdateLog Initializing UpdateLog: dataDir= defaultSyncLevel=FLUSH numRecordsToKeep=100 maxNumLogsToKeep=10 numVersionBuckets=65536
   [junit4]   2> 1049198 INFO  (coreLoadExecutor-3570-thread-1-processing-n:127.0.0.1:43877_t_ylw%2Fvv) [n:127.0.0.1:43877_t_ylw%2Fvv c:control_collection s:shard1 r:core_node1 x:collection1] o.a.s.u.CommitTracker Hard AutoCommit: disabled
   [junit4]   2> 1049198 INFO  (coreLoadExecutor-3570-thread-1-processing-n:127.0.0.1:43877_t_ylw%2Fvv) [n:127.0.0.1:43877_t_ylw%2Fvv c:control_collection s:shard1 r:core_node1 x:collection1] o.a.s.u.CommitTracker Soft AutoCommit: disabled
   [junit4]   2> 1049199 INFO  (coreLoadExecutor-3570-thread-1-processing-n:127.0.0.1:43877_t_ylw%2Fvv) [n:127.0.0.1:43877_t_ylw%2Fvv c:control_collection s:shard1 r:core_node1 x:collection1] o.a.s.u.RandomMergePolicy RandomMergePolicy wrapping class org.apache.lucene.index.TieredMergePolicy: [TieredMergePolicy: maxMergeAtOnce=18, maxMergeAtOnceExplicit=39, maxMergedSegmentMB=73.3525390625, floorSegmentMB=1.529296875, forceMergeDeletesPctAllowed=21.115481618560093, segmentsPerTier=31.0, maxCFSSegmentSizeMB=8.796093022207999E12, noCFSRatio=0.7157808220089125
   [junit4]   2> 1049199 INFO  (coreLoadExecutor-3570-thread-1-processing-n:127.0.0.1:43877_t_ylw%2Fvv) [n:127.0.0.1:43877_t_ylw%2Fvv c:control_collection s:shard1 r:core_node1 x:collection1] o.a.s.c.SolrDeletionPolicy SolrDeletionPolicy.onInit: commits: num=1
   [junit4]   2> 	commit{dir=MockDirectoryWrapper(RAMDirectory@1535da1 lockFactory=org.apache.lucene.store.SingleInstanceLockFactory@27fad6),segFN=segments_1,generation=1}
   [junit4]   2> 1049199 INFO  (coreLoadExecutor-3570-thread-1-processing-n:127.0.0.1:43877_t_ylw%2Fvv) [n:127.0.0.1:43877_t_ylw%2Fvv c:control_collection s:shard1 r:core_node1 x:collection1] o.a.s.c.SolrDeletionPolicy newest commit generation = 1
   [junit4]   2> 1049199 INFO  (coreLoadExecutor-3570-thread-1-processing-n:127.0.0.1:43877_t_ylw%2Fvv) [n:127.0.0.1:43877_t_ylw%2Fvv c:control_collection s:shard1 r:core_node1 x:collection1] o.a.s.s.SolrIndexSearcher Opening Searcher@1f2773d[collection1] main
   [junit4]   2> 1049199 INFO  (coreLoadExecutor-3570-thread-1-processing-n:127.0.0.1:43877_t_ylw%2Fvv) [n:127.0.0.1:43877_t_ylw%2Fvv c:control_collection s:shard1 r:core_node1 x:collection1] o.a.s.c.c.ZkStateReader Load collection config from: [/collections/control_collection]
   [junit4]   2> 1049200 INFO  (coreLoadExecutor-3570-thread-1-processing-n:127.0.0.1:43877_t_ylw%2Fvv) [n:127.0.0.1:43877_t_ylw%2Fvv c:control_collection s:shard1 r:core_node1 x:collection1] o.a.s.c.c.ZkStateReader path=[/collections/control_collection] [configName]=[conf1] specified config exists in ZooKeeper
   [junit4]   2> 1049200 INFO  (coreLoadExecutor-3570-thread-1-processing-n:127.0.0.1:43877_t_ylw%2Fvv) [n:127.0.0.1:43877_t_ylw%2Fvv c:control_collection s:shard1 r:core_node1 x:collection1] o.a.s.r.ManagedResourceStorage Setting up ZooKeeper-based storage for the RestManager with znodeBase: /configs/conf1
   [junit4]   2> 1049200 INFO  (coreLoadExecutor-3570-thread-1-processing-n:127.0.0.1:43877_t_ylw%2Fvv) [n:127.0.0.1:43877_t_ylw%2Fvv c:control_collection s:shard1 r:core_node1 x:collection1] o.a.s.r.ManagedResourceStorage Configured ZooKeeperStorageIO with znodeBase: /configs/conf1
   [junit4]   2> 1049201 INFO  (coreLoadExecutor-3570-thread-1-processing-n:127.0.0.1:43877_t_ylw%2Fvv) [n:127.0.0.1:43877_t_ylw%2Fvv c:control_collection s:shard1 r:core_node1 x:collection1] o.a.s.r.RestManager Initializing RestManager with initArgs: {}
   [junit4]   2> 1049201 INFO  (coreLoadExecutor-3570-thread-1-processing-n:127.0.0.1:43877_t_ylw%2Fvv) [n:127.0.0.1:43877_t_ylw%2Fvv c:control_collection s:shard1 r:core_node1 x:collection1] o.a.s.r.ManagedResourceStorage Reading _rest_managed.json using ZooKeeperStorageIO:path=/configs/conf1
   [junit4]   2> 1049201 INFO  (coreLoadExecutor-3570-thread-1-processing-n:127.0.0.1:43877_t_ylw%2Fvv) [n:127.0.0.1:43877_t_ylw%2Fvv c:control_collection s:shard1 r:core_node1 x:collection1] o.a.s.r.ManagedResourceStorage No data found for znode /configs/conf1/_rest_managed.json
   [junit4]   2> 1049201 INFO  (coreLoadExecutor-3570-thread-1-processing-n:127.0.0.1:43877_t_ylw%2Fvv) [n:127.0.0.1:43877_t_ylw%2Fvv c:control_collection s:shard1 r:core_node1 x:collection1] o.a.s.r.ManagedResourceStorage Loaded null at path _rest_managed.json using ZooKeeperStorageIO:path=/configs/conf1
   [junit4]   2> 1049201 INFO  (coreLoadExecutor-3570-thread-1-processing-n:127.0.0.1:43877_t_ylw%2Fvv) [n:127.0.0.1:43877_t_ylw%2Fvv c:control_collection s:shard1 r:core_node1 x:collection1] o.a.s.r.RestManager Initializing 0 registered ManagedResources
   [junit4]   2> 1049201 INFO  (coreLoadExecutor-3570-thread-1-processing-n:127.0.0.1:43877_t_ylw%2Fvv) [n:127.0.0.1:43877_t_ylw%2Fvv c:control_collection s:shard1 r:core_node1 x:collection1] o.a.s.h.ReplicationHandler Commits will be reserved for  10000
   [junit4]   2> 1049202 INFO  (searcherExecutor-3571-thread-1-processing-r:core_node1 s:shard1 c:control_collection n:127.0.0.1:43877_t_ylw%2Fvv x:collection1) [n:127.0.0.1:43877_t_ylw%2Fvv c:control_collection s:shard1 r:core_node1 x:collection1] o.a.s.c.SolrCore [collection1] Registered new searcher Searcher@1f2773d[collection1] main{ExitableDirectoryReader(UninvertingDirectoryReader())}
   [junit4]   2> 1049202 INFO  (coreLoadExecutor-3570-thread-1-processing-n:127.0.0.1:43877_t_ylw%2Fvv) [n:127.0.0.1:43877_t_ylw%2Fvv c:control_collection s:shard1 r:core_node1 x:collection1] o.a.s.u.UpdateLog Looking up max value of version field to seed version buckets
   [junit4]   2> 1049202 INFO  (coreLoadExecutor-3570-thread-1-processing-n:127.0.0.1:43877_t_ylw%2Fvv) [n:127.0.0.1:43877_t_ylw%2Fvv c:control_collection s:shard1 r:core_node1 x:collection1] o.a.s.u.VersionInfo Refreshing highest value of _version_ for 65536 version buckets from index
   [junit4]   2> 1049203 INFO  (coreLoadExecutor-3570-thread-1-processing-n:127.0.0.1:43877_t_ylw%2Fvv) [n:127.0.0.1:43877_t_ylw%2Fvv c:control_collection s:shard1 r:core_node1 x:collection1] o.a.s.u.VersionInfo No terms found for _version_, cannot seed version bucket highest value from index
   [junit4]   2> 1049203 INFO  (coreLoadExecutor-3570-thread-1-processing-n:127.0.0.1:43877_t_ylw%2Fvv) [n:127.0.0.1:43877_t_ylw%2Fvv c:control_collection s:shard1 r:core_node1 x:collection1] o.a.s.u.UpdateLog Could not find max version in index or recent updates, using new clock 1527551090668601344
   [junit4]   2> 1049204 INFO  (coreLoadExecutor-3570-thread-1-processing-n:127.0.0.1:43877_t_ylw%2Fvv) [n:127.0.0.1:43877_t_ylw%2Fvv c:control_collection s:shard1 r:core_node1 x:collection1] o.a.s.u.UpdateLog Took 1.0ms to seed version buckets with highest version 1527551090668601344
   [junit4]   2> 1049204 INFO  (coreLoadExecutor-3570-thread-1-processing-n:127.0.0.1:43877_t_ylw%2Fvv) [n:127.0.0.1:43877_t_ylw%2Fvv c:control_collection s:shard1 r:core_node1 x:collection1] o.a.s.c.ZkController watch zkdir /configs/conf1
   [junit4]   2> 1049205 INFO  (coreLoadExecutor-3570-thread-1-processing-n:127.0.0.1:43877_t_ylw%2Fvv) [n:127.0.0.1:43877_t_ylw%2Fvv c:control_collection s:shard1 r:core_node1 x:collection1] o.a.s.c.CoreContainer registering core: collection1
   [junit4]   2> 1049205 INFO  (coreZkRegister-3564-thread-1-processing-r:core_node1 s:shard1 c:control_collection n:127.0.0.1:43877_t_ylw%2Fvv x:collection1) [n:127.0.0.1:43877_t_ylw%2Fvv c:control_collection s:shard1 r:core_node1 x:collection1] o.a.s.c.ZkController Register replica - core:collection1 address:http://127.0.0.1:43877/t_ylw/vv collection:control_collection shard:shard1
   [junit4]   2> 1049205 INFO  (coreZkRegister-3564-thread-1-processing-r:core_node1 s:shard1 c:control_collection n:127.0.0.1:43877_t_ylw%2Fvv x:collection1) [n:127.0.0.1:43877_t_ylw%2Fvv c:control_collection s:shard1 r:core_node1 x:collection1] o.a.s.c.c.SolrZkClient makePath: /collections/control_collection/leader_elect/shard1/election
   [junit4]   2> 1049207 INFO  (coreZkRegister-3564-thread-1-processing-r:core_node1 s:shard1 c:control_collection n:127.0.0.1:43877_t_ylw%2Fvv x:collection1) [n:127.0.0.1:43877_t_ylw%2Fvv c:control_collection s:shard1 r:core_node1 x:collection1] o.a.s.c.LeaderElector Joined leadership election with path: /collections/control_collection/leader_elect/shard1/election/95471943062192134-core_node1-n_0000000000
   [junit4]   2> 1049207 INFO  (coreZkRegister-3564-thread-1-processing-r:core_node1 s:shard1 c:control_collection n:127.0.0.1:43877_t_ylw%2Fvv x:collection1) [n:127.0.0.1:43877_t_ylw%2Fvv c:control_collection s:shard1 r:core_node1 x:collection1] o.a.s.c.ShardLeaderElectionContext Running the leader process for shard=shard1 and weAreReplacement=false and leaderVoteWait=180000
   [junit4]   2> 1049208 INFO  (coreZkRegister-3564-thread-1-processing-r:core_node1 s:shard1 c:control_collection n:127.0.0.1:43877_t_ylw%2Fvv x:collection1) [n:127.0.0.1:43877_t_ylw%2Fvv c:control_collection s:shard1 r:core_node1 x:collection1] o.a.s.c.ShardLeaderElectionContext Enough replicas found to continue.
   [junit4]   2> 1049208 INFO  (coreZkRegister-3564-thread-1-processing-r:core_node1 s:shard1 c:control_collection n:127.0.0.1:43877_t_ylw%2Fvv x:collection1) [n:127.0.0.1:43877_t_ylw%2Fvv c:control_collection s:shard1 r:core_node1 x:collection1] o.a.s.c.ShardLeaderElectionContext I may be the new leader - try and sync
   [junit4]   2> 1049208 INFO  (OverseerStateUpdate-95471943062192134-127.0.0.1:43877_t_ylw%2Fvv-n_0000000000) [n:127.0.0.1:43877_t_ylw%2Fvv    ] o.a.s.c.Overseer processMessage: queueSize: 1, message = {
   [junit4]   2>   "operation":"leader",
   [junit4]   2>   "shard":"shard1",
   [junit4]   2>   "collection":"control_collection"} current state version: 1
   [junit4]   2> 1049208 INFO  (coreZkRegister-3564-thread-1-processing-r:core_node1 s:shard1 c:control_collection n:127.0.0.1:43877_t_ylw%2Fvv x:collection1) [n:127.0.0.1:43877_t_ylw%2Fvv c:control_collection s:shard1 r:core_node1 x:collection1] o.a.s.c.SyncStrategy Sync replicas to http://127.0.0.1:43877/t_ylw/vv/collection1/
   [junit4]   2> 1049209 INFO  (coreZkRegister-3564-thread-1-processing-r:core_node1 s:shard1 c:control_collection n:127.0.0.1:43877_t_ylw%2Fvv x:collection1) [n:127.0.0.1:43877_t_ylw%2Fvv c:control_collection s:shard1 r:core_node1 x:collection1] o.a.s.c.SyncStrategy Sync Success - now sync replicas to me
   [junit4]   2> 1049209 INFO  (coreZkRegister-3564-thread-1-processing-r:core_node1 s:shard1 c:control_collection n:127.0.0.1:43877_t_ylw%2Fvv x:collection1) [n:127.0.0.1:43877_t_ylw%2Fvv c:control_collection s:shard1 r:core_node1 x:collection1] o.a.s.c.SyncStrategy http://127.0.0.1:43877/t_ylw/vv/collection1/ has no replicas
   [junit4]   2> 1049209 INFO  (coreZkRegister-3564-thread-1-processing-r:core_node1 s:shard1 c:control_collection n:127.0.0.1:43877_t_ylw%2Fvv x:collection1) [n:127.0.0.1:43877_t_ylw%2Fvv c:control_collection s:shard1 r:core_node1 x:collection1] o.a.s.c.c.SolrZkClient makePath: /collections/control_collection/leaders/shard1
   [junit4]   2> 1049210 INFO  (coreZkRegister-3564-thread-1-processing-r:core_node1 s:shard1 c:control_collection n:127.0.0.1:43877_t_ylw%2Fvv x:collection1) [n:127.0.0.1:43877_t_ylw%2Fvv c:control_collection s:shard1 r:core_node1 x:collection1] o.a.s.c.ShardLeaderElectionContextBase Creating leader registration node
   [junit4]   2> 1049211 INFO  (coreZkRegister-3564-thread-1-processing-r:core_node1 s:shard1 c:control_collection n:127.0.0.1:43877_t_ylw%2Fvv x:collection1) [n:127.0.0.1:43877_t_ylw%2Fvv c:control_collection s:shard1 r:core_node1 x:collection1] o.a.s.c.ShardLeaderElectionContext I am the new leader: http://127.0.0.1:43877/t_ylw/vv/collection1/ shard1
   [junit4]   2> 1049211 INFO  (OverseerStateUpdate-95471943062192134-127.0.0.1:43877_t_ylw%2Fvv-n_0000000000) [n:127.0.0.1:43877_t_ylw%2Fvv    ] o.a.s.c.Overseer processMessage: queueSize: 1, message = {
   [junit4]   2>   "operation":"leader",
   [junit4]   2>   "shard":"shard1",
   [junit4]   2>   "collection":"control_collection",
   [junit4]   2>   "base_url":"http://127.0.0.1:43877/t_ylw/vv",
   [junit4]   2>   "core":"collection1",
   [junit4]   2>   "state":"active"} current state version: 1
   [junit4]   2> 1049313 INFO  (zkCallback-2788-thread-1-processing-n:127.0.0.1:43877_t_ylw%2Fvv) [n:127.0.0.1:43877_t_ylw%2Fvv    ] o.a.s.c.c.ZkStateReader A cluster state change: [WatchedEvent state:SyncConnected type:NodeDataChanged path:/clusterstate.json], has occurred - updating... (live nodes size: [1])
   [junit4]   2> 1049362 INFO  (coreZkRegister-3564-thread-1-processing-r:core_node1 s:shard1 c:control_collection n:127.0.0.1:43877_t_ylw%2Fvv x:collection1) [n:127.0.0.1:43877_t_ylw%2Fvv c:control_collection s:shard1 r:core_node1 x:collection1] o.a.s.c.ZkController We are http://127.0.0.1:43877/t_ylw/vv/collection1/ and leader is http://127.0.0.1:43877/t_ylw/vv/collection1/
   [junit4]   2> 1049362 INFO  (coreZkRegister-3564-thread-1-processing-r:core_node1 s:shard1 c:control_collection n:127.0.0.1:43877_t_ylw%2Fvv x:collection1) [n:127.0.0.1:43877_t_ylw%2Fvv c:control_collection s:shard1 r:core_node1 x:collection1] o.a.s.c.ZkController No LogReplay needed for core=collection1 baseURL=http://127.0.0.1:43877/t_ylw/vv
   [junit4]   2> 1049362 INFO  (coreZkRegister-3564-thread-1-processing-r:core_node1 s:shard1 c:control_collection n:127.0.0.1:43877_t_ylw%2Fvv x:collection1) [n:127.0.0.1:43877_t_ylw%2Fvv c:control_collection s:shard1 r:core_node1 x:collection1] o.a.s.c.ZkController I am the leader, no recovery necessary
   [junit4]   2> 1049362 INFO  (coreZkRegister-3564-thread-1-processing-r:core_node1 s:shard1 c:control_collection n:127.0.0.1:43877_t_ylw%2Fvv x:collection1) [n:127.0.0.1:43877_t_ylw%2Fvv c:control_collection s:shard1 r:core_node1 x:collection1] o.a.s.c.ZkController publishing state=active
   [junit4]   2> 1049362 INFO  (coreZkRegister-3564-thread-1-processing-r:core_node1 s:shard1 c:control_collection n:127.0.0.1:43877_t_ylw%2Fvv x:collection1) [n:127.0.0.1:43877_t_ylw%2Fvv c:control_collection s:shard1 r:core_node1 x:collection1] o.a.s.c.ZkController numShards not found on descriptor - reading it from system property
   [junit4]   2> 1049363 INFO  (OverseerStateUpdate-95471943062192134-127.0.0.1:43877_t_ylw%2Fvv-n_0000000000) [n:127.0.0.1:43877_t_ylw%2Fvv    ] o.a.s.c.Overseer processMessage: queueSize: 1, message = {
   [junit4]   2>   "roles":null,
   [junit4]   2>   "state":"active",
   [junit4]   2>   "base_url":"http://127.0.0.1:43877/t_ylw/vv",
   [junit4]   2>   "operation":"state",
   [junit4]   2>   "shard":"shard1",
   [junit4]   2>   "collection":"control_collection",
   [junit4]   2>   "node_name":"127.0.0.1:43877_t_ylw%2Fvv",
   [junit4]   2>   "numShards":"1",
   [junit4]   2>   "core":"collection1",
   [junit4]   2>   "core_node_name":"core_node1"} current state version: 2
   [junit4]   2> 1049363 INFO  (OverseerStateUpdate-95471943062192134-127.0.0.1:43877_t_ylw%2Fvv-n_0000000000) [n:127.0.0.1:43877_t_ylw%2Fvv    ] o.a.s.c.o.ReplicaMutator Update state numShards=1 message={
   [junit4]   2>   "roles":null,
   [junit4]   2>   "state":"active",
   [junit4]   2>   "base_url":"http://127.0.0.1:43877/t_ylw/vv",
   [junit4]   2>   "operation":"state",
   [junit4]   2>   "shard":"shard1",
   [junit4]   2>   "collection":"control_collection",
   [junit4]   2>   "node_name":"127.0.0.1:43877_t_ylw%2Fvv",
   [junit4]   2>   "numShards":"1",
   [junit4]   2>   "core":"collection1",
   [junit4]   2>   "core_node_name":"core_node1"}
   [junit4]   2> 1049367 INFO  (TEST-CollectionsAPIDistributedZkTest.test-seed#[9904A45616232EF2]) [    ] o.a.s.c.c.SolrZkClient Using default ZkCredentialsProvider
   [junit4]   2> 1049368 INFO  (TEST-CollectionsAPIDistributedZkTest.test-seed#[9904A45616232EF2]) [    ] o.a.s.c.c.ConnectionManager Waiting for client to connect to ZooKeeper
   [junit4]   2> 1049369 INFO  (zkCallback-2790-thread-1) [    ] o.a.s.c.c.ConnectionManager Watcher org.apache.solr.common.cloud.ConnectionManager@939c9f name:ZooKeeperConnection Watcher:127.0.0.1:53313/solr got event WatchedEvent state:SyncConnected type:None path:null path:null type:None
   [junit4]   2> 1049369 INFO  (TEST-CollectionsAPIDistributedZkTest.test-seed#[9904A45616232EF2]) [    ] o.a.s.c.c.ConnectionManager Client is connected to ZooKeeper
   [junit4]   2> 1049369 INFO  (TEST-CollectionsAPIDistributedZkTest.test-seed#[9904A45616232EF2]) [    ] o.a.s.c.c.SolrZkClient Using default ZkACLProvider
   [junit4]   2> 1049369 INFO  (TEST-CollectionsAPIDistributedZkTest.test-seed#[9904A45616232EF2]) [    ] o.a.s.c.c.ZkStateReader Updating cluster state from ZooKeeper... 
   [junit4]   2> 1049371 INFO  (TEST-CollectionsAPIDistributedZkTest.test-seed#[9904A45616232EF2]) [    ] o.a.s.c.ChaosMonkey monkey: init - expire sessions:false cause connection loss:false
   [junit4]   2> 1049371 INFO  (TEST-CollectionsAPIDistributedZkTest.test-seed#[9904A45616232EF2]) [    ] o.a.s.c.AbstractFullDistribZkTestBase Creating collection1 with stateFormat=2
   [junit4]   2> 1049371 INFO  (TEST-CollectionsAPIDistributedZkTest.test-seed#[9904A45616232EF2]) [    ] o.a.s.c.c.SolrZkClient Using default ZkCredentialsProvider
   [junit4]   2> 1049371 INFO  (TEST-CollectionsAPIDistributedZkTest.test-seed#[9904A45616232EF2]) [    ] o.a.s.c.c.ConnectionManager Waiting for client to connect to ZooKeeper
   [junit4]   2> 1049372 INFO  (zkCallback-2791-thread-1) [    ] o.a.s.c.c.ConnectionManager Watcher org.apache.solr.common.cloud.ConnectionManager@153af8e name:ZooKeeperConnection Watcher:127.0.0.1:53313/solr got event WatchedEvent state:SyncConnected type:None path:null path:null type:None
   [junit4]   2> 1049372 INFO  (TEST-CollectionsAPIDistributedZkTest.test-seed#[9904A45616232EF2]) [    ] o.a.s.c.c.ConnectionManager Client is connected to ZooKeeper
   [junit4]   2> 1049372 INFO  (TEST-CollectionsAPIDistributedZkTest.test-seed#[9904A45616232EF2]) [    ] o.a.s.c.c.SolrZkClient Using default ZkACLProvider
   [junit4]   2> 1049373 INFO  (OverseerStateUpdate-95471943062192134-127.0.0.1:43877_t_ylw%2Fvv-n_0000000000) [n:127.0.0.1:43877_t_ylw%2Fvv    ] o.a.s.c.Overseer processMessage: queueSize: 1, message = {
   [junit4]   2>   "operation":"create",
   [junit4]   2>   "name":"collection1",
   [junit4]   2>   "numShards":"2",
   [junit4]   2>   "stateFormat":"2"} current state version: 2
   [junit4]   2> 1049373 INFO  (OverseerStateUpdate-95471943062192134-127.0.0.1:43877_t_ylw%2Fvv-n_0000000000) [n:127.0.0.1:43877_t_ylw%2Fvv    ] o.a.s.c.o.ClusterStateMutator building a new cName: collection1
   [junit4]   2> 1049374 INFO  (zkCallback-2790-thread-1) [    ] o.a.s.c.c.ZkStateReader A cluster state change: [WatchedEvent state:SyncConnected type:NodeDataChanged path:/clusterstate.json], has occurred - updating... (live nodes size: [1])
   [junit4]   2> 1049374 INFO  (zkCallback-2788-thread-1-processing-n:127.0.0.1:43877_t_ylw%2Fvv) [n:127.0.0.1:43877_t_ylw%2Fvv    ] o.a.s.c.c.ZkStateReader A cluster state change: [WatchedEvent state:SyncConnected type:NodeDataChanged path:/clusterstate.json], has occurred - updating... (live nodes size: [1])
   [junit4]   2> 1049443 INFO  (TEST-CollectionsAPIDistributedZkTest.test-seed#[9904A45616232EF2]) [    ] o.a.s.SolrTestCaseJ4 Writing core.properties file to /home/jenkins/workspace/Lucene-Solr-5.5-Linux/solr/build/solr-core/test/J2/temp/solr.cloud.CollectionsAPIDistributedZkTest_9904A45616232EF2-001/shard-1-001/cores/collection1
   [junit4]   2> 1049443 INFO  (TEST-CollectionsAPIDistributedZkTest.test-seed#[9904A45616232EF2]) [    ] o.a.s.c.AbstractFullDistribZkTestBase create jetty 1 in directory /home/jenkins/workspace/Lucene-Solr-5.5-Linux/solr/build/solr-core/test/J2/temp/solr.cloud.CollectionsAPIDistributedZkTest_9904A45616232EF2-001/shard-1-001
   [junit4]   2> 1049444 INFO  (TEST-CollectionsAPIDistributedZkTest.test-seed#[9904A45616232EF2]) [    ] o.e.j.s.Server jetty-9.2.13.v20150730
   [junit4]   2> 1049445 INFO  (TEST-CollectionsAPIDistributedZkTest.test-seed#[9904A45616232EF2]) [    ] o.e.j.s.h.ContextHandler Started o.e.j.s.ServletContextHandler@353ae1{/t_ylw/vv,null,AVAILABLE}
   [junit4]   2> 1049446 INFO  (TEST-CollectionsAPIDistributedZkTest.test-seed#[9904A45616232EF2]) [    ] o.e.j.s.ServerConnector Started ServerConnector@fb1f3c{HTTP/1.1}{127.0.0.1:52486}
   [junit4]   2> 1049446 INFO  (TEST-CollectionsAPIDistributedZkTest.test-seed#[9904A45616232EF2]) [    ] o.e.j.s.Server Started @1050543ms
   [junit4]   2> 1049446 INFO  (TEST-CollectionsAPIDistributedZkTest.test-seed#[9904A45616232EF2]) [    ] o.a.s.c.s.e.JettySolrRunner Jetty properties: {solr.data.dir=/home/jenkins/workspace/Lucene-Solr-5.5-Linux/solr/build/solr-core/test/J2/temp/solr.cloud.CollectionsAPIDistributedZkTest_9904A45616232EF2-001/tempDir-001/jetty1, hostContext=/t_ylw/vv, coreRootDirectory=/home/jenkins/workspace/Lucene-Solr-5.5-Linux/solr/build/solr-core/test/J2/../../../../../../../../../home/jenkins/workspace/Lucene-Solr-5.5-Linux/solr/build/solr-core/test/J2/temp/solr.cloud.CollectionsAPIDistributedZkTest_9904A45616232EF2-001/shard-1-001/cores, solrconfig=solrconfig.xml, hostPort=52486}
   [junit4]   2> 1049446 INFO  (TEST-CollectionsAPIDistributedZkTest.test-seed#[9904A45616232EF2]) [    ] o.a.s.s.SolrDispatchFilter SolrDispatchFilter.init(): sun.misc.Launcher$AppClassLoader@1482747
   [junit4]   2> 1049446 INFO  (TEST-CollectionsAPIDistributedZkTest.test-seed#[9904A45616232EF2]) [    ] o.a.s.c.SolrResourceLoader new SolrResourceLoader for directory: '/home/jenkins/workspace/Lucene-Solr-5.5-Linux/solr/build/solr-core/test/J2/temp/solr.cloud.CollectionsAPIDistributedZkTest_9904A45616232EF2-001/shard-1-001'
   [junit4]   2> 1049446 INFO  (TEST-CollectionsAPIDistributedZkTest.test-seed#[9904A45616232EF2]) [    ] o.a.s.c.SolrResourceLoader JNDI not configured for solr (NoInitialContextEx)
   [junit4]   2> 1049446 INFO  (TEST-CollectionsAPIDistributedZkTest.test-seed#[9904A45616232EF2]) [    ] o.a.s.c.SolrResourceLoader solr home defaulted to 'solr/' (could not find system property or JNDI)
   [junit4]   2> 1049446 INFO  (TEST-CollectionsAPIDistributedZkTest.test-seed#[9904A45616232EF2]) [    ] o.a.s.c.c.SolrZkClient Using default ZkCredentialsProvider
   [junit4]   2> 1049447 INFO  (TEST-CollectionsAPIDistributedZkTest.test-seed#[9904A45616232EF2]) [    ] o.a.s.c.c.ConnectionManager Waiting for client to connect to ZooKeeper
   [junit4]   2> 1049448 INFO  (zkCallback-2792-thread-1) [    ] o.a.s.c.c.ConnectionManager Watcher org.apache.solr.common.cloud.ConnectionManager@1ba659d name:ZooKeeperConnection Watcher:127.0.0.1:53313/solr got event WatchedEvent state:SyncConnected type:None path:null path:null type:None
   [junit4]   2> 1049448 INFO  (TEST-CollectionsAPIDistributedZkTest.test-seed#[9904A45616232EF2]) [    ] o.a.s.c.c.ConnectionManager Client is connected to ZooKeeper
   [junit4]   2> 1049448 INFO  (TEST-CollectionsAPIDistributedZkTest.test-seed#[9904A45616232EF2]) [    ] o.a.s.c.c.SolrZkClient Using default ZkACLProvider
   [junit4]   2> 1049449 INFO  (TEST-CollectionsAPIDistributedZkTest.test-seed#[9904A45616232EF2]) [    ] o.a.s.s.SolrDispatchFilter Loading solr.xml from SolrHome (not found in ZooKeeper)
   [junit4]   2> 1049449 INFO  (TEST-CollectionsAPIDistributedZkTest.test-seed#[9904A45616232EF2]) [    ] o.a.s.c.SolrXmlConfig Loading container configuration from /home/jenkins/workspace/Lucene-Solr-5.5-Linux/solr/build/solr-core/test/J2/temp/solr.cloud.CollectionsAPIDistributedZkTest_9904A45616232EF2-001/shard-1-001/solr.xml
   [junit4]   2> 1049467 INFO  (TEST-CollectionsAPIDistributedZkTest.test-seed#[9904A45616232EF2]) [    ] o.a.s.c.CorePropertiesLocator Config-defined core root directory: /home/jenkins/workspace/Lucene-Solr-5.5-Linux/solr/build/solr-core/test/J2/../../../../../../../../../home/jenkins/workspace/Lucene-Solr-5.5-Linux/solr/build/solr-core/test/J2/temp/solr.cloud.CollectionsAPIDistributedZkTest_9904A45616232EF2-001/shard-1-001/cores
   [junit4]   2> 1049467 INFO  (TEST-CollectionsAPIDistributedZkTest.test-seed#[9904A45616232EF2]) [    ] o.a.s.c.CoreContainer New CoreContainer 12854716
   [junit4]   2> 1049467 INFO  (TEST-CollectionsAPIDistributedZkTest.test-seed#[9904A45616232EF2]) [    ] o.a.s.c.CoreContainer Loading cores into CoreContainer [instanceDir=/home/jenkins/workspace/Lucene-Solr-5.5-Linux/solr/build/solr-core/test/J2/temp/solr.cloud.CollectionsAPIDistributedZkTest_9904A45616232EF2-001/shard-1-001]
   [junit4]   2> 1049467 WARN  (TEST-CollectionsAPIDistributedZkTest.test-seed#[9904A45616232EF2]) [    ] o.a.s.c.CoreContainer Couldn't add files from /home/jenkins/workspace/Lucene-Solr-5.5-Linux/solr/build/solr-core/test/J2/temp/solr.cloud.CollectionsAPIDistributedZkTest_9904A45616232EF2-001/shard-1-001/lib to classpath: /home/jenkins/workspace/Lucene-Solr-5.5-Linux/solr/build/solr-core/test/J2/temp/solr.cloud.CollectionsAPIDistributedZkTest_9904A45616232EF2-001/shard-1-001/lib
   [junit4]   2> 1049467 INFO  (TEST-CollectionsAPIDistributedZkTest.test-seed#[9904A45616232EF2]) [    ] o.a.s.h.c.HttpShardHandlerFactory created with socketTimeout : 90000,urlScheme : ,connTimeout : 15000,maxConnectionsPerHost : 20,maxConnections : 10000,corePoolSize : 0,maximumPoolSize : 2147483647,maxThreadIdleTime : 5,sizeOfQueue : -1,fairnessPolicy : false,useRetries : false,
   [junit4]   2> 1049469 INFO  (TEST-CollectionsAPIDistributedZkTest.test-seed#[9904A45616232EF2]) [    ] o.a.s.u.UpdateShardHandler Creating UpdateShardHandler HTTP client with params: socketTimeout=340000&connTimeout=45000&retry=true
   [junit4]   2> 1049469 INFO  (TEST-CollectionsAPIDistributedZkTest.test-seed#[9904A45616232EF2]) [    ] o.a.s.l.LogWatcher SLF4J impl is org.slf4j.impl.Log4jLoggerFactory
   [junit4]   2> 1049469 INFO  (TEST-CollectionsAPIDistributedZkTest.test-seed#[9904A45616232EF2]) [    ] o.a.s.l.LogWatcher Registering Log Listener [Log4j (org.slf4j.impl.Log4jLoggerFactory)]
   [junit4]   2> 1049469 INFO  (TEST-CollectionsAPIDistributedZkTest.test-seed#[9904A45616232EF2]) [    ] o.a.s.c.ZkContainer Zookeeper client=127.0.0.1:53313/solr
   [junit4]   2> 1049469 INFO  (TEST-CollectionsAPIDistributedZkTest.test-seed#[9904A45616232EF2]) [    ] o.a.s.c.ZkController zkHost includes chroot
   [junit4]   2> 1049469 INFO  (TEST-CollectionsAPIDistributedZkTest.test-seed#[9904A45616232EF2]) [    ] o.a.s.c.c.SolrZkClient Using default ZkCredentialsProvider
   [junit4]   2> 1049470 INFO  (TEST-CollectionsAPIDistributedZkTest.test-seed#[9904A45616232EF2]) [    ] o.a.s.c.c.ConnectionManager Waiting for client to connect to ZooKeeper
   [junit4]   2> 1049471 INFO  (zkCallback-2795-thread-1) [    ] o.a.s.c.c.ConnectionManager Watcher org.apache.solr.common.cloud.ConnectionManager@f6f053 name:ZooKeeperConnection Watcher:127.0.0.1:53313 got event WatchedEvent state:SyncConnected type:None path:null path:null type:None
   [junit4]   2> 1049471 INFO  (TEST-CollectionsAPIDistributedZkTest.test-seed#[9904A45616232EF2]) [    ] o.a.s.c.c.ConnectionManager Client is connected to ZooKeeper
   [junit4]   2> 1049472 INFO  (TEST-CollectionsAPIDistributedZkTest.test-seed#[9904A45616232EF2]) [    ] o.a.s.c.c.SolrZkClient Using default ZkACLProvider
   [junit4]   2> 1049472 INFO  (TEST-CollectionsAPIDistributedZkTest.test-seed#[9904A45616232EF2]) [n:127.0.0.1:52486_t_ylw%2Fvv    ] o.a.s.c.c.ConnectionManager Waiting for client to connect to ZooKeeper
   [junit4]   2> 1049473 INFO  (zkCallback-2796-thread-1-processing-n:127.0.0.1:52486_t_ylw%2Fvv) [n:127.0.0.1:52486_t_ylw%2Fvv    ] o.a.s.c.c.ConnectionManager Watcher org.apache.solr.common.cloud.ConnectionManager@c86e4d name:ZooKeeperConnection Watcher:127.0.0.1:53313/solr got event WatchedEvent state:SyncConnected type:None path:null path:null type:None
   [junit4]   2> 1049473 INFO  (TEST-CollectionsAPIDistributedZkTest.test-seed#[9904A45616232EF2]) [n:127.0.0.1:52486_t_ylw%2Fvv    ] o.a.s.c.c.ConnectionManager Client is connected to ZooKeeper
   [junit4]   2> 1049476 INFO  (TEST-CollectionsAPIDistributedZkTest.test-seed#[9904A45616232EF2]) [n:127.0.0.1:52486_t_ylw%2Fvv    ] o.a.s.c.c.ZkStateReader Updating cluster state from ZooKeeper... 
   [junit4]   2> 1049477 INFO  (OverseerStateUpdate-95471943062192134-127.0.0.1:43877_t_ylw%2Fvv-n_0000000000) [n:127.0.0.1:43877_t_ylw%2Fvv    ] o.a.s.c.o.ZkStateWriter going to create_collection /collections/collection1/state.json
   [junit4]   2> 1050479 INFO  (TEST-CollectionsAPIDistributedZkTest.test-seed#[9904A45616232EF2]) [n:127.0.0.1:52486_t_ylw%2Fvv    ] o.a.s.c.ZkController Register node as live in ZooKeeper:/live_nodes/127.0.0.1:52486_t_ylw%2Fvv
   [junit4]   2> 1050480 INFO  (TEST-CollectionsAPIDistributedZkTest.test-seed#[9904A45616232EF2]) [n:127.0.0.1:52486_t_ylw%2Fvv    ] o.a.s.c.c.SolrZkClient makePath: /live_nodes/127.0.0.1:52486_t_ylw%2Fvv
   [junit4]   2> 1050480 INFO  (zkCallback-2796-thread-1-processing-n:127.0.0.1:52486_t_ylw%2Fvv) [n:127.0.0.1:52486_t_ylw%2Fvv    ] o.a.s.c.c.ZkStateReader A live node change: [WatchedEvent state:SyncConnected type:NodeChildrenChanged path:/live_nodes], has occurred - updating... (live nodes size: [1])
   [junit4]   2> 1050480 INFO  (zkCallback-2788-thread-1-processing-n:127.0.0.1:43877_t_ylw%2Fvv) [n:127.0.0.1:43877_t_ylw%2Fvv    ] o.a.s.c.c.ZkStateReader A live node change: [WatchedEvent state:SyncConnected type:NodeChildrenChanged path:/live_nodes], has occurred - updating... (live nodes size: [1])
   [junit4]   2> 1050480 INFO  (zkCallback-2790-thread-1) [    ] o.a.s.c.c.ZkStateReader A live node change: [WatchedEvent state:SyncConnected type:NodeChildrenChanged path:/live_nodes], has occurred - updating... (live nodes size: [1])
   [junit4]   2> 1050481 INFO  (TEST-CollectionsAPIDistributedZkTest.test-seed#[9904A45616232EF2]) [n:127.0.0.1:52486_t_ylw%2Fvv    ] o.a.s.c.Overseer Overseer (id=null) closing
   [junit4]   2> 1050482 INFO  (TEST-CollectionsAPIDistributedZkTest.test-seed#[9904A45616232EF2]) [n:127.0.0.1:52486_t_ylw%2Fvv    ] o.a.s.c.LeaderElector Joined leadership election with path: /overseer_elect/election/95471943062192139-127.0.0.1:52486_t_ylw%2Fvv-n_0000000001
   [junit4]   2> 1050482 INFO  (TEST-CollectionsAPIDistributedZkTest.test-seed#[9904A45616232EF2]) [n:127.0.0.1:52486_t_ylw%2Fvv    ] o.a.s.c.LeaderElector Watching path /overseer_elect/election/95471943062192134-127.0.0.1:43877_t_ylw%2Fvv-n_0000000000 to know if I could be the leader
   [junit4]   2> 1050525 INFO  (TEST-CollectionsAPIDistributedZkTest.test-seed#[9904A45616232EF2]) [n:127.0.0.1:52486_t_ylw%2Fvv    ] o.a.s.c.CoreContainer Security conf doesn't exist. Skipping setup for authorization module.
   [junit4]   2> 1050525 INFO  (TEST-CollectionsAPIDistributedZkTest.test-seed#[9904A45616232EF2]) [n:127.0.0.1:52486_t_ylw%2Fvv    ] o.a.s.c.CoreContainer No authentication plugin used.
   [junit4]   2> 1050526 INFO  (TEST-CollectionsAPIDistributedZkTest.test-seed#[9904A45616232EF2]) [n:127.0.0.1:52486_t_ylw%2Fvv    ] o.a.s.c.CorePropertiesLocator Looking for core definitions underneath /home/jenkins/workspace/Lucene-Solr-5.5-Linux/solr/build/solr-core/test/J2/../../../../../../../../../home/jenkins/workspace/Lucene-Solr-5.5-Linux/solr/build/solr-core/test/J2/temp/solr.cloud.CollectionsAPIDistributedZkTest_9904A45616232EF2-001/shard-1-001/cores
   [junit4]   2> 1050526 INFO  (TEST-CollectionsAPIDistributedZkTest.test-seed#[9904A45616232EF2]) [n:127.0.0.1:52486_t_ylw%2Fvv    ] o.a.s.c.CoreDescriptor Created CoreDescriptor: {loadOnStartup=true, dataDir=data/, name=collection1, coreNodeName=, transient=false, collection=collection1, configSetProperties=configsetprops.json, shard=, schema=schema.xml, config=solrconfig.xml}
   [junit4]   2> 1050526 INFO  (TEST-CollectionsAPIDistributedZkTest.test-seed#[9904A45616232EF2]) [n:127.0.0.1:52486_t_ylw%2Fvv    ] o.a.s.c.CorePropertiesLocator Found core collection1 in /home/jenkins/workspace/Lucene-Solr-5.5-Linux/solr/build/solr-core/test/J2/../../../../../../../../../home/jenkins/workspace/Lucene-Solr-5.5-Linux/solr/build/solr-core/test/J2/temp/solr.cloud.CollectionsAPIDistributedZkTest_9904A45616232EF2-001/shard-1-001/cores/collection1
   [junit4]   2> 1050526 INFO  (TEST-CollectionsAPIDistributedZkTest.test-seed#[9904A45616232EF2]) [n:127.0.0.1:52486_t_ylw%2Fvv    ] o.a.s.c.CorePropertiesLocator Found 1 core definitions
   [junit4]   2> 1050527 INFO  (TEST-CollectionsAPIDistributedZkTest.test-seed#[9904A45616232EF2]) [n:127.0.0.1:52486_t_ylw%2Fvv    ] o.a.s.s.SolrDispatchFilter user.dir=/home/jenkins/workspace/Lucene-Solr-5.5-Linux/solr/build/solr-core/test/J2
   [junit4]   2> 1050527 INFO  (TEST-CollectionsAPIDistributedZkTest.test-seed#[9904A45616232EF2]) [n:127.0.0.1:52486_t_ylw%2Fvv    ] o.a.s.s.SolrDispatchFilter SolrDispatchFilter.init() done
   [junit4]   2> 1050527 INFO  (coreLoadExecutor-3581-thread-1-processing-n:127.0.0.1:52486_t_ylw%2Fvv) [n:127.0.0.1:52486_t_ylw%2Fvv c:collection1   x:collection1] o.a.s.c.ZkController publishing state=down
   [junit4]   2> 1050527 INFO  (coreLoadExecutor-3581-thread-1-processing-n:127.0.0.1:52486_t_ylw%2Fvv) [n:127.0.0.1:52486_t_ylw%2Fvv c:collection1   x:collection1] o.a.s.c.ZkController numShards not found on descriptor - reading it from system property
   [junit4]   2> 1050528 INFO  (coreLoadExecutor-3581-thread-1-processing-n:127.0.0.1:52486_t_ylw%2Fvv) [n:127.0.0.1:52486_t_ylw%2Fvv c:collection1   x:collection1] o.a.s.c.ZkController Registering watch for collection collection1
   [junit4]   2> 1050528 INFO  (coreLoadExecutor-3581-thread-1-processing-n:127.0.0.1:52486_t_ylw%2Fvv) [n:127.0.0.1:52486_t_ylw%2Fvv c:collection1   x:collection1] o.a.s.c.c.ZkStateReader addZkWatch [collection1]
   [junit4]   2> 1050528 INFO  (OverseerStateUpdate-95471943062192134-127.0.0.1:43877_t_ylw%2Fvv-n_0000000000) [n:127.0.0.1:43877_t_ylw%2Fvv    ] o.a.s.c.Overseer processMessage: queueSize: 1, message = {
   [junit4]   2>   "roles":null,
   [junit4]   2>   "state":"down",
   [junit4]   2>   "base_url":"http://127.0.0.1:52486/t_ylw/vv",
   [junit4]   2>   "operation":"state",
   [junit4]   2>   "shard":null,
   [junit4]   2>   "collection":"collection1",
   [junit4]   2>   "node_name":"127.0.0.1:52486_t_ylw%2Fvv",
   [junit4]   2>   "numShards":"2",
   [junit4]   2>   "core":"collection1"} current state version: 3
   [junit4]   2> 1050528 INFO  (coreLoadExecutor-3581-thread-1-processing-n:127.0.0.1:52486_t_ylw%2Fvv) [n:127.0.0.1:52486_t_ylw%2Fvv c:collection1   x:collection1] o.a.s.c.c.ZkStateReader Add data

[...truncated too long message...]

lica2/data/index;done=false>>]
   [junit4]   2> 1096903 INFO  (coreCloseExecutor-3742-thread-1) [n:127.0.0.1:46939_t_ylw%2Fvv c:nodes_used_collection s:shard1 r:core_node3 x:nodes_used_collection_shard1_replica2] o.a.s.c.CachingDirectoryFactory Closing directory: /home/jenkins/workspace/Lucene-Solr-5.5-Linux/solr/build/solr-core/test/J2/temp/solr.cloud.CollectionsAPIDistributedZkTest_9904A45616232EF2-001/shard-4-001/cores/nodes_used_collection_shard1_replica2/data/index
   [junit4]   2> 1096903 INFO  (TEST-CollectionsAPIDistributedZkTest.test-seed#[9904A45616232EF2]) [    ] o.a.s.c.Overseer Overseer (id=95471943062192153-127.0.0.1:46939_t_ylw%2Fvv-n_0000000005) closing
   [junit4]   2> 1096903 INFO  (OverseerStateUpdate-95471943062192153-127.0.0.1:46939_t_ylw%2Fvv-n_0000000005) [n:127.0.0.1:46939_t_ylw%2Fvv    ] o.a.s.c.Overseer Overseer Loop exiting : 127.0.0.1:46939_t_ylw%2Fvv
   [junit4]   2> 1096904 INFO  (zkCallback-2829-thread-3-processing-n:127.0.0.1:46939_t_ylw%2Fvv) [n:127.0.0.1:46939_t_ylw%2Fvv    ] o.a.s.c.c.ZkStateReader A live node change: [WatchedEvent state:SyncConnected type:NodeChildrenChanged path:/live_nodes], has occurred - updating... (live nodes size: [1])
   [junit4]   2> 1096904 WARN  (zkCallback-2829-thread-3-processing-n:127.0.0.1:46939_t_ylw%2Fvv) [n:127.0.0.1:46939_t_ylw%2Fvv    ] o.a.s.c.c.ZkStateReader ZooKeeper watch triggered, but Solr cannot talk to ZK: [KeeperErrorCode = Session expired for /live_nodes]
   [junit4]   2> 1096905 INFO  (TEST-CollectionsAPIDistributedZkTest.test-seed#[9904A45616232EF2]) [    ] o.e.j.s.ServerConnector Stopped ServerConnector@95357{HTTP/1.1}{127.0.0.1:46939}
   [junit4]   2> 1096910 INFO  (TEST-CollectionsAPIDistributedZkTest.test-seed#[9904A45616232EF2]) [    ] o.e.j.s.h.ContextHandler Stopped o.e.j.s.ServletContextHandler@1ea48eb{/t_ylw/vv,null,UNAVAILABLE}
   [junit4]   2> 1096911 INFO  (TEST-CollectionsAPIDistributedZkTest.test-seed#[9904A45616232EF2]) [    ] o.a.s.c.ZkTestServer connecting to 127.0.0.1:53313 53313
   [junit4]   2> 1097009 INFO  (Thread-2774) [    ] o.a.s.c.ZkTestServer connecting to 127.0.0.1:53313 53313
   [junit4]   2> 1097009 WARN  (Thread-2774) [    ] o.a.s.c.ZkTestServer Watch limit violations: 
   [junit4]   2> Maximum concurrent create/delete watches above limit:
   [junit4]   2> 
   [junit4]   2> 	9	/solr/aliases.json
   [junit4]   2> 	6	/solr/configs/conf1
   [junit4]   2> 	6	/solr/security.json
   [junit4]   2> 	6	/solr/configs/conf2
   [junit4]   2> 
   [junit4]   2> Maximum concurrent data watches above limit:
   [junit4]   2> 
   [junit4]   2> 	9	/solr/clusterstate.json
   [junit4]   2> 	6	/solr/collections/awholynewcollection_0/state.json
   [junit4]   2> 	5	/solr/collections/nodes_used_collection/state.json
   [junit4]   2> 	5	/solr/collections/collection1/state.json
   [junit4]   2> 	2	/solr/collections/awholynewcollection_0/leader_elect/shard5/election/95471943062192134-core_node8-n_0000000000
   [junit4]   2> 	2	/solr/collections/collection1/leader_elect/shard2/election/95471943062192142-core_node2-n_0000000000
   [junit4]   2> 	2	/solr/collections/nodes_used_collection/leader_elect/shard1/election/95471943062192142-core_node1-n_0000000000
   [junit4]   2> 	2	/solr/overseer_elect/election/95471943062192145-127.0.0.1:34993_t_ylw%2Fvv-n_0000000003
   [junit4]   2> 
   [junit4]   2> Maximum concurrent children watches above limit:
   [junit4]   2> 
   [junit4]   2> 	9	/solr/collections
   [junit4]   2> 	8	/solr/live_nodes
   [junit4]   2> 	5	/solr/overseer/queue
   [junit4]   2> 	5	/solr/overseer/collection-queue-work
   [junit4]   2> 	2	/solr/overseer/queue-work
   [junit4]   2> 
   [junit4]   2> NOTE: reproduce with: ant test  -Dtestcase=CollectionsAPIDistributedZkTest -Dtests.method=test -Dtests.seed=9904A45616232EF2 -Dtests.multiplier=3 -Dtests.slow=true -Dtests.locale=zh-HK -Dtests.timezone=Europe/Nicosia -Dtests.asserts=true -Dtests.file.encoding=UTF-8
   [junit4] FAILURE 49.4s J2 | CollectionsAPIDistributedZkTest.test <<<
   [junit4]    > Throwable #1: java.lang.AssertionError: expected:<3> but was:<2>
   [junit4]    > 	at __randomizedtesting.SeedInfo.seed([9904A45616232EF2:11509B8CB8DF430A]:0)
   [junit4]    > 	at org.apache.solr.cloud.CollectionsAPIDistributedZkTest.testCollectionsAPI(CollectionsAPIDistributedZkTest.java:800)
   [junit4]    > 	at org.apache.solr.cloud.CollectionsAPIDistributedZkTest.test(CollectionsAPIDistributedZkTest.java:160)
   [junit4]    > 	at org.apache.solr.BaseDistributedSearchTestCase$ShardsRepeatRule$ShardsFixedStatement.callStatement(BaseDistributedSearchTestCase.java:964)
   [junit4]    > 	at org.apache.solr.BaseDistributedSearchTestCase$ShardsRepeatRule$ShardsStatement.evaluate(BaseDistributedSearchTestCase.java:939)
   [junit4]    > 	at java.lang.Thread.run(Thread.java:745)
   [junit4]   2> 1097012 INFO  (SUITE-CollectionsAPIDistributedZkTest-seed#[9904A45616232EF2]-worker) [    ] o.a.s.SolrTestCaseJ4 ###deleteCore
   [junit4]   2> NOTE: leaving temporary files on disk at: /home/jenkins/workspace/Lucene-Solr-5.5-Linux/solr/build/solr-core/test/J2/temp/solr.cloud.CollectionsAPIDistributedZkTest_9904A45616232EF2-001
   [junit4]   2> Feb 29, 2016 10:51:29 PM com.carrotsearch.randomizedtesting.ThreadLeakControl checkThreadLeaks
   [junit4]   2> WARNING: Will linger awaiting termination of 1 leaked thread(s).
   [junit4]   2> NOTE: test params are: codec=Asserting(Lucene54): {range_facet_l=PostingsFormat(name=LuceneVarGapDocFreqInterval), other_tl1=PostingsFormat(name=LuceneVarGapDocFreqInterval), range_facet_i_dv=PostingsFormat(name=LuceneVarGapDocFreqInterval), range_facet_l_dv=BlockTreeOrds(blocksize=128), multiDefault=PostingsFormat(name=Asserting), _version_=PostingsFormat(name=LuceneVarGapDocFreqInterval), text=Lucene50(blocksize=128), id=BlockTreeOrds(blocksize=128), a_t=PostingsFormat(name=LuceneVarGapDocFreqInterval), a_i1=PostingsFormat(name=LuceneVarGapDocFreqInterval), intDefault=PostingsFormat(name=LuceneVarGapDocFreqInterval), timestamp=PostingsFormat(name=LuceneVarGapDocFreqInterval)}, docValues:{range_facet_i_dv=DocValuesFormat(name=Direct), range_facet_l_dv=DocValuesFormat(name=Lucene54), timestamp=DocValuesFormat(name=Direct)}, sim=RandomSimilarity(queryNorm=false,coord=no): {}, locale=zh-HK, timezone=Europe/Nicosia
   [junit4]   2> NOTE: Linux 3.19.0-51-generic i386/Oracle Corporation 1.7.0_80 (32-bit)/cpus=12,threads=1,free=300153960,total=462159872
   [junit4]   2> NOTE: All tests run in this JVM: [RequestLoggingTest, BadComponentTest, TestSearcherReuse, DeleteLastCustomShardedReplicaTest, TestLRUStatsCache, TestPerFieldSimilarityWithDefaultOverride, HighlighterMaxOffsetTest, TestSuggestSpellingConverter, TestGroupingSearch, DirectoryFactoryTest, TestMiniSolrCloudCluster, TestSolrIndexConfig, IgnoreCommitOptimizeUpdateProcessorFactoryTest, DistributedFacetPivotSmallAdvancedTest, ScriptEngineTest, CurrencyFieldXmlFileTest, TestFastWriter, TestExtendedDismaxParser, TestIndexingPerformance, TestShortCircuitedRequests, TestConfigSetProperties, TestSolrConfigHandlerCloud, HdfsUnloadDistributedZkTest, SampleTest, AssignTest, TestCloudManagedSchemaConcurrent, TestTrieFacet, SimpleFacetsTest, SecurityConfHandlerTest, TestElisionMultitermQuery, RecoveryZkTest, SuggesterTest, FacetPivotSmallTest, TestAuthorizationFramework, TestMaxScoreQueryParser, DateRangeFieldTest, SolrTestCaseJ4Test, ForceLeaderTest, TestReversedWildcardFilterFactory, CollectionReloadTest, NoCacheHeaderTest, TestPostingsSolrHighlighter, BJQParserTest, HdfsNNFailoverTest, HLLSerializationTest, SolrCloudExampleTest, SortSpecParsingTest, SuggesterWFSTTest, TestSolrDeletionPolicy1, QueryResultKeyTest, DeleteStatusTest, TestUseDocValuesAsStored2, HdfsRestartWhileUpdatingTest, DebugComponentTest, TestSolrQueryParserResource, TestMacros, TestMiniSolrCloudClusterSSL, LeaderElectionTest, SpatialRPTFieldTypeTest, TestHdfsUpdateLog, BlockJoinFacetSimpleTest, ReplicationFactorTest, CircularListTest, TestCryptoKeys, TestObjectReleaseTracker, OverseerTaskQueueTest, TestOverriddenPrefixQueryForCustomFieldType, AutoCommitTest, ClusterStateTest, DateMathParserTest, PrimitiveFieldTypeTest, TestSolrJ, DistribJoinFromCollectionTest, TestClusterStateMutator, DocValuesMultiTest, BadIndexSchemaTest, TestTestInjection, TestSchemaNameResource, TestSha256AuthenticationProvider, RegexBoostProcessorTest, StatelessScriptUpdateProcessorFactoryTest, CoreAdminHandlerTest, TestExclusionRuleCollectionAccess, DirectSolrConnectionTest, TestMinMaxOnMultiValuedField, TestStressRecovery, BasicDistributedZk2Test, MultiThreadedOCPTest, TestSolrQueryParser, TestFreeTextSuggestions, TestCharFilters, CollectionsAPIDistributedZkTest]
   [junit4] Completed [286/566 (1!)] on J2 in 49.68s, 1 test, 1 failure <<< FAILURES!

[...truncated 866 lines...]
BUILD FAILED
/home/jenkins/workspace/Lucene-Solr-5.5-Linux/build.xml:750: The following error occurred while executing this line:
/home/jenkins/workspace/Lucene-Solr-5.5-Linux/build.xml:694: The following error occurred while executing this line:
/home/jenkins/workspace/Lucene-Solr-5.5-Linux/build.xml:59: The following error occurred while executing this line:
/home/jenkins/workspace/Lucene-Solr-5.5-Linux/solr/build.xml:233: The following error occurred while executing this line:
/home/jenkins/workspace/Lucene-Solr-5.5-Linux/solr/common-build.xml:534: The following error occurred while executing this line:
/home/jenkins/workspace/Lucene-Solr-5.5-Linux/lucene/common-build.xml:1477: The following error occurred while executing this line:
/home/jenkins/workspace/Lucene-Solr-5.5-Linux/lucene/common-build.xml:1033: There were test failures: 566 suites (7 ignored), 2277 tests, 1 failure, 84 ignored (39 assumptions) [seed: 9904A45616232EF2]

Total time: 57 minutes 25 seconds
Build step 'Invoke Ant' marked build as failure
Archiving artifacts
[WARNINGS] Skipping publisher since build result is FAILURE
Recording test results
Email was triggered for: Failure - Any
Sending email for trigger: Failure - Any



[JENKINS] Lucene-Solr-5.5-Linux (64bit/jdk1.8.0_72) - Build # 170 - Still Failing!

Posted by Policeman Jenkins Server <je...@thetaphi.de>.
Build: http://jenkins.thetaphi.de/job/Lucene-Solr-5.5-Linux/170/
Java: 64bit/jdk1.8.0_72 -XX:+UseCompressedOops -XX:+UseG1GC

3 tests failed.
FAILED:  junit.framework.TestSuite.org.apache.solr.cloud.CollectionsAPIDistributedZkTest

Error Message:
5 threads leaked from SUITE scope at org.apache.solr.cloud.CollectionsAPIDistributedZkTest:     1) Thread[id=13352, name=zkCallback-1374-thread-2, state=TIMED_WAITING, group=TGRP-CollectionsAPIDistributedZkTest]         at sun.misc.Unsafe.park(Native Method)         at java.util.concurrent.locks.LockSupport.parkNanos(LockSupport.java:215)         at java.util.concurrent.SynchronousQueue$TransferStack.awaitFulfill(SynchronousQueue.java:460)         at java.util.concurrent.SynchronousQueue$TransferStack.transfer(SynchronousQueue.java:362)         at java.util.concurrent.SynchronousQueue.poll(SynchronousQueue.java:941)         at java.util.concurrent.ThreadPoolExecutor.getTask(ThreadPoolExecutor.java:1066)         at java.util.concurrent.ThreadPoolExecutor.runWorker(ThreadPoolExecutor.java:1127)         at java.util.concurrent.ThreadPoolExecutor$Worker.run(ThreadPoolExecutor.java:617)         at java.lang.Thread.run(Thread.java:745)    2) Thread[id=7417, name=zkCallback-1374-thread-1, state=TIMED_WAITING, group=TGRP-CollectionsAPIDistributedZkTest]         at sun.misc.Unsafe.park(Native Method)         at java.util.concurrent.locks.LockSupport.parkNanos(LockSupport.java:215)         at java.util.concurrent.SynchronousQueue$TransferStack.awaitFulfill(SynchronousQueue.java:460)         at java.util.concurrent.SynchronousQueue$TransferStack.transfer(SynchronousQueue.java:362)         at java.util.concurrent.SynchronousQueue.poll(SynchronousQueue.java:941)         at java.util.concurrent.ThreadPoolExecutor.getTask(ThreadPoolExecutor.java:1066)         at java.util.concurrent.ThreadPoolExecutor.runWorker(ThreadPoolExecutor.java:1127)         at java.util.concurrent.ThreadPoolExecutor$Worker.run(ThreadPoolExecutor.java:617)         at java.lang.Thread.run(Thread.java:745)    3) Thread[id=7416, name=TEST-CollectionsAPIDistributedZkTest.test-seed#[A926803B21EF3C10]-EventThread, state=WAITING, group=TGRP-CollectionsAPIDistributedZkTest]         at sun.misc.Unsafe.park(Native Method)         at java.util.concurrent.locks.LockSupport.park(LockSupport.java:175)         at java.util.concurrent.locks.AbstractQueuedSynchronizer$ConditionObject.await(AbstractQueuedSynchronizer.java:2039)         at java.util.concurrent.LinkedBlockingQueue.take(LinkedBlockingQueue.java:442)         at org.apache.zookeeper.ClientCnxn$EventThread.run(ClientCnxn.java:494)    4) Thread[id=7415, name=TEST-CollectionsAPIDistributedZkTest.test-seed#[A926803B21EF3C10]-SendThread(127.0.0.1:44032), state=TIMED_WAITING, group=TGRP-CollectionsAPIDistributedZkTest]         at java.lang.Thread.sleep(Native Method)         at org.apache.zookeeper.ClientCnxn$SendThread.run(ClientCnxn.java:994)    5) Thread[id=13353, name=zkCallback-1374-thread-3, state=TIMED_WAITING, group=TGRP-CollectionsAPIDistributedZkTest]         at sun.misc.Unsafe.park(Native Method)         at java.util.concurrent.locks.LockSupport.parkNanos(LockSupport.java:215)         at java.util.concurrent.SynchronousQueue$TransferStack.awaitFulfill(SynchronousQueue.java:460)         at java.util.concurrent.SynchronousQueue$TransferStack.transfer(SynchronousQueue.java:362)         at java.util.concurrent.SynchronousQueue.poll(SynchronousQueue.java:941)         at java.util.concurrent.ThreadPoolExecutor.getTask(ThreadPoolExecutor.java:1066)         at java.util.concurrent.ThreadPoolExecutor.runWorker(ThreadPoolExecutor.java:1127)         at java.util.concurrent.ThreadPoolExecutor$Worker.run(ThreadPoolExecutor.java:617)         at java.lang.Thread.run(Thread.java:745)

Stack Trace:
com.carrotsearch.randomizedtesting.ThreadLeakError: 5 threads leaked from SUITE scope at org.apache.solr.cloud.CollectionsAPIDistributedZkTest: 
   1) Thread[id=13352, name=zkCallback-1374-thread-2, state=TIMED_WAITING, group=TGRP-CollectionsAPIDistributedZkTest]
        at sun.misc.Unsafe.park(Native Method)
        at java.util.concurrent.locks.LockSupport.parkNanos(LockSupport.java:215)
        at java.util.concurrent.SynchronousQueue$TransferStack.awaitFulfill(SynchronousQueue.java:460)
        at java.util.concurrent.SynchronousQueue$TransferStack.transfer(SynchronousQueue.java:362)
        at java.util.concurrent.SynchronousQueue.poll(SynchronousQueue.java:941)
        at java.util.concurrent.ThreadPoolExecutor.getTask(ThreadPoolExecutor.java:1066)
        at java.util.concurrent.ThreadPoolExecutor.runWorker(ThreadPoolExecutor.java:1127)
        at java.util.concurrent.ThreadPoolExecutor$Worker.run(ThreadPoolExecutor.java:617)
        at java.lang.Thread.run(Thread.java:745)
   2) Thread[id=7417, name=zkCallback-1374-thread-1, state=TIMED_WAITING, group=TGRP-CollectionsAPIDistributedZkTest]
        at sun.misc.Unsafe.park(Native Method)
        at java.util.concurrent.locks.LockSupport.parkNanos(LockSupport.java:215)
        at java.util.concurrent.SynchronousQueue$TransferStack.awaitFulfill(SynchronousQueue.java:460)
        at java.util.concurrent.SynchronousQueue$TransferStack.transfer(SynchronousQueue.java:362)
        at java.util.concurrent.SynchronousQueue.poll(SynchronousQueue.java:941)
        at java.util.concurrent.ThreadPoolExecutor.getTask(ThreadPoolExecutor.java:1066)
        at java.util.concurrent.ThreadPoolExecutor.runWorker(ThreadPoolExecutor.java:1127)
        at java.util.concurrent.ThreadPoolExecutor$Worker.run(ThreadPoolExecutor.java:617)
        at java.lang.Thread.run(Thread.java:745)
   3) Thread[id=7416, name=TEST-CollectionsAPIDistributedZkTest.test-seed#[A926803B21EF3C10]-EventThread, state=WAITING, group=TGRP-CollectionsAPIDistributedZkTest]
        at sun.misc.Unsafe.park(Native Method)
        at java.util.concurrent.locks.LockSupport.park(LockSupport.java:175)
        at java.util.concurrent.locks.AbstractQueuedSynchronizer$ConditionObject.await(AbstractQueuedSynchronizer.java:2039)
        at java.util.concurrent.LinkedBlockingQueue.take(LinkedBlockingQueue.java:442)
        at org.apache.zookeeper.ClientCnxn$EventThread.run(ClientCnxn.java:494)
   4) Thread[id=7415, name=TEST-CollectionsAPIDistributedZkTest.test-seed#[A926803B21EF3C10]-SendThread(127.0.0.1:44032), state=TIMED_WAITING, group=TGRP-CollectionsAPIDistributedZkTest]
        at java.lang.Thread.sleep(Native Method)
        at org.apache.zookeeper.ClientCnxn$SendThread.run(ClientCnxn.java:994)
   5) Thread[id=13353, name=zkCallback-1374-thread-3, state=TIMED_WAITING, group=TGRP-CollectionsAPIDistributedZkTest]
        at sun.misc.Unsafe.park(Native Method)
        at java.util.concurrent.locks.LockSupport.parkNanos(LockSupport.java:215)
        at java.util.concurrent.SynchronousQueue$TransferStack.awaitFulfill(SynchronousQueue.java:460)
        at java.util.concurrent.SynchronousQueue$TransferStack.transfer(SynchronousQueue.java:362)
        at java.util.concurrent.SynchronousQueue.poll(SynchronousQueue.java:941)
        at java.util.concurrent.ThreadPoolExecutor.getTask(ThreadPoolExecutor.java:1066)
        at java.util.concurrent.ThreadPoolExecutor.runWorker(ThreadPoolExecutor.java:1127)
        at java.util.concurrent.ThreadPoolExecutor$Worker.run(ThreadPoolExecutor.java:617)
        at java.lang.Thread.run(Thread.java:745)
	at __randomizedtesting.SeedInfo.seed([A926803B21EF3C10]:0)


FAILED:  junit.framework.TestSuite.org.apache.solr.cloud.CollectionsAPIDistributedZkTest

Error Message:
There are still zombie threads that couldn't be terminated:    1) Thread[id=13352, name=zkCallback-1374-thread-2, state=TIMED_WAITING, group=TGRP-CollectionsAPIDistributedZkTest]         at sun.misc.Unsafe.park(Native Method)         at java.util.concurrent.locks.LockSupport.parkNanos(LockSupport.java:215)         at java.util.concurrent.SynchronousQueue$TransferStack.awaitFulfill(SynchronousQueue.java:460)         at java.util.concurrent.SynchronousQueue$TransferStack.transfer(SynchronousQueue.java:362)         at java.util.concurrent.SynchronousQueue.poll(SynchronousQueue.java:941)         at java.util.concurrent.ThreadPoolExecutor.getTask(ThreadPoolExecutor.java:1066)         at java.util.concurrent.ThreadPoolExecutor.runWorker(ThreadPoolExecutor.java:1127)         at java.util.concurrent.ThreadPoolExecutor$Worker.run(ThreadPoolExecutor.java:617)         at java.lang.Thread.run(Thread.java:745)    2) Thread[id=7417, name=zkCallback-1374-thread-1, state=TIMED_WAITING, group=TGRP-CollectionsAPIDistributedZkTest]         at sun.misc.Unsafe.park(Native Method)         at java.util.concurrent.locks.LockSupport.parkNanos(LockSupport.java:215)         at java.util.concurrent.SynchronousQueue$TransferStack.awaitFulfill(SynchronousQueue.java:460)         at java.util.concurrent.SynchronousQueue$TransferStack.transfer(SynchronousQueue.java:362)         at java.util.concurrent.SynchronousQueue.poll(SynchronousQueue.java:941)         at java.util.concurrent.ThreadPoolExecutor.getTask(ThreadPoolExecutor.java:1066)         at java.util.concurrent.ThreadPoolExecutor.runWorker(ThreadPoolExecutor.java:1127)         at java.util.concurrent.ThreadPoolExecutor$Worker.run(ThreadPoolExecutor.java:617)         at java.lang.Thread.run(Thread.java:745)    3) Thread[id=7415, name=TEST-CollectionsAPIDistributedZkTest.test-seed#[A926803B21EF3C10]-SendThread(127.0.0.1:44032), state=TIMED_WAITING, group=TGRP-CollectionsAPIDistributedZkTest]         at java.lang.Thread.sleep(Native Method)         at org.apache.zookeeper.client.StaticHostProvider.next(StaticHostProvider.java:101)         at org.apache.zookeeper.ClientCnxn$SendThread.startConnect(ClientCnxn.java:940)         at org.apache.zookeeper.ClientCnxn$SendThread.run(ClientCnxn.java:1003)    4) Thread[id=13353, name=zkCallback-1374-thread-3, state=TIMED_WAITING, group=TGRP-CollectionsAPIDistributedZkTest]         at sun.misc.Unsafe.park(Native Method)         at java.util.concurrent.locks.LockSupport.parkNanos(LockSupport.java:215)         at java.util.concurrent.SynchronousQueue$TransferStack.awaitFulfill(SynchronousQueue.java:460)         at java.util.concurrent.SynchronousQueue$TransferStack.transfer(SynchronousQueue.java:362)         at java.util.concurrent.SynchronousQueue.poll(SynchronousQueue.java:941)         at java.util.concurrent.ThreadPoolExecutor.getTask(ThreadPoolExecutor.java:1066)         at java.util.concurrent.ThreadPoolExecutor.runWorker(ThreadPoolExecutor.java:1127)         at java.util.concurrent.ThreadPoolExecutor$Worker.run(ThreadPoolExecutor.java:617)         at java.lang.Thread.run(Thread.java:745)

Stack Trace:
com.carrotsearch.randomizedtesting.ThreadLeakError: There are still zombie threads that couldn't be terminated:
   1) Thread[id=13352, name=zkCallback-1374-thread-2, state=TIMED_WAITING, group=TGRP-CollectionsAPIDistributedZkTest]
        at sun.misc.Unsafe.park(Native Method)
        at java.util.concurrent.locks.LockSupport.parkNanos(LockSupport.java:215)
        at java.util.concurrent.SynchronousQueue$TransferStack.awaitFulfill(SynchronousQueue.java:460)
        at java.util.concurrent.SynchronousQueue$TransferStack.transfer(SynchronousQueue.java:362)
        at java.util.concurrent.SynchronousQueue.poll(SynchronousQueue.java:941)
        at java.util.concurrent.ThreadPoolExecutor.getTask(ThreadPoolExecutor.java:1066)
        at java.util.concurrent.ThreadPoolExecutor.runWorker(ThreadPoolExecutor.java:1127)
        at java.util.concurrent.ThreadPoolExecutor$Worker.run(ThreadPoolExecutor.java:617)
        at java.lang.Thread.run(Thread.java:745)
   2) Thread[id=7417, name=zkCallback-1374-thread-1, state=TIMED_WAITING, group=TGRP-CollectionsAPIDistributedZkTest]
        at sun.misc.Unsafe.park(Native Method)
        at java.util.concurrent.locks.LockSupport.parkNanos(LockSupport.java:215)
        at java.util.concurrent.SynchronousQueue$TransferStack.awaitFulfill(SynchronousQueue.java:460)
        at java.util.concurrent.SynchronousQueue$TransferStack.transfer(SynchronousQueue.java:362)
        at java.util.concurrent.SynchronousQueue.poll(SynchronousQueue.java:941)
        at java.util.concurrent.ThreadPoolExecutor.getTask(ThreadPoolExecutor.java:1066)
        at java.util.concurrent.ThreadPoolExecutor.runWorker(ThreadPoolExecutor.java:1127)
        at java.util.concurrent.ThreadPoolExecutor$Worker.run(ThreadPoolExecutor.java:617)
        at java.lang.Thread.run(Thread.java:745)
   3) Thread[id=7415, name=TEST-CollectionsAPIDistributedZkTest.test-seed#[A926803B21EF3C10]-SendThread(127.0.0.1:44032), state=TIMED_WAITING, group=TGRP-CollectionsAPIDistributedZkTest]
        at java.lang.Thread.sleep(Native Method)
        at org.apache.zookeeper.client.StaticHostProvider.next(StaticHostProvider.java:101)
        at org.apache.zookeeper.ClientCnxn$SendThread.startConnect(ClientCnxn.java:940)
        at org.apache.zookeeper.ClientCnxn$SendThread.run(ClientCnxn.java:1003)
   4) Thread[id=13353, name=zkCallback-1374-thread-3, state=TIMED_WAITING, group=TGRP-CollectionsAPIDistributedZkTest]
        at sun.misc.Unsafe.park(Native Method)
        at java.util.concurrent.locks.LockSupport.parkNanos(LockSupport.java:215)
        at java.util.concurrent.SynchronousQueue$TransferStack.awaitFulfill(SynchronousQueue.java:460)
        at java.util.concurrent.SynchronousQueue$TransferStack.transfer(SynchronousQueue.java:362)
        at java.util.concurrent.SynchronousQueue.poll(SynchronousQueue.java:941)
        at java.util.concurrent.ThreadPoolExecutor.getTask(ThreadPoolExecutor.java:1066)
        at java.util.concurrent.ThreadPoolExecutor.runWorker(ThreadPoolExecutor.java:1127)
        at java.util.concurrent.ThreadPoolExecutor$Worker.run(ThreadPoolExecutor.java:617)
        at java.lang.Thread.run(Thread.java:745)
	at __randomizedtesting.SeedInfo.seed([A926803B21EF3C10]:0)


FAILED:  org.apache.solr.cloud.CollectionsAPIDistributedZkTest.test

Error Message:
Error from server at http://127.0.0.1:57634/yf/f/awholynewcollection_0: non ok status: 500, message:Server Error

Stack Trace:
org.apache.solr.client.solrj.impl.HttpSolrClient$RemoteSolrException: Error from server at http://127.0.0.1:57634/yf/f/awholynewcollection_0: non ok status: 500, message:Server Error
	at __randomizedtesting.SeedInfo.seed([A926803B21EF3C10:2172BFE18F1351E8]:0)
	at org.apache.solr.client.solrj.impl.HttpSolrClient.executeMethod(HttpSolrClient.java:511)
	at org.apache.solr.client.solrj.impl.HttpSolrClient.request(HttpSolrClient.java:240)
	at org.apache.solr.client.solrj.impl.HttpSolrClient.request(HttpSolrClient.java:229)
	at org.apache.solr.client.solrj.SolrRequest.process(SolrRequest.java:149)
	at org.apache.solr.client.solrj.SolrClient.query(SolrClient.java:942)
	at org.apache.solr.client.solrj.SolrClient.query(SolrClient.java:957)
	at org.apache.solr.cloud.AbstractFullDistribZkTestBase.waitForNon403or404or503(AbstractFullDistribZkTestBase.java:1753)
	at org.apache.solr.cloud.CollectionsAPIDistributedZkTest.testCollectionsAPI(CollectionsAPIDistributedZkTest.java:737)
	at org.apache.solr.cloud.CollectionsAPIDistributedZkTest.test(CollectionsAPIDistributedZkTest.java:160)
	at sun.reflect.NativeMethodAccessorImpl.invoke0(Native Method)
	at sun.reflect.NativeMethodAccessorImpl.invoke(NativeMethodAccessorImpl.java:62)
	at sun.reflect.DelegatingMethodAccessorImpl.invoke(DelegatingMethodAccessorImpl.java:43)
	at java.lang.reflect.Method.invoke(Method.java:498)
	at com.carrotsearch.randomizedtesting.RandomizedRunner.invoke(RandomizedRunner.java:1764)
	at com.carrotsearch.randomizedtesting.RandomizedRunner$8.evaluate(RandomizedRunner.java:871)
	at com.carrotsearch.randomizedtesting.RandomizedRunner$9.evaluate(RandomizedRunner.java:907)
	at com.carrotsearch.randomizedtesting.RandomizedRunner$10.evaluate(RandomizedRunner.java:921)
	at org.apache.solr.BaseDistributedSearchTestCase$ShardsRepeatRule$ShardsFixedStatement.callStatement(BaseDistributedSearchTestCase.java:964)
	at org.apache.solr.BaseDistributedSearchTestCase$ShardsRepeatRule$ShardsStatement.evaluate(BaseDistributedSearchTestCase.java:939)
	at com.carrotsearch.randomizedtesting.rules.SystemPropertiesRestoreRule$1.evaluate(SystemPropertiesRestoreRule.java:57)
	at org.apache.lucene.util.TestRuleSetupTeardownChained$1.evaluate(TestRuleSetupTeardownChained.java:49)
	at org.apache.lucene.util.AbstractBeforeAfterRule$1.evaluate(AbstractBeforeAfterRule.java:45)
	at org.apache.lucene.util.TestRuleThreadAndTestName$1.evaluate(TestRuleThreadAndTestName.java:48)
	at org.apache.lucene.util.TestRuleIgnoreAfterMaxFailures$1.evaluate(TestRuleIgnoreAfterMaxFailures.java:64)
	at org.apache.lucene.util.TestRuleMarkFailure$1.evaluate(TestRuleMarkFailure.java:47)
	at com.carrotsearch.randomizedtesting.rules.StatementAdapter.evaluate(StatementAdapter.java:36)
	at com.carrotsearch.randomizedtesting.ThreadLeakControl$StatementRunner.run(ThreadLeakControl.java:367)
	at com.carrotsearch.randomizedtesting.ThreadLeakControl.forkTimeoutingTask(ThreadLeakControl.java:809)
	at com.carrotsearch.randomizedtesting.ThreadLeakControl$3.evaluate(ThreadLeakControl.java:460)
	at com.carrotsearch.randomizedtesting.RandomizedRunner.runSingleTest(RandomizedRunner.java:880)
	at com.carrotsearch.randomizedtesting.RandomizedRunner$5.evaluate(RandomizedRunner.java:781)
	at com.carrotsearch.randomizedtesting.RandomizedRunner$6.evaluate(RandomizedRunner.java:816)
	at com.carrotsearch.randomizedtesting.RandomizedRunner$7.evaluate(RandomizedRunner.java:827)
	at com.carrotsearch.randomizedtesting.rules.StatementAdapter.evaluate(StatementAdapter.java:36)
	at com.carrotsearch.randomizedtesting.rules.SystemPropertiesRestoreRule$1.evaluate(SystemPropertiesRestoreRule.java:57)
	at org.apache.lucene.util.AbstractBeforeAfterRule$1.evaluate(AbstractBeforeAfterRule.java:45)
	at com.carrotsearch.randomizedtesting.rules.StatementAdapter.evaluate(StatementAdapter.java:36)
	at org.apache.lucene.util.TestRuleStoreClassName$1.evaluate(TestRuleStoreClassName.java:41)
	at com.carrotsearch.randomizedtesting.rules.NoShadowingOrOverridesOnMethodsRule$1.evaluate(NoShadowingOrOverridesOnMethodsRule.java:40)
	at com.carrotsearch.randomizedtesting.rules.NoShadowingOrOverridesOnMethodsRule$1.evaluate(NoShadowingOrOverridesOnMethodsRule.java:40)
	at com.carrotsearch.randomizedtesting.rules.StatementAdapter.evaluate(StatementAdapter.java:36)
	at com.carrotsearch.randomizedtesting.rules.StatementAdapter.evaluate(StatementAdapter.java:36)
	at com.carrotsearch.randomizedtesting.rules.StatementAdapter.evaluate(StatementAdapter.java:36)
	at org.apache.lucene.util.TestRuleAssertionsRequired$1.evaluate(TestRuleAssertionsRequired.java:53)
	at org.apache.lucene.util.TestRuleMarkFailure$1.evaluate(TestRuleMarkFailure.java:47)
	at org.apache.lucene.util.TestRuleIgnoreAfterMaxFailures$1.evaluate(TestRuleIgnoreAfterMaxFailures.java:64)
	at org.apache.lucene.util.TestRuleIgnoreTestSuites$1.evaluate(TestRuleIgnoreTestSuites.java:54)
	at com.carrotsearch.randomizedtesting.rules.StatementAdapter.evaluate(StatementAdapter.java:36)
	at com.carrotsearch.randomizedtesting.ThreadLeakControl$StatementRunner.run(ThreadLeakControl.java:367)
	at java.lang.Thread.run(Thread.java:745)




Build Log:
[...truncated 11513 lines...]
   [junit4] Suite: org.apache.solr.cloud.CollectionsAPIDistributedZkTest
   [junit4]   2> Creating dataDir: /home/jenkins/workspace/Lucene-Solr-5.5-Linux/solr/build/solr-core/test/J2/temp/solr.cloud.CollectionsAPIDistributedZkTest_A926803B21EF3C10-001/init-core-data-001
   [junit4]   2> 741208 INFO  (SUITE-CollectionsAPIDistributedZkTest-seed#[A926803B21EF3C10]-worker) [    ] o.a.s.SolrTestCaseJ4 Randomized ssl (false) and clientAuth (false)
   [junit4]   2> 741208 INFO  (SUITE-CollectionsAPIDistributedZkTest-seed#[A926803B21EF3C10]-worker) [    ] o.a.s.BaseDistributedSearchTestCase Setting hostContext system property: /yf/f
   [junit4]   2> 741211 INFO  (TEST-CollectionsAPIDistributedZkTest.test-seed#[A926803B21EF3C10]) [    ] o.a.s.c.ZkTestServer STARTING ZK TEST SERVER
   [junit4]   2> 741211 INFO  (Thread-2507) [    ] o.a.s.c.ZkTestServer client port:0.0.0.0/0.0.0.0:0
   [junit4]   2> 741211 INFO  (Thread-2507) [    ] o.a.s.c.ZkTestServer Starting server
   [junit4]   2> 741311 INFO  (TEST-CollectionsAPIDistributedZkTest.test-seed#[A926803B21EF3C10]) [    ] o.a.s.c.ZkTestServer start zk server on port:44032
   [junit4]   2> 741311 INFO  (TEST-CollectionsAPIDistributedZkTest.test-seed#[A926803B21EF3C10]) [    ] o.a.s.c.c.SolrZkClient Using default ZkCredentialsProvider
   [junit4]   2> 741312 INFO  (TEST-CollectionsAPIDistributedZkTest.test-seed#[A926803B21EF3C10]) [    ] o.a.s.c.c.ConnectionManager Waiting for client to connect to ZooKeeper
   [junit4]   2> 741315 INFO  (zkCallback-1335-thread-1) [    ] o.a.s.c.c.ConnectionManager Watcher org.apache.solr.common.cloud.ConnectionManager@4d2761de name:ZooKeeperConnection Watcher:127.0.0.1:44032 got event WatchedEvent state:SyncConnected type:None path:null path:null type:None
   [junit4]   2> 741316 INFO  (TEST-CollectionsAPIDistributedZkTest.test-seed#[A926803B21EF3C10]) [    ] o.a.s.c.c.ConnectionManager Client is connected to ZooKeeper
   [junit4]   2> 741316 INFO  (TEST-CollectionsAPIDistributedZkTest.test-seed#[A926803B21EF3C10]) [    ] o.a.s.c.c.SolrZkClient Using default ZkACLProvider
   [junit4]   2> 741316 INFO  (TEST-CollectionsAPIDistributedZkTest.test-seed#[A926803B21EF3C10]) [    ] o.a.s.c.c.SolrZkClient makePath: /solr
   [junit4]   2> 741318 INFO  (TEST-CollectionsAPIDistributedZkTest.test-seed#[A926803B21EF3C10]) [    ] o.a.s.c.c.SolrZkClient Using default ZkCredentialsProvider
   [junit4]   2> 741325 INFO  (TEST-CollectionsAPIDistributedZkTest.test-seed#[A926803B21EF3C10]) [    ] o.a.s.c.c.ConnectionManager Waiting for client to connect to ZooKeeper
   [junit4]   2> 741326 INFO  (zkCallback-1336-thread-1) [    ] o.a.s.c.c.ConnectionManager Watcher org.apache.solr.common.cloud.ConnectionManager@547ac880 name:ZooKeeperConnection Watcher:127.0.0.1:44032/solr got event WatchedEvent state:SyncConnected type:None path:null path:null type:None
   [junit4]   2> 741326 INFO  (TEST-CollectionsAPIDistributedZkTest.test-seed#[A926803B21EF3C10]) [    ] o.a.s.c.c.ConnectionManager Client is connected to ZooKeeper
   [junit4]   2> 741327 INFO  (TEST-CollectionsAPIDistributedZkTest.test-seed#[A926803B21EF3C10]) [    ] o.a.s.c.c.SolrZkClient Using default ZkACLProvider
   [junit4]   2> 741327 INFO  (TEST-CollectionsAPIDistributedZkTest.test-seed#[A926803B21EF3C10]) [    ] o.a.s.c.c.SolrZkClient makePath: /collections/collection1
   [junit4]   2> 741328 INFO  (TEST-CollectionsAPIDistributedZkTest.test-seed#[A926803B21EF3C10]) [    ] o.a.s.c.c.SolrZkClient makePath: /collections/collection1/shards
   [junit4]   2> 741328 INFO  (TEST-CollectionsAPIDistributedZkTest.test-seed#[A926803B21EF3C10]) [    ] o.a.s.c.c.SolrZkClient makePath: /collections/control_collection
   [junit4]   2> 741329 INFO  (TEST-CollectionsAPIDistributedZkTest.test-seed#[A926803B21EF3C10]) [    ] o.a.s.c.c.SolrZkClient makePath: /collections/control_collection/shards
   [junit4]   2> 741329 INFO  (TEST-CollectionsAPIDistributedZkTest.test-seed#[A926803B21EF3C10]) [    ] o.a.s.c.AbstractZkTestCase put /home/jenkins/workspace/Lucene-Solr-5.5-Linux/solr/core/src/test-files/solr/collection1/conf/solrconfig-tlog.xml to /configs/conf1/solrconfig.xml
   [junit4]   2> 741329 INFO  (TEST-CollectionsAPIDistributedZkTest.test-seed#[A926803B21EF3C10]) [    ] o.a.s.c.c.SolrZkClient makePath: /configs/conf1/solrconfig.xml
   [junit4]   2> 741330 INFO  (TEST-CollectionsAPIDistributedZkTest.test-seed#[A926803B21EF3C10]) [    ] o.a.s.c.AbstractZkTestCase put /home/jenkins/workspace/Lucene-Solr-5.5-Linux/solr/core/src/test-files/solr/collection1/conf/schema.xml to /configs/conf1/schema.xml
   [junit4]   2> 741331 INFO  (TEST-CollectionsAPIDistributedZkTest.test-seed#[A926803B21EF3C10]) [    ] o.a.s.c.c.SolrZkClient makePath: /configs/conf1/schema.xml
   [junit4]   2> 741332 INFO  (TEST-CollectionsAPIDistributedZkTest.test-seed#[A926803B21EF3C10]) [    ] o.a.s.c.AbstractZkTestCase put /home/jenkins/workspace/Lucene-Solr-5.5-Linux/solr/core/src/test-files/solr/collection1/conf/solrconfig.snippet.randomindexconfig.xml to /configs/conf1/solrconfig.snippet.randomindexconfig.xml
   [junit4]   2> 741332 INFO  (TEST-CollectionsAPIDistributedZkTest.test-seed#[A926803B21EF3C10]) [    ] o.a.s.c.c.SolrZkClient makePath: /configs/conf1/solrconfig.snippet.randomindexconfig.xml
   [junit4]   2> 741333 INFO  (TEST-CollectionsAPIDistributedZkTest.test-seed#[A926803B21EF3C10]) [    ] o.a.s.c.AbstractZkTestCase put /home/jenkins/workspace/Lucene-Solr-5.5-Linux/solr/core/src/test-files/solr/collection1/conf/stopwords.txt to /configs/conf1/stopwords.txt
   [junit4]   2> 741333 INFO  (TEST-CollectionsAPIDistributedZkTest.test-seed#[A926803B21EF3C10]) [    ] o.a.s.c.c.SolrZkClient makePath: /configs/conf1/stopwords.txt
   [junit4]   2> 741334 INFO  (TEST-CollectionsAPIDistributedZkTest.test-seed#[A926803B21EF3C10]) [    ] o.a.s.c.AbstractZkTestCase put /home/jenkins/workspace/Lucene-Solr-5.5-Linux/solr/core/src/test-files/solr/collection1/conf/protwords.txt to /configs/conf1/protwords.txt
   [junit4]   2> 741334 INFO  (TEST-CollectionsAPIDistributedZkTest.test-seed#[A926803B21EF3C10]) [    ] o.a.s.c.c.SolrZkClient makePath: /configs/conf1/protwords.txt
   [junit4]   2> 741335 INFO  (TEST-CollectionsAPIDistributedZkTest.test-seed#[A926803B21EF3C10]) [    ] o.a.s.c.AbstractZkTestCase put /home/jenkins/workspace/Lucene-Solr-5.5-Linux/solr/core/src/test-files/solr/collection1/conf/currency.xml to /configs/conf1/currency.xml
   [junit4]   2> 741335 INFO  (TEST-CollectionsAPIDistributedZkTest.test-seed#[A926803B21EF3C10]) [    ] o.a.s.c.c.SolrZkClient makePath: /configs/conf1/currency.xml
   [junit4]   2> 741336 INFO  (TEST-CollectionsAPIDistributedZkTest.test-seed#[A926803B21EF3C10]) [    ] o.a.s.c.AbstractZkTestCase put /home/jenkins/workspace/Lucene-Solr-5.5-Linux/solr/core/src/test-files/solr/collection1/conf/enumsConfig.xml to /configs/conf1/enumsConfig.xml
   [junit4]   2> 741336 INFO  (TEST-CollectionsAPIDistributedZkTest.test-seed#[A926803B21EF3C10]) [    ] o.a.s.c.c.SolrZkClient makePath: /configs/conf1/enumsConfig.xml
   [junit4]   2> 741337 INFO  (TEST-CollectionsAPIDistributedZkTest.test-seed#[A926803B21EF3C10]) [    ] o.a.s.c.AbstractZkTestCase put /home/jenkins/workspace/Lucene-Solr-5.5-Linux/solr/core/src/test-files/solr/collection1/conf/open-exchange-rates.json to /configs/conf1/open-exchange-rates.json
   [junit4]   2> 741337 INFO  (TEST-CollectionsAPIDistributedZkTest.test-seed#[A926803B21EF3C10]) [    ] o.a.s.c.c.SolrZkClient makePath: /configs/conf1/open-exchange-rates.json
   [junit4]   2> 741338 INFO  (TEST-CollectionsAPIDistributedZkTest.test-seed#[A926803B21EF3C10]) [    ] o.a.s.c.AbstractZkTestCase put /home/jenkins/workspace/Lucene-Solr-5.5-Linux/solr/core/src/test-files/solr/collection1/conf/mapping-ISOLatin1Accent.txt to /configs/conf1/mapping-ISOLatin1Accent.txt
   [junit4]   2> 741338 INFO  (TEST-CollectionsAPIDistributedZkTest.test-seed#[A926803B21EF3C10]) [    ] o.a.s.c.c.SolrZkClient makePath: /configs/conf1/mapping-ISOLatin1Accent.txt
   [junit4]   2> 741339 INFO  (TEST-CollectionsAPIDistributedZkTest.test-seed#[A926803B21EF3C10]) [    ] o.a.s.c.AbstractZkTestCase put /home/jenkins/workspace/Lucene-Solr-5.5-Linux/solr/core/src/test-files/solr/collection1/conf/old_synonyms.txt to /configs/conf1/old_synonyms.txt
   [junit4]   2> 741339 INFO  (TEST-CollectionsAPIDistributedZkTest.test-seed#[A926803B21EF3C10]) [    ] o.a.s.c.c.SolrZkClient makePath: /configs/conf1/old_synonyms.txt
   [junit4]   2> 741340 INFO  (TEST-CollectionsAPIDistributedZkTest.test-seed#[A926803B21EF3C10]) [    ] o.a.s.c.AbstractZkTestCase put /home/jenkins/workspace/Lucene-Solr-5.5-Linux/solr/core/src/test-files/solr/collection1/conf/synonyms.txt to /configs/conf1/synonyms.txt
   [junit4]   2> 741340 INFO  (TEST-CollectionsAPIDistributedZkTest.test-seed#[A926803B21EF3C10]) [    ] o.a.s.c.c.SolrZkClient makePath: /configs/conf1/synonyms.txt
   [junit4]   2> 741342 INFO  (TEST-CollectionsAPIDistributedZkTest.test-seed#[A926803B21EF3C10]) [    ] o.a.s.c.c.SolrZkClient Using default ZkCredentialsProvider
   [junit4]   2> 741359 INFO  (TEST-CollectionsAPIDistributedZkTest.test-seed#[A926803B21EF3C10]) [    ] o.a.s.c.c.ConnectionManager Waiting for client to connect to ZooKeeper
   [junit4]   2> 741359 INFO  (zkCallback-1337-thread-1) [    ] o.a.s.c.c.ConnectionManager Watcher org.apache.solr.common.cloud.ConnectionManager@34f5a6f8 name:ZooKeeperConnection Watcher:127.0.0.1:44032 got event WatchedEvent state:SyncConnected type:None path:null path:null type:None
   [junit4]   2> 741360 INFO  (TEST-CollectionsAPIDistributedZkTest.test-seed#[A926803B21EF3C10]) [    ] o.a.s.c.c.ConnectionManager Client is connected to ZooKeeper
   [junit4]   2> 741360 INFO  (TEST-CollectionsAPIDistributedZkTest.test-seed#[A926803B21EF3C10]) [    ] o.a.s.c.c.SolrZkClient Using default ZkACLProvider
   [junit4]   2> 741360 INFO  (TEST-CollectionsAPIDistributedZkTest.test-seed#[A926803B21EF3C10]) [    ] o.a.s.c.c.SolrZkClient makePath: /solr
   [junit4]   2> 741361 INFO  (TEST-CollectionsAPIDistributedZkTest.test-seed#[A926803B21EF3C10]) [    ] o.a.s.c.c.SolrZkClient Using default ZkCredentialsProvider
   [junit4]   2> 741375 INFO  (TEST-CollectionsAPIDistributedZkTest.test-seed#[A926803B21EF3C10]) [    ] o.a.s.c.c.ConnectionManager Waiting for client to connect to ZooKeeper
   [junit4]   2> 741383 INFO  (zkCallback-1338-thread-1) [    ] o.a.s.c.c.ConnectionManager Watcher org.apache.solr.common.cloud.ConnectionManager@68fec42f name:ZooKeeperConnection Watcher:127.0.0.1:44032/solr got event WatchedEvent state:SyncConnected type:None path:null path:null type:None
   [junit4]   2> 741383 INFO  (TEST-CollectionsAPIDistributedZkTest.test-seed#[A926803B21EF3C10]) [    ] o.a.s.c.c.ConnectionManager Client is connected to ZooKeeper
   [junit4]   2> 741384 INFO  (TEST-CollectionsAPIDistributedZkTest.test-seed#[A926803B21EF3C10]) [    ] o.a.s.c.c.SolrZkClient Using default ZkACLProvider
   [junit4]   2> 741384 INFO  (TEST-CollectionsAPIDistributedZkTest.test-seed#[A926803B21EF3C10]) [    ] o.a.s.c.AbstractZkTestCase put /home/jenkins/workspace/Lucene-Solr-5.5-Linux/solr/core/src/test-files/solr/collection1/conf/solrconfig-tlog.xml to /configs/conf2/solrconfig.xml
   [junit4]   2> 741384 INFO  (TEST-CollectionsAPIDistributedZkTest.test-seed#[A926803B21EF3C10]) [    ] o.a.s.c.c.SolrZkClient makePath: /configs/conf2/solrconfig.xml
   [junit4]   2> 741386 INFO  (TEST-CollectionsAPIDistributedZkTest.test-seed#[A926803B21EF3C10]) [    ] o.a.s.c.AbstractZkTestCase put /home/jenkins/workspace/Lucene-Solr-5.5-Linux/solr/core/src/test-files/solr/collection1/conf/schema.xml to /configs/conf2/schema.xml
   [junit4]   2> 741386 INFO  (TEST-CollectionsAPIDistributedZkTest.test-seed#[A926803B21EF3C10]) [    ] o.a.s.c.c.SolrZkClient makePath: /configs/conf2/schema.xml
   [junit4]   2> 741387 INFO  (TEST-CollectionsAPIDistributedZkTest.test-seed#[A926803B21EF3C10]) [    ] o.a.s.c.AbstractZkTestCase put /home/jenkins/workspace/Lucene-Solr-5.5-Linux/solr/core/src/test-files/solr/collection1/conf/enumsConfig.xml to /configs/conf2/enumsConfig.xml
   [junit4]   2> 741387 INFO  (TEST-CollectionsAPIDistributedZkTest.test-seed#[A926803B21EF3C10]) [    ] o.a.s.c.c.SolrZkClient makePath: /configs/conf2/enumsConfig.xml
   [junit4]   2> 741388 INFO  (TEST-CollectionsAPIDistributedZkTest.test-seed#[A926803B21EF3C10]) [    ] o.a.s.c.AbstractZkTestCase put /home/jenkins/workspace/Lucene-Solr-5.5-Linux/solr/core/src/test-files/solr/collection1/conf/solrconfig.snippet.randomindexconfig.xml to /configs/conf2/solrconfig.snippet.randomindexconfig.xml
   [junit4]   2> 741389 INFO  (TEST-CollectionsAPIDistributedZkTest.test-seed#[A926803B21EF3C10]) [    ] o.a.s.c.c.SolrZkClient makePath: /configs/conf2/solrconfig.snippet.randomindexconfig.xml
   [junit4]   2> 741389 INFO  (TEST-CollectionsAPIDistributedZkTest.test-seed#[A926803B21EF3C10]) [    ] o.a.s.c.AbstractZkTestCase put /home/jenkins/workspace/Lucene-Solr-5.5-Linux/solr/core/src/test-files/solr/collection1/conf/stopwords.txt to /configs/conf2/stopwords.txt
   [junit4]   2> 741390 INFO  (TEST-CollectionsAPIDistributedZkTest.test-seed#[A926803B21EF3C10]) [    ] o.a.s.c.c.SolrZkClient makePath: /configs/conf2/stopwords.txt
   [junit4]   2> 741390 INFO  (TEST-CollectionsAPIDistributedZkTest.test-seed#[A926803B21EF3C10]) [    ] o.a.s.c.AbstractZkTestCase put /home/jenkins/workspace/Lucene-Solr-5.5-Linux/solr/core/src/test-files/solr/collection1/conf/protwords.txt to /configs/conf2/protwords.txt
   [junit4]   2> 741391 INFO  (TEST-CollectionsAPIDistributedZkTest.test-seed#[A926803B21EF3C10]) [    ] o.a.s.c.c.SolrZkClient makePath: /configs/conf2/protwords.txt
   [junit4]   2> 741391 INFO  (TEST-CollectionsAPIDistributedZkTest.test-seed#[A926803B21EF3C10]) [    ] o.a.s.c.AbstractZkTestCase put /home/jenkins/workspace/Lucene-Solr-5.5-Linux/solr/core/src/test-files/solr/collection1/conf/currency.xml to /configs/conf2/currency.xml
   [junit4]   2> 741392 INFO  (TEST-CollectionsAPIDistributedZkTest.test-seed#[A926803B21EF3C10]) [    ] o.a.s.c.c.SolrZkClient makePath: /configs/conf2/currency.xml
   [junit4]   2> 741392 INFO  (TEST-CollectionsAPIDistributedZkTest.test-seed#[A926803B21EF3C10]) [    ] o.a.s.c.AbstractZkTestCase put /home/jenkins/workspace/Lucene-Solr-5.5-Linux/solr/core/src/test-files/solr/collection1/conf/open-exchange-rates.json to /configs/conf2/open-exchange-rates.json
   [junit4]   2> 741392 INFO  (TEST-CollectionsAPIDistributedZkTest.test-seed#[A926803B21EF3C10]) [    ] o.a.s.c.c.SolrZkClient makePath: /configs/conf2/open-exchange-rates.json
   [junit4]   2> 741393 INFO  (TEST-CollectionsAPIDistributedZkTest.test-seed#[A926803B21EF3C10]) [    ] o.a.s.c.AbstractZkTestCase put /home/jenkins/workspace/Lucene-Solr-5.5-Linux/solr/core/src/test-files/solr/collection1/conf/mapping-ISOLatin1Accent.txt to /configs/conf2/mapping-ISOLatin1Accent.txt
   [junit4]   2> 741393 INFO  (TEST-CollectionsAPIDistributedZkTest.test-seed#[A926803B21EF3C10]) [    ] o.a.s.c.c.SolrZkClient makePath: /configs/conf2/mapping-ISOLatin1Accent.txt
   [junit4]   2> 741394 INFO  (TEST-CollectionsAPIDistributedZkTest.test-seed#[A926803B21EF3C10]) [    ] o.a.s.c.AbstractZkTestCase put /home/jenkins/workspace/Lucene-Solr-5.5-Linux/solr/core/src/test-files/solr/collection1/conf/old_synonyms.txt to /configs/conf2/old_synonyms.txt
   [junit4]   2> 741394 INFO  (TEST-CollectionsAPIDistributedZkTest.test-seed#[A926803B21EF3C10]) [    ] o.a.s.c.c.SolrZkClient makePath: /configs/conf2/old_synonyms.txt
   [junit4]   2> 741395 INFO  (TEST-CollectionsAPIDistributedZkTest.test-seed#[A926803B21EF3C10]) [    ] o.a.s.c.AbstractZkTestCase put /home/jenkins/workspace/Lucene-Solr-5.5-Linux/solr/core/src/test-files/solr/collection1/conf/synonyms.txt to /configs/conf2/synonyms.txt
   [junit4]   2> 741395 INFO  (TEST-CollectionsAPIDistributedZkTest.test-seed#[A926803B21EF3C10]) [    ] o.a.s.c.c.SolrZkClient makePath: /configs/conf2/synonyms.txt
   [junit4]   2> 741396 INFO  (TEST-CollectionsAPIDistributedZkTest.test-seed#[A926803B21EF3C10]) [    ] o.a.s.c.AbstractZkTestCase put /home/jenkins/workspace/Lucene-Solr-5.5-Linux/solr/core/src/test-files/solr/collection1/conf/elevate.xml to /configs/conf2/elevate.xml
   [junit4]   2> 741396 INFO  (TEST-CollectionsAPIDistributedZkTest.test-seed#[A926803B21EF3C10]) [    ] o.a.s.c.c.SolrZkClient makePath: /configs/conf2/elevate.xml
   [junit4]   2> 741477 INFO  (TEST-CollectionsAPIDistributedZkTest.test-seed#[A926803B21EF3C10]) [    ] o.a.s.SolrTestCaseJ4 Writing core.properties file to /home/jenkins/workspace/Lucene-Solr-5.5-Linux/solr/build/solr-core/test/J2/temp/solr.cloud.CollectionsAPIDistributedZkTest_A926803B21EF3C10-001/control-001/cores/collection1
   [junit4]   2> 741479 INFO  (TEST-CollectionsAPIDistributedZkTest.test-seed#[A926803B21EF3C10]) [    ] o.e.j.s.Server jetty-9.2.13.v20150730
   [junit4]   2> 741480 INFO  (TEST-CollectionsAPIDistributedZkTest.test-seed#[A926803B21EF3C10]) [    ] o.e.j.s.h.ContextHandler Started o.e.j.s.ServletContextHandler@4c8ac0bc{/yf/f,null,AVAILABLE}
   [junit4]   2> 741482 INFO  (TEST-CollectionsAPIDistributedZkTest.test-seed#[A926803B21EF3C10]) [    ] o.e.j.s.ServerConnector Started ServerConnector@35d3f017{HTTP/1.1}{127.0.0.1:59576}
   [junit4]   2> 741482 INFO  (TEST-CollectionsAPIDistributedZkTest.test-seed#[A926803B21EF3C10]) [    ] o.e.j.s.Server Started @742905ms
   [junit4]   2> 741483 INFO  (TEST-CollectionsAPIDistributedZkTest.test-seed#[A926803B21EF3C10]) [    ] o.a.s.c.s.e.JettySolrRunner Jetty properties: {solr.data.dir=/home/jenkins/workspace/Lucene-Solr-5.5-Linux/solr/build/solr-core/test/J2/temp/solr.cloud.CollectionsAPIDistributedZkTest_A926803B21EF3C10-001/tempDir-001/control/data, hostContext=/yf/f, hostPort=59576, coreRootDirectory=/home/jenkins/workspace/Lucene-Solr-5.5-Linux/solr/build/solr-core/test/J2/temp/solr.cloud.CollectionsAPIDistributedZkTest_A926803B21EF3C10-001/control-001/cores}
   [junit4]   2> 741483 INFO  (TEST-CollectionsAPIDistributedZkTest.test-seed#[A926803B21EF3C10]) [    ] o.a.s.s.SolrDispatchFilter SolrDispatchFilter.init(): sun.misc.Launcher$AppClassLoader@73d16e93
   [junit4]   2> 741483 INFO  (TEST-CollectionsAPIDistributedZkTest.test-seed#[A926803B21EF3C10]) [    ] o.a.s.c.SolrResourceLoader new SolrResourceLoader for directory: '/home/jenkins/workspace/Lucene-Solr-5.5-Linux/solr/build/solr-core/test/J2/temp/solr.cloud.CollectionsAPIDistributedZkTest_A926803B21EF3C10-001/control-001'
   [junit4]   2> 741483 INFO  (TEST-CollectionsAPIDistributedZkTest.test-seed#[A926803B21EF3C10]) [    ] o.a.s.c.SolrResourceLoader JNDI not configured for solr (NoInitialContextEx)
   [junit4]   2> 741483 INFO  (TEST-CollectionsAPIDistributedZkTest.test-seed#[A926803B21EF3C10]) [    ] o.a.s.c.SolrResourceLoader solr home defaulted to 'solr/' (could not find system property or JNDI)
   [junit4]   2> 741484 INFO  (TEST-CollectionsAPIDistributedZkTest.test-seed#[A926803B21EF3C10]) [    ] o.a.s.c.c.SolrZkClient Using default ZkCredentialsProvider
   [junit4]   2> 741504 INFO  (TEST-CollectionsAPIDistributedZkTest.test-seed#[A926803B21EF3C10]) [    ] o.a.s.c.c.ConnectionManager Waiting for client to connect to ZooKeeper
   [junit4]   2> 741504 INFO  (zkCallback-1339-thread-1) [    ] o.a.s.c.c.ConnectionManager Watcher org.apache.solr.common.cloud.ConnectionManager@7914fb47 name:ZooKeeperConnection Watcher:127.0.0.1:44032/solr got event WatchedEvent state:SyncConnected type:None path:null path:null type:None
   [junit4]   2> 741504 INFO  (TEST-CollectionsAPIDistributedZkTest.test-seed#[A926803B21EF3C10]) [    ] o.a.s.c.c.ConnectionManager Client is connected to ZooKeeper
   [junit4]   2> 741504 INFO  (TEST-CollectionsAPIDistributedZkTest.test-seed#[A926803B21EF3C10]) [    ] o.a.s.c.c.SolrZkClient Using default ZkACLProvider
   [junit4]   2> 741505 WARN  (NIOServerCxn.Factory:0.0.0.0/0.0.0.0:0) [    ] o.a.z.s.NIOServerCnxn caught end of stream exception
   [junit4]   2> EndOfStreamException: Unable to read additional data from client sessionid 0x1532fc2103f0004, likely client has closed socket
   [junit4]   2> 	at org.apache.zookeeper.server.NIOServerCnxn.doIO(NIOServerCnxn.java:228)
   [junit4]   2> 	at org.apache.zookeeper.server.NIOServerCnxnFactory.run(NIOServerCnxnFactory.java:208)
   [junit4]   2> 	at java.lang.Thread.run(Thread.java:745)
   [junit4]   2> 741505 INFO  (TEST-CollectionsAPIDistributedZkTest.test-seed#[A926803B21EF3C10]) [    ] o.a.s.s.SolrDispatchFilter Loading solr.xml from SolrHome (not found in ZooKeeper)
   [junit4]   2> 741505 INFO  (TEST-CollectionsAPIDistributedZkTest.test-seed#[A926803B21EF3C10]) [    ] o.a.s.c.SolrXmlConfig Loading container configuration from /home/jenkins/workspace/Lucene-Solr-5.5-Linux/solr/build/solr-core/test/J2/temp/solr.cloud.CollectionsAPIDistributedZkTest_A926803B21EF3C10-001/control-001/solr.xml
   [junit4]   2> 741560 INFO  (TEST-CollectionsAPIDistributedZkTest.test-seed#[A926803B21EF3C10]) [    ] o.a.s.c.CorePropertiesLocator Config-defined core root directory: /home/jenkins/workspace/Lucene-Solr-5.5-Linux/solr/build/solr-core/test/J2/temp/solr.cloud.CollectionsAPIDistributedZkTest_A926803B21EF3C10-001/control-001/cores
   [junit4]   2> 741560 INFO  (TEST-CollectionsAPIDistributedZkTest.test-seed#[A926803B21EF3C10]) [    ] o.a.s.c.CoreContainer New CoreContainer 1477091645
   [junit4]   2> 741560 INFO  (TEST-CollectionsAPIDistributedZkTest.test-seed#[A926803B21EF3C10]) [    ] o.a.s.c.CoreContainer Loading cores into CoreContainer [instanceDir=/home/jenkins/workspace/Lucene-Solr-5.5-Linux/solr/build/solr-core/test/J2/temp/solr.cloud.CollectionsAPIDistributedZkTest_A926803B21EF3C10-001/control-001]
   [junit4]   2> 741560 WARN  (TEST-CollectionsAPIDistributedZkTest.test-seed#[A926803B21EF3C10]) [    ] o.a.s.c.CoreContainer Couldn't add files from /home/jenkins/workspace/Lucene-Solr-5.5-Linux/solr/build/solr-core/test/J2/temp/solr.cloud.CollectionsAPIDistributedZkTest_A926803B21EF3C10-001/control-001/lib to classpath: /home/jenkins/workspace/Lucene-Solr-5.5-Linux/solr/build/solr-core/test/J2/temp/solr.cloud.CollectionsAPIDistributedZkTest_A926803B21EF3C10-001/control-001/lib
   [junit4]   2> 741561 INFO  (TEST-CollectionsAPIDistributedZkTest.test-seed#[A926803B21EF3C10]) [    ] o.a.s.h.c.HttpShardHandlerFactory created with socketTimeout : 90000,urlScheme : ,connTimeout : 15000,maxConnectionsPerHost : 20,maxConnections : 10000,corePoolSize : 0,maximumPoolSize : 2147483647,maxThreadIdleTime : 5,sizeOfQueue : -1,fairnessPolicy : false,useRetries : false,
   [junit4]   2> 741562 INFO  (TEST-CollectionsAPIDistributedZkTest.test-seed#[A926803B21EF3C10]) [    ] o.a.s.u.UpdateShardHandler Creating UpdateShardHandler HTTP client with params: socketTimeout=340000&connTimeout=45000&retry=true
   [junit4]   2> 741563 INFO  (TEST-CollectionsAPIDistributedZkTest.test-seed#[A926803B21EF3C10]) [    ] o.a.s.l.LogWatcher SLF4J impl is org.slf4j.impl.Log4jLoggerFactory
   [junit4]   2> 741563 INFO  (TEST-CollectionsAPIDistributedZkTest.test-seed#[A926803B21EF3C10]) [    ] o.a.s.l.LogWatcher Registering Log Listener [Log4j (org.slf4j.impl.Log4jLoggerFactory)]
   [junit4]   2> 741563 INFO  (TEST-CollectionsAPIDistributedZkTest.test-seed#[A926803B21EF3C10]) [    ] o.a.s.c.ZkContainer Zookeeper client=127.0.0.1:44032/solr
   [junit4]   2> 741564 INFO  (TEST-CollectionsAPIDistributedZkTest.test-seed#[A926803B21EF3C10]) [    ] o.a.s.c.ZkController zkHost includes chroot
   [junit4]   2> 741564 INFO  (TEST-CollectionsAPIDistributedZkTest.test-seed#[A926803B21EF3C10]) [    ] o.a.s.c.c.SolrZkClient Using default ZkCredentialsProvider
   [junit4]   2> 741577 INFO  (TEST-CollectionsAPIDistributedZkTest.test-seed#[A926803B21EF3C10]) [    ] o.a.s.c.c.ConnectionManager Waiting for client to connect to ZooKeeper
   [junit4]   2> 741577 INFO  (zkCallback-1342-thread-1) [    ] o.a.s.c.c.ConnectionManager Watcher org.apache.solr.common.cloud.ConnectionManager@615faf1a name:ZooKeeperConnection Watcher:127.0.0.1:44032 got event WatchedEvent state:SyncConnected type:None path:null path:null type:None
   [junit4]   2> 741578 INFO  (TEST-CollectionsAPIDistributedZkTest.test-seed#[A926803B21EF3C10]) [    ] o.a.s.c.c.ConnectionManager Client is connected to ZooKeeper
   [junit4]   2> 741579 INFO  (TEST-CollectionsAPIDistributedZkTest.test-seed#[A926803B21EF3C10]) [    ] o.a.s.c.c.SolrZkClient Using default ZkACLProvider
   [junit4]   2> 741580 INFO  (TEST-CollectionsAPIDistributedZkTest.test-seed#[A926803B21EF3C10]) [n:127.0.0.1:59576_yf%2Ff    ] o.a.s.c.c.ConnectionManager Waiting for client to connect to ZooKeeper
   [junit4]   2> 741581 INFO  (zkCallback-1343-thread-1-processing-n:127.0.0.1:59576_yf%2Ff) [n:127.0.0.1:59576_yf%2Ff    ] o.a.s.c.c.ConnectionManager Watcher org.apache.solr.common.cloud.ConnectionManager@3284dcca name:ZooKeeperConnection Watcher:127.0.0.1:44032/solr got event WatchedEvent state:SyncConnected type:None path:null path:null type:None
   [junit4]   2> 741581 INFO  (TEST-CollectionsAPIDistributedZkTest.test-seed#[A926803B21EF3C10]) [n:127.0.0.1:59576_yf%2Ff    ] o.a.s.c.c.ConnectionManager Client is connected to ZooKeeper
   [junit4]   2> 741582 INFO  (TEST-CollectionsAPIDistributedZkTest.test-seed#[A926803B21EF3C10]) [n:127.0.0.1:59576_yf%2Ff    ] o.a.s.c.c.SolrZkClient makePath: /overseer/queue
   [junit4]   2> 741583 INFO  (TEST-CollectionsAPIDistributedZkTest.test-seed#[A926803B21EF3C10]) [n:127.0.0.1:59576_yf%2Ff    ] o.a.s.c.c.SolrZkClient makePath: /overseer/collection-queue-work
   [junit4]   2> 741584 INFO  (TEST-CollectionsAPIDistributedZkTest.test-seed#[A926803B21EF3C10]) [n:127.0.0.1:59576_yf%2Ff    ] o.a.s.c.c.SolrZkClient makePath: /overseer/collection-map-running
   [junit4]   2> 741585 INFO  (TEST-CollectionsAPIDistributedZkTest.test-seed#[A926803B21EF3C10]) [n:127.0.0.1:59576_yf%2Ff    ] o.a.s.c.c.SolrZkClient makePath: /overseer/collection-map-completed
   [junit4]   2> 741586 INFO  (TEST-CollectionsAPIDistributedZkTest.test-seed#[A926803B21EF3C10]) [n:127.0.0.1:59576_yf%2Ff    ] o.a.s.c.c.SolrZkClient makePath: /overseer/collection-map-failure
   [junit4]   2> 741588 INFO  (TEST-CollectionsAPIDistributedZkTest.test-seed#[A926803B21EF3C10]) [n:127.0.0.1:59576_yf%2Ff    ] o.a.s.c.c.SolrZkClient makePath: /live_nodes
   [junit4]   2> 741588 INFO  (TEST-CollectionsAPIDistributedZkTest.test-seed#[A926803B21EF3C10]) [n:127.0.0.1:59576_yf%2Ff    ] o.a.s.c.c.SolrZkClient makePath: /aliases.json
   [junit4]   2> 741589 INFO  (TEST-CollectionsAPIDistributedZkTest.test-seed#[A926803B21EF3C10]) [n:127.0.0.1:59576_yf%2Ff    ] o.a.s.c.c.SolrZkClient makePath: /clusterstate.json
   [junit4]   2> 741589 INFO  (TEST-CollectionsAPIDistributedZkTest.test-seed#[A926803B21EF3C10]) [n:127.0.0.1:59576_yf%2Ff    ] o.a.s.c.c.SolrZkClient makePath: /security.json
   [junit4]   2> 741590 INFO  (TEST-CollectionsAPIDistributedZkTest.test-seed#[A926803B21EF3C10]) [n:127.0.0.1:59576_yf%2Ff    ] o.a.s.c.ZkController Register node as live in ZooKeeper:/live_nodes/127.0.0.1:59576_yf%2Ff
   [junit4]   2> 741590 INFO  (TEST-CollectionsAPIDistributedZkTest.test-seed#[A926803B21EF3C10]) [n:127.0.0.1:59576_yf%2Ff    ] o.a.s.c.c.SolrZkClient makePath: /live_nodes/127.0.0.1:59576_yf%2Ff
   [junit4]   2> 741591 INFO  (TEST-CollectionsAPIDistributedZkTest.test-seed#[A926803B21EF3C10]) [n:127.0.0.1:59576_yf%2Ff    ] o.a.s.c.c.SolrZkClient makePath: /overseer_elect
   [junit4]   2> 741593 INFO  (TEST-CollectionsAPIDistributedZkTest.test-seed#[A926803B21EF3C10]) [n:127.0.0.1:59576_yf%2Ff    ] o.a.s.c.c.SolrZkClient makePath: /overseer_elect/election
   [junit4]   2> 741594 INFO  (TEST-CollectionsAPIDistributedZkTest.test-seed#[A926803B21EF3C10]) [n:127.0.0.1:59576_yf%2Ff    ] o.a.s.c.Overseer Overseer (id=null) closing
   [junit4]   2> 741594 INFO  (TEST-CollectionsAPIDistributedZkTest.test-seed#[A926803B21EF3C10]) [n:127.0.0.1:59576_yf%2Ff    ] o.a.s.c.LeaderElector Joined leadership election with path: /overseer_elect/election/95472527647637510-127.0.0.1:59576_yf%2Ff-n_0000000000
   [junit4]   2> 741594 INFO  (TEST-CollectionsAPIDistributedZkTest.test-seed#[A926803B21EF3C10]) [n:127.0.0.1:59576_yf%2Ff    ] o.a.s.c.OverseerElectionContext I am going to be the leader 127.0.0.1:59576_yf%2Ff
   [junit4]   2> 741595 INFO  (TEST-CollectionsAPIDistributedZkTest.test-seed#[A926803B21EF3C10]) [n:127.0.0.1:59576_yf%2Ff    ] o.a.s.c.c.SolrZkClient makePath: /overseer_elect/leader
   [junit4]   2> 741595 INFO  (TEST-CollectionsAPIDistributedZkTest.test-seed#[A926803B21EF3C10]) [n:127.0.0.1:59576_yf%2Ff    ] o.a.s.c.Overseer Overseer (id=95472527647637510-127.0.0.1:59576_yf%2Ff-n_0000000000) starting
   [junit4]   2> 741596 INFO  (TEST-CollectionsAPIDistributedZkTest.test-seed#[A926803B21EF3C10]) [n:127.0.0.1:59576_yf%2Ff    ] o.a.s.c.c.SolrZkClient makePath: /overseer/queue-work
   [junit4]   2> 741600 INFO  (TEST-CollectionsAPIDistributedZkTest.test-seed#[A926803B21EF3C10]) [n:127.0.0.1:59576_yf%2Ff    ] o.a.s.c.OverseerAutoReplicaFailoverThread Starting OverseerAutoReplicaFailoverThread autoReplicaFailoverWorkLoopDelay=10000 autoReplicaFailoverWaitAfterExpiration=10000 autoReplicaFailoverBadNodeExpiration=60000
   [junit4]   2> 741601 INFO  (OverseerStateUpdate-95472527647637510-127.0.0.1:59576_yf%2Ff-n_0000000000) [n:127.0.0.1:59576_yf%2Ff    ] o.a.s.c.Overseer Starting to work on the main queue
   [junit4]   2> 741601 INFO  (OverseerStateUpdate-95472527647637510-127.0.0.1:59576_yf%2Ff-n_0000000000) [n:127.0.0.1:59576_yf%2Ff    ] o.a.s.c.c.ZkStateReader Updating cluster state from ZooKeeper... 
   [junit4]   2> 741623 INFO  (OverseerCollectionConfigSetProcessor-95472527647637510-127.0.0.1:59576_yf%2Ff-n_0000000000) [n:127.0.0.1:59576_yf%2Ff    ] o.a.s.c.OverseerTaskProcessor Process current queue of overseer operations
   [junit4]   2> 741636 INFO  (TEST-CollectionsAPIDistributedZkTest.test-seed#[A926803B21EF3C10]) [n:127.0.0.1:59576_yf%2Ff    ] o.a.s.c.c.ZkStateReader Updating cluster state from ZooKeeper... 
   [junit4]   2> 741664 INFO  (TEST-CollectionsAPIDistributedZkTest.test-seed#[A926803B21EF3C10]) [n:127.0.0.1:59576_yf%2Ff    ] o.a.s.c.CoreContainer Security conf doesn't exist. Skipping setup for authorization module.
   [junit4]   2> 741664 INFO  (TEST-CollectionsAPIDistributedZkTest.test-seed#[A926803B21EF3C10]) [n:127.0.0.1:59576_yf%2Ff    ] o.a.s.c.CoreContainer No authentication plugin used.
   [junit4]   2> 741664 INFO  (TEST-CollectionsAPIDistributedZkTest.test-seed#[A926803B21EF3C10]) [n:127.0.0.1:59576_yf%2Ff    ] o.a.s.c.CorePropertiesLocator Looking for core definitions underneath /home/jenkins/workspace/Lucene-Solr-5.5-Linux/solr/build/solr-core/test/J2/temp/solr.cloud.CollectionsAPIDistributedZkTest_A926803B21EF3C10-001/control-001/cores
   [junit4]   2> 741665 INFO  (TEST-CollectionsAPIDistributedZkTest.test-seed#[A926803B21EF3C10]) [n:127.0.0.1:59576_yf%2Ff    ] o.a.s.c.CoreDescriptor Created CoreDescriptor: {name=collection1, config=solrconfig.xml, transient=false, schema=schema.xml, loadOnStartup=true, configSetProperties=configsetprops.json, collection=control_collection, coreNodeName=, dataDir=data/, shard=}
   [junit4]   2> 741665 INFO  (TEST-CollectionsAPIDistributedZkTest.test-seed#[A926803B21EF3C10]) [n:127.0.0.1:59576_yf%2Ff    ] o.a.s.c.CorePropertiesLocator Found core collection1 in /home/jenkins/workspace/Lucene-Solr-5.5-Linux/solr/build/solr-core/test/J2/temp/solr.cloud.CollectionsAPIDistributedZkTest_A926803B21EF3C10-001/control-001/cores/collection1
   [junit4]   2> 741665 INFO  (TEST-CollectionsAPIDistributedZkTest.test-seed#[A926803B21EF3C10]) [n:127.0.0.1:59576_yf%2Ff    ] o.a.s.c.CorePropertiesLocator Found 1 core definitions
   [junit4]   2> 741666 INFO  (TEST-CollectionsAPIDistributedZkTest.test-seed#[A926803B21EF3C10]) [n:127.0.0.1:59576_yf%2Ff    ] o.a.s.s.SolrDispatchFilter user.dir=/home/jenkins/workspace/Lucene-Solr-5.5-Linux/solr/build/solr-core/test/J2
   [junit4]   2> 741666 INFO  (TEST-CollectionsAPIDistributedZkTest.test-seed#[A926803B21EF3C10]) [n:127.0.0.1:59576_yf%2Ff    ] o.a.s.s.SolrDispatchFilter SolrDispatchFilter.init() done
   [junit4]   2> 741666 INFO  (coreLoadExecutor-3371-thread-1-processing-n:127.0.0.1:59576_yf%2Ff) [n:127.0.0.1:59576_yf%2Ff c:control_collection   x:collection1] o.a.s.c.ZkController publishing state=down
   [junit4]   2> 741666 INFO  (coreLoadExecutor-3371-thread-1-processing-n:127.0.0.1:59576_yf%2Ff) [n:127.0.0.1:59576_yf%2Ff c:control_collection   x:collection1] o.a.s.c.ZkController numShards not found on descriptor - reading it from system property
   [junit4]   2> 741667 INFO  (OverseerStateUpdate-95472527647637510-127.0.0.1:59576_yf%2Ff-n_0000000000) [n:127.0.0.1:59576_yf%2Ff    ] o.a.s.c.Overseer processMessage: queueSize: 1, message = {
   [junit4]   2>   "core":"collection1",
   [junit4]   2>   "roles":null,
   [junit4]   2>   "base_url":"http://127.0.0.1:59576/yf/f",
   [junit4]   2>   "node_name":"127.0.0.1:59576_yf%2Ff",
   [junit4]   2>   "numShards":"1",
   [junit4]   2>   "state":"down",
   [junit4]   2>   "shard":null,
   [junit4]   2>   "collection":"control_collection",
   [junit4]   2>   "operation":"state"} current state version: 0
   [junit4]   2> 741667 INFO  (coreLoadExecutor-3371-thread-1-processing-n:127.0.0.1:59576_yf%2Ff) [n:127.0.0.1:59576_yf%2Ff c:control_collection   x:collection1] o.a.s.c.ZkController look for our core node name
   [junit4]   2> 741667 INFO  (OverseerStateUpdate-95472527647637510-127.0.0.1:59576_yf%2Ff-n_0000000000) [n:127.0.0.1:59576_yf%2Ff    ] o.a.s.c.o.ReplicaMutator Update state numShards=1 message={
   [junit4]   2>   "core":"collection1",
   [junit4]   2>   "roles":null,
   [junit4]   2>   "base_url":"http://127.0.0.1:59576/yf/f",
   [junit4]   2>   "node_name":"127.0.0.1:59576_yf%2Ff",
   [junit4]   2>   "numShards":"1",
   [junit4]   2>   "state":"down",
   [junit4]   2>   "shard":null,
   [junit4]   2>   "collection":"control_collection",
   [junit4]   2>   "operation":"state"}
   [junit4]   2> 741667 INFO  (OverseerStateUpdate-95472527647637510-127.0.0.1:59576_yf%2Ff-n_0000000000) [n:127.0.0.1:59576_yf%2Ff    ] o.a.s.c.o.ClusterStateMutator building a new cName: control_collection
   [junit4]   2> 741667 INFO  (OverseerStateUpdate-95472527647637510-127.0.0.1:59576_yf%2Ff-n_0000000000) [n:127.0.0.1:59576_yf%2Ff    ] o.a.s.c.o.ReplicaMutator Assigning new node to shard shard=shard1
   [junit4]   2> 741680 INFO  (zkCallback-1343-thread-1-processing-n:127.0.0.1:59576_yf%2Ff) [n:127.0.0.1:59576_yf%2Ff    ] o.a.s.c.c.ZkStateReader A cluster state change: [WatchedEvent state:SyncConnected type:NodeDataChanged path:/clusterstate.json], has occurred - updating... (live nodes size: [1])
   [junit4]   2> 741680 INFO  (zkCallback-1343-thread-2-processing-n:127.0.0.1:59576_yf%2Ff) [n:127.0.0.1:59576_yf%2Ff    ] o.a.s.c.c.ZkStateReader A cluster state change: [WatchedEvent state:SyncConnected type:NodeDataChanged path:/clusterstate.json], has occurred - updating... (live nodes size: [1])
   [junit4]   2> 742667 INFO  (coreLoadExecutor-3371-thread-1-processing-n:127.0.0.1:59576_yf%2Ff) [n:127.0.0.1:59576_yf%2Ff c:control_collection   x:collection1] o.a.s.c.ZkController waiting to find shard id in clusterstate for collection1
   [junit4]   2> 742668 INFO  (coreLoadExecutor-3371-thread-1-processing-n:127.0.0.1:59576_yf%2Ff) [n:127.0.0.1:59576_yf%2Ff c:control_collection   x:collection1] o.a.s.c.ZkController Check for collection zkNode:control_collection
   [junit4]   2> 742668 INFO  (coreLoadExecutor-3371-thread-1-processing-n:127.0.0.1:59576_yf%2Ff) [n:127.0.0.1:59576_yf%2Ff c:control_collection   x:collection1] o.a.s.c.ZkController Collection zkNode exists
   [junit4]   2> 742668 INFO  (coreLoadExecutor-3371-thread-1-processing-n:127.0.0.1:59576_yf%2Ff) [n:127.0.0.1:59576_yf%2Ff c:control_collection   x:collection1] o.a.s.c.c.ZkStateReader Load collection config from: [/collections/control_collection]
   [junit4]   2> 742668 INFO  (coreLoadExecutor-3371-thread-1-processing-n:127.0.0.1:59576_yf%2Ff) [n:127.0.0.1:59576_yf%2Ff c:control_collection   x:collection1] o.a.s.c.c.ZkStateReader path=[/collections/control_collection] [configName]=[conf1] specified config exists in ZooKeeper
   [junit4]   2> 742668 INFO  (coreLoadExecutor-3371-thread-1-processing-n:127.0.0.1:59576_yf%2Ff) [n:127.0.0.1:59576_yf%2Ff c:control_collection   x:collection1] o.a.s.c.SolrResourceLoader new SolrResourceLoader for directory: '/home/jenkins/workspace/Lucene-Solr-5.5-Linux/solr/build/solr-core/test/J2/temp/solr.cloud.CollectionsAPIDistributedZkTest_A926803B21EF3C10-001/control-001/cores/collection1'
   [junit4]   2> 742668 INFO  (coreLoadExecutor-3371-thread-1-processing-n:127.0.0.1:59576_yf%2Ff) [n:127.0.0.1:59576_yf%2Ff c:control_collection   x:collection1] o.a.s.c.SolrResourceLoader JNDI not configured for solr (NoInitialContextEx)
   [junit4]   2> 742669 INFO  (coreLoadExecutor-3371-thread-1-processing-n:127.0.0.1:59576_yf%2Ff) [n:127.0.0.1:59576_yf%2Ff c:control_collection   x:collection1] o.a.s.c.SolrResourceLoader solr home defaulted to 'solr/' (could not find system property or JNDI)
   [junit4]   2> 742670 INFO  (coreLoadExecutor-3371-thread-1-processing-n:127.0.0.1:59576_yf%2Ff) [n:127.0.0.1:59576_yf%2Ff c:control_collection   x:collection1] o.a.s.c.Config loaded config solrconfig.xml with version 0 
   [junit4]   2> 742676 INFO  (coreLoadExecutor-3371-thread-1-processing-n:127.0.0.1:59576_yf%2Ff) [n:127.0.0.1:59576_yf%2Ff c:control_collection   x:collection1] o.a.s.c.SolrConfig current version of requestparams : -1
   [junit4]   2> 742680 INFO  (coreLoadExecutor-3371-thread-1-processing-n:127.0.0.1:59576_yf%2Ff) [n:127.0.0.1:59576_yf%2Ff c:control_collection   x:collection1] o.a.s.c.SolrConfig Using Lucene MatchVersion: 5.5.0
   [junit4]   2> 742688 INFO  (coreLoadExecutor-3371-thread-1-processing-n:127.0.0.1:59576_yf%2Ff) [n:127.0.0.1:59576_yf%2Ff c:control_collection   x:collection1] o.a.s.c.SolrConfig Loaded SolrConfig: solrconfig.xml
   [junit4]   2> 742696 INFO  (coreLoadExecutor-3371-thread-1-processing-n:127.0.0.1:59576_yf%2Ff) [n:127.0.0.1:59576_yf%2Ff c:control_collection   x:collection1] o.a.s.s.IndexSchema [collection1] Schema name=test
   [junit4]   2> 742965 INFO  (coreLoadExecutor-3371-thread-1-processing-n:127.0.0.1:59576_yf%2Ff) [n:127.0.0.1:59576_yf%2Ff c:control_collection   x:collection1] o.a.s.s.OpenExchangeRatesOrgProvider Initialized with rates=open-exchange-rates.json, refreshInterval=1440.
   [junit4]   2> 742983 INFO  (coreLoadExecutor-3371-thread-1-processing-n:127.0.0.1:59576_yf%2Ff) [n:127.0.0.1:59576_yf%2Ff c:control_collection   x:collection1] o.a.s.s.IndexSchema default search field in schema is text
   [junit4]   2> 742984 INFO  (coreLoadExecutor-3371-thread-1-processing-n:127.0.0.1:59576_yf%2Ff) [n:127.0.0.1:59576_yf%2Ff c:control_collection   x:collection1] o.a.s.s.IndexSchema unique key field: id
   [junit4]   2> 742990 INFO  (coreLoadExecutor-3371-thread-1-processing-n:127.0.0.1:59576_yf%2Ff) [n:127.0.0.1:59576_yf%2Ff c:control_collection   x:collection1] o.a.s.s.FileExchangeRateProvider Reloading exchange rates from file currency.xml
   [junit4]   2> 742993 INFO  (coreLoadExecutor-3371-thread-1-processing-n:127.0.0.1:59576_yf%2Ff) [n:127.0.0.1:59576_yf%2Ff c:control_collection   x:collection1] o.a.s.s.FileExchangeRateProvider Reloading exchange rates from file currency.xml
   [junit4]   2> 742995 INFO  (coreLoadExecutor-3371-thread-1-processing-n:127.0.0.1:59576_yf%2Ff) [n:127.0.0.1:59576_yf%2Ff c:control_collection   x:collection1] o.a.s.s.OpenExchangeRatesOrgProvider Reloading exchange rates from open-exchange-rates.json
   [junit4]   2> 742995 INFO  (coreLoadExecutor-3371-thread-1-processing-n:127.0.0.1:59576_yf%2Ff) [n:127.0.0.1:59576_yf%2Ff c:control_collection   x:collection1] o.a.s.s.OpenExchangeRatesOrgProvider Reloading exchange rates from open-exchange-rates.json
   [junit4]   2> 742996 INFO  (coreLoadExecutor-3371-thread-1-processing-n:127.0.0.1:59576_yf%2Ff) [n:127.0.0.1:59576_yf%2Ff c:control_collection   x:collection1] o.a.s.c.ConfigSetProperties Did not find ConfigSet properties, assuming default properties: Can't find resource 'configsetprops.json' in classpath or '/configs/conf1', cwd=/home/jenkins/workspace/Lucene-Solr-5.5-Linux/solr/build/solr-core/test/J2
   [junit4]   2> 742996 INFO  (coreLoadExecutor-3371-thread-1-processing-n:127.0.0.1:59576_yf%2Ff) [n:127.0.0.1:59576_yf%2Ff c:control_collection   x:collection1] o.a.s.c.CoreContainer Creating SolrCore 'collection1' using configuration from collection control_collection
   [junit4]   2> 742996 INFO  (coreLoadExecutor-3371-thread-1-processing-n:127.0.0.1:59576_yf%2Ff) [n:127.0.0.1:59576_yf%2Ff c:control_collection s:shard1 r:core_node1 x:collection1] o.a.s.c.SolrCore org.apache.solr.core.MockDirectoryFactory
   [junit4]   2> 742996 INFO  (coreLoadExecutor-3371-thread-1-processing-n:127.0.0.1:59576_yf%2Ff) [n:127.0.0.1:59576_yf%2Ff c:control_collection s:shard1 r:core_node1 x:collection1] o.a.s.c.SolrCore [[collection1] ] Opening new SolrCore at [/home/jenkins/workspace/Lucene-Solr-5.5-Linux/solr/build/solr-core/test/J2/temp/solr.cloud.CollectionsAPIDistributedZkTest_A926803B21EF3C10-001/control-001/cores/collection1], dataDir=[/home/jenkins/workspace/Lucene-Solr-5.5-Linux/solr/build/solr-core/test/J2/temp/solr.cloud.CollectionsAPIDistributedZkTest_A926803B21EF3C10-001/control-001/cores/collection1/data/]
   [junit4]   2> 742996 INFO  (coreLoadExecutor-3371-thread-1-processing-n:127.0.0.1:59576_yf%2Ff) [n:127.0.0.1:59576_yf%2Ff c:control_collection s:shard1 r:core_node1 x:collection1] o.a.s.c.JmxMonitoredMap JMX monitoring is enabled. Adding Solr mbeans to JMX Server: com.sun.jmx.mbeanserver.JmxMBeanServer@395dc6a8
   [junit4]   2> 742997 INFO  (coreLoadExecutor-3371-thread-1-processing-n:127.0.0.1:59576_yf%2Ff) [n:127.0.0.1:59576_yf%2Ff c:control_collection s:shard1 r:core_node1 x:collection1] o.a.s.c.CachingDirectoryFactory return new directory for /home/jenkins/workspace/Lucene-Solr-5.5-Linux/solr/build/solr-core/test/J2/temp/solr.cloud.CollectionsAPIDistributedZkTest_A926803B21EF3C10-001/control-001/cores/collection1/data
   [junit4]   2> 742997 INFO  (coreLoadExecutor-3371-thread-1-processing-n:127.0.0.1:59576_yf%2Ff) [n:127.0.0.1:59576_yf%2Ff c:control_collection s:shard1 r:core_node1 x:collection1] o.a.s.c.SolrCore New index directory detected: old=null new=/home/jenkins/workspace/Lucene-Solr-5.5-Linux/solr/build/solr-core/test/J2/temp/solr.cloud.CollectionsAPIDistributedZkTest_A926803B21EF3C10-001/control-001/cores/collection1/data/index/
   [junit4]   2> 742997 WARN  (coreLoadExecutor-3371-thread-1-processing-n:127.0.0.1:59576_yf%2Ff) [n:127.0.0.1:59576_yf%2Ff c:control_collection s:shard1 r:core_node1 x:collection1] o.a.s.c.SolrCore [collection1] Solr index directory '/home/jenkins/workspace/Lucene-Solr-5.5-Linux/solr/build/solr-core/test/J2/temp/solr.cloud.CollectionsAPIDistributedZkTest_A926803B21EF3C10-001/control-001/cores/collection1/data/index' doesn't exist. Creating new index...
   [junit4]   2> 742997 INFO  (coreLoadExecutor-3371-thread-1-processing-n:127.0.0.1:59576_yf%2Ff) [n:127.0.0.1:59576_yf%2Ff c:control_collection s:shard1 r:core_node1 x:collection1] o.a.s.c.CachingDirectoryFactory return new directory for /home/jenkins/workspace/Lucene-Solr-5.5-Linux/solr/build/solr-core/test/J2/temp/solr.cloud.CollectionsAPIDistributedZkTest_A926803B21EF3C10-001/control-001/cores/collection1/data/index
   [junit4]   2> 742997 INFO  (coreLoadExecutor-3371-thread-1-processing-n:127.0.0.1:59576_yf%2Ff) [n:127.0.0.1:59576_yf%2Ff c:control_collection s:shard1 r:core_node1 x:collection1] o.a.s.u.RandomMergePolicy RandomMergePolicy wrapping class org.apache.lucene.index.LogDocMergePolicy: [LogDocMergePolicy: minMergeSize=1000, mergeFactor=35, maxMergeSize=9223372036854775807, maxMergeSizeForForcedMerge=9223372036854775807, calibrateSizeByDeletes=false, maxMergeDocs=2147483647, maxCFSSegmentSizeMB=8.796093022207999E12, noCFSRatio=0.5312081971910995]
   [junit4]   2> 742998 INFO  (coreLoadExecutor-3371-thread-1-processing-n:127.0.0.1:59576_yf%2Ff) [n:127.0.0.1:59576_yf%2Ff c:control_collection s:shard1 r:core_node1 x:collection1] o.a.s.c.SolrDeletionPolicy SolrDeletionPolicy.onCommit: commits: num=1
   [junit4]   2> 	commit{dir=MockDirectoryWrapper(RAMDirectory@747383ab lockFactory=org.apache.lucene.store.SingleInstanceLockFactory@7fb2c47f),segFN=segments_1,generation=1}
   [junit4]   2> 742998 INFO  (coreLoadExecutor-3371-thread-1-processing-n:127.0.0.1:59576_yf%2Ff) [n:127.0.0.1:59576_yf%2Ff c:control_collection s:shard1 r:core_node1 x:collection1] o.a.s.c.SolrDeletionPolicy newest commit generation = 1
   [junit4]   2> 742998 INFO  (OldIndexDirectoryCleanupThreadForCore-collection1) [n:127.0.0.1:59576_yf%2Ff c:control_collection s:shard1 r:core_node1 x:collection1] o.a.s.c.SolrCore Looking for old index directories to cleanup for core collection1 in /home/jenkins/workspace/Lucene-Solr-5.5-Linux/solr/build/solr-core/test/J2/temp/solr.cloud.CollectionsAPIDistributedZkTest_A926803B21EF3C10-001/control-001/cores/collection1/data/
   [junit4]   2> 742998 WARN  (OldIndexDirectoryCleanupThreadForCore-collection1) [n:127.0.0.1:59576_yf%2Ff c:control_collection s:shard1 r:core_node1 x:collection1] o.a.s.c.DirectoryFactory /home/jenkins/workspace/Lucene-Solr-5.5-Linux/solr/build/solr-core/test/J2/temp/solr.cloud.CollectionsAPIDistributedZkTest_A926803B21EF3C10-001/control-001/cores/collection1/data/ does not point to a valid data directory; skipping clean-up of old index directories.
   [junit4]   2> 743000 INFO  (coreLoadExecutor-3371-thread-1-processing-n:127.0.0.1:59576_yf%2Ff) [n:127.0.0.1:59576_yf%2Ff c:control_collection s:shard1 r:core_node1 x:collection1] o.a.s.u.p.UpdateRequestProcessorChain creating updateRequestProcessorChain "nodistrib"
   [junit4]   2> 743001 INFO  (coreLoadExecutor-3371-thread-1-processing-n:127.0.0.1:59576_yf%2Ff) [n:127.0.0.1:59576_yf%2Ff c:control_collection s:shard1 r:core_node1 x:collection1] o.a.s.u.p.UpdateRequestProcessorChain creating updateRequestProcessorChain "dedupe"
   [junit4]   2> 743001 INFO  (coreLoadExecutor-3371-thread-1-processing-n:127.0.0.1:59576_yf%2Ff) [n:127.0.0.1:59576_yf%2Ff c:control_collection s:shard1 r:core_node1 x:collection1] o.a.s.u.p.UpdateRequestProcessorChain inserting DistributedUpdateProcessorFactory into updateRequestProcessorChain "dedupe"
   [junit4]   2> 743001 INFO  (coreLoadExecutor-3371-thread-1-processing-n:127.0.0.1:59576_yf%2Ff) [n:127.0.0.1:59576_yf%2Ff c:control_collection s:shard1 r:core_node1 x:collection1] o.a.s.u.p.UpdateRequestProcessorChain creating updateRequestProcessorChain "stored_sig"
   [junit4]   2> 743001 INFO  (coreLoadExecutor-3371-thread-1-processing-n:127.0.0.1:59576_yf%2Ff) [n:127.0.0.1:59576_yf%2Ff c:control_collection s:shard1 r:core_node1 x:collection1] o.a.s.u.p.UpdateRequestProcessorChain inserting DistributedUpdateProcessorFactory into updateRequestProcessorChain "stored_sig"
   [junit4]   2> 743001 INFO  (coreLoadExecutor-3371-thread-1-processing-n:127.0.0.1:59576_yf%2Ff) [n:127.0.0.1:59576_yf%2Ff c:control_collection s:shard1 r:core_node1 x:collection1] o.a.s.u.p.UpdateRequestProcessorChain creating updateRequestProcessorChain "distrib-dup-test-chain-explicit"
   [junit4]   2> 743001 INFO  (coreLoadExecutor-3371-thread-1-processing-n:127.0.0.1:59576_yf%2Ff) [n:127.0.0.1:59576_yf%2Ff c:control_collection s:shard1 r:core_node1 x:collection1] o.a.s.u.p.UpdateRequestProcessorChain creating updateRequestProcessorChain "distrib-dup-test-chain-implicit"
   [junit4]   2> 743001 INFO  (coreLoadExecutor-3371-thread-1-processing-n:127.0.0.1:59576_yf%2Ff) [n:127.0.0.1:59576_yf%2Ff c:control_collection s:shard1 r:core_node1 x:collection1] o.a.s.u.p.UpdateRequestProcessorChain inserting DistributedUpdateProcessorFactory into updateRequestProcessorChain "distrib-dup-test-chain-implicit"
   [junit4]   2> 743001 INFO  (coreLoadExecutor-3371-thread-1-processing-n:127.0.0.1:59576_yf%2Ff) [n:127.0.0.1:59576_yf%2Ff c:control_collection s:shard1 r:core_node1 x:collection1] o.a.s.c.SolrCore no updateRequestProcessorChain defined as default, creating implicit default
   [junit4]   2> 743001 WARN  (coreLoadExecutor-3371-thread-1-processing-n:127.0.0.1:59576_yf%2Ff) [n:127.0.0.1:59576_yf%2Ff c:control_collection s:shard1 r:core_node1 x:collection1] o.a.s.c.RequestHandlers INVALID paramSet a in requestHandler {type = requestHandler,name = /dump,class = DumpRequestHandler,args = {defaults={a=A,b=B}}}
   [junit4]   2> 743002 INFO  (coreLoadExecutor-3371-thread-1-processing-n:127.0.0.1:59576_yf%2Ff) [n:127.0.0.1:59576_yf%2Ff c:control_collection s:shard1 r:core_node1 x:collection1] o.a.s.h.l.XMLLoader xsltCacheLifetimeSeconds=60
   [junit4]   2> 743004 INFO  (coreLoadExecutor-3371-thread-1-processing-n:127.0.0.1:59576_yf%2Ff) [n:127.0.0.1:59576_yf%2Ff c:control_collection s:shard1 r:core_node1 x:collection1] o.a.s.h.l.XMLLoader xsltCacheLifetimeSeconds=60
   [junit4]   2> 743005 INFO  (coreLoadExecutor-3371-thread-1-processing-n:127.0.0.1:59576_yf%2Ff) [n:127.0.0.1:59576_yf%2Ff c:control_collection s:shard1 r:core_node1 x:collection1] o.a.s.h.l.XMLLoader xsltCacheLifetimeSeconds=60
   [junit4]   2> 743005 INFO  (coreLoadExecutor-3371-thread-1-processing-n:127.0.0.1:59576_yf%2Ff) [n:127.0.0.1:59576_yf%2Ff c:control_collection s:shard1 r:core_node1 x:collection1] o.a.s.h.l.XMLLoader xsltCacheLifetimeSeconds=60
   [junit4]   2> 743007 INFO  (coreLoadExecutor-3371-thread-1-processing-n:127.0.0.1:59576_yf%2Ff) [n:127.0.0.1:59576_yf%2Ff c:control_collection s:shard1 r:core_node1 x:collection1] o.a.s.c.RequestHandlers Registered paths: /admin/mbeans,standard,/dump,/update/csv,/update/json/docs,/admin/luke,/admin/segments,/get,/admin/system,/replication,/admin/properties,/config,/schema,/admin/plugins,/admin/logging,/update/json,/admin/threads,/admin/ping,/update,/admin/file
   [junit4]   2> 743007 INFO  (coreLoadExecutor-3371-thread-1-processing-n:127.0.0.1:59576_yf%2Ff) [n:127.0.0.1:59576_yf%2Ff c:control_collection s:shard1 r:core_node1 x:collection1] o.a.s.c.SolrCore Using default statsCache cache: org.apache.solr.search.stats.LocalStatsCache
   [junit4]   2> 743008 INFO  (coreLoadExecutor-3371-thread-1-processing-n:127.0.0.1:59576_yf%2Ff) [n:127.0.0.1:59576_yf%2Ff c:control_collection s:shard1 r:core_node1 x:collection1] o.a.s.u.UpdateHandler Using UpdateLog implementation: org.apache.solr.update.UpdateLog
   [junit4]   2> 743008 INFO  (coreLoadExecutor-3371-thread-1-processing-n:127.0.0.1:59576_yf%2Ff) [n:127.0.0.1:59576_yf%2Ff c:control_collection s:shard1 r:core_node1 x:collection1] o.a.s.u.UpdateLog Initializing UpdateLog: dataDir= defaultSyncLevel=FLUSH numRecordsToKeep=100 maxNumLogsToKeep=10 numVersionBuckets=65536
   [junit4]   2> 743008 INFO  (coreLoadExecutor-3371-thread-1-processing-n:127.0.0.1:59576_yf%2Ff) [n:127.0.0.1:59576_yf%2Ff c:control_collection s:shard1 r:core_node1 x:collection1] o.a.s.u.CommitTracker Hard AutoCommit: disabled
   [junit4]   2> 743009 INFO  (coreLoadExecutor-3371-thread-1-processing-n:127.0.0.1:59576_yf%2Ff) [n:127.0.0.1:59576_yf%2Ff c:control_collection s:shard1 r:core_node1 x:collection1] o.a.s.u.CommitTracker Soft AutoCommit: disabled
   [junit4]   2> 743009 INFO  (coreLoadExecutor-3371-thread-1-processing-n:127.0.0.1:59576_yf%2Ff) [n:127.0.0.1:59576_yf%2Ff c:control_collection s:shard1 r:core_node1 x:collection1] o.a.s.u.RandomMergePolicy RandomMergePolicy wrapping class org.apache.lucene.index.LogDocMergePolicy: [LogDocMergePolicy: minMergeSize=1000, mergeFactor=28, maxMergeSize=9223372036854775807, maxMergeSizeForForcedMerge=9223372036854775807, calibrateSizeByDeletes=true, maxMergeDocs=2147483647, maxCFSSegmentSizeMB=8.796093022207999E12, noCFSRatio=1.0]
   [junit4]   2> 743009 INFO  (coreLoadExecutor-3371-thread-1-processing-n:127.0.0.1:59576_yf%2Ff) [n:127.0.0.1:59576_yf%2Ff c:control_collection s:shard1 r:core_node1 x:collection1] o.a.s.c.SolrDeletionPolicy SolrDeletionPolicy.onInit: commits: num=1
   [junit4]   2> 	commit{dir=MockDirectoryWrapper(RAMDirectory@747383ab lockFactory=org.apache.lucene.store.SingleInstanceLockFactory@7fb2c47f),segFN=segments_1,generation=1}
   [junit4]   2> 743009 INFO  (coreLoadExecutor-3371-thread-1-processing-n:127.0.0.1:59576_yf%2Ff) [n:127.0.0.1:59576_yf%2Ff c:control_collection s:shard1 r:core_node1 x:collection1] o.a.s.c.SolrDeletionPolicy newest commit generation = 1
   [junit4]   2> 743009 INFO  (coreLoadExecutor-3371-thread-1-processing-n:127.0.0.1:59576_yf%2Ff) [n:127.0.0.1:59576_yf%2Ff c:control_collection s:shard1 r:core_node1 x:collection1] o.a.s.s.SolrIndexSearcher Opening Searcher@7e8587bb[collection1] main
   [junit4]   2> 743009 INFO  (coreLoadExecutor-3371-thread-1-processing-n:127.0.0.1:59576_yf%2Ff) [n:127.0.0.1:59576_yf%2Ff c:control_collection s:shard1 r:core_node1 x:collection1] o.a.s.c.c.ZkStateReader Load collection config from: [/collections/control_collection]
   [junit4]   2> 743010 INFO  (coreLoadExecutor-3371-thread-1-processing-n:127.0.0.1:59576_yf%2Ff) [n:127.0.0.1:59576_yf%2Ff c:control_collection s:shard1 r:core_node1 x:collection1] o.a.s.c.c.ZkStateReader path=[/collections/control_collection] [configName]=[conf1] specified config exists in ZooKeeper
   [junit4]   2> 743010 INFO  (coreLoadExecutor-3371-thread-1-processing-n:127.0.0.1:59576_yf%2Ff) [n:127.0.0.1:59576_yf%2Ff c:control_collection s:shard1 r:core_node1 x:collection1] o.a.s.r.ManagedResourceStorage Setting up ZooKeeper-based storage for the RestManager with znodeBase: /configs/conf1
   [junit4]   2> 743010 INFO  (coreLoadExecutor-3371-thread-1-processing-n:127.0.0.1:59576_yf%2Ff) [n:127.0.0.1:59576_yf%2Ff c:control_collection s:shard1 r:core_node1 x:collection1] o.a.s.r.ManagedResourceStorage Configured ZooKeeperStorageIO with znodeBase: /configs/conf1
   [junit4]   2> 743010 INFO  (coreLoadExecutor-3371-thread-1-processing-n:127.0.0.1:59576_yf%2Ff) [n:127.0.0.1:59576_yf%2Ff c:control_collection s:shard1 r:core_node1 x:collection1] o.a.s.r.RestManager Initializing RestManager with initArgs: {}
   [junit4]   2> 743010 INFO  (coreLoadExecutor-3371-thread-1-processing-n:127.0.0.1:59576_yf%2Ff) [n:127.0.0.1:59576_yf%2Ff c:control_collection s:shard1 r:core_node1 x:collection1] o.a.s.r.ManagedResourceStorage Reading _rest_managed.json using ZooKeeperStorageIO:path=/configs/conf1
   [junit4]   2> 743010 INFO  (coreLoadExecutor-3371-thread-1-processing-n:127.0.0.1:59576_yf%2Ff) [n:127.0.0.1:59576_yf%2Ff c:control_collection s:shard1 r:core_node1 x:collection1] o.a.s.r.ManagedResourceStorage No data found for znode /configs/conf1/_rest_managed.json
   [junit4]   2> 743010 INFO  (coreLoadExecutor-3371-thread-1-processing-n:127.0.0.1:59576_yf%2Ff) [n:127.0.0.1:59576_yf%2Ff c:control_collection s:shard1 r:core_node1 x:collection1] o.a.s.r.ManagedResourceStorage Loaded null at path _rest_managed.json using ZooKeeperStorageIO:path=/configs/conf1
   [junit4]   2> 743010 INFO  (coreLoadExecutor-3371-thread-1-processing-n:127.0.0.1:59576_yf%2Ff) [n:127.0.0.1:59576_yf%2Ff c:control_collection s:shard1 r:core_node1 x:collection1] o.a.s.r.RestManager Initializing 0 registered ManagedResources
   [junit4]   2> 743011 INFO  (coreLoadExecutor-3371-thread-1-processing-n:127.0.0.1:59576_yf%2Ff) [n:127.0.0.1:59576_yf%2Ff c:control_collection s:shard1 r:core_node1 x:collection1] o.a.s.h.ReplicationHandler Commits will be reserved for  10000
   [junit4]   2> 743011 INFO  (searcherExecutor-3372-thread-1-processing-n:127.0.0.1:59576_yf%2Ff x:collection1 s:shard1 c:control_collection r:core_node1) [n:127.0.0.1:59576_yf%2Ff c:control_collection s:shard1 r:core_node1 x:collection1] o.a.s.c.SolrCore [collection1] Registered new searcher Searcher@7e8587bb[collection1] main{ExitableDirectoryReader(UninvertingDirectoryReader())}
   [junit4]   2> 743011 INFO  (coreLoadExecutor-3371-thread-1-processing-n:127.0.0.1:59576_yf%2Ff) [n:127.0.0.1:59576_yf%2Ff c:control_collection s:shard1 r:core_node1 x:collection1] o.a.s.u.UpdateLog Looking up max value of version field to seed version buckets
   [junit4]   2> 743011 INFO  (coreLoadExecutor-3371-thread-1-processing-n:127.0.0.1:59576_yf%2Ff) [n:127.0.0.1:59576_yf%2Ff c:control_collection s:shard1 r:core_node1 x:collection1] o.a.s.u.VersionInfo Refreshing highest value of _version_ for 65536 version buckets from index
   [junit4]   2> 743011 INFO  (coreLoadExecutor-3371-thread-1-processing-n:127.0.0.1:59576_yf%2Ff) [n:127.0.0.1:59576_yf%2Ff c:control_collection s:shard1 r:core_node1 x:collection1] o.a.s.u.VersionInfo No terms found for _version_, cannot seed version bucket highest value from index
   [junit4]   2> 743011 INFO  (coreLoadExecutor-3371-thread-1-processing-n:127.0.0.1:59576_yf%2Ff) [n:127.0.0.1:59576_yf%2Ff c:control_collection s:shard1 r:core_node1 x:collection1] o.a.s.u.UpdateLog Could not find max version in index or recent updates, using new clock 1527560444244393984
   [junit4]   2> 743013 INFO  (coreLoadExecutor-3371-thread-1-processing-n:127.0.0.1:59576_yf%2Ff) [n:127.0.0.1:59576_yf%2Ff c:control_collection s:shard1 r:core_node1 x:collection1] o.a.s.u.UpdateLog Took 1.0ms to seed version buckets with highest version 1527560444244393984
   [junit4]   2> 743013 INFO  (coreLoadExecutor-3371-thread-1-processing-n:127.0.0.1:59576_yf%2Ff) [n:127.0.0.1:59576_yf%2Ff c:control_collection s:shard1 r:core_node1 x:collection1] o.a.s.c.ZkController watch zkdir /configs/conf1
   [junit4]   2> 743013 INFO  (coreLoadExecutor-3371-thread-1-processing-n:127.0.0.1:59576_yf%2Ff) [n:127.0.0.1:59576_yf%2Ff c:control_collection s:shard1 r:core_node1 x:collection1] o.a.s.c.CoreContainer registering core: collection1
   [junit4]   2> 743014 INFO  (coreZkRegister-3365-thread-1-processing-n:127.0.0.1:59576_yf%2Ff x:collection1 s:shard1 c:control_collection r:core_node1) [n:127.0.0.1:59576_yf%2Ff c:control_collection s:shard1 r:core_node1 x:collection1] o.a.s.c.ZkController Register replica - core:collection1 address:http://127.0.0.1:59576/yf/f collection:control_collection shard:shard1
   [junit4]   2> 743014 INFO  (coreZkRegister-3365-thread-1-processing-n:127.0.0.1:59576_yf%2Ff x:collection1 s:shard1 c:control_collection r:core_node1) [n:127.0.0.1:59576_yf%2Ff c:control_collection s:shard1 r:core_node1 x:collection1] o.a.s.c.c.SolrZkClient makePath: /collections/control_collection/leader_elect/shard1/election
   [junit4]   2> 743016 INFO  (coreZkRegister-3365-thread-1-processing-n:127.0.0.1:59576_yf%2Ff x:collection1 s:shard1 c:control_collection r:core_node1) [n:127.0.0.1:59576_yf%2Ff c:control_collection s:shard1 r:core_node1 x:collection1] o.a.s.c.LeaderElector Joined leadership election with path: /collections/control_collection/leader_elect/shard1/election/95472527647637510-core_node1-n_0000000000
   [junit4]   2> 743016 INFO  (coreZkRegister-3365-thread-1-processing-n:127.0.0.1:59576_yf%2Ff x:collection1 s:shard1 c:control_collection r:core_node1) [n:127.0.0.1:59576_yf%2Ff c:control_collection s:shard1 r:core_node1 x:collection1] o.a.s.c.ShardLeaderElectionContext Running the leader process for shard=shard1 and weAreReplacement=false and leaderVoteWait=180000
   [junit4]   2> 743017 INFO  (coreZkRegister-3365-thread-1-processing-n:127.0.0.1:59576_yf%2Ff x:collection1 s:shard1 c:control_collection r:core_node1) [n:127.0.0.1:59576_yf%2Ff c:control_collection s:shard1 r:core_node1 x:collection1] o.a.s.c.ShardLeaderElectionContext Enough replicas found to continue.
   [junit4]   2> 743017 INFO  (coreZkRegister-3365-thread-1-processing-n:127.0.0.1:59576_yf%2Ff x:collection1 s:shard1 c:control_collection r:core_node1) [n:127.0.0.1:59576_yf%2Ff c:control_collection s:shard1 r:core_node1 x:collection1] o.a.s.c.ShardLeaderElectionContext I may be the new leader - try and sync
   [junit4]   2> 743017 INFO  (coreZkRegister-3365-thread-1-processing-n:127.0.0.1:59576_yf%2Ff x:collection1 s:shard1 c:control_collection r:core_node1) [n:127.0.0.1:59576_yf%2Ff c:control_collection s:shard1 r:core_node1 x:collection1] o.a.s.c.SyncStrategy Sync replicas to http://127.0.0.1:59576/yf/f/collection1/
   [junit4]   2> 743017 INFO  (OverseerStateUpdate-95472527647637510-127.0.0.1:59576_yf%2Ff-n_0000000000) [n:127.0.0.1:59576_yf%2Ff    ] o.a.s.c.Overseer processMessage: queueSize: 1, message = {
   [junit4]   2>   "operation":"leader",
   [junit4]   2>   "shard":"shard1",
   [junit4]   2>   "collection":"control_collection"} current state version: 1
   [junit4]   2> 743017 INFO  (coreZkRegister-3365-thread-1-processing-n:127.0.0.1:59576_yf%2Ff x:collection1 s:shard1 c:control_collection r:core_node1) [n:127.0.0.1:59576_yf%2Ff c:control_collection s:shard1 r:core_node1 x:collection1] o.a.s.c.SyncStrategy Sync Success - now sync replicas to me
   [junit4]   2> 743018 INFO  (coreZkRegister-3365-thread-1-processing-n:127.0.0.1:59576_yf%2Ff x:collection1 s:shard1 c:control_collection r:core_node1) [n:127.0.0.1:59576_yf%2Ff c:control_collection s:shard1 r:core_node1 x:collection1] o.a.s.c.SyncStrategy http://127.0.0.1:59576/yf/f/collection1/ has no replicas
   [junit4]   2> 743018 INFO  (coreZkRegister-3365-thread-1-processing-n:127.0.0.1:59576_yf%2Ff x:collection1 s:shard1 c:control_collection r:core_node1) [n:127.0.0.1:59576_yf%2Ff c:control_collection s:shard1 r:core_node1 x:collection1] o.a.s.c.c.SolrZkClient makePath: /collections/control_collection/leaders/shard1
   [junit4]   2> 743019 INFO  (coreZkRegister-3365-thread-1-processing-n:127.0.0.1:59576_yf%2Ff x:collection1 s:shard1 c:control_collection r:core_node1) [n:127.0.0.1:59576_yf%2Ff c:control_collection s:shard1 r:core_node1 x:collection1] o.a.s.c.ShardLeaderElectionContextBase Creating leader registration node
   [junit4]   2> 743020 INFO  (coreZkRegister-3365-thread-1-processing-n:127.0.0.1:59576_yf%2Ff x:collection1 s:shard1 c:control_collection r:core_node1) [n:127.0.0.1:59576_yf%2Ff c:control_collection s:shard1 r:core_node1 x:collection1] o.a.s.c.ShardLeaderElectionContext I am the new leader: http://127.0.0.1:59576/yf/f/collection1/ shard1
   [junit4]   2> 743021 INFO  (OverseerStateUpdate-95472527647637510-127.0.0.1:59576_yf%2Ff-n_0000000000) [n:127.0.0.1:59576_yf%2Ff    ] o.a.s.c.Overseer processMessage: queueSize: 1, message = {
   [junit4]   2>   "operation":"leader",
   [junit4]   2>   "shard":"shard1",
   [junit4]   2>   "collection":"control_collection",
   [junit4]   2>   "base_url":"http://127.0.0.1:59576/yf/f",
   [junit4]   2>   "core":"collection1",
   [junit4]   2>   "state":"active"} current state version: 1
   [junit4]   2> 743141 INFO  (zkCallback-1343-thread-2-processing-n:127.0.0.1:59576_yf%2Ff) [n:127.0.0.1:59576_yf%2Ff    ] o.a.s.c.c.ZkStateReader A cluster state change: [WatchedEvent state:SyncConnected type:NodeDataChanged path:/clusterstate.json], has occurred - updating... (live nodes size: [1])
   [junit4]   2> 743141 INFO  (zkCallback-1343-thread-1-processing-n:127.0.0.1:59576_yf%2Ff) [n:127.0.0.1:59576_yf%2Ff    ] o.a.s.c.c.ZkStateReader A cluster state change: [WatchedEvent state:SyncConnected type:NodeDataChanged path:/clusterstate.json], has occurred - updating... (live nodes size: [1])
   [junit4]   2> 743169 INFO  (TEST-CollectionsAPIDistributedZkTest.test-seed#[A926803B21EF3C10]) [    ] o.a.s.c.c.SolrZkClient Using default ZkCredentialsProvider
   [junit4]   2> 743169 INFO  (TEST-CollectionsAPIDistributedZkTest.test-seed#[A926803B21EF3C10]) [    ] o.a.s.c.c.ConnectionManager Waiting for client to connect to ZooKeeper
   [junit4]   2> 743172 INFO  (zkCallback-1345-thread-1) [    ] o.a.s.c.c.ConnectionManager Watcher org.apache.solr.common.cloud.ConnectionManager@7c358e29 name:ZooKeeperConnection Watcher:127.0.0.1:44032/solr got event WatchedEvent state:SyncConnected type:None path:null path:null type:None
   [junit4]   2> 743172 INFO  (TEST-CollectionsAPIDistributedZkTest.test-seed#[A926803B21EF3C10]) [    ] o.a.s.c.c.ConnectionManager Client is connected to ZooKeeper
   [junit4]   2> 743172 INFO  (TEST-CollectionsAPIDistributedZkTest.test-seed#[A926803B21EF3C10]) [    ] o.a.s.c.c.SolrZkClient Using default ZkACLProvider
   [junit4]   2> 743172 INFO  (TEST-CollectionsAPIDistributedZkTest.test-seed#[A926803B21EF3C10]) [    ] o.a.s.c.c.ZkStateReader Updating cluster state from ZooKeeper... 
   [junit4]   2> 743176 INFO  (TEST-CollectionsAPIDistributedZkTest.test-seed#[A926803B21EF3C10]) [    ] o.a.s.c.ChaosMonkey monkey: init - expire sessions:false cause connection loss:false
   [junit4]   2> 743176 INFO  (TEST-CollectionsAPIDistributedZkTest.test-seed#[A926803B21EF3C10]) [    ] o.a.s.c.AbstractFullDistribZkTestBase Creating collection1 with stateFormat=2
   [junit4]   2> 743176 INFO  (TEST-CollectionsAPIDistributedZkTest.test-seed#[A926803B21EF3C10]) [    ] o.a.s.c.c.SolrZkClient Using default ZkCredentialsProvider
   [junit4]   2> 743190 INFO  (coreZkRegister-3365-thread-1-processing-n:127.0.0.1:59576_yf%2Ff x:collection1 s:shard1 c:control_collection r:core_node1) [n:127.0.0.1:59576_yf%2Ff c:control_collection s:shard1 r:core_node1 x:collection1] o.a.s.c.ZkController We are http://127.0.0.1:59576/yf/f/collection1/ and leader is http://127.0.0.1:59576/yf/f/collection1/
   [junit4]   2> 743190 INFO  (coreZkRegister-3365-thread-1-processing-n:127.0.0.1:59576_yf%2Ff x:collection1 s:shard1 c:control_collection r:core_node1) [n:127.0.0.1:59576_yf%2Ff c:control_collection s:shard1 r:core_node1 x:collection1] o.a.s.c.ZkController No LogReplay needed for core=collection1 baseURL=http://127.0.0.1:59576/yf/f
   [junit4]   2> 743190 INFO  (coreZkRegister-3365-thread-1-processing-n:127.0.0.1:59576_yf%2Ff x:collection1 s:shard1 c:control_collection r:core_node1) [n:127.0.0.1:59576_yf%2Ff c:control_collection s:shard1 r:core_node1 x:collection1] o.a.s.c.ZkController I am the leader, no recovery necessary
   [junit4]   2> 743190 INFO  (coreZkRegister-3365-thread-1-processing-n:127.0.0.1:59576_yf%2Ff x:collection1 s:shard1 c:control_collection r:core_node1) [n:127.0.0.1:59576_yf%2Ff c:control_collection s:shard1 r:core_node1 x:collection1] o.a.s.c.ZkController publishing state=active
   [junit4]   2> 743190 INFO  (coreZkRegister-3365-thread-1-processing-n:127.0.0.1:59576_yf%2Ff x:collection1 s:shard1 c:control_collection r:core_node1) [n:127.0.0.1:59576_yf%2Ff c:control_collection s:shard1 r:core_node1 x:collection1] o.a.s.c.ZkController numShards not found on descriptor - reading it from system property
   [junit4]   2> 743191 INFO  (OverseerStateUpdate-95472527647637510-127.0.0.1:59576_yf%2Ff-n_0000000000) [n:127.0.0.1:59576_yf%2Ff    ] o.a.s.c.Overseer processMessage: queueSize: 1, message = {
   [junit4]   2>   "core":"collection1",
   [junit4]   2>   "core_node_name":"core_node1",
   [junit4]   2>   "roles":null,
   [junit4]   2>   "base_url":"http://127.0.0.1:59576/yf/f",
   [junit4]   2>   "node_name":"127.0.0.1:59576_yf%2Ff",
   [junit4]   2>   "numShards":"2",
   [junit4]   2>   "state":"active",
   [junit4]   2>   "shard":"shard1",
   [junit4]   2>   "collection":"control_collection",
   [junit4]   2>   "operation":"state"} current state version: 2
   [junit4]   2> 743192 INFO  (OverseerStateUpdate-95472527647637510-127.0.0.1:59576_yf%2Ff-n_0000000000) [n:127.0.0.1:59576_yf%2Ff    ] o.a.s.c.o.ReplicaMutator Update state numShards=2 message={
   [junit4]   2>   "core":"collection1",
   [junit4]   2>   "core_node_name":"core_node1",
   [junit4]   2>   "roles":null,
   [junit4]   2>   "base_url":"http://127.0.0.1:59576/yf/f",
   [junit4]   2>   "node_name":"127.0.0.1:59576_yf%2Ff",
   [junit4]   2>   "numShards":"2",
   [junit4]   2>   "state":"active",
   [junit4]   2>   "shard":"shard1",
   [junit4]   2>   "collection":"control_collection",
   [junit4]   2>   "operation":"state"}
   [junit4]   2> 743195 INFO  (TEST-CollectionsAPIDistributedZkTest.test-seed#[A926803B21EF3C10]) [    ] o.a.s.c.c.ConnectionManager Waiting for client to connect to ZooKeeper
   [junit4]   2> 743207 INFO  (zkCallback-1346-thread-1) [    ] o.a.s.c.c.ConnectionManager Watcher org.apache.solr.common.cloud.ConnectionManager@2c001187 name:ZooKeeperConnection Watcher:127.0.0.1:44032/solr got event WatchedEvent state:SyncConnected type:None path:null path:null type:None
   [junit4]   2> 743207 INFO  (TEST-CollectionsAPIDistributedZkTest.test-seed#[A926803B21EF3C10]) [    ] o.a.s.c.c.ConnectionManager Client is connected to ZooKeeper
   [junit4]   2> 743208 INFO  (TEST-CollectionsAPIDistributedZkTest.test-seed#[A926803B21EF3C10]) [    ] o.a.s.c.c.SolrZkClient Using default ZkACLProvider
   [junit4]   2> 743209 INFO  (OverseerStateUpdate-95472527647637510-127.0.0.1:59576_yf%2Ff-n_0000000000) [n:127.0.0.1:59576_yf%2Ff    ] o.a.s.c.Overseer processMessage: queueSize: 1, message = {
   [junit4]   2>   "operation":"create",
   [junit4]   2>   "name":"collection1",
   [junit4]   2>   "numShards":"2",
   [junit4]   2>   "stateFormat":"2"} current state version: 2
   [junit4]   2> 743209 INFO  (OverseerStateUpdate-95472527647637510-127.0.0.1:59576_yf%2Ff-n_0000000000) [n:127.0.0.1:59576_yf%2Ff    ] o.a.s.c.o.ClusterStateMutator building a new cName: collection1
   [junit4]   2> 743210 INFO  (zkCallback-1343-thread-1-processing-n:127.0.0.1:59576_yf%2Ff) [n:127.0.0.1:59576_yf%2Ff    ] o.a.s.c.c.ZkStateReader A cluster state change: [WatchedEvent state:SyncConnected type:NodeDataChanged path:/clusterstate.json], has occurred - updating... (live nodes size: [1])
   [junit4]   2> 743210 INFO  (zkCallback-1343-thread-2-processing-n:127.0.0.1:59576_yf%2Ff) [n:127.0.0.1:59576_yf%2Ff    ] o.a.s.c.c.ZkStateReader A cluster state change: [WatchedEvent state:SyncConnected type:NodeDataChanged path:/clusterstate.json], has occurred - updating... (live nodes size: [1])
   [junit4]   2> 743211 INFO  (zkCallback-1345-thread-1) [    ] o.a.s.c.c.ZkStateReader A cluster state change: [WatchedEvent state:SyncConnected type:NodeDataChanged path:/clusterstate.json], has occurred - updating... (live nodes size: [1])
   [junit4]   2> 743294 INFO  (TEST-CollectionsAPIDistributedZkTest.test-seed#[A926803B21EF3C10]) [    ] o.a.s.SolrTestCaseJ4 Writing core.properties file to /home/jenkins/workspace/Lucene-Solr-5.5-Linux/solr/build/solr-core/test/J2/temp/solr.cloud.CollectionsAPIDistributedZkTest_A926803B21EF3C10-001/shard-1-001/cores/collection1
   [junit4]   2> 743296 INFO  (TEST-CollectionsAPIDistributedZkTest.test-seed#[A926803B21EF3C10]) [    ] o.a.s.c.AbstractFullDistribZkTestBase create jetty 1 in directory /home/jenkins/workspace/Lucene-Solr-5.5-Linux/solr/build/solr-core/test/J2/temp/solr.cloud.CollectionsAPIDistributedZkTest_A926803B21EF3C10-001/shard-1-001
   [junit4]   2> 743296 INFO  (TEST-CollectionsAPIDistributedZkTest.test-see

[...truncated too long message...]

owFileRequestHandlerTest, TestWriterPerf, SharedFSAutoReplicaFailoverTest, CollectionsAPIDistributedZkTest]
   [junit4]   2> NOTE: reproduce with: ant test  -Dtestcase=CollectionsAPIDistributedZkTest -Dtests.seed=A926803B21EF3C10 -Dtests.multiplier=3 -Dtests.slow=true -Dtests.locale=sk -Dtests.timezone=Brazil/East -Dtests.asserts=true -Dtests.file.encoding=UTF-8
   [junit4] ERROR   0.00s J2 | CollectionsAPIDistributedZkTest (suite) <<<
   [junit4]    > Throwable #1: com.carrotsearch.randomizedtesting.ThreadLeakError: 5 threads leaked from SUITE scope at org.apache.solr.cloud.CollectionsAPIDistributedZkTest: 
   [junit4]    >    1) Thread[id=13352, name=zkCallback-1374-thread-2, state=TIMED_WAITING, group=TGRP-CollectionsAPIDistributedZkTest]
   [junit4]    >         at sun.misc.Unsafe.park(Native Method)
   [junit4]    >         at java.util.concurrent.locks.LockSupport.parkNanos(LockSupport.java:215)
   [junit4]    >         at java.util.concurrent.SynchronousQueue$TransferStack.awaitFulfill(SynchronousQueue.java:460)
   [junit4]    >         at java.util.concurrent.SynchronousQueue$TransferStack.transfer(SynchronousQueue.java:362)
   [junit4]    >         at java.util.concurrent.SynchronousQueue.poll(SynchronousQueue.java:941)
   [junit4]    >         at java.util.concurrent.ThreadPoolExecutor.getTask(ThreadPoolExecutor.java:1066)
   [junit4]    >         at java.util.concurrent.ThreadPoolExecutor.runWorker(ThreadPoolExecutor.java:1127)
   [junit4]    >         at java.util.concurrent.ThreadPoolExecutor$Worker.run(ThreadPoolExecutor.java:617)
   [junit4]    >         at java.lang.Thread.run(Thread.java:745)
   [junit4]    >    2) Thread[id=7417, name=zkCallback-1374-thread-1, state=TIMED_WAITING, group=TGRP-CollectionsAPIDistributedZkTest]
   [junit4]    >         at sun.misc.Unsafe.park(Native Method)
   [junit4]    >         at java.util.concurrent.locks.LockSupport.parkNanos(LockSupport.java:215)
   [junit4]    >         at java.util.concurrent.SynchronousQueue$TransferStack.awaitFulfill(SynchronousQueue.java:460)
   [junit4]    >         at java.util.concurrent.SynchronousQueue$TransferStack.transfer(SynchronousQueue.java:362)
   [junit4]    >         at java.util.concurrent.SynchronousQueue.poll(SynchronousQueue.java:941)
   [junit4]    >         at java.util.concurrent.ThreadPoolExecutor.getTask(ThreadPoolExecutor.java:1066)
   [junit4]    >         at java.util.concurrent.ThreadPoolExecutor.runWorker(ThreadPoolExecutor.java:1127)
   [junit4]    >         at java.util.concurrent.ThreadPoolExecutor$Worker.run(ThreadPoolExecutor.java:617)
   [junit4]    >         at java.lang.Thread.run(Thread.java:745)
   [junit4]    >    3) Thread[id=7416, name=TEST-CollectionsAPIDistributedZkTest.test-seed#[A926803B21EF3C10]-EventThread, state=WAITING, group=TGRP-CollectionsAPIDistributedZkTest]
   [junit4]    >         at sun.misc.Unsafe.park(Native Method)
   [junit4]    >         at java.util.concurrent.locks.LockSupport.park(LockSupport.java:175)
   [junit4]    >         at java.util.concurrent.locks.AbstractQueuedSynchronizer$ConditionObject.await(AbstractQueuedSynchronizer.java:2039)
   [junit4]    >         at java.util.concurrent.LinkedBlockingQueue.take(LinkedBlockingQueue.java:442)
   [junit4]    >         at org.apache.zookeeper.ClientCnxn$EventThread.run(ClientCnxn.java:494)
   [junit4]    >    4) Thread[id=7415, name=TEST-CollectionsAPIDistributedZkTest.test-seed#[A926803B21EF3C10]-SendThread(127.0.0.1:44032), state=TIMED_WAITING, group=TGRP-CollectionsAPIDistributedZkTest]
   [junit4]    >         at java.lang.Thread.sleep(Native Method)
   [junit4]    >         at org.apache.zookeeper.ClientCnxn$SendThread.run(ClientCnxn.java:994)
   [junit4]    >    5) Thread[id=13353, name=zkCallback-1374-thread-3, state=TIMED_WAITING, group=TGRP-CollectionsAPIDistributedZkTest]
   [junit4]    >         at sun.misc.Unsafe.park(Native Method)
   [junit4]    >         at java.util.concurrent.locks.LockSupport.parkNanos(LockSupport.java:215)
   [junit4]    >         at java.util.concurrent.SynchronousQueue$TransferStack.awaitFulfill(SynchronousQueue.java:460)
   [junit4]    >         at java.util.concurrent.SynchronousQueue$TransferStack.transfer(SynchronousQueue.java:362)
   [junit4]    >         at java.util.concurrent.SynchronousQueue.poll(SynchronousQueue.java:941)
   [junit4]    >         at java.util.concurrent.ThreadPoolExecutor.getTask(ThreadPoolExecutor.java:1066)
   [junit4]    >         at java.util.concurrent.ThreadPoolExecutor.runWorker(ThreadPoolExecutor.java:1127)
   [junit4]    >         at java.util.concurrent.ThreadPoolExecutor$Worker.run(ThreadPoolExecutor.java:617)
   [junit4]    >         at java.lang.Thread.run(Thread.java:745)
   [junit4]    > 	at __randomizedtesting.SeedInfo.seed([A926803B21EF3C10]:0)Throwable #2: com.carrotsearch.randomizedtesting.ThreadLeakError: There are still zombie threads that couldn't be terminated:
   [junit4]    >    1) Thread[id=13352, name=zkCallback-1374-thread-2, state=TIMED_WAITING, group=TGRP-CollectionsAPIDistributedZkTest]
   [junit4]    >         at sun.misc.Unsafe.park(Native Method)
   [junit4]    >         at java.util.concurrent.locks.LockSupport.parkNanos(LockSupport.java:215)
   [junit4]    >         at java.util.concurrent.SynchronousQueue$TransferStack.awaitFulfill(SynchronousQueue.java:460)
   [junit4]    >         at java.util.concurrent.SynchronousQueue$TransferStack.transfer(SynchronousQueue.java:362)
   [junit4]    >         at java.util.concurrent.SynchronousQueue.poll(SynchronousQueue.java:941)
   [junit4]    >         at java.util.concurrent.ThreadPoolExecutor.getTask(ThreadPoolExecutor.java:1066)
   [junit4]    >         at java.util.concurrent.ThreadPoolExecutor.runWorker(ThreadPoolExecutor.java:1127)
   [junit4]    >         at java.util.concurrent.ThreadPoolExecutor$Worker.run(ThreadPoolExecutor.java:617)
   [junit4]    >         at java.lang.Thread.run(Thread.java:745)
   [junit4]    >    2) Thread[id=7417, name=zkCallback-1374-thread-1, state=TIMED_WAITING, group=TGRP-CollectionsAPIDistributedZkTest]
   [junit4]    >         at sun.misc.Unsafe.park(Native Method)
   [junit4]    >         at java.util.concurrent.locks.LockSupport.parkNanos(LockSupport.java:215)
   [junit4]    >         at java.util.concurrent.SynchronousQueue$TransferStack.awaitFulfill(SynchronousQueue.java:460)
   [junit4]    >         at java.util.concurrent.SynchronousQueue$TransferStack.transfer(SynchronousQueue.java:362)
   [junit4]    >         at java.util.concurrent.SynchronousQueue.poll(SynchronousQueue.java:941)
   [junit4]    >         at java.util.concurrent.ThreadPoolExecutor.getTask(ThreadPoolExecutor.java:1066)
   [junit4]    >         at java.util.concurrent.ThreadPoolExecutor.runWorker(ThreadPoolExecutor.java:1127)
   [junit4]    >         at java.util.concurrent.ThreadPoolExecutor$Worker.run(ThreadPoolExecutor.java:617)
   [junit4]    >         at java.lang.Thread.run(Thread.java:745)
   [junit4]    >    3) Thread[id=7415, name=TEST-CollectionsAPIDistributedZkTest.test-seed#[A926803B21EF3C10]-SendThread(127.0.0.1:44032), state=TIMED_WAITING, group=TGRP-CollectionsAPIDistributedZkTest]
   [junit4]    >         at java.lang.Thread.sleep(Native Method)
   [junit4]    >         at org.apache.zookeeper.client.StaticHostProvider.next(StaticHostProvider.java:101)
   [junit4]    >         at org.apache.zookeeper.ClientCnxn$SendThread.startConnect(ClientCnxn.java:940)
   [junit4]    >         at org.apache.zookeeper.ClientCnxn$SendThread.run(ClientCnxn.java:1003)
   [junit4]    >    4) Thread[id=13353, name=zkCallback-1374-thread-3, state=TIMED_WAITING, group=TGRP-CollectionsAPIDistributedZkTest]
   [junit4]    >         at sun.misc.Unsafe.park(Native Method)
   [junit4]    >         at java.util.concurrent.locks.LockSupport.parkNanos(LockSupport.java:215)
   [junit4]    >         at java.util.concurrent.SynchronousQueue$TransferStack.awaitFulfill(SynchronousQueue.java:460)
   [junit4]    >         at java.util.concurrent.SynchronousQueue$TransferStack.transfer(SynchronousQueue.java:362)
   [junit4]    >         at java.util.concurrent.SynchronousQueue.poll(SynchronousQueue.java:941)
   [junit4]    >         at java.util.concurrent.ThreadPoolExecutor.getTask(ThreadPoolExecutor.java:1066)
   [junit4]    >         at java.util.concurrent.ThreadPoolExecutor.runWorker(ThreadPoolExecutor.java:1127)
   [junit4]    >         at java.util.concurrent.ThreadPoolExecutor$Worker.run(ThreadPoolExecutor.java:617)
   [junit4]    >         at java.lang.Thread.run(Thread.java:745)
   [junit4]    > 	at __randomizedtesting.SeedInfo.seed([A926803B21EF3C10]:0)
   [junit4] Completed [289/566 (1!)] on J2 in 83.70s, 1 test, 3 errors <<< FAILURES!

[...truncated 850 lines...]
BUILD FAILED
/home/jenkins/workspace/Lucene-Solr-5.5-Linux/build.xml:750: The following error occurred while executing this line:
/home/jenkins/workspace/Lucene-Solr-5.5-Linux/build.xml:694: The following error occurred while executing this line:
/home/jenkins/workspace/Lucene-Solr-5.5-Linux/build.xml:59: The following error occurred while executing this line:
/home/jenkins/workspace/Lucene-Solr-5.5-Linux/solr/build.xml:233: The following error occurred while executing this line:
/home/jenkins/workspace/Lucene-Solr-5.5-Linux/solr/common-build.xml:534: The following error occurred while executing this line:
/home/jenkins/workspace/Lucene-Solr-5.5-Linux/lucene/common-build.xml:1477: The following error occurred while executing this line:
/home/jenkins/workspace/Lucene-Solr-5.5-Linux/lucene/common-build.xml:1033: There were test failures: 566 suites (7 ignored), 2277 tests, 2 suite-level errors, 1 error, 1035 ignored (33 assumptions) [seed: A926803B21EF3C10]

Total time: 41 minutes 51 seconds
Build step 'Invoke Ant' marked build as failure
Archiving artifacts
[WARNINGS] Skipping publisher since build result is FAILURE
Recording test results
Email was triggered for: Failure - Any
Sending email for trigger: Failure - Any