You are viewing a plain text version of this content. The canonical link for it is here.
Posted to notification@tuscany.apache.org by Apache Jenkins Server <je...@builds.apache.org> on 2013/02/06 02:16:07 UTC

Build failed in Jenkins: Tuscany-2x #928

See <https://builds.apache.org/job/Tuscany-2x/928/>

------------------------------------------
[...truncated 34349 lines...]
	project: MavenProject: org.apache.tuscany.sca:tuscany-tracing-aspectj:2.5-SNAPSHOT @ <https://builds.apache.org/job/Tuscany-2x/ws/sca-2x/modules/tracing-aspectj/pom.xml>
[INFO] Processing artifact: org.springframework:spring-aop:jar:3.0.5.RELEASE:compile
[INFO] Processing artifact: com.hazelcast:hazelcast:jar:1.9.2.2:compile
[INFO] Processing artifact: org.springframework:spring-core:jar:3.0.5.RELEASE:compile
[INFO] Processing artifact: active project artifact:
	artifact = org.apache.tuscany.sca:tuscany-assembly:jar:2.5-SNAPSHOT:compile;
	project: MavenProject: org.apache.tuscany.sca:tuscany-assembly:2.5-SNAPSHOT @ <https://builds.apache.org/job/Tuscany-2x/ws/sca-2x/modules/assembly/pom.xml>
[INFO] Processing artifact: active project artifact:
	artifact = org.apache.tuscany.sca:tuscany-interface-java-jaxws:jar:2.5-SNAPSHOT:compile;
	project: MavenProject: org.apache.tuscany.sca:tuscany-interface-java-jaxws:2.5-SNAPSHOT @ <https://builds.apache.org/job/Tuscany-2x/ws/sca-2x/modules/interface-java-jaxws/pom.xml>
[INFO] Processing artifact: org.apache.geronimo.specs:geronimo-annotation_1.1_spec:jar:1.0:compile
[INFO] Processing artifact: active project artifact:
	artifact = org.apache.tuscany.sca:tuscany-host-corba:jar:2.5-SNAPSHOT:compile;
	project: MavenProject: org.apache.tuscany.sca:tuscany-host-corba:2.5-SNAPSHOT @ <https://builds.apache.org/job/Tuscany-2x/ws/sca-2x/modules/host-corba/pom.xml>
[INFO] Processing artifact: active project artifact:
	artifact = org.apache.tuscany.sca:tuscany-node-launcher-equinox:jar:2.5-SNAPSHOT:compile;
	project: MavenProject: org.apache.tuscany.sca:tuscany-node-launcher-equinox:2.5-SNAPSHOT @ <https://builds.apache.org/job/Tuscany-2x/ws/sca-2x/modules/node-launcher-equinox/pom.xml>
[INFO] Processing artifact: active project artifact:
	artifact = org.apache.tuscany.sca:tuscany-data-api:jar:2.5-SNAPSHOT:compile;
	project: MavenProject: org.apache.tuscany.sca:tuscany-data-api:2.5-SNAPSHOT @ <https://builds.apache.org/job/Tuscany-2x/ws/sca-2x/modules/data-api/pom.xml>
[INFO] Processing artifact: org.apache.santuario:xmlsec:jar:1.4.4:compile
[INFO] Processing artifact: org.dojotoolkit:dojo:zip:1.5.0:compile
[INFO] Processing artifact: active project artifact:
	artifact = org.apache.tuscany.sca:tuscany-node-impl-osgi:jar:2.5-SNAPSHOT:compile;
	project: MavenProject: org.apache.tuscany.sca:tuscany-node-impl-osgi:2.5-SNAPSHOT @ <https://builds.apache.org/job/Tuscany-2x/ws/sca-2x/modules/node-impl-osgi/pom.xml>
[INFO] Processing artifact: active project artifact:
	artifact = org.apache.tuscany.sca:tuscany-binding-corba:jar:2.5-SNAPSHOT:compile;
	project: MavenProject: org.apache.tuscany.sca:tuscany-binding-corba:2.5-SNAPSHOT @ <https://builds.apache.org/job/Tuscany-2x/ws/sca-2x/modules/binding-corba/pom.xml>
[INFO] Processing artifact: active project artifact:
	artifact = org.apache.tuscany.sca:tuscany-implementation-java:jar:2.5-SNAPSHOT:compile;
	project: MavenProject: org.apache.tuscany.sca:tuscany-implementation-java:2.5-SNAPSHOT @ <https://builds.apache.org/job/Tuscany-2x/ws/sca-2x/modules/implementation-java/pom.xml>
[INFO] Processing artifact: org.apache.geronimo.specs:geronimo-javamail_1.4_spec:jar:1.6:compile
[INFO] Processing artifact: org.apache.rampart:rampart-trust:jar:1.5.1:compile
[INFO] Processing artifact: org.apache.ode:ode-bpel-dao:jar:1.3.2:compile
[INFO] Processing artifact: active project artifact:
	artifact = org.apache.tuscany.sca:tuscany-policy-logging:jar:2.5-SNAPSHOT:compile;
	project: MavenProject: org.apache.tuscany.sca:tuscany-policy-logging:2.5-SNAPSHOT @ <https://builds.apache.org/job/Tuscany-2x/ws/sca-2x/modules/policy-logging/pom.xml>
[INFO] Processing artifact: active project artifact:
	artifact = org.apache.tuscany.sca:tuscany-monitor:jar:2.5-SNAPSHOT:compile;
	project: MavenProject: org.apache.tuscany.sca:tuscany-monitor:2.5-SNAPSHOT @ <https://builds.apache.org/job/Tuscany-2x/ws/sca-2x/modules/monitor/pom.xml>
[INFO] Processing artifact: active project artifact:
	artifact = org.apache.tuscany.sca:tuscany-binding-atom:jar:2.5-SNAPSHOT:compile;
	project: MavenProject: org.apache.tuscany.sca:tuscany-binding-atom:2.5-SNAPSHOT @ <https://builds.apache.org/job/Tuscany-2x/ws/sca-2x/modules/binding-atom/pom.xml>
[INFO] Processing artifact: active project artifact:
	artifact = org.apache.tuscany.sca:tuscany-binding-ws-runtime-axis2:jar:2.5-SNAPSHOT:compile;
	project: MavenProject: org.apache.tuscany.sca:tuscany-binding-ws-runtime-axis2:2.5-SNAPSHOT @ <https://builds.apache.org/job/Tuscany-2x/ws/sca-2x/modules/binding-ws-runtime-axis2/pom.xml>
[INFO] Processing artifact: active project artifact:
	artifact = org.apache.tuscany.sca:tuscany-host-corba-jse-tns:jar:2.5-SNAPSHOT:compile;
	project: MavenProject: org.apache.tuscany.sca:tuscany-host-corba-jse-tns:2.5-SNAPSHOT @ <https://builds.apache.org/job/Tuscany-2x/ws/sca-2x/modules/host-corba-jse-tns/pom.xml>
[INFO] Processing artifact: org.apache.geronimo.modules:geronimo-kernel:jar:2.0.1:compile
[INFO] Processing artifact: active project artifact:
	artifact = org.apache.tuscany.sca:tuscany-deployment:jar:2.5-SNAPSHOT:compile;
	project: MavenProject: org.apache.tuscany.sca:tuscany-deployment:2.5-SNAPSHOT @ <https://builds.apache.org/job/Tuscany-2x/ws/sca-2x/modules/deployment/pom.xml>
[INFO] Processing artifact: active project artifact:
	artifact = active project artifact:
	artifact = active project artifact:
	artifact = org.apache.tuscany.sca.aggregation:tuscany-base-runtime-aggregation:jar:2.5-SNAPSHOT:compile;
	project: MavenProject: org.apache.tuscany.sca.aggregation:tuscany-base-runtime-aggregation:2.5-SNAPSHOT @ <https://builds.apache.org/job/Tuscany-2x/ws/sca-2x/distribution/aggregations/base-runtime-aggregation/pom.xml;>
	project: MavenProject: org.apache.tuscany.sca.aggregation:tuscany-base-runtime-aggregation:2.5-SNAPSHOT @ <https://builds.apache.org/job/Tuscany-2x/ws/sca-2x/distribution/aggregations/base-runtime-aggregation/pom.xml;>
	project: MavenProject: org.apache.tuscany.sca.aggregation:tuscany-base-runtime-aggregation:2.5-SNAPSHOT @ <https://builds.apache.org/job/Tuscany-2x/ws/sca-2x/distribution/aggregations/base-runtime-aggregation/pom.xml>
[INFO] Processing artifact: org.aspectj:aspectjrt:jar:1.6.8:compile
[INFO] Processing artifact: org.apache.abdera:abdera-client:jar:1.1.1:compile
[INFO] Processing artifact: net.sourceforge.saxon:saxon:jar:xqj:9.1.0.8:compile
[INFO] Processing artifact: active project artifact:
	artifact = org.apache.tuscany.sca:tuscany-binding-jsonrpc-runtime:jar:2.5-SNAPSHOT:compile;
	project: MavenProject: org.apache.tuscany.sca:tuscany-binding-jsonrpc-runtime:2.5-SNAPSHOT @ <https://builds.apache.org/job/Tuscany-2x/ws/sca-2x/modules/binding-jsonrpc-runtime/pom.xml>
[INFO] Processing artifact: org.mortbay.jetty:jetty-util:jar:6.1.26:compile
[INFO] Processing artifact: org.apache.ws.commons.axiom:axiom-api:jar:1.2.10:compile
[INFO] Processing artifact: active project artifact:
	artifact = org.apache.tuscany.sca:tuscany-implementation-spring-runtime:jar:2.5-SNAPSHOT:compile;
	project: MavenProject: org.apache.tuscany.sca:tuscany-implementation-spring-runtime:2.5-SNAPSHOT @ <https://builds.apache.org/job/Tuscany-2x/ws/sca-2x/modules/implementation-spring-runtime/pom.xml>
[INFO] Processing artifact: org.apache.tuscany.sdo:tuscany-sdo-api-r2.1:jar:1.1.1:compile
[INFO] Processing artifact: active project artifact:
	artifact = org.apache.tuscany.sca:tuscany-binding-rmi-runtime:jar:2.5-SNAPSHOT:compile;
	project: MavenProject: org.apache.tuscany.sca:tuscany-binding-rmi-runtime:2.5-SNAPSHOT @ <https://builds.apache.org/job/Tuscany-2x/ws/sca-2x/modules/binding-rmi-runtime/pom.xml>
[INFO] Processing artifact: org.apache.neethi:neethi:jar:2.0.4:compile
[INFO] Processing artifact: active project artifact:
	artifact = org.apache.tuscany.sca:tuscany-web-javascript:jar:2.5-SNAPSHOT:compile;
	project: MavenProject: org.apache.tuscany.sca:tuscany-web-javascript:2.5-SNAPSHOT @ <https://builds.apache.org/job/Tuscany-2x/ws/sca-2x/modules/web-javascript/pom.xml>
[INFO] Processing artifact: org.directwebremoting:dwr:jar:2.0.3:compile
[INFO] Processing artifact: org.apache.ws.commons.axiom:axiom-impl:jar:1.2.10:compile
[INFO] MANIFEST.MF found for org.apache.ws.commons.axiom:axiom-impl:jar:1.2.10:compile (<https://builds.apache.org/job/Tuscany-2x/ws/sca-2x/distribution/all/manifests/axiom-impl-1.2.10.MF)>
[INFO] Processing artifact: org.apache.tuscany.sdo:tuscany-sdo-impl:jar:1.1.1:compile
[INFO] Processing artifact: net.sourceforge.saxon:saxon:jar:xpath:9.1.0.8:compile
[INFO] Processing artifact: active project artifact:
	artifact = org.apache.tuscany.sca:tuscany-host-jetty:jar:2.5-SNAPSHOT:compile;
	project: MavenProject: org.apache.tuscany.sca:tuscany-host-jetty:2.5-SNAPSHOT @ <https://builds.apache.org/job/Tuscany-2x/ws/sca-2x/modules/host-jetty/pom.xml>
[INFO] Processing artifact: active project artifact:
	artifact = org.apache.tuscany.sca:tuscany-myfaces:jar:2.5-SNAPSHOT:compile;
	project: MavenProject: org.apache.tuscany.sca:tuscany-myfaces:2.5-SNAPSHOT @ <https://builds.apache.org/job/Tuscany-2x/ws/sca-2x/modules/myfaces/pom.xml>
[INFO] Processing artifact: org.apache.ode:ode-jacob-ap:jar:1.3.2:compile
[INFO] Processing artifact: net.sourceforge.saxon:saxon:jar:9.1.0.8:compile
[INFO] Processing artifact: net.sourceforge.saxon:saxon:jar:dom:9.1.0.8:compile
[INFO] Processing artifact: active project artifact:
	artifact = org.apache.tuscany.sca:tuscany-sca-client-impl:jar:2.5-SNAPSHOT:compile;
	project: MavenProject: org.apache.tuscany.sca:tuscany-sca-client-impl:2.5-SNAPSHOT @ <https://builds.apache.org/job/Tuscany-2x/ws/sca-2x/modules/sca-client-impl/pom.xml>
[INFO] Processing artifact: active project artifact:
	artifact = org.apache.tuscany.sca:tuscany-assembly-xml:jar:2.5-SNAPSHOT:compile;
	project: MavenProject: org.apache.tuscany.sca:tuscany-assembly-xml:2.5-SNAPSHOT @ <https://builds.apache.org/job/Tuscany-2x/ws/sca-2x/modules/assembly-xml/pom.xml>
[INFO] Processing artifact: org.apache.geronimo.specs:geronimo-j2ee-connector_1.5_spec:jar:2.0.0:compile
[INFO] Processing artifact: active project artifact:
	artifact = org.apache.tuscany.sca:tuscany-databinding-sdo:jar:2.5-SNAPSHOT:compile;
	project: MavenProject: org.apache.tuscany.sca:tuscany-databinding-sdo:2.5-SNAPSHOT @ <https://builds.apache.org/job/Tuscany-2x/ws/sca-2x/modules/databinding-sdo/pom.xml>
[INFO] Processing artifact: active project artifact:
	artifact = org.apache.tuscany.sca:tuscany-sca-api:jar:2.5-SNAPSHOT:compile;
	project: MavenProject: org.apache.tuscany.sca:tuscany-sca-api:2.5-SNAPSHOT @ <https://builds.apache.org/job/Tuscany-2x/ws/sca-2x/modules/sca-api/pom.xml>
[INFO] Processing artifact: active project artifact:
	artifact = org.apache.tuscany.sca:tuscany-implementation-web:jar:2.5-SNAPSHOT:compile;
	project: MavenProject: org.apache.tuscany.sca:tuscany-implementation-web:2.5-SNAPSHOT @ <https://builds.apache.org/job/Tuscany-2x/ws/sca-2x/modules/implementation-web/pom.xml>
[INFO] Processing artifact: org.apache.ode:ode-bpel-epr:jar:1.3.2:compile
[INFO] Processing artifact: active project artifact:
	artifact = org.apache.tuscany.sca:tuscany-implementation-web-client:jar:2.5-SNAPSHOT:compile;
	project: MavenProject: org.apache.tuscany.sca:tuscany-implementation-web-client:2.5-SNAPSHOT @ <https://builds.apache.org/job/Tuscany-2x/ws/sca-2x/modules/implementation-web-client/pom.xml>
[INFO] Processing artifact: active project artifact:
	artifact = active project artifact:
	artifact = active project artifact:
	artifact = org.apache.tuscany.sca:tuscany-feature-all:pom:2.5-SNAPSHOT:compile;
	project: MavenProject: org.apache.tuscany.sca:tuscany-feature-all:2.5-SNAPSHOT @ <https://builds.apache.org/job/Tuscany-2x/ws/sca-2x/features/all/pom.xml;>
	project: MavenProject: org.apache.tuscany.sca:tuscany-feature-all:2.5-SNAPSHOT @ <https://builds.apache.org/job/Tuscany-2x/ws/sca-2x/features/all/pom.xml;>
	project: MavenProject: org.apache.tuscany.sca:tuscany-feature-all:2.5-SNAPSHOT @ <https://builds.apache.org/job/Tuscany-2x/ws/sca-2x/features/all/pom.xml>
[INFO] Processing artifact: org.json:json:jar:20090211:compile
[INFO] Processing artifact: org.apache.ws.commons.axiom:axiom-dom:jar:1.2.10:compile
[INFO] Processing artifact: active project artifact:
	artifact = org.apache.tuscany.sca:tuscany-xsd:jar:2.5-SNAPSHOT:compile;
	project: MavenProject: org.apache.tuscany.sca:tuscany-xsd:2.5-SNAPSHOT @ <https://builds.apache.org/job/Tuscany-2x/ws/sca-2x/modules/xsd/pom.xml>
[INFO] Processing artifact: active project artifact:
	artifact = org.apache.tuscany.sca:tuscany-policy-wspolicy:jar:2.5-SNAPSHOT:compile;
	project: MavenProject: org.apache.tuscany.sca:tuscany-policy-wspolicy:2.5-SNAPSHOT @ <https://builds.apache.org/job/Tuscany-2x/ws/sca-2x/modules/policy-wspolicy/pom.xml>
[INFO] Processing artifact: org.eclipse.emf:common:jar:2.2.3:compile
[INFO] Processing artifact: org.eclipse.core:runtime:jar:3.4.0-v20080512:runtime
[INFO] Processing artifact: active project artifact:
	artifact = org.apache.tuscany.sca:tuscany-implementation-script:jar:2.5-SNAPSHOT:compile;
	project: MavenProject: org.apache.tuscany.sca:tuscany-implementation-script:2.5-SNAPSHOT @ <https://builds.apache.org/job/Tuscany-2x/ws/sca-2x/modules/implementation-script/pom.xml>
[INFO] Processing artifact: active project artifact:
	artifact = org.apache.tuscany.sca:tuscany-domain-hazelcast:jar:2.5-SNAPSHOT:compile;
	project: MavenProject: org.apache.tuscany.sca:tuscany-domain-hazelcast:2.5-SNAPSHOT @ <https://builds.apache.org/job/Tuscany-2x/ws/sca-2x/modules/domain-hazelcast/pom.xml>
[INFO] Processing artifact: org.codehaus.groovy:groovy-all:jar:1.7.1:runtime
[INFO] Processing artifact: org.apache.wink:wink-client-apache-httpclient:jar:1.2.0-incubating:compile
[INFO] Processing artifact: org.apache.axis2:org.apache.axis2.osgi:jar:1.5.3:compile
[INFO] Overriding the manifest for org.apache.axis2:org.apache.axis2.osgi:jar:1.5.3:compile
[INFO] Processing artifact: org.apache.ode:ode-bpel-runtime:jar:1.3.2:compile
[INFO] Processing artifact: org.eclipse.emf:ecore-change:jar:2.2.3:compile
[INFO] Processing artifact: org.codehaus.jackson:jackson-mapper-asl:jar:1.9.4:compile
[INFO] Processing artifact: org.apache.openjpa:openjpa:jar:1.2.1:compile
[INFO] Processing artifact: org.apache.geronimo.specs:geronimo-ejb_3.0_spec:jar:1.0.1:compile
[INFO] Processing artifact: active project artifact:
	artifact = org.apache.tuscany.sca:tuscany-binding-ws-runtime-jaxws:jar:2.5-SNAPSHOT:compile;
	project: MavenProject: org.apache.tuscany.sca:tuscany-binding-ws-runtime-jaxws:2.5-SNAPSHOT @ <https://builds.apache.org/job/Tuscany-2x/ws/sca-2x/modules/binding-ws-runtime-jaxws/pom.xml>
[INFO] Processing artifact: jdom:jdom:jar:1.0:compile
[INFO] Processing artifact: org.apache.ode:ode-bpel-compiler:jar:1.3.2:compile
[INFO] Processing artifact: active project artifact:
	artifact = org.apache.tuscany.sca:tuscany-host-corba-jee:jar:2.5-SNAPSHOT:compile;
	project: MavenProject: org.apache.tuscany.sca:tuscany-host-corba-jee:2.5-SNAPSHOT @ <https://builds.apache.org/job/Tuscany-2x/ws/sca-2x/modules/host-corba-jee/pom.xml>
[INFO] Processing artifact: active project artifact:
	artifact = org.apache.tuscany.sca:tuscany-binding-rest-runtime:jar:2.5-SNAPSHOT:compile;
	project: MavenProject: org.apache.tuscany.sca:tuscany-binding-rest-runtime:2.5-SNAPSHOT @ <https://builds.apache.org/job/Tuscany-2x/ws/sca-2x/modules/binding-rest-runtime/pom.xml>
[INFO] Processing artifact: wsdl4j:wsdl4j:jar:1.6.2:compile
[INFO] Processing artifact: org.mortbay.jetty:jetty:jar:6.1.26:compile
[INFO] Processing artifact: org.apache.geronimo.components:geronimo-connector:jar:2.1.4:compile
[INFO] Processing artifact: active project artifact:
	artifact = org.apache.tuscany.sca:tuscany-binding-jsonrpc:jar:2.5-SNAPSHOT:compile;
	project: MavenProject: org.apache.tuscany.sca:tuscany-binding-jsonrpc:2.5-SNAPSHOT @ <https://builds.apache.org/job/Tuscany-2x/ws/sca-2x/modules/binding-jsonrpc/pom.xml>
[INFO] Processing artifact: active project artifact:
	artifact = org.apache.tuscany.sca:tuscany-implementation-python:jar:2.5-SNAPSHOT:compile;
	project: MavenProject: org.apache.tuscany.sca:tuscany-implementation-python:2.5-SNAPSHOT @ <https://builds.apache.org/job/Tuscany-2x/ws/sca-2x/modules/implementation-python/pom.xml>
[INFO] Processing artifact: commons-codec:commons-codec:jar:1.6:compile
[INFO] Generating manifest jar: <https://builds.apache.org/job/Tuscany-2x/ws/sca-2x/distribution/all/target/features/tuscany-binding-ejb-runtime/tuscany-binding-ejb-runtime-manifest.jar>
[INFO] Generating manifest jar: <https://builds.apache.org/job/Tuscany-2x/ws/sca-2x/distribution/all/target/features/tuscany-implementation-osgi-runtime/tuscany-implementation-osgi-runtime-manifest.jar>
[INFO] Generating manifest jar: <https://builds.apache.org/job/Tuscany-2x/ws/sca-2x/distribution/all/target/features/tuscany-host-jetty/tuscany-host-jetty-manifest.jar>
[INFO] Generating manifest jar: <https://builds.apache.org/job/Tuscany-2x/ws/sca-2x/distribution/all/target/features/tuscany-binding-ws-runtime-axis2/tuscany-binding-ws-runtime-axis2-manifest.jar>
[INFO] Generating manifest jar: <https://builds.apache.org/job/Tuscany-2x/ws/sca-2x/distribution/all/target/features/tuscany-implementation-python-runtime/tuscany-implementation-python-runtime-manifest.jar>
[INFO] Generating manifest jar: <https://builds.apache.org/job/Tuscany-2x/ws/sca-2x/distribution/all/target/features/tuscany-binding-jms-runtime/tuscany-binding-jms-runtime-manifest.jar>
[INFO] Generating manifest jar: <https://builds.apache.org/job/Tuscany-2x/ws/sca-2x/distribution/all/target/features/tuscany-implementation-spring-runtime/tuscany-implementation-spring-runtime-manifest.jar>
[INFO] Generating manifest jar: <https://builds.apache.org/job/Tuscany-2x/ws/sca-2x/distribution/all/target/features/tuscany-binding-rest-runtime/tuscany-binding-rest-runtime-manifest.jar>
[INFO] Generating manifest jar: <https://builds.apache.org/job/Tuscany-2x/ws/sca-2x/distribution/all/target/features/tuscany-binding-atom-runtime/tuscany-binding-atom-runtime-manifest.jar>
[INFO] Generating manifest jar: <https://builds.apache.org/job/Tuscany-2x/ws/sca-2x/distribution/all/target/features/tuscany-implementation-widget-runtime/tuscany-implementation-widget-runtime-manifest.jar>
[INFO] Generating manifest jar: <https://builds.apache.org/job/Tuscany-2x/ws/sca-2x/distribution/all/target/features/tuscany-base-runtime-pom/tuscany-base-runtime-pom-manifest.jar>
[INFO] Generating manifest jar: <https://builds.apache.org/job/Tuscany-2x/ws/sca-2x/distribution/all/target/features/tuscany-implementation-bpel-runtime/tuscany-implementation-bpel-runtime-manifest.jar>
[INFO] Generating manifest jar: <https://builds.apache.org/job/Tuscany-2x/ws/sca-2x/distribution/all/target/features/tuscany-binding-corba-runtime/tuscany-binding-corba-runtime-manifest.jar>
[INFO] Generating manifest jar: <https://builds.apache.org/job/Tuscany-2x/ws/sca-2x/distribution/all/target/features/tuscany-binding-rmi-runtime/tuscany-binding-rmi-runtime-manifest.jar>
[INFO] Generating manifest jar: <https://builds.apache.org/job/Tuscany-2x/ws/sca-2x/distribution/all/target/features/tuscany-binding-jsonrpc-runtime/tuscany-binding-jsonrpc-runtime-manifest.jar>
[INFO] Generating manifest jar: <https://builds.apache.org/job/Tuscany-2x/ws/sca-2x/distribution/all/target/features/tuscany-implementation-script-runtime/tuscany-implementation-script-runtime-manifest.jar>
[INFO] Generating manifest jar: <https://builds.apache.org/job/Tuscany-2x/ws/sca-2x/distribution/all/target/features/tuscany-binding-jsonp-runtime/tuscany-binding-jsonp-runtime-manifest.jar>
[INFO] Generating manifest jar: <https://builds.apache.org/job/Tuscany-2x/ws/sca-2x/distribution/all/target/features/tuscany-implementation-web-runtime/tuscany-implementation-web-runtime-manifest.jar>
[INFO] Generating equinox manifest jar: <https://builds.apache.org/job/Tuscany-2x/ws/sca-2x/distribution/all/target/features/tuscany-sca-equinox-manifest.jar>
[INFO] Generating ANT build path: <https://builds.apache.org/job/Tuscany-2x/ws/sca-2x/distribution/all/target/features/tuscany-binding-ejb-runtime/build-path.xml>
[INFO] Generating ANT build path: <https://builds.apache.org/job/Tuscany-2x/ws/sca-2x/distribution/all/target/features/tuscany-implementation-osgi-runtime/build-path.xml>
[INFO] Generating ANT build path: <https://builds.apache.org/job/Tuscany-2x/ws/sca-2x/distribution/all/target/features/tuscany-host-jetty/build-path.xml>
[INFO] Generating ANT build path: <https://builds.apache.org/job/Tuscany-2x/ws/sca-2x/distribution/all/target/features/tuscany-binding-ws-runtime-axis2/build-path.xml>
[INFO] Generating ANT build path: <https://builds.apache.org/job/Tuscany-2x/ws/sca-2x/distribution/all/target/features/tuscany-implementation-python-runtime/build-path.xml>
[INFO] Generating ANT build path: <https://builds.apache.org/job/Tuscany-2x/ws/sca-2x/distribution/all/target/features/tuscany-binding-jms-runtime/build-path.xml>
[INFO] Generating ANT build path: <https://builds.apache.org/job/Tuscany-2x/ws/sca-2x/distribution/all/target/features/tuscany-implementation-spring-runtime/build-path.xml>
[INFO] Generating ANT build path: <https://builds.apache.org/job/Tuscany-2x/ws/sca-2x/distribution/all/target/features/tuscany-binding-rest-runtime/build-path.xml>
[INFO] Generating ANT build path: <https://builds.apache.org/job/Tuscany-2x/ws/sca-2x/distribution/all/target/features/tuscany-binding-atom-runtime/build-path.xml>
[INFO] Generating ANT build path: <https://builds.apache.org/job/Tuscany-2x/ws/sca-2x/distribution/all/target/features/tuscany-implementation-widget-runtime/build-path.xml>
[INFO] Generating ANT build path: <https://builds.apache.org/job/Tuscany-2x/ws/sca-2x/distribution/all/target/features/tuscany-base-runtime-pom/build-path.xml>
[INFO] Generating ANT build path: <https://builds.apache.org/job/Tuscany-2x/ws/sca-2x/distribution/all/target/features/tuscany-implementation-bpel-runtime/build-path.xml>
[INFO] Generating ANT build path: <https://builds.apache.org/job/Tuscany-2x/ws/sca-2x/distribution/all/target/features/tuscany-binding-corba-runtime/build-path.xml>
[INFO] Generating ANT build path: <https://builds.apache.org/job/Tuscany-2x/ws/sca-2x/distribution/all/target/features/tuscany-binding-rmi-runtime/build-path.xml>
[INFO] Generating ANT build path: <https://builds.apache.org/job/Tuscany-2x/ws/sca-2x/distribution/all/target/features/tuscany-binding-jsonrpc-runtime/build-path.xml>
[INFO] Generating ANT build path: <https://builds.apache.org/job/Tuscany-2x/ws/sca-2x/distribution/all/target/features/tuscany-implementation-script-runtime/build-path.xml>
[INFO] Generating ANT build path: <https://builds.apache.org/job/Tuscany-2x/ws/sca-2x/distribution/all/target/features/tuscany-binding-jsonp-runtime/build-path.xml>
[INFO] Generating ANT build path: <https://builds.apache.org/job/Tuscany-2x/ws/sca-2x/distribution/all/target/features/tuscany-implementation-web-runtime/build-path.xml>
[INFO] Generating Which Jars: <https://builds.apache.org/job/Tuscany-2x/ws/sca-2x/distribution/all/target/features/tuscany-binding-ejb-runtime/which-jars>
[INFO] Generating Which Jars: <https://builds.apache.org/job/Tuscany-2x/ws/sca-2x/distribution/all/target/features/tuscany-implementation-osgi-runtime/which-jars>
[INFO] Generating Which Jars: <https://builds.apache.org/job/Tuscany-2x/ws/sca-2x/distribution/all/target/features/tuscany-host-jetty/which-jars>
[INFO] Generating Which Jars: <https://builds.apache.org/job/Tuscany-2x/ws/sca-2x/distribution/all/target/features/tuscany-binding-ws-runtime-axis2/which-jars>
[INFO] Generating Which Jars: <https://builds.apache.org/job/Tuscany-2x/ws/sca-2x/distribution/all/target/features/tuscany-implementation-python-runtime/which-jars>
[INFO] Generating Which Jars: <https://builds.apache.org/job/Tuscany-2x/ws/sca-2x/distribution/all/target/features/tuscany-binding-jms-runtime/which-jars>
[INFO] Generating Which Jars: <https://builds.apache.org/job/Tuscany-2x/ws/sca-2x/distribution/all/target/features/tuscany-implementation-spring-runtime/which-jars>
[INFO] Generating Which Jars: <https://builds.apache.org/job/Tuscany-2x/ws/sca-2x/distribution/all/target/features/tuscany-binding-rest-runtime/which-jars>
[INFO] Generating Which Jars: <https://builds.apache.org/job/Tuscany-2x/ws/sca-2x/distribution/all/target/features/tuscany-binding-atom-runtime/which-jars>
[INFO] Generating Which Jars: <https://builds.apache.org/job/Tuscany-2x/ws/sca-2x/distribution/all/target/features/tuscany-implementation-widget-runtime/which-jars>
[INFO] Generating Which Jars: <https://builds.apache.org/job/Tuscany-2x/ws/sca-2x/distribution/all/target/features/tuscany-base-runtime-pom/which-jars>
[INFO] Generating Which Jars: <https://builds.apache.org/job/Tuscany-2x/ws/sca-2x/distribution/all/target/features/tuscany-implementation-bpel-runtime/which-jars>
[INFO] Generating Which Jars: <https://builds.apache.org/job/Tuscany-2x/ws/sca-2x/distribution/all/target/features/tuscany-binding-corba-runtime/which-jars>
[INFO] Generating Which Jars: <https://builds.apache.org/job/Tuscany-2x/ws/sca-2x/distribution/all/target/features/tuscany-binding-rmi-runtime/which-jars>
[INFO] Generating Which Jars: <https://builds.apache.org/job/Tuscany-2x/ws/sca-2x/distribution/all/target/features/tuscany-binding-jsonrpc-runtime/which-jars>
[INFO] Generating Which Jars: <https://builds.apache.org/job/Tuscany-2x/ws/sca-2x/distribution/all/target/features/tuscany-implementation-script-runtime/which-jars>
[INFO] Generating Which Jars: <https://builds.apache.org/job/Tuscany-2x/ws/sca-2x/distribution/all/target/features/tuscany-binding-jsonp-runtime/which-jars>
[INFO] Generating Which Jars: <https://builds.apache.org/job/Tuscany-2x/ws/sca-2x/distribution/all/target/features/tuscany-implementation-web-runtime/which-jars>
[INFO] [site:attach-descriptor {execution: default-attach-descriptor}]
[INFO] [assembly:single {execution: distribution-package}]
[INFO] Reading assembly descriptor: src/main/assembly/bin-distribution.xml
[INFO] Reading assembly descriptor: src/main/assembly/src.xml
[WARNING] POM for 'org.opensaml:opensaml:pom:2.2.3:compile' is invalid.

Its dependencies (if any) will NOT be available to the current build.
[WARNING] Cannot include project artifact: org.apache.tuscany.sca:tuscany-distribution-all:pom:2.5-SNAPSHOT; it doesn't have an associated file or directory.
[WARNING] Cannot include project artifact: org.apache.tuscany.sca:tuscany-distribution-all:pom:2.5-SNAPSHOT; it doesn't have an associated file or directory.
[JENKINS] Archiving disabled
[INFO] ------------------------------------------------------------------------
[ERROR] BUILD ERROR
[INFO] ------------------------------------------------------------------------
[INFO] Failed to create assembly: Error creating assembly archive : Failed to retrieve numeric file attributes using: '/bin/sh -c ls -1laR <https://builds.apache.org/job/Tuscany-2x/ws/sca-2x/distribution/all/../..'>

[INFO] ------------------------------------------------------------------------
[INFO] For more information, run Maven with the -e switch
[INFO] ------------------------------------------------------------------------
[INFO] Total time: 20 minutes 21 seconds
[INFO] Finished at: Wed Feb 06 01:15:59 UTC 2013
[INFO] Final Memory: 547M/730M
[INFO] ------------------------------------------------------------------------
Waiting for Jenkins to finish collecting data
Sending e-mails to: notification@tuscany.apache.org
Sending e-mails to: notification@tuscany.apache.org
channel stopped
2013-02-06 01:16:02.564:INFO::Shutdown hook executing
2013-02-06 01:16:02.565:INFO::Shutdown hook complete

Build failed in Jenkins: Tuscany-2x #937

Posted by Apache Jenkins Server <je...@builds.apache.org>.
See <https://builds.apache.org/job/Tuscany-2x/937/>

------------------------------------------
[...truncated 34457 lines...]
	project: MavenProject: org.apache.tuscany.sca:tuscany-tracing-aspectj:2.5-SNAPSHOT @ <https://builds.apache.org/job/Tuscany-2x/ws/sca-2x/modules/tracing-aspectj/pom.xml>
[INFO] Processing artifact: org.springframework:spring-aop:jar:3.0.5.RELEASE:compile
[INFO] Processing artifact: com.hazelcast:hazelcast:jar:1.9.2.2:compile
[INFO] Processing artifact: org.springframework:spring-core:jar:3.0.5.RELEASE:compile
[INFO] Processing artifact: active project artifact:
	artifact = org.apache.tuscany.sca:tuscany-assembly:jar:2.5-SNAPSHOT:compile;
	project: MavenProject: org.apache.tuscany.sca:tuscany-assembly:2.5-SNAPSHOT @ <https://builds.apache.org/job/Tuscany-2x/ws/sca-2x/modules/assembly/pom.xml>
[INFO] Processing artifact: active project artifact:
	artifact = org.apache.tuscany.sca:tuscany-interface-java-jaxws:jar:2.5-SNAPSHOT:compile;
	project: MavenProject: org.apache.tuscany.sca:tuscany-interface-java-jaxws:2.5-SNAPSHOT @ <https://builds.apache.org/job/Tuscany-2x/ws/sca-2x/modules/interface-java-jaxws/pom.xml>
[INFO] Processing artifact: org.apache.geronimo.specs:geronimo-annotation_1.1_spec:jar:1.0:compile
[INFO] Processing artifact: active project artifact:
	artifact = org.apache.tuscany.sca:tuscany-host-corba:jar:2.5-SNAPSHOT:compile;
	project: MavenProject: org.apache.tuscany.sca:tuscany-host-corba:2.5-SNAPSHOT @ <https://builds.apache.org/job/Tuscany-2x/ws/sca-2x/modules/host-corba/pom.xml>
[INFO] Processing artifact: active project artifact:
	artifact = org.apache.tuscany.sca:tuscany-node-launcher-equinox:jar:2.5-SNAPSHOT:compile;
	project: MavenProject: org.apache.tuscany.sca:tuscany-node-launcher-equinox:2.5-SNAPSHOT @ <https://builds.apache.org/job/Tuscany-2x/ws/sca-2x/modules/node-launcher-equinox/pom.xml>
[INFO] Processing artifact: active project artifact:
	artifact = org.apache.tuscany.sca:tuscany-data-api:jar:2.5-SNAPSHOT:compile;
	project: MavenProject: org.apache.tuscany.sca:tuscany-data-api:2.5-SNAPSHOT @ <https://builds.apache.org/job/Tuscany-2x/ws/sca-2x/modules/data-api/pom.xml>
[INFO] Processing artifact: org.apache.santuario:xmlsec:jar:1.4.4:compile
[INFO] Processing artifact: org.dojotoolkit:dojo:zip:1.5.0:compile
[INFO] Processing artifact: active project artifact:
	artifact = org.apache.tuscany.sca:tuscany-node-impl-osgi:jar:2.5-SNAPSHOT:compile;
	project: MavenProject: org.apache.tuscany.sca:tuscany-node-impl-osgi:2.5-SNAPSHOT @ <https://builds.apache.org/job/Tuscany-2x/ws/sca-2x/modules/node-impl-osgi/pom.xml>
[INFO] Processing artifact: active project artifact:
	artifact = org.apache.tuscany.sca:tuscany-binding-corba:jar:2.5-SNAPSHOT:compile;
	project: MavenProject: org.apache.tuscany.sca:tuscany-binding-corba:2.5-SNAPSHOT @ <https://builds.apache.org/job/Tuscany-2x/ws/sca-2x/modules/binding-corba/pom.xml>
[INFO] Processing artifact: active project artifact:
	artifact = org.apache.tuscany.sca:tuscany-implementation-java:jar:2.5-SNAPSHOT:compile;
	project: MavenProject: org.apache.tuscany.sca:tuscany-implementation-java:2.5-SNAPSHOT @ <https://builds.apache.org/job/Tuscany-2x/ws/sca-2x/modules/implementation-java/pom.xml>
[INFO] Processing artifact: org.apache.geronimo.specs:geronimo-javamail_1.4_spec:jar:1.6:compile
[INFO] Processing artifact: org.apache.rampart:rampart-trust:jar:1.5.1:compile
[INFO] Processing artifact: org.apache.ode:ode-bpel-dao:jar:1.3.2:compile
[INFO] Processing artifact: active project artifact:
	artifact = org.apache.tuscany.sca:tuscany-policy-logging:jar:2.5-SNAPSHOT:compile;
	project: MavenProject: org.apache.tuscany.sca:tuscany-policy-logging:2.5-SNAPSHOT @ <https://builds.apache.org/job/Tuscany-2x/ws/sca-2x/modules/policy-logging/pom.xml>
[INFO] Processing artifact: active project artifact:
	artifact = org.apache.tuscany.sca:tuscany-monitor:jar:2.5-SNAPSHOT:compile;
	project: MavenProject: org.apache.tuscany.sca:tuscany-monitor:2.5-SNAPSHOT @ <https://builds.apache.org/job/Tuscany-2x/ws/sca-2x/modules/monitor/pom.xml>
[INFO] Processing artifact: active project artifact:
	artifact = org.apache.tuscany.sca:tuscany-binding-atom:jar:2.5-SNAPSHOT:compile;
	project: MavenProject: org.apache.tuscany.sca:tuscany-binding-atom:2.5-SNAPSHOT @ <https://builds.apache.org/job/Tuscany-2x/ws/sca-2x/modules/binding-atom/pom.xml>
[INFO] Processing artifact: active project artifact:
	artifact = org.apache.tuscany.sca:tuscany-binding-ws-runtime-axis2:jar:2.5-SNAPSHOT:compile;
	project: MavenProject: org.apache.tuscany.sca:tuscany-binding-ws-runtime-axis2:2.5-SNAPSHOT @ <https://builds.apache.org/job/Tuscany-2x/ws/sca-2x/modules/binding-ws-runtime-axis2/pom.xml>
[INFO] Processing artifact: active project artifact:
	artifact = org.apache.tuscany.sca:tuscany-host-corba-jse-tns:jar:2.5-SNAPSHOT:compile;
	project: MavenProject: org.apache.tuscany.sca:tuscany-host-corba-jse-tns:2.5-SNAPSHOT @ <https://builds.apache.org/job/Tuscany-2x/ws/sca-2x/modules/host-corba-jse-tns/pom.xml>
[INFO] Processing artifact: org.apache.geronimo.modules:geronimo-kernel:jar:2.0.1:compile
[INFO] Processing artifact: active project artifact:
	artifact = org.apache.tuscany.sca:tuscany-deployment:jar:2.5-SNAPSHOT:compile;
	project: MavenProject: org.apache.tuscany.sca:tuscany-deployment:2.5-SNAPSHOT @ <https://builds.apache.org/job/Tuscany-2x/ws/sca-2x/modules/deployment/pom.xml>
[INFO] Processing artifact: active project artifact:
	artifact = active project artifact:
	artifact = active project artifact:
	artifact = org.apache.tuscany.sca.aggregation:tuscany-base-runtime-aggregation:jar:2.5-SNAPSHOT:compile;
	project: MavenProject: org.apache.tuscany.sca.aggregation:tuscany-base-runtime-aggregation:2.5-SNAPSHOT @ <https://builds.apache.org/job/Tuscany-2x/ws/sca-2x/distribution/aggregations/base-runtime-aggregation/pom.xml;>
	project: MavenProject: org.apache.tuscany.sca.aggregation:tuscany-base-runtime-aggregation:2.5-SNAPSHOT @ <https://builds.apache.org/job/Tuscany-2x/ws/sca-2x/distribution/aggregations/base-runtime-aggregation/pom.xml;>
	project: MavenProject: org.apache.tuscany.sca.aggregation:tuscany-base-runtime-aggregation:2.5-SNAPSHOT @ <https://builds.apache.org/job/Tuscany-2x/ws/sca-2x/distribution/aggregations/base-runtime-aggregation/pom.xml>
[INFO] Processing artifact: org.aspectj:aspectjrt:jar:1.6.8:compile
[INFO] Processing artifact: org.apache.abdera:abdera-client:jar:1.1.1:compile
[INFO] Processing artifact: net.sourceforge.saxon:saxon:jar:xqj:9.1.0.8:compile
[INFO] Processing artifact: active project artifact:
	artifact = org.apache.tuscany.sca:tuscany-binding-jsonrpc-runtime:jar:2.5-SNAPSHOT:compile;
	project: MavenProject: org.apache.tuscany.sca:tuscany-binding-jsonrpc-runtime:2.5-SNAPSHOT @ <https://builds.apache.org/job/Tuscany-2x/ws/sca-2x/modules/binding-jsonrpc-runtime/pom.xml>
[INFO] Processing artifact: org.mortbay.jetty:jetty-util:jar:6.1.26:compile
[INFO] Processing artifact: org.apache.ws.commons.axiom:axiom-api:jar:1.2.10:compile
[INFO] Processing artifact: active project artifact:
	artifact = org.apache.tuscany.sca:tuscany-implementation-spring-runtime:jar:2.5-SNAPSHOT:compile;
	project: MavenProject: org.apache.tuscany.sca:tuscany-implementation-spring-runtime:2.5-SNAPSHOT @ <https://builds.apache.org/job/Tuscany-2x/ws/sca-2x/modules/implementation-spring-runtime/pom.xml>
[INFO] Processing artifact: org.apache.tuscany.sdo:tuscany-sdo-api-r2.1:jar:1.1.1:compile
[INFO] Processing artifact: active project artifact:
	artifact = org.apache.tuscany.sca:tuscany-binding-rmi-runtime:jar:2.5-SNAPSHOT:compile;
	project: MavenProject: org.apache.tuscany.sca:tuscany-binding-rmi-runtime:2.5-SNAPSHOT @ <https://builds.apache.org/job/Tuscany-2x/ws/sca-2x/modules/binding-rmi-runtime/pom.xml>
[INFO] Processing artifact: org.apache.neethi:neethi:jar:2.0.4:compile
[INFO] Processing artifact: active project artifact:
	artifact = org.apache.tuscany.sca:tuscany-web-javascript:jar:2.5-SNAPSHOT:compile;
	project: MavenProject: org.apache.tuscany.sca:tuscany-web-javascript:2.5-SNAPSHOT @ <https://builds.apache.org/job/Tuscany-2x/ws/sca-2x/modules/web-javascript/pom.xml>
[INFO] Processing artifact: org.directwebremoting:dwr:jar:2.0.3:compile
[INFO] Processing artifact: org.apache.ws.commons.axiom:axiom-impl:jar:1.2.10:compile
[INFO] MANIFEST.MF found for org.apache.ws.commons.axiom:axiom-impl:jar:1.2.10:compile (<https://builds.apache.org/job/Tuscany-2x/ws/sca-2x/distribution/all/manifests/axiom-impl-1.2.10.MF)>
[INFO] Processing artifact: org.apache.tuscany.sdo:tuscany-sdo-impl:jar:1.1.1:compile
[INFO] Processing artifact: net.sourceforge.saxon:saxon:jar:xpath:9.1.0.8:compile
[INFO] Processing artifact: active project artifact:
	artifact = org.apache.tuscany.sca:tuscany-host-jetty:jar:2.5-SNAPSHOT:compile;
	project: MavenProject: org.apache.tuscany.sca:tuscany-host-jetty:2.5-SNAPSHOT @ <https://builds.apache.org/job/Tuscany-2x/ws/sca-2x/modules/host-jetty/pom.xml>
[INFO] Processing artifact: active project artifact:
	artifact = org.apache.tuscany.sca:tuscany-myfaces:jar:2.5-SNAPSHOT:compile;
	project: MavenProject: org.apache.tuscany.sca:tuscany-myfaces:2.5-SNAPSHOT @ <https://builds.apache.org/job/Tuscany-2x/ws/sca-2x/modules/myfaces/pom.xml>
[INFO] Processing artifact: org.apache.ode:ode-jacob-ap:jar:1.3.2:compile
[INFO] Processing artifact: net.sourceforge.saxon:saxon:jar:9.1.0.8:compile
[INFO] Processing artifact: net.sourceforge.saxon:saxon:jar:dom:9.1.0.8:compile
[INFO] Processing artifact: active project artifact:
	artifact = org.apache.tuscany.sca:tuscany-sca-client-impl:jar:2.5-SNAPSHOT:compile;
	project: MavenProject: org.apache.tuscany.sca:tuscany-sca-client-impl:2.5-SNAPSHOT @ <https://builds.apache.org/job/Tuscany-2x/ws/sca-2x/modules/sca-client-impl/pom.xml>
[INFO] Processing artifact: active project artifact:
	artifact = org.apache.tuscany.sca:tuscany-assembly-xml:jar:2.5-SNAPSHOT:compile;
	project: MavenProject: org.apache.tuscany.sca:tuscany-assembly-xml:2.5-SNAPSHOT @ <https://builds.apache.org/job/Tuscany-2x/ws/sca-2x/modules/assembly-xml/pom.xml>
[INFO] Processing artifact: org.apache.geronimo.specs:geronimo-j2ee-connector_1.5_spec:jar:2.0.0:compile
[INFO] Processing artifact: active project artifact:
	artifact = org.apache.tuscany.sca:tuscany-databinding-sdo:jar:2.5-SNAPSHOT:compile;
	project: MavenProject: org.apache.tuscany.sca:tuscany-databinding-sdo:2.5-SNAPSHOT @ <https://builds.apache.org/job/Tuscany-2x/ws/sca-2x/modules/databinding-sdo/pom.xml>
[INFO] Processing artifact: active project artifact:
	artifact = org.apache.tuscany.sca:tuscany-sca-api:jar:2.5-SNAPSHOT:compile;
	project: MavenProject: org.apache.tuscany.sca:tuscany-sca-api:2.5-SNAPSHOT @ <https://builds.apache.org/job/Tuscany-2x/ws/sca-2x/modules/sca-api/pom.xml>
[INFO] Processing artifact: active project artifact:
	artifact = org.apache.tuscany.sca:tuscany-implementation-web:jar:2.5-SNAPSHOT:compile;
	project: MavenProject: org.apache.tuscany.sca:tuscany-implementation-web:2.5-SNAPSHOT @ <https://builds.apache.org/job/Tuscany-2x/ws/sca-2x/modules/implementation-web/pom.xml>
[INFO] Processing artifact: org.apache.ode:ode-bpel-epr:jar:1.3.2:compile
[INFO] Processing artifact: active project artifact:
	artifact = org.apache.tuscany.sca:tuscany-implementation-web-client:jar:2.5-SNAPSHOT:compile;
	project: MavenProject: org.apache.tuscany.sca:tuscany-implementation-web-client:2.5-SNAPSHOT @ <https://builds.apache.org/job/Tuscany-2x/ws/sca-2x/modules/implementation-web-client/pom.xml>
[INFO] Processing artifact: active project artifact:
	artifact = active project artifact:
	artifact = active project artifact:
	artifact = org.apache.tuscany.sca:tuscany-feature-all:pom:2.5-SNAPSHOT:compile;
	project: MavenProject: org.apache.tuscany.sca:tuscany-feature-all:2.5-SNAPSHOT @ <https://builds.apache.org/job/Tuscany-2x/ws/sca-2x/features/all/pom.xml;>
	project: MavenProject: org.apache.tuscany.sca:tuscany-feature-all:2.5-SNAPSHOT @ <https://builds.apache.org/job/Tuscany-2x/ws/sca-2x/features/all/pom.xml;>
	project: MavenProject: org.apache.tuscany.sca:tuscany-feature-all:2.5-SNAPSHOT @ <https://builds.apache.org/job/Tuscany-2x/ws/sca-2x/features/all/pom.xml>
[INFO] Processing artifact: org.json:json:jar:20090211:compile
[INFO] Processing artifact: org.apache.ws.commons.axiom:axiom-dom:jar:1.2.10:compile
[INFO] Processing artifact: active project artifact:
	artifact = org.apache.tuscany.sca:tuscany-xsd:jar:2.5-SNAPSHOT:compile;
	project: MavenProject: org.apache.tuscany.sca:tuscany-xsd:2.5-SNAPSHOT @ <https://builds.apache.org/job/Tuscany-2x/ws/sca-2x/modules/xsd/pom.xml>
[INFO] Processing artifact: active project artifact:
	artifact = org.apache.tuscany.sca:tuscany-policy-wspolicy:jar:2.5-SNAPSHOT:compile;
	project: MavenProject: org.apache.tuscany.sca:tuscany-policy-wspolicy:2.5-SNAPSHOT @ <https://builds.apache.org/job/Tuscany-2x/ws/sca-2x/modules/policy-wspolicy/pom.xml>
[INFO] Processing artifact: org.eclipse.emf:common:jar:2.2.3:compile
[INFO] Processing artifact: org.eclipse.core:runtime:jar:3.4.0-v20080512:runtime
[INFO] Processing artifact: active project artifact:
	artifact = org.apache.tuscany.sca:tuscany-implementation-script:jar:2.5-SNAPSHOT:compile;
	project: MavenProject: org.apache.tuscany.sca:tuscany-implementation-script:2.5-SNAPSHOT @ <https://builds.apache.org/job/Tuscany-2x/ws/sca-2x/modules/implementation-script/pom.xml>
[INFO] Processing artifact: active project artifact:
	artifact = org.apache.tuscany.sca:tuscany-domain-hazelcast:jar:2.5-SNAPSHOT:compile;
	project: MavenProject: org.apache.tuscany.sca:tuscany-domain-hazelcast:2.5-SNAPSHOT @ <https://builds.apache.org/job/Tuscany-2x/ws/sca-2x/modules/domain-hazelcast/pom.xml>
[INFO] Processing artifact: org.codehaus.groovy:groovy-all:jar:1.7.1:runtime
[INFO] Processing artifact: org.apache.wink:wink-client-apache-httpclient:jar:1.2.0-incubating:compile
[INFO] Processing artifact: org.apache.axis2:org.apache.axis2.osgi:jar:1.5.3:compile
[INFO] Overriding the manifest for org.apache.axis2:org.apache.axis2.osgi:jar:1.5.3:compile
[INFO] Processing artifact: org.apache.ode:ode-bpel-runtime:jar:1.3.2:compile
[INFO] Processing artifact: org.eclipse.emf:ecore-change:jar:2.2.3:compile
[INFO] Processing artifact: org.codehaus.jackson:jackson-mapper-asl:jar:1.9.4:compile
[INFO] Processing artifact: org.apache.openjpa:openjpa:jar:1.2.1:compile
[INFO] Processing artifact: org.apache.geronimo.specs:geronimo-ejb_3.0_spec:jar:1.0.1:compile
[INFO] Processing artifact: active project artifact:
	artifact = org.apache.tuscany.sca:tuscany-binding-ws-runtime-jaxws:jar:2.5-SNAPSHOT:compile;
	project: MavenProject: org.apache.tuscany.sca:tuscany-binding-ws-runtime-jaxws:2.5-SNAPSHOT @ <https://builds.apache.org/job/Tuscany-2x/ws/sca-2x/modules/binding-ws-runtime-jaxws/pom.xml>
[INFO] Processing artifact: jdom:jdom:jar:1.0:compile
[INFO] Processing artifact: org.apache.ode:ode-bpel-compiler:jar:1.3.2:compile
[INFO] Processing artifact: active project artifact:
	artifact = org.apache.tuscany.sca:tuscany-host-corba-jee:jar:2.5-SNAPSHOT:compile;
	project: MavenProject: org.apache.tuscany.sca:tuscany-host-corba-jee:2.5-SNAPSHOT @ <https://builds.apache.org/job/Tuscany-2x/ws/sca-2x/modules/host-corba-jee/pom.xml>
[INFO] Processing artifact: active project artifact:
	artifact = org.apache.tuscany.sca:tuscany-binding-rest-runtime:jar:2.5-SNAPSHOT:compile;
	project: MavenProject: org.apache.tuscany.sca:tuscany-binding-rest-runtime:2.5-SNAPSHOT @ <https://builds.apache.org/job/Tuscany-2x/ws/sca-2x/modules/binding-rest-runtime/pom.xml>
[INFO] Processing artifact: wsdl4j:wsdl4j:jar:1.6.2:compile
[INFO] Processing artifact: org.mortbay.jetty:jetty:jar:6.1.26:compile
[INFO] Processing artifact: org.apache.geronimo.components:geronimo-connector:jar:2.1.4:compile
[INFO] Processing artifact: active project artifact:
	artifact = org.apache.tuscany.sca:tuscany-binding-jsonrpc:jar:2.5-SNAPSHOT:compile;
	project: MavenProject: org.apache.tuscany.sca:tuscany-binding-jsonrpc:2.5-SNAPSHOT @ <https://builds.apache.org/job/Tuscany-2x/ws/sca-2x/modules/binding-jsonrpc/pom.xml>
[INFO] Processing artifact: active project artifact:
	artifact = org.apache.tuscany.sca:tuscany-implementation-python:jar:2.5-SNAPSHOT:compile;
	project: MavenProject: org.apache.tuscany.sca:tuscany-implementation-python:2.5-SNAPSHOT @ <https://builds.apache.org/job/Tuscany-2x/ws/sca-2x/modules/implementation-python/pom.xml>
[INFO] Processing artifact: commons-codec:commons-codec:jar:1.6:compile
[INFO] Generating manifest jar: <https://builds.apache.org/job/Tuscany-2x/ws/sca-2x/distribution/all/target/features/tuscany-binding-ejb-runtime/tuscany-binding-ejb-runtime-manifest.jar>
[INFO] Generating manifest jar: <https://builds.apache.org/job/Tuscany-2x/ws/sca-2x/distribution/all/target/features/tuscany-implementation-osgi-runtime/tuscany-implementation-osgi-runtime-manifest.jar>
[INFO] Generating manifest jar: <https://builds.apache.org/job/Tuscany-2x/ws/sca-2x/distribution/all/target/features/tuscany-host-jetty/tuscany-host-jetty-manifest.jar>
[INFO] Generating manifest jar: <https://builds.apache.org/job/Tuscany-2x/ws/sca-2x/distribution/all/target/features/tuscany-binding-ws-runtime-axis2/tuscany-binding-ws-runtime-axis2-manifest.jar>
[INFO] Generating manifest jar: <https://builds.apache.org/job/Tuscany-2x/ws/sca-2x/distribution/all/target/features/tuscany-implementation-python-runtime/tuscany-implementation-python-runtime-manifest.jar>
[INFO] Generating manifest jar: <https://builds.apache.org/job/Tuscany-2x/ws/sca-2x/distribution/all/target/features/tuscany-binding-jms-runtime/tuscany-binding-jms-runtime-manifest.jar>
[INFO] Generating manifest jar: <https://builds.apache.org/job/Tuscany-2x/ws/sca-2x/distribution/all/target/features/tuscany-implementation-spring-runtime/tuscany-implementation-spring-runtime-manifest.jar>
[INFO] Generating manifest jar: <https://builds.apache.org/job/Tuscany-2x/ws/sca-2x/distribution/all/target/features/tuscany-binding-rest-runtime/tuscany-binding-rest-runtime-manifest.jar>
[INFO] Generating manifest jar: <https://builds.apache.org/job/Tuscany-2x/ws/sca-2x/distribution/all/target/features/tuscany-binding-atom-runtime/tuscany-binding-atom-runtime-manifest.jar>
[INFO] Generating manifest jar: <https://builds.apache.org/job/Tuscany-2x/ws/sca-2x/distribution/all/target/features/tuscany-implementation-widget-runtime/tuscany-implementation-widget-runtime-manifest.jar>
[INFO] Generating manifest jar: <https://builds.apache.org/job/Tuscany-2x/ws/sca-2x/distribution/all/target/features/tuscany-base-runtime-pom/tuscany-base-runtime-pom-manifest.jar>
[INFO] Generating manifest jar: <https://builds.apache.org/job/Tuscany-2x/ws/sca-2x/distribution/all/target/features/tuscany-implementation-bpel-runtime/tuscany-implementation-bpel-runtime-manifest.jar>
[INFO] Generating manifest jar: <https://builds.apache.org/job/Tuscany-2x/ws/sca-2x/distribution/all/target/features/tuscany-binding-corba-runtime/tuscany-binding-corba-runtime-manifest.jar>
[INFO] Generating manifest jar: <https://builds.apache.org/job/Tuscany-2x/ws/sca-2x/distribution/all/target/features/tuscany-binding-rmi-runtime/tuscany-binding-rmi-runtime-manifest.jar>
[INFO] Generating manifest jar: <https://builds.apache.org/job/Tuscany-2x/ws/sca-2x/distribution/all/target/features/tuscany-binding-jsonrpc-runtime/tuscany-binding-jsonrpc-runtime-manifest.jar>
[INFO] Generating manifest jar: <https://builds.apache.org/job/Tuscany-2x/ws/sca-2x/distribution/all/target/features/tuscany-implementation-script-runtime/tuscany-implementation-script-runtime-manifest.jar>
[INFO] Generating manifest jar: <https://builds.apache.org/job/Tuscany-2x/ws/sca-2x/distribution/all/target/features/tuscany-binding-jsonp-runtime/tuscany-binding-jsonp-runtime-manifest.jar>
[INFO] Generating manifest jar: <https://builds.apache.org/job/Tuscany-2x/ws/sca-2x/distribution/all/target/features/tuscany-implementation-web-runtime/tuscany-implementation-web-runtime-manifest.jar>
[INFO] Generating equinox manifest jar: <https://builds.apache.org/job/Tuscany-2x/ws/sca-2x/distribution/all/target/features/tuscany-sca-equinox-manifest.jar>
[INFO] Generating ANT build path: <https://builds.apache.org/job/Tuscany-2x/ws/sca-2x/distribution/all/target/features/tuscany-binding-ejb-runtime/build-path.xml>
[INFO] Generating ANT build path: <https://builds.apache.org/job/Tuscany-2x/ws/sca-2x/distribution/all/target/features/tuscany-implementation-osgi-runtime/build-path.xml>
[INFO] Generating ANT build path: <https://builds.apache.org/job/Tuscany-2x/ws/sca-2x/distribution/all/target/features/tuscany-host-jetty/build-path.xml>
[INFO] Generating ANT build path: <https://builds.apache.org/job/Tuscany-2x/ws/sca-2x/distribution/all/target/features/tuscany-binding-ws-runtime-axis2/build-path.xml>
[INFO] Generating ANT build path: <https://builds.apache.org/job/Tuscany-2x/ws/sca-2x/distribution/all/target/features/tuscany-implementation-python-runtime/build-path.xml>
[INFO] Generating ANT build path: <https://builds.apache.org/job/Tuscany-2x/ws/sca-2x/distribution/all/target/features/tuscany-binding-jms-runtime/build-path.xml>
[INFO] Generating ANT build path: <https://builds.apache.org/job/Tuscany-2x/ws/sca-2x/distribution/all/target/features/tuscany-implementation-spring-runtime/build-path.xml>
[INFO] Generating ANT build path: <https://builds.apache.org/job/Tuscany-2x/ws/sca-2x/distribution/all/target/features/tuscany-binding-rest-runtime/build-path.xml>
[INFO] Generating ANT build path: <https://builds.apache.org/job/Tuscany-2x/ws/sca-2x/distribution/all/target/features/tuscany-binding-atom-runtime/build-path.xml>
[INFO] Generating ANT build path: <https://builds.apache.org/job/Tuscany-2x/ws/sca-2x/distribution/all/target/features/tuscany-implementation-widget-runtime/build-path.xml>
[INFO] Generating ANT build path: <https://builds.apache.org/job/Tuscany-2x/ws/sca-2x/distribution/all/target/features/tuscany-base-runtime-pom/build-path.xml>
[INFO] Generating ANT build path: <https://builds.apache.org/job/Tuscany-2x/ws/sca-2x/distribution/all/target/features/tuscany-implementation-bpel-runtime/build-path.xml>
[INFO] Generating ANT build path: <https://builds.apache.org/job/Tuscany-2x/ws/sca-2x/distribution/all/target/features/tuscany-binding-corba-runtime/build-path.xml>
[INFO] Generating ANT build path: <https://builds.apache.org/job/Tuscany-2x/ws/sca-2x/distribution/all/target/features/tuscany-binding-rmi-runtime/build-path.xml>
[INFO] Generating ANT build path: <https://builds.apache.org/job/Tuscany-2x/ws/sca-2x/distribution/all/target/features/tuscany-binding-jsonrpc-runtime/build-path.xml>
[INFO] Generating ANT build path: <https://builds.apache.org/job/Tuscany-2x/ws/sca-2x/distribution/all/target/features/tuscany-implementation-script-runtime/build-path.xml>
[INFO] Generating ANT build path: <https://builds.apache.org/job/Tuscany-2x/ws/sca-2x/distribution/all/target/features/tuscany-binding-jsonp-runtime/build-path.xml>
[INFO] Generating ANT build path: <https://builds.apache.org/job/Tuscany-2x/ws/sca-2x/distribution/all/target/features/tuscany-implementation-web-runtime/build-path.xml>
[INFO] Generating Which Jars: <https://builds.apache.org/job/Tuscany-2x/ws/sca-2x/distribution/all/target/features/tuscany-binding-ejb-runtime/which-jars>
[INFO] Generating Which Jars: <https://builds.apache.org/job/Tuscany-2x/ws/sca-2x/distribution/all/target/features/tuscany-implementation-osgi-runtime/which-jars>
[INFO] Generating Which Jars: <https://builds.apache.org/job/Tuscany-2x/ws/sca-2x/distribution/all/target/features/tuscany-host-jetty/which-jars>
[INFO] Generating Which Jars: <https://builds.apache.org/job/Tuscany-2x/ws/sca-2x/distribution/all/target/features/tuscany-binding-ws-runtime-axis2/which-jars>
[INFO] Generating Which Jars: <https://builds.apache.org/job/Tuscany-2x/ws/sca-2x/distribution/all/target/features/tuscany-implementation-python-runtime/which-jars>
[INFO] Generating Which Jars: <https://builds.apache.org/job/Tuscany-2x/ws/sca-2x/distribution/all/target/features/tuscany-binding-jms-runtime/which-jars>
[INFO] Generating Which Jars: <https://builds.apache.org/job/Tuscany-2x/ws/sca-2x/distribution/all/target/features/tuscany-implementation-spring-runtime/which-jars>
[INFO] Generating Which Jars: <https://builds.apache.org/job/Tuscany-2x/ws/sca-2x/distribution/all/target/features/tuscany-binding-rest-runtime/which-jars>
[INFO] Generating Which Jars: <https://builds.apache.org/job/Tuscany-2x/ws/sca-2x/distribution/all/target/features/tuscany-binding-atom-runtime/which-jars>
[INFO] Generating Which Jars: <https://builds.apache.org/job/Tuscany-2x/ws/sca-2x/distribution/all/target/features/tuscany-implementation-widget-runtime/which-jars>
[INFO] Generating Which Jars: <https://builds.apache.org/job/Tuscany-2x/ws/sca-2x/distribution/all/target/features/tuscany-base-runtime-pom/which-jars>
[INFO] Generating Which Jars: <https://builds.apache.org/job/Tuscany-2x/ws/sca-2x/distribution/all/target/features/tuscany-implementation-bpel-runtime/which-jars>
[INFO] Generating Which Jars: <https://builds.apache.org/job/Tuscany-2x/ws/sca-2x/distribution/all/target/features/tuscany-binding-corba-runtime/which-jars>
[INFO] Generating Which Jars: <https://builds.apache.org/job/Tuscany-2x/ws/sca-2x/distribution/all/target/features/tuscany-binding-rmi-runtime/which-jars>
[INFO] Generating Which Jars: <https://builds.apache.org/job/Tuscany-2x/ws/sca-2x/distribution/all/target/features/tuscany-binding-jsonrpc-runtime/which-jars>
[INFO] Generating Which Jars: <https://builds.apache.org/job/Tuscany-2x/ws/sca-2x/distribution/all/target/features/tuscany-implementation-script-runtime/which-jars>
[INFO] Generating Which Jars: <https://builds.apache.org/job/Tuscany-2x/ws/sca-2x/distribution/all/target/features/tuscany-binding-jsonp-runtime/which-jars>
[INFO] Generating Which Jars: <https://builds.apache.org/job/Tuscany-2x/ws/sca-2x/distribution/all/target/features/tuscany-implementation-web-runtime/which-jars>
[INFO] [site:attach-descriptor {execution: default-attach-descriptor}]
[INFO] [assembly:single {execution: distribution-package}]
[INFO] Reading assembly descriptor: src/main/assembly/bin-distribution.xml
[INFO] Reading assembly descriptor: src/main/assembly/src.xml
[WARNING] POM for 'org.opensaml:opensaml:pom:2.2.3:compile' is invalid.

Its dependencies (if any) will NOT be available to the current build.
[WARNING] Cannot include project artifact: org.apache.tuscany.sca:tuscany-distribution-all:pom:2.5-SNAPSHOT; it doesn't have an associated file or directory.
[WARNING] Cannot include project artifact: org.apache.tuscany.sca:tuscany-distribution-all:pom:2.5-SNAPSHOT; it doesn't have an associated file or directory.
[JENKINS] Archiving disabled
[INFO] ------------------------------------------------------------------------
[ERROR] BUILD ERROR
[INFO] ------------------------------------------------------------------------
[INFO] Failed to create assembly: Error creating assembly archive : Failed to retrieve numeric file attributes using: '/bin/sh -c ls -1laR <https://builds.apache.org/job/Tuscany-2x/ws/sca-2x/distribution/all/../..'>

[INFO] ------------------------------------------------------------------------
[INFO] For more information, run Maven with the -e switch
[INFO] ------------------------------------------------------------------------
[INFO] Total time: 20 minutes 45 seconds
[INFO] Finished at: Fri Feb 15 01:52:43 UTC 2013
[INFO] Final Memory: 547M/723M
[INFO] ------------------------------------------------------------------------
Waiting for Jenkins to finish collecting data
Maven failed with error.
Sending e-mails to: notification@tuscany.apache.org
channel stopped
2013-02-15 01:56:56.543:INFO::Shutdown hook executing
2013-02-15 01:56:56.543:INFO::Shutdown hook complete

Build failed in Jenkins: Tuscany-2x #936

Posted by Apache Jenkins Server <je...@builds.apache.org>.
See <https://builds.apache.org/job/Tuscany-2x/936/>

------------------------------------------
[...truncated 34409 lines...]
	project: MavenProject: org.apache.tuscany.sca:tuscany-tracing-aspectj:2.5-SNAPSHOT @ <https://builds.apache.org/job/Tuscany-2x/ws/sca-2x/modules/tracing-aspectj/pom.xml>
[INFO] Processing artifact: org.springframework:spring-aop:jar:3.0.5.RELEASE:compile
[INFO] Processing artifact: com.hazelcast:hazelcast:jar:1.9.2.2:compile
[INFO] Processing artifact: org.springframework:spring-core:jar:3.0.5.RELEASE:compile
[INFO] Processing artifact: active project artifact:
	artifact = org.apache.tuscany.sca:tuscany-assembly:jar:2.5-SNAPSHOT:compile;
	project: MavenProject: org.apache.tuscany.sca:tuscany-assembly:2.5-SNAPSHOT @ <https://builds.apache.org/job/Tuscany-2x/ws/sca-2x/modules/assembly/pom.xml>
[INFO] Processing artifact: active project artifact:
	artifact = org.apache.tuscany.sca:tuscany-interface-java-jaxws:jar:2.5-SNAPSHOT:compile;
	project: MavenProject: org.apache.tuscany.sca:tuscany-interface-java-jaxws:2.5-SNAPSHOT @ <https://builds.apache.org/job/Tuscany-2x/ws/sca-2x/modules/interface-java-jaxws/pom.xml>
[INFO] Processing artifact: org.apache.geronimo.specs:geronimo-annotation_1.1_spec:jar:1.0:compile
[INFO] Processing artifact: active project artifact:
	artifact = org.apache.tuscany.sca:tuscany-host-corba:jar:2.5-SNAPSHOT:compile;
	project: MavenProject: org.apache.tuscany.sca:tuscany-host-corba:2.5-SNAPSHOT @ <https://builds.apache.org/job/Tuscany-2x/ws/sca-2x/modules/host-corba/pom.xml>
[INFO] Processing artifact: active project artifact:
	artifact = org.apache.tuscany.sca:tuscany-node-launcher-equinox:jar:2.5-SNAPSHOT:compile;
	project: MavenProject: org.apache.tuscany.sca:tuscany-node-launcher-equinox:2.5-SNAPSHOT @ <https://builds.apache.org/job/Tuscany-2x/ws/sca-2x/modules/node-launcher-equinox/pom.xml>
[INFO] Processing artifact: active project artifact:
	artifact = org.apache.tuscany.sca:tuscany-data-api:jar:2.5-SNAPSHOT:compile;
	project: MavenProject: org.apache.tuscany.sca:tuscany-data-api:2.5-SNAPSHOT @ <https://builds.apache.org/job/Tuscany-2x/ws/sca-2x/modules/data-api/pom.xml>
[INFO] Processing artifact: org.apache.santuario:xmlsec:jar:1.4.4:compile
[INFO] Processing artifact: org.dojotoolkit:dojo:zip:1.5.0:compile
[INFO] Processing artifact: active project artifact:
	artifact = org.apache.tuscany.sca:tuscany-node-impl-osgi:jar:2.5-SNAPSHOT:compile;
	project: MavenProject: org.apache.tuscany.sca:tuscany-node-impl-osgi:2.5-SNAPSHOT @ <https://builds.apache.org/job/Tuscany-2x/ws/sca-2x/modules/node-impl-osgi/pom.xml>
[INFO] Processing artifact: active project artifact:
	artifact = org.apache.tuscany.sca:tuscany-binding-corba:jar:2.5-SNAPSHOT:compile;
	project: MavenProject: org.apache.tuscany.sca:tuscany-binding-corba:2.5-SNAPSHOT @ <https://builds.apache.org/job/Tuscany-2x/ws/sca-2x/modules/binding-corba/pom.xml>
[INFO] Processing artifact: active project artifact:
	artifact = org.apache.tuscany.sca:tuscany-implementation-java:jar:2.5-SNAPSHOT:compile;
	project: MavenProject: org.apache.tuscany.sca:tuscany-implementation-java:2.5-SNAPSHOT @ <https://builds.apache.org/job/Tuscany-2x/ws/sca-2x/modules/implementation-java/pom.xml>
[INFO] Processing artifact: org.apache.geronimo.specs:geronimo-javamail_1.4_spec:jar:1.6:compile
[INFO] Processing artifact: org.apache.rampart:rampart-trust:jar:1.5.1:compile
[INFO] Processing artifact: org.apache.ode:ode-bpel-dao:jar:1.3.2:compile
[INFO] Processing artifact: active project artifact:
	artifact = org.apache.tuscany.sca:tuscany-policy-logging:jar:2.5-SNAPSHOT:compile;
	project: MavenProject: org.apache.tuscany.sca:tuscany-policy-logging:2.5-SNAPSHOT @ <https://builds.apache.org/job/Tuscany-2x/ws/sca-2x/modules/policy-logging/pom.xml>
[INFO] Processing artifact: active project artifact:
	artifact = org.apache.tuscany.sca:tuscany-monitor:jar:2.5-SNAPSHOT:compile;
	project: MavenProject: org.apache.tuscany.sca:tuscany-monitor:2.5-SNAPSHOT @ <https://builds.apache.org/job/Tuscany-2x/ws/sca-2x/modules/monitor/pom.xml>
[INFO] Processing artifact: active project artifact:
	artifact = org.apache.tuscany.sca:tuscany-binding-atom:jar:2.5-SNAPSHOT:compile;
	project: MavenProject: org.apache.tuscany.sca:tuscany-binding-atom:2.5-SNAPSHOT @ <https://builds.apache.org/job/Tuscany-2x/ws/sca-2x/modules/binding-atom/pom.xml>
[INFO] Processing artifact: active project artifact:
	artifact = org.apache.tuscany.sca:tuscany-binding-ws-runtime-axis2:jar:2.5-SNAPSHOT:compile;
	project: MavenProject: org.apache.tuscany.sca:tuscany-binding-ws-runtime-axis2:2.5-SNAPSHOT @ <https://builds.apache.org/job/Tuscany-2x/ws/sca-2x/modules/binding-ws-runtime-axis2/pom.xml>
[INFO] Processing artifact: active project artifact:
	artifact = org.apache.tuscany.sca:tuscany-host-corba-jse-tns:jar:2.5-SNAPSHOT:compile;
	project: MavenProject: org.apache.tuscany.sca:tuscany-host-corba-jse-tns:2.5-SNAPSHOT @ <https://builds.apache.org/job/Tuscany-2x/ws/sca-2x/modules/host-corba-jse-tns/pom.xml>
[INFO] Processing artifact: org.apache.geronimo.modules:geronimo-kernel:jar:2.0.1:compile
[INFO] Processing artifact: active project artifact:
	artifact = org.apache.tuscany.sca:tuscany-deployment:jar:2.5-SNAPSHOT:compile;
	project: MavenProject: org.apache.tuscany.sca:tuscany-deployment:2.5-SNAPSHOT @ <https://builds.apache.org/job/Tuscany-2x/ws/sca-2x/modules/deployment/pom.xml>
[INFO] Processing artifact: active project artifact:
	artifact = active project artifact:
	artifact = active project artifact:
	artifact = org.apache.tuscany.sca.aggregation:tuscany-base-runtime-aggregation:jar:2.5-SNAPSHOT:compile;
	project: MavenProject: org.apache.tuscany.sca.aggregation:tuscany-base-runtime-aggregation:2.5-SNAPSHOT @ <https://builds.apache.org/job/Tuscany-2x/ws/sca-2x/distribution/aggregations/base-runtime-aggregation/pom.xml;>
	project: MavenProject: org.apache.tuscany.sca.aggregation:tuscany-base-runtime-aggregation:2.5-SNAPSHOT @ <https://builds.apache.org/job/Tuscany-2x/ws/sca-2x/distribution/aggregations/base-runtime-aggregation/pom.xml;>
	project: MavenProject: org.apache.tuscany.sca.aggregation:tuscany-base-runtime-aggregation:2.5-SNAPSHOT @ <https://builds.apache.org/job/Tuscany-2x/ws/sca-2x/distribution/aggregations/base-runtime-aggregation/pom.xml>
[INFO] Processing artifact: org.aspectj:aspectjrt:jar:1.6.8:compile
[INFO] Processing artifact: org.apache.abdera:abdera-client:jar:1.1.1:compile
[INFO] Processing artifact: net.sourceforge.saxon:saxon:jar:xqj:9.1.0.8:compile
[INFO] Processing artifact: active project artifact:
	artifact = org.apache.tuscany.sca:tuscany-binding-jsonrpc-runtime:jar:2.5-SNAPSHOT:compile;
	project: MavenProject: org.apache.tuscany.sca:tuscany-binding-jsonrpc-runtime:2.5-SNAPSHOT @ <https://builds.apache.org/job/Tuscany-2x/ws/sca-2x/modules/binding-jsonrpc-runtime/pom.xml>
[INFO] Processing artifact: org.mortbay.jetty:jetty-util:jar:6.1.26:compile
[INFO] Processing artifact: org.apache.ws.commons.axiom:axiom-api:jar:1.2.10:compile
[INFO] Processing artifact: active project artifact:
	artifact = org.apache.tuscany.sca:tuscany-implementation-spring-runtime:jar:2.5-SNAPSHOT:compile;
	project: MavenProject: org.apache.tuscany.sca:tuscany-implementation-spring-runtime:2.5-SNAPSHOT @ <https://builds.apache.org/job/Tuscany-2x/ws/sca-2x/modules/implementation-spring-runtime/pom.xml>
[INFO] Processing artifact: org.apache.tuscany.sdo:tuscany-sdo-api-r2.1:jar:1.1.1:compile
[INFO] Processing artifact: active project artifact:
	artifact = org.apache.tuscany.sca:tuscany-binding-rmi-runtime:jar:2.5-SNAPSHOT:compile;
	project: MavenProject: org.apache.tuscany.sca:tuscany-binding-rmi-runtime:2.5-SNAPSHOT @ <https://builds.apache.org/job/Tuscany-2x/ws/sca-2x/modules/binding-rmi-runtime/pom.xml>
[INFO] Processing artifact: org.apache.neethi:neethi:jar:2.0.4:compile
[INFO] Processing artifact: active project artifact:
	artifact = org.apache.tuscany.sca:tuscany-web-javascript:jar:2.5-SNAPSHOT:compile;
	project: MavenProject: org.apache.tuscany.sca:tuscany-web-javascript:2.5-SNAPSHOT @ <https://builds.apache.org/job/Tuscany-2x/ws/sca-2x/modules/web-javascript/pom.xml>
[INFO] Processing artifact: org.directwebremoting:dwr:jar:2.0.3:compile
[INFO] Processing artifact: org.apache.ws.commons.axiom:axiom-impl:jar:1.2.10:compile
[INFO] MANIFEST.MF found for org.apache.ws.commons.axiom:axiom-impl:jar:1.2.10:compile (<https://builds.apache.org/job/Tuscany-2x/ws/sca-2x/distribution/all/manifests/axiom-impl-1.2.10.MF)>
[INFO] Processing artifact: org.apache.tuscany.sdo:tuscany-sdo-impl:jar:1.1.1:compile
[INFO] Processing artifact: net.sourceforge.saxon:saxon:jar:xpath:9.1.0.8:compile
[INFO] Processing artifact: active project artifact:
	artifact = org.apache.tuscany.sca:tuscany-host-jetty:jar:2.5-SNAPSHOT:compile;
	project: MavenProject: org.apache.tuscany.sca:tuscany-host-jetty:2.5-SNAPSHOT @ <https://builds.apache.org/job/Tuscany-2x/ws/sca-2x/modules/host-jetty/pom.xml>
[INFO] Processing artifact: active project artifact:
	artifact = org.apache.tuscany.sca:tuscany-myfaces:jar:2.5-SNAPSHOT:compile;
	project: MavenProject: org.apache.tuscany.sca:tuscany-myfaces:2.5-SNAPSHOT @ <https://builds.apache.org/job/Tuscany-2x/ws/sca-2x/modules/myfaces/pom.xml>
[INFO] Processing artifact: org.apache.ode:ode-jacob-ap:jar:1.3.2:compile
[INFO] Processing artifact: net.sourceforge.saxon:saxon:jar:9.1.0.8:compile
[INFO] Processing artifact: net.sourceforge.saxon:saxon:jar:dom:9.1.0.8:compile
[INFO] Processing artifact: active project artifact:
	artifact = org.apache.tuscany.sca:tuscany-sca-client-impl:jar:2.5-SNAPSHOT:compile;
	project: MavenProject: org.apache.tuscany.sca:tuscany-sca-client-impl:2.5-SNAPSHOT @ <https://builds.apache.org/job/Tuscany-2x/ws/sca-2x/modules/sca-client-impl/pom.xml>
[INFO] Processing artifact: active project artifact:
	artifact = org.apache.tuscany.sca:tuscany-assembly-xml:jar:2.5-SNAPSHOT:compile;
	project: MavenProject: org.apache.tuscany.sca:tuscany-assembly-xml:2.5-SNAPSHOT @ <https://builds.apache.org/job/Tuscany-2x/ws/sca-2x/modules/assembly-xml/pom.xml>
[INFO] Processing artifact: org.apache.geronimo.specs:geronimo-j2ee-connector_1.5_spec:jar:2.0.0:compile
[INFO] Processing artifact: active project artifact:
	artifact = org.apache.tuscany.sca:tuscany-databinding-sdo:jar:2.5-SNAPSHOT:compile;
	project: MavenProject: org.apache.tuscany.sca:tuscany-databinding-sdo:2.5-SNAPSHOT @ <https://builds.apache.org/job/Tuscany-2x/ws/sca-2x/modules/databinding-sdo/pom.xml>
[INFO] Processing artifact: active project artifact:
	artifact = org.apache.tuscany.sca:tuscany-sca-api:jar:2.5-SNAPSHOT:compile;
	project: MavenProject: org.apache.tuscany.sca:tuscany-sca-api:2.5-SNAPSHOT @ <https://builds.apache.org/job/Tuscany-2x/ws/sca-2x/modules/sca-api/pom.xml>
[INFO] Processing artifact: active project artifact:
	artifact = org.apache.tuscany.sca:tuscany-implementation-web:jar:2.5-SNAPSHOT:compile;
	project: MavenProject: org.apache.tuscany.sca:tuscany-implementation-web:2.5-SNAPSHOT @ <https://builds.apache.org/job/Tuscany-2x/ws/sca-2x/modules/implementation-web/pom.xml>
[INFO] Processing artifact: org.apache.ode:ode-bpel-epr:jar:1.3.2:compile
[INFO] Processing artifact: active project artifact:
	artifact = org.apache.tuscany.sca:tuscany-implementation-web-client:jar:2.5-SNAPSHOT:compile;
	project: MavenProject: org.apache.tuscany.sca:tuscany-implementation-web-client:2.5-SNAPSHOT @ <https://builds.apache.org/job/Tuscany-2x/ws/sca-2x/modules/implementation-web-client/pom.xml>
[INFO] Processing artifact: active project artifact:
	artifact = active project artifact:
	artifact = active project artifact:
	artifact = org.apache.tuscany.sca:tuscany-feature-all:pom:2.5-SNAPSHOT:compile;
	project: MavenProject: org.apache.tuscany.sca:tuscany-feature-all:2.5-SNAPSHOT @ <https://builds.apache.org/job/Tuscany-2x/ws/sca-2x/features/all/pom.xml;>
	project: MavenProject: org.apache.tuscany.sca:tuscany-feature-all:2.5-SNAPSHOT @ <https://builds.apache.org/job/Tuscany-2x/ws/sca-2x/features/all/pom.xml;>
	project: MavenProject: org.apache.tuscany.sca:tuscany-feature-all:2.5-SNAPSHOT @ <https://builds.apache.org/job/Tuscany-2x/ws/sca-2x/features/all/pom.xml>
[INFO] Processing artifact: org.json:json:jar:20090211:compile
[INFO] Processing artifact: org.apache.ws.commons.axiom:axiom-dom:jar:1.2.10:compile
[INFO] Processing artifact: active project artifact:
	artifact = org.apache.tuscany.sca:tuscany-xsd:jar:2.5-SNAPSHOT:compile;
	project: MavenProject: org.apache.tuscany.sca:tuscany-xsd:2.5-SNAPSHOT @ <https://builds.apache.org/job/Tuscany-2x/ws/sca-2x/modules/xsd/pom.xml>
[INFO] Processing artifact: active project artifact:
	artifact = org.apache.tuscany.sca:tuscany-policy-wspolicy:jar:2.5-SNAPSHOT:compile;
	project: MavenProject: org.apache.tuscany.sca:tuscany-policy-wspolicy:2.5-SNAPSHOT @ <https://builds.apache.org/job/Tuscany-2x/ws/sca-2x/modules/policy-wspolicy/pom.xml>
[INFO] Processing artifact: org.eclipse.emf:common:jar:2.2.3:compile
[INFO] Processing artifact: org.eclipse.core:runtime:jar:3.4.0-v20080512:runtime
[INFO] Processing artifact: active project artifact:
	artifact = org.apache.tuscany.sca:tuscany-implementation-script:jar:2.5-SNAPSHOT:compile;
	project: MavenProject: org.apache.tuscany.sca:tuscany-implementation-script:2.5-SNAPSHOT @ <https://builds.apache.org/job/Tuscany-2x/ws/sca-2x/modules/implementation-script/pom.xml>
[INFO] Processing artifact: active project artifact:
	artifact = org.apache.tuscany.sca:tuscany-domain-hazelcast:jar:2.5-SNAPSHOT:compile;
	project: MavenProject: org.apache.tuscany.sca:tuscany-domain-hazelcast:2.5-SNAPSHOT @ <https://builds.apache.org/job/Tuscany-2x/ws/sca-2x/modules/domain-hazelcast/pom.xml>
[INFO] Processing artifact: org.codehaus.groovy:groovy-all:jar:1.7.1:runtime
[INFO] Processing artifact: org.apache.wink:wink-client-apache-httpclient:jar:1.2.0-incubating:compile
[INFO] Processing artifact: org.apache.axis2:org.apache.axis2.osgi:jar:1.5.3:compile
[INFO] Overriding the manifest for org.apache.axis2:org.apache.axis2.osgi:jar:1.5.3:compile
[INFO] Processing artifact: org.apache.ode:ode-bpel-runtime:jar:1.3.2:compile
[INFO] Processing artifact: org.eclipse.emf:ecore-change:jar:2.2.3:compile
[INFO] Processing artifact: org.codehaus.jackson:jackson-mapper-asl:jar:1.9.4:compile
[INFO] Processing artifact: org.apache.openjpa:openjpa:jar:1.2.1:compile
[INFO] Processing artifact: org.apache.geronimo.specs:geronimo-ejb_3.0_spec:jar:1.0.1:compile
[INFO] Processing artifact: active project artifact:
	artifact = org.apache.tuscany.sca:tuscany-binding-ws-runtime-jaxws:jar:2.5-SNAPSHOT:compile;
	project: MavenProject: org.apache.tuscany.sca:tuscany-binding-ws-runtime-jaxws:2.5-SNAPSHOT @ <https://builds.apache.org/job/Tuscany-2x/ws/sca-2x/modules/binding-ws-runtime-jaxws/pom.xml>
[INFO] Processing artifact: jdom:jdom:jar:1.0:compile
[INFO] Processing artifact: org.apache.ode:ode-bpel-compiler:jar:1.3.2:compile
[INFO] Processing artifact: active project artifact:
	artifact = org.apache.tuscany.sca:tuscany-host-corba-jee:jar:2.5-SNAPSHOT:compile;
	project: MavenProject: org.apache.tuscany.sca:tuscany-host-corba-jee:2.5-SNAPSHOT @ <https://builds.apache.org/job/Tuscany-2x/ws/sca-2x/modules/host-corba-jee/pom.xml>
[INFO] Processing artifact: active project artifact:
	artifact = org.apache.tuscany.sca:tuscany-binding-rest-runtime:jar:2.5-SNAPSHOT:compile;
	project: MavenProject: org.apache.tuscany.sca:tuscany-binding-rest-runtime:2.5-SNAPSHOT @ <https://builds.apache.org/job/Tuscany-2x/ws/sca-2x/modules/binding-rest-runtime/pom.xml>
[INFO] Processing artifact: wsdl4j:wsdl4j:jar:1.6.2:compile
[INFO] Processing artifact: org.mortbay.jetty:jetty:jar:6.1.26:compile
[INFO] Processing artifact: org.apache.geronimo.components:geronimo-connector:jar:2.1.4:compile
[INFO] Processing artifact: active project artifact:
	artifact = org.apache.tuscany.sca:tuscany-binding-jsonrpc:jar:2.5-SNAPSHOT:compile;
	project: MavenProject: org.apache.tuscany.sca:tuscany-binding-jsonrpc:2.5-SNAPSHOT @ <https://builds.apache.org/job/Tuscany-2x/ws/sca-2x/modules/binding-jsonrpc/pom.xml>
[INFO] Processing artifact: active project artifact:
	artifact = org.apache.tuscany.sca:tuscany-implementation-python:jar:2.5-SNAPSHOT:compile;
	project: MavenProject: org.apache.tuscany.sca:tuscany-implementation-python:2.5-SNAPSHOT @ <https://builds.apache.org/job/Tuscany-2x/ws/sca-2x/modules/implementation-python/pom.xml>
[INFO] Processing artifact: commons-codec:commons-codec:jar:1.6:compile
[INFO] Generating manifest jar: <https://builds.apache.org/job/Tuscany-2x/ws/sca-2x/distribution/all/target/features/tuscany-binding-ejb-runtime/tuscany-binding-ejb-runtime-manifest.jar>
[INFO] Generating manifest jar: <https://builds.apache.org/job/Tuscany-2x/ws/sca-2x/distribution/all/target/features/tuscany-implementation-osgi-runtime/tuscany-implementation-osgi-runtime-manifest.jar>
[INFO] Generating manifest jar: <https://builds.apache.org/job/Tuscany-2x/ws/sca-2x/distribution/all/target/features/tuscany-host-jetty/tuscany-host-jetty-manifest.jar>
[INFO] Generating manifest jar: <https://builds.apache.org/job/Tuscany-2x/ws/sca-2x/distribution/all/target/features/tuscany-binding-ws-runtime-axis2/tuscany-binding-ws-runtime-axis2-manifest.jar>
[INFO] Generating manifest jar: <https://builds.apache.org/job/Tuscany-2x/ws/sca-2x/distribution/all/target/features/tuscany-implementation-python-runtime/tuscany-implementation-python-runtime-manifest.jar>
[INFO] Generating manifest jar: <https://builds.apache.org/job/Tuscany-2x/ws/sca-2x/distribution/all/target/features/tuscany-binding-jms-runtime/tuscany-binding-jms-runtime-manifest.jar>
[INFO] Generating manifest jar: <https://builds.apache.org/job/Tuscany-2x/ws/sca-2x/distribution/all/target/features/tuscany-implementation-spring-runtime/tuscany-implementation-spring-runtime-manifest.jar>
[INFO] Generating manifest jar: <https://builds.apache.org/job/Tuscany-2x/ws/sca-2x/distribution/all/target/features/tuscany-binding-rest-runtime/tuscany-binding-rest-runtime-manifest.jar>
[INFO] Generating manifest jar: <https://builds.apache.org/job/Tuscany-2x/ws/sca-2x/distribution/all/target/features/tuscany-binding-atom-runtime/tuscany-binding-atom-runtime-manifest.jar>
[INFO] Generating manifest jar: <https://builds.apache.org/job/Tuscany-2x/ws/sca-2x/distribution/all/target/features/tuscany-implementation-widget-runtime/tuscany-implementation-widget-runtime-manifest.jar>
[INFO] Generating manifest jar: <https://builds.apache.org/job/Tuscany-2x/ws/sca-2x/distribution/all/target/features/tuscany-base-runtime-pom/tuscany-base-runtime-pom-manifest.jar>
[INFO] Generating manifest jar: <https://builds.apache.org/job/Tuscany-2x/ws/sca-2x/distribution/all/target/features/tuscany-implementation-bpel-runtime/tuscany-implementation-bpel-runtime-manifest.jar>
[INFO] Generating manifest jar: <https://builds.apache.org/job/Tuscany-2x/ws/sca-2x/distribution/all/target/features/tuscany-binding-corba-runtime/tuscany-binding-corba-runtime-manifest.jar>
[INFO] Generating manifest jar: <https://builds.apache.org/job/Tuscany-2x/ws/sca-2x/distribution/all/target/features/tuscany-binding-rmi-runtime/tuscany-binding-rmi-runtime-manifest.jar>
[INFO] Generating manifest jar: <https://builds.apache.org/job/Tuscany-2x/ws/sca-2x/distribution/all/target/features/tuscany-binding-jsonrpc-runtime/tuscany-binding-jsonrpc-runtime-manifest.jar>
[INFO] Generating manifest jar: <https://builds.apache.org/job/Tuscany-2x/ws/sca-2x/distribution/all/target/features/tuscany-implementation-script-runtime/tuscany-implementation-script-runtime-manifest.jar>
[INFO] Generating manifest jar: <https://builds.apache.org/job/Tuscany-2x/ws/sca-2x/distribution/all/target/features/tuscany-binding-jsonp-runtime/tuscany-binding-jsonp-runtime-manifest.jar>
[INFO] Generating manifest jar: <https://builds.apache.org/job/Tuscany-2x/ws/sca-2x/distribution/all/target/features/tuscany-implementation-web-runtime/tuscany-implementation-web-runtime-manifest.jar>
[INFO] Generating equinox manifest jar: <https://builds.apache.org/job/Tuscany-2x/ws/sca-2x/distribution/all/target/features/tuscany-sca-equinox-manifest.jar>
[INFO] Generating ANT build path: <https://builds.apache.org/job/Tuscany-2x/ws/sca-2x/distribution/all/target/features/tuscany-binding-ejb-runtime/build-path.xml>
[INFO] Generating ANT build path: <https://builds.apache.org/job/Tuscany-2x/ws/sca-2x/distribution/all/target/features/tuscany-implementation-osgi-runtime/build-path.xml>
[INFO] Generating ANT build path: <https://builds.apache.org/job/Tuscany-2x/ws/sca-2x/distribution/all/target/features/tuscany-host-jetty/build-path.xml>
[INFO] Generating ANT build path: <https://builds.apache.org/job/Tuscany-2x/ws/sca-2x/distribution/all/target/features/tuscany-binding-ws-runtime-axis2/build-path.xml>
[INFO] Generating ANT build path: <https://builds.apache.org/job/Tuscany-2x/ws/sca-2x/distribution/all/target/features/tuscany-implementation-python-runtime/build-path.xml>
[INFO] Generating ANT build path: <https://builds.apache.org/job/Tuscany-2x/ws/sca-2x/distribution/all/target/features/tuscany-binding-jms-runtime/build-path.xml>
[INFO] Generating ANT build path: <https://builds.apache.org/job/Tuscany-2x/ws/sca-2x/distribution/all/target/features/tuscany-implementation-spring-runtime/build-path.xml>
[INFO] Generating ANT build path: <https://builds.apache.org/job/Tuscany-2x/ws/sca-2x/distribution/all/target/features/tuscany-binding-rest-runtime/build-path.xml>
[INFO] Generating ANT build path: <https://builds.apache.org/job/Tuscany-2x/ws/sca-2x/distribution/all/target/features/tuscany-binding-atom-runtime/build-path.xml>
[INFO] Generating ANT build path: <https://builds.apache.org/job/Tuscany-2x/ws/sca-2x/distribution/all/target/features/tuscany-implementation-widget-runtime/build-path.xml>
[INFO] Generating ANT build path: <https://builds.apache.org/job/Tuscany-2x/ws/sca-2x/distribution/all/target/features/tuscany-base-runtime-pom/build-path.xml>
[INFO] Generating ANT build path: <https://builds.apache.org/job/Tuscany-2x/ws/sca-2x/distribution/all/target/features/tuscany-implementation-bpel-runtime/build-path.xml>
[INFO] Generating ANT build path: <https://builds.apache.org/job/Tuscany-2x/ws/sca-2x/distribution/all/target/features/tuscany-binding-corba-runtime/build-path.xml>
[INFO] Generating ANT build path: <https://builds.apache.org/job/Tuscany-2x/ws/sca-2x/distribution/all/target/features/tuscany-binding-rmi-runtime/build-path.xml>
[INFO] Generating ANT build path: <https://builds.apache.org/job/Tuscany-2x/ws/sca-2x/distribution/all/target/features/tuscany-binding-jsonrpc-runtime/build-path.xml>
[INFO] Generating ANT build path: <https://builds.apache.org/job/Tuscany-2x/ws/sca-2x/distribution/all/target/features/tuscany-implementation-script-runtime/build-path.xml>
[INFO] Generating ANT build path: <https://builds.apache.org/job/Tuscany-2x/ws/sca-2x/distribution/all/target/features/tuscany-binding-jsonp-runtime/build-path.xml>
[INFO] Generating ANT build path: <https://builds.apache.org/job/Tuscany-2x/ws/sca-2x/distribution/all/target/features/tuscany-implementation-web-runtime/build-path.xml>
[INFO] Generating Which Jars: <https://builds.apache.org/job/Tuscany-2x/ws/sca-2x/distribution/all/target/features/tuscany-binding-ejb-runtime/which-jars>
[INFO] Generating Which Jars: <https://builds.apache.org/job/Tuscany-2x/ws/sca-2x/distribution/all/target/features/tuscany-implementation-osgi-runtime/which-jars>
[INFO] Generating Which Jars: <https://builds.apache.org/job/Tuscany-2x/ws/sca-2x/distribution/all/target/features/tuscany-host-jetty/which-jars>
[INFO] Generating Which Jars: <https://builds.apache.org/job/Tuscany-2x/ws/sca-2x/distribution/all/target/features/tuscany-binding-ws-runtime-axis2/which-jars>
[INFO] Generating Which Jars: <https://builds.apache.org/job/Tuscany-2x/ws/sca-2x/distribution/all/target/features/tuscany-implementation-python-runtime/which-jars>
[INFO] Generating Which Jars: <https://builds.apache.org/job/Tuscany-2x/ws/sca-2x/distribution/all/target/features/tuscany-binding-jms-runtime/which-jars>
[INFO] Generating Which Jars: <https://builds.apache.org/job/Tuscany-2x/ws/sca-2x/distribution/all/target/features/tuscany-implementation-spring-runtime/which-jars>
[INFO] Generating Which Jars: <https://builds.apache.org/job/Tuscany-2x/ws/sca-2x/distribution/all/target/features/tuscany-binding-rest-runtime/which-jars>
[INFO] Generating Which Jars: <https://builds.apache.org/job/Tuscany-2x/ws/sca-2x/distribution/all/target/features/tuscany-binding-atom-runtime/which-jars>
[INFO] Generating Which Jars: <https://builds.apache.org/job/Tuscany-2x/ws/sca-2x/distribution/all/target/features/tuscany-implementation-widget-runtime/which-jars>
[INFO] Generating Which Jars: <https://builds.apache.org/job/Tuscany-2x/ws/sca-2x/distribution/all/target/features/tuscany-base-runtime-pom/which-jars>
[INFO] Generating Which Jars: <https://builds.apache.org/job/Tuscany-2x/ws/sca-2x/distribution/all/target/features/tuscany-implementation-bpel-runtime/which-jars>
[INFO] Generating Which Jars: <https://builds.apache.org/job/Tuscany-2x/ws/sca-2x/distribution/all/target/features/tuscany-binding-corba-runtime/which-jars>
[INFO] Generating Which Jars: <https://builds.apache.org/job/Tuscany-2x/ws/sca-2x/distribution/all/target/features/tuscany-binding-rmi-runtime/which-jars>
[INFO] Generating Which Jars: <https://builds.apache.org/job/Tuscany-2x/ws/sca-2x/distribution/all/target/features/tuscany-binding-jsonrpc-runtime/which-jars>
[INFO] Generating Which Jars: <https://builds.apache.org/job/Tuscany-2x/ws/sca-2x/distribution/all/target/features/tuscany-implementation-script-runtime/which-jars>
[INFO] Generating Which Jars: <https://builds.apache.org/job/Tuscany-2x/ws/sca-2x/distribution/all/target/features/tuscany-binding-jsonp-runtime/which-jars>
[INFO] Generating Which Jars: <https://builds.apache.org/job/Tuscany-2x/ws/sca-2x/distribution/all/target/features/tuscany-implementation-web-runtime/which-jars>
[INFO] [site:attach-descriptor {execution: default-attach-descriptor}]
[INFO] [assembly:single {execution: distribution-package}]
[INFO] Reading assembly descriptor: src/main/assembly/bin-distribution.xml
[INFO] Reading assembly descriptor: src/main/assembly/src.xml
[WARNING] POM for 'org.opensaml:opensaml:pom:2.2.3:compile' is invalid.

Its dependencies (if any) will NOT be available to the current build.
[WARNING] Cannot include project artifact: org.apache.tuscany.sca:tuscany-distribution-all:pom:2.5-SNAPSHOT; it doesn't have an associated file or directory.
[WARNING] Cannot include project artifact: org.apache.tuscany.sca:tuscany-distribution-all:pom:2.5-SNAPSHOT; it doesn't have an associated file or directory.
[JENKINS] Archiving disabled
[INFO] ------------------------------------------------------------------------
[ERROR] BUILD ERROR
[INFO] ------------------------------------------------------------------------
[INFO] Failed to create assembly: Error creating assembly archive : Failed to retrieve numeric file attributes using: '/bin/sh -c ls -1laR <https://builds.apache.org/job/Tuscany-2x/ws/sca-2x/distribution/all/../..'>

[INFO] ------------------------------------------------------------------------
[INFO] For more information, run Maven with the -e switch
[INFO] ------------------------------------------------------------------------
[INFO] Total time: 21 minutes 2 seconds
[INFO] Finished at: Thu Feb 14 03:06:19 UTC 2013
[INFO] Final Memory: 547M/729M
[INFO] ------------------------------------------------------------------------
Waiting for Jenkins to finish collecting data
Maven failed with error.
Sending e-mails to: notification@tuscany.apache.org
channel stopped
2013-02-14 03:10:21.859:INFO::Shutdown hook executing
2013-02-14 03:10:21.859:INFO::Shutdown hook complete

Build failed in Jenkins: Tuscany-2x #935

Posted by Apache Jenkins Server <je...@builds.apache.org>.
See <https://builds.apache.org/job/Tuscany-2x/935/>

------------------------------------------
[...truncated 34423 lines...]
	project: MavenProject: org.apache.tuscany.sca:tuscany-tracing-aspectj:2.5-SNAPSHOT @ <https://builds.apache.org/job/Tuscany-2x/ws/sca-2x/modules/tracing-aspectj/pom.xml>
[INFO] Processing artifact: org.springframework:spring-aop:jar:3.0.5.RELEASE:compile
[INFO] Processing artifact: com.hazelcast:hazelcast:jar:1.9.2.2:compile
[INFO] Processing artifact: org.springframework:spring-core:jar:3.0.5.RELEASE:compile
[INFO] Processing artifact: active project artifact:
	artifact = org.apache.tuscany.sca:tuscany-assembly:jar:2.5-SNAPSHOT:compile;
	project: MavenProject: org.apache.tuscany.sca:tuscany-assembly:2.5-SNAPSHOT @ <https://builds.apache.org/job/Tuscany-2x/ws/sca-2x/modules/assembly/pom.xml>
[INFO] Processing artifact: active project artifact:
	artifact = org.apache.tuscany.sca:tuscany-interface-java-jaxws:jar:2.5-SNAPSHOT:compile;
	project: MavenProject: org.apache.tuscany.sca:tuscany-interface-java-jaxws:2.5-SNAPSHOT @ <https://builds.apache.org/job/Tuscany-2x/ws/sca-2x/modules/interface-java-jaxws/pom.xml>
[INFO] Processing artifact: org.apache.geronimo.specs:geronimo-annotation_1.1_spec:jar:1.0:compile
[INFO] Processing artifact: active project artifact:
	artifact = org.apache.tuscany.sca:tuscany-host-corba:jar:2.5-SNAPSHOT:compile;
	project: MavenProject: org.apache.tuscany.sca:tuscany-host-corba:2.5-SNAPSHOT @ <https://builds.apache.org/job/Tuscany-2x/ws/sca-2x/modules/host-corba/pom.xml>
[INFO] Processing artifact: active project artifact:
	artifact = org.apache.tuscany.sca:tuscany-node-launcher-equinox:jar:2.5-SNAPSHOT:compile;
	project: MavenProject: org.apache.tuscany.sca:tuscany-node-launcher-equinox:2.5-SNAPSHOT @ <https://builds.apache.org/job/Tuscany-2x/ws/sca-2x/modules/node-launcher-equinox/pom.xml>
[INFO] Processing artifact: active project artifact:
	artifact = org.apache.tuscany.sca:tuscany-data-api:jar:2.5-SNAPSHOT:compile;
	project: MavenProject: org.apache.tuscany.sca:tuscany-data-api:2.5-SNAPSHOT @ <https://builds.apache.org/job/Tuscany-2x/ws/sca-2x/modules/data-api/pom.xml>
[INFO] Processing artifact: org.apache.santuario:xmlsec:jar:1.4.4:compile
[INFO] Processing artifact: org.dojotoolkit:dojo:zip:1.5.0:compile
[INFO] Processing artifact: active project artifact:
	artifact = org.apache.tuscany.sca:tuscany-node-impl-osgi:jar:2.5-SNAPSHOT:compile;
	project: MavenProject: org.apache.tuscany.sca:tuscany-node-impl-osgi:2.5-SNAPSHOT @ <https://builds.apache.org/job/Tuscany-2x/ws/sca-2x/modules/node-impl-osgi/pom.xml>
[INFO] Processing artifact: active project artifact:
	artifact = org.apache.tuscany.sca:tuscany-binding-corba:jar:2.5-SNAPSHOT:compile;
	project: MavenProject: org.apache.tuscany.sca:tuscany-binding-corba:2.5-SNAPSHOT @ <https://builds.apache.org/job/Tuscany-2x/ws/sca-2x/modules/binding-corba/pom.xml>
[INFO] Processing artifact: active project artifact:
	artifact = org.apache.tuscany.sca:tuscany-implementation-java:jar:2.5-SNAPSHOT:compile;
	project: MavenProject: org.apache.tuscany.sca:tuscany-implementation-java:2.5-SNAPSHOT @ <https://builds.apache.org/job/Tuscany-2x/ws/sca-2x/modules/implementation-java/pom.xml>
[INFO] Processing artifact: org.apache.geronimo.specs:geronimo-javamail_1.4_spec:jar:1.6:compile
[INFO] Processing artifact: org.apache.rampart:rampart-trust:jar:1.5.1:compile
[INFO] Processing artifact: org.apache.ode:ode-bpel-dao:jar:1.3.2:compile
[INFO] Processing artifact: active project artifact:
	artifact = org.apache.tuscany.sca:tuscany-policy-logging:jar:2.5-SNAPSHOT:compile;
	project: MavenProject: org.apache.tuscany.sca:tuscany-policy-logging:2.5-SNAPSHOT @ <https://builds.apache.org/job/Tuscany-2x/ws/sca-2x/modules/policy-logging/pom.xml>
[INFO] Processing artifact: active project artifact:
	artifact = org.apache.tuscany.sca:tuscany-monitor:jar:2.5-SNAPSHOT:compile;
	project: MavenProject: org.apache.tuscany.sca:tuscany-monitor:2.5-SNAPSHOT @ <https://builds.apache.org/job/Tuscany-2x/ws/sca-2x/modules/monitor/pom.xml>
[INFO] Processing artifact: active project artifact:
	artifact = org.apache.tuscany.sca:tuscany-binding-atom:jar:2.5-SNAPSHOT:compile;
	project: MavenProject: org.apache.tuscany.sca:tuscany-binding-atom:2.5-SNAPSHOT @ <https://builds.apache.org/job/Tuscany-2x/ws/sca-2x/modules/binding-atom/pom.xml>
[INFO] Processing artifact: active project artifact:
	artifact = org.apache.tuscany.sca:tuscany-binding-ws-runtime-axis2:jar:2.5-SNAPSHOT:compile;
	project: MavenProject: org.apache.tuscany.sca:tuscany-binding-ws-runtime-axis2:2.5-SNAPSHOT @ <https://builds.apache.org/job/Tuscany-2x/ws/sca-2x/modules/binding-ws-runtime-axis2/pom.xml>
[INFO] Processing artifact: active project artifact:
	artifact = org.apache.tuscany.sca:tuscany-host-corba-jse-tns:jar:2.5-SNAPSHOT:compile;
	project: MavenProject: org.apache.tuscany.sca:tuscany-host-corba-jse-tns:2.5-SNAPSHOT @ <https://builds.apache.org/job/Tuscany-2x/ws/sca-2x/modules/host-corba-jse-tns/pom.xml>
[INFO] Processing artifact: org.apache.geronimo.modules:geronimo-kernel:jar:2.0.1:compile
[INFO] Processing artifact: active project artifact:
	artifact = org.apache.tuscany.sca:tuscany-deployment:jar:2.5-SNAPSHOT:compile;
	project: MavenProject: org.apache.tuscany.sca:tuscany-deployment:2.5-SNAPSHOT @ <https://builds.apache.org/job/Tuscany-2x/ws/sca-2x/modules/deployment/pom.xml>
[INFO] Processing artifact: active project artifact:
	artifact = active project artifact:
	artifact = active project artifact:
	artifact = org.apache.tuscany.sca.aggregation:tuscany-base-runtime-aggregation:jar:2.5-SNAPSHOT:compile;
	project: MavenProject: org.apache.tuscany.sca.aggregation:tuscany-base-runtime-aggregation:2.5-SNAPSHOT @ <https://builds.apache.org/job/Tuscany-2x/ws/sca-2x/distribution/aggregations/base-runtime-aggregation/pom.xml;>
	project: MavenProject: org.apache.tuscany.sca.aggregation:tuscany-base-runtime-aggregation:2.5-SNAPSHOT @ <https://builds.apache.org/job/Tuscany-2x/ws/sca-2x/distribution/aggregations/base-runtime-aggregation/pom.xml;>
	project: MavenProject: org.apache.tuscany.sca.aggregation:tuscany-base-runtime-aggregation:2.5-SNAPSHOT @ <https://builds.apache.org/job/Tuscany-2x/ws/sca-2x/distribution/aggregations/base-runtime-aggregation/pom.xml>
[INFO] Processing artifact: org.aspectj:aspectjrt:jar:1.6.8:compile
[INFO] Processing artifact: org.apache.abdera:abdera-client:jar:1.1.1:compile
[INFO] Processing artifact: net.sourceforge.saxon:saxon:jar:xqj:9.1.0.8:compile
[INFO] Processing artifact: active project artifact:
	artifact = org.apache.tuscany.sca:tuscany-binding-jsonrpc-runtime:jar:2.5-SNAPSHOT:compile;
	project: MavenProject: org.apache.tuscany.sca:tuscany-binding-jsonrpc-runtime:2.5-SNAPSHOT @ <https://builds.apache.org/job/Tuscany-2x/ws/sca-2x/modules/binding-jsonrpc-runtime/pom.xml>
[INFO] Processing artifact: org.mortbay.jetty:jetty-util:jar:6.1.26:compile
[INFO] Processing artifact: org.apache.ws.commons.axiom:axiom-api:jar:1.2.10:compile
[INFO] Processing artifact: active project artifact:
	artifact = org.apache.tuscany.sca:tuscany-implementation-spring-runtime:jar:2.5-SNAPSHOT:compile;
	project: MavenProject: org.apache.tuscany.sca:tuscany-implementation-spring-runtime:2.5-SNAPSHOT @ <https://builds.apache.org/job/Tuscany-2x/ws/sca-2x/modules/implementation-spring-runtime/pom.xml>
[INFO] Processing artifact: org.apache.tuscany.sdo:tuscany-sdo-api-r2.1:jar:1.1.1:compile
[INFO] Processing artifact: active project artifact:
	artifact = org.apache.tuscany.sca:tuscany-binding-rmi-runtime:jar:2.5-SNAPSHOT:compile;
	project: MavenProject: org.apache.tuscany.sca:tuscany-binding-rmi-runtime:2.5-SNAPSHOT @ <https://builds.apache.org/job/Tuscany-2x/ws/sca-2x/modules/binding-rmi-runtime/pom.xml>
[INFO] Processing artifact: org.apache.neethi:neethi:jar:2.0.4:compile
[INFO] Processing artifact: active project artifact:
	artifact = org.apache.tuscany.sca:tuscany-web-javascript:jar:2.5-SNAPSHOT:compile;
	project: MavenProject: org.apache.tuscany.sca:tuscany-web-javascript:2.5-SNAPSHOT @ <https://builds.apache.org/job/Tuscany-2x/ws/sca-2x/modules/web-javascript/pom.xml>
[INFO] Processing artifact: org.directwebremoting:dwr:jar:2.0.3:compile
[INFO] Processing artifact: org.apache.ws.commons.axiom:axiom-impl:jar:1.2.10:compile
[INFO] MANIFEST.MF found for org.apache.ws.commons.axiom:axiom-impl:jar:1.2.10:compile (<https://builds.apache.org/job/Tuscany-2x/ws/sca-2x/distribution/all/manifests/axiom-impl-1.2.10.MF)>
[INFO] Processing artifact: org.apache.tuscany.sdo:tuscany-sdo-impl:jar:1.1.1:compile
[INFO] Processing artifact: net.sourceforge.saxon:saxon:jar:xpath:9.1.0.8:compile
[INFO] Processing artifact: active project artifact:
	artifact = org.apache.tuscany.sca:tuscany-host-jetty:jar:2.5-SNAPSHOT:compile;
	project: MavenProject: org.apache.tuscany.sca:tuscany-host-jetty:2.5-SNAPSHOT @ <https://builds.apache.org/job/Tuscany-2x/ws/sca-2x/modules/host-jetty/pom.xml>
[INFO] Processing artifact: active project artifact:
	artifact = org.apache.tuscany.sca:tuscany-myfaces:jar:2.5-SNAPSHOT:compile;
	project: MavenProject: org.apache.tuscany.sca:tuscany-myfaces:2.5-SNAPSHOT @ <https://builds.apache.org/job/Tuscany-2x/ws/sca-2x/modules/myfaces/pom.xml>
[INFO] Processing artifact: org.apache.ode:ode-jacob-ap:jar:1.3.2:compile
[INFO] Processing artifact: net.sourceforge.saxon:saxon:jar:9.1.0.8:compile
[INFO] Processing artifact: net.sourceforge.saxon:saxon:jar:dom:9.1.0.8:compile
[INFO] Processing artifact: active project artifact:
	artifact = org.apache.tuscany.sca:tuscany-sca-client-impl:jar:2.5-SNAPSHOT:compile;
	project: MavenProject: org.apache.tuscany.sca:tuscany-sca-client-impl:2.5-SNAPSHOT @ <https://builds.apache.org/job/Tuscany-2x/ws/sca-2x/modules/sca-client-impl/pom.xml>
[INFO] Processing artifact: active project artifact:
	artifact = org.apache.tuscany.sca:tuscany-assembly-xml:jar:2.5-SNAPSHOT:compile;
	project: MavenProject: org.apache.tuscany.sca:tuscany-assembly-xml:2.5-SNAPSHOT @ <https://builds.apache.org/job/Tuscany-2x/ws/sca-2x/modules/assembly-xml/pom.xml>
[INFO] Processing artifact: org.apache.geronimo.specs:geronimo-j2ee-connector_1.5_spec:jar:2.0.0:compile
[INFO] Processing artifact: active project artifact:
	artifact = org.apache.tuscany.sca:tuscany-databinding-sdo:jar:2.5-SNAPSHOT:compile;
	project: MavenProject: org.apache.tuscany.sca:tuscany-databinding-sdo:2.5-SNAPSHOT @ <https://builds.apache.org/job/Tuscany-2x/ws/sca-2x/modules/databinding-sdo/pom.xml>
[INFO] Processing artifact: active project artifact:
	artifact = org.apache.tuscany.sca:tuscany-sca-api:jar:2.5-SNAPSHOT:compile;
	project: MavenProject: org.apache.tuscany.sca:tuscany-sca-api:2.5-SNAPSHOT @ <https://builds.apache.org/job/Tuscany-2x/ws/sca-2x/modules/sca-api/pom.xml>
[INFO] Processing artifact: active project artifact:
	artifact = org.apache.tuscany.sca:tuscany-implementation-web:jar:2.5-SNAPSHOT:compile;
	project: MavenProject: org.apache.tuscany.sca:tuscany-implementation-web:2.5-SNAPSHOT @ <https://builds.apache.org/job/Tuscany-2x/ws/sca-2x/modules/implementation-web/pom.xml>
[INFO] Processing artifact: org.apache.ode:ode-bpel-epr:jar:1.3.2:compile
[INFO] Processing artifact: active project artifact:
	artifact = org.apache.tuscany.sca:tuscany-implementation-web-client:jar:2.5-SNAPSHOT:compile;
	project: MavenProject: org.apache.tuscany.sca:tuscany-implementation-web-client:2.5-SNAPSHOT @ <https://builds.apache.org/job/Tuscany-2x/ws/sca-2x/modules/implementation-web-client/pom.xml>
[INFO] Processing artifact: active project artifact:
	artifact = active project artifact:
	artifact = active project artifact:
	artifact = org.apache.tuscany.sca:tuscany-feature-all:pom:2.5-SNAPSHOT:compile;
	project: MavenProject: org.apache.tuscany.sca:tuscany-feature-all:2.5-SNAPSHOT @ <https://builds.apache.org/job/Tuscany-2x/ws/sca-2x/features/all/pom.xml;>
	project: MavenProject: org.apache.tuscany.sca:tuscany-feature-all:2.5-SNAPSHOT @ <https://builds.apache.org/job/Tuscany-2x/ws/sca-2x/features/all/pom.xml;>
	project: MavenProject: org.apache.tuscany.sca:tuscany-feature-all:2.5-SNAPSHOT @ <https://builds.apache.org/job/Tuscany-2x/ws/sca-2x/features/all/pom.xml>
[INFO] Processing artifact: org.json:json:jar:20090211:compile
[INFO] Processing artifact: org.apache.ws.commons.axiom:axiom-dom:jar:1.2.10:compile
[INFO] Processing artifact: active project artifact:
	artifact = org.apache.tuscany.sca:tuscany-xsd:jar:2.5-SNAPSHOT:compile;
	project: MavenProject: org.apache.tuscany.sca:tuscany-xsd:2.5-SNAPSHOT @ <https://builds.apache.org/job/Tuscany-2x/ws/sca-2x/modules/xsd/pom.xml>
[INFO] Processing artifact: active project artifact:
	artifact = org.apache.tuscany.sca:tuscany-policy-wspolicy:jar:2.5-SNAPSHOT:compile;
	project: MavenProject: org.apache.tuscany.sca:tuscany-policy-wspolicy:2.5-SNAPSHOT @ <https://builds.apache.org/job/Tuscany-2x/ws/sca-2x/modules/policy-wspolicy/pom.xml>
[INFO] Processing artifact: org.eclipse.emf:common:jar:2.2.3:compile
[INFO] Processing artifact: org.eclipse.core:runtime:jar:3.4.0-v20080512:runtime
[INFO] Processing artifact: active project artifact:
	artifact = org.apache.tuscany.sca:tuscany-implementation-script:jar:2.5-SNAPSHOT:compile;
	project: MavenProject: org.apache.tuscany.sca:tuscany-implementation-script:2.5-SNAPSHOT @ <https://builds.apache.org/job/Tuscany-2x/ws/sca-2x/modules/implementation-script/pom.xml>
[INFO] Processing artifact: active project artifact:
	artifact = org.apache.tuscany.sca:tuscany-domain-hazelcast:jar:2.5-SNAPSHOT:compile;
	project: MavenProject: org.apache.tuscany.sca:tuscany-domain-hazelcast:2.5-SNAPSHOT @ <https://builds.apache.org/job/Tuscany-2x/ws/sca-2x/modules/domain-hazelcast/pom.xml>
[INFO] Processing artifact: org.codehaus.groovy:groovy-all:jar:1.7.1:runtime
[INFO] Processing artifact: org.apache.wink:wink-client-apache-httpclient:jar:1.2.0-incubating:compile
[INFO] Processing artifact: org.apache.axis2:org.apache.axis2.osgi:jar:1.5.3:compile
[INFO] Overriding the manifest for org.apache.axis2:org.apache.axis2.osgi:jar:1.5.3:compile
[INFO] Processing artifact: org.apache.ode:ode-bpel-runtime:jar:1.3.2:compile
[INFO] Processing artifact: org.eclipse.emf:ecore-change:jar:2.2.3:compile
[INFO] Processing artifact: org.codehaus.jackson:jackson-mapper-asl:jar:1.9.4:compile
[INFO] Processing artifact: org.apache.openjpa:openjpa:jar:1.2.1:compile
[INFO] Processing artifact: org.apache.geronimo.specs:geronimo-ejb_3.0_spec:jar:1.0.1:compile
[INFO] Processing artifact: active project artifact:
	artifact = org.apache.tuscany.sca:tuscany-binding-ws-runtime-jaxws:jar:2.5-SNAPSHOT:compile;
	project: MavenProject: org.apache.tuscany.sca:tuscany-binding-ws-runtime-jaxws:2.5-SNAPSHOT @ <https://builds.apache.org/job/Tuscany-2x/ws/sca-2x/modules/binding-ws-runtime-jaxws/pom.xml>
[INFO] Processing artifact: jdom:jdom:jar:1.0:compile
[INFO] Processing artifact: org.apache.ode:ode-bpel-compiler:jar:1.3.2:compile
[INFO] Processing artifact: active project artifact:
	artifact = org.apache.tuscany.sca:tuscany-host-corba-jee:jar:2.5-SNAPSHOT:compile;
	project: MavenProject: org.apache.tuscany.sca:tuscany-host-corba-jee:2.5-SNAPSHOT @ <https://builds.apache.org/job/Tuscany-2x/ws/sca-2x/modules/host-corba-jee/pom.xml>
[INFO] Processing artifact: active project artifact:
	artifact = org.apache.tuscany.sca:tuscany-binding-rest-runtime:jar:2.5-SNAPSHOT:compile;
	project: MavenProject: org.apache.tuscany.sca:tuscany-binding-rest-runtime:2.5-SNAPSHOT @ <https://builds.apache.org/job/Tuscany-2x/ws/sca-2x/modules/binding-rest-runtime/pom.xml>
[INFO] Processing artifact: wsdl4j:wsdl4j:jar:1.6.2:compile
[INFO] Processing artifact: org.mortbay.jetty:jetty:jar:6.1.26:compile
[INFO] Processing artifact: org.apache.geronimo.components:geronimo-connector:jar:2.1.4:compile
[INFO] Processing artifact: active project artifact:
	artifact = org.apache.tuscany.sca:tuscany-binding-jsonrpc:jar:2.5-SNAPSHOT:compile;
	project: MavenProject: org.apache.tuscany.sca:tuscany-binding-jsonrpc:2.5-SNAPSHOT @ <https://builds.apache.org/job/Tuscany-2x/ws/sca-2x/modules/binding-jsonrpc/pom.xml>
[INFO] Processing artifact: active project artifact:
	artifact = org.apache.tuscany.sca:tuscany-implementation-python:jar:2.5-SNAPSHOT:compile;
	project: MavenProject: org.apache.tuscany.sca:tuscany-implementation-python:2.5-SNAPSHOT @ <https://builds.apache.org/job/Tuscany-2x/ws/sca-2x/modules/implementation-python/pom.xml>
[INFO] Processing artifact: commons-codec:commons-codec:jar:1.6:compile
[INFO] Generating manifest jar: <https://builds.apache.org/job/Tuscany-2x/ws/sca-2x/distribution/all/target/features/tuscany-binding-ejb-runtime/tuscany-binding-ejb-runtime-manifest.jar>
[INFO] Generating manifest jar: <https://builds.apache.org/job/Tuscany-2x/ws/sca-2x/distribution/all/target/features/tuscany-implementation-osgi-runtime/tuscany-implementation-osgi-runtime-manifest.jar>
[INFO] Generating manifest jar: <https://builds.apache.org/job/Tuscany-2x/ws/sca-2x/distribution/all/target/features/tuscany-host-jetty/tuscany-host-jetty-manifest.jar>
[INFO] Generating manifest jar: <https://builds.apache.org/job/Tuscany-2x/ws/sca-2x/distribution/all/target/features/tuscany-binding-ws-runtime-axis2/tuscany-binding-ws-runtime-axis2-manifest.jar>
[INFO] Generating manifest jar: <https://builds.apache.org/job/Tuscany-2x/ws/sca-2x/distribution/all/target/features/tuscany-implementation-python-runtime/tuscany-implementation-python-runtime-manifest.jar>
[INFO] Generating manifest jar: <https://builds.apache.org/job/Tuscany-2x/ws/sca-2x/distribution/all/target/features/tuscany-binding-jms-runtime/tuscany-binding-jms-runtime-manifest.jar>
[INFO] Generating manifest jar: <https://builds.apache.org/job/Tuscany-2x/ws/sca-2x/distribution/all/target/features/tuscany-implementation-spring-runtime/tuscany-implementation-spring-runtime-manifest.jar>
[INFO] Generating manifest jar: <https://builds.apache.org/job/Tuscany-2x/ws/sca-2x/distribution/all/target/features/tuscany-binding-rest-runtime/tuscany-binding-rest-runtime-manifest.jar>
[INFO] Generating manifest jar: <https://builds.apache.org/job/Tuscany-2x/ws/sca-2x/distribution/all/target/features/tuscany-binding-atom-runtime/tuscany-binding-atom-runtime-manifest.jar>
[INFO] Generating manifest jar: <https://builds.apache.org/job/Tuscany-2x/ws/sca-2x/distribution/all/target/features/tuscany-implementation-widget-runtime/tuscany-implementation-widget-runtime-manifest.jar>
[INFO] Generating manifest jar: <https://builds.apache.org/job/Tuscany-2x/ws/sca-2x/distribution/all/target/features/tuscany-base-runtime-pom/tuscany-base-runtime-pom-manifest.jar>
[INFO] Generating manifest jar: <https://builds.apache.org/job/Tuscany-2x/ws/sca-2x/distribution/all/target/features/tuscany-implementation-bpel-runtime/tuscany-implementation-bpel-runtime-manifest.jar>
[INFO] Generating manifest jar: <https://builds.apache.org/job/Tuscany-2x/ws/sca-2x/distribution/all/target/features/tuscany-binding-corba-runtime/tuscany-binding-corba-runtime-manifest.jar>
[INFO] Generating manifest jar: <https://builds.apache.org/job/Tuscany-2x/ws/sca-2x/distribution/all/target/features/tuscany-binding-rmi-runtime/tuscany-binding-rmi-runtime-manifest.jar>
[INFO] Generating manifest jar: <https://builds.apache.org/job/Tuscany-2x/ws/sca-2x/distribution/all/target/features/tuscany-binding-jsonrpc-runtime/tuscany-binding-jsonrpc-runtime-manifest.jar>
[INFO] Generating manifest jar: <https://builds.apache.org/job/Tuscany-2x/ws/sca-2x/distribution/all/target/features/tuscany-implementation-script-runtime/tuscany-implementation-script-runtime-manifest.jar>
[INFO] Generating manifest jar: <https://builds.apache.org/job/Tuscany-2x/ws/sca-2x/distribution/all/target/features/tuscany-binding-jsonp-runtime/tuscany-binding-jsonp-runtime-manifest.jar>
[INFO] Generating manifest jar: <https://builds.apache.org/job/Tuscany-2x/ws/sca-2x/distribution/all/target/features/tuscany-implementation-web-runtime/tuscany-implementation-web-runtime-manifest.jar>
[INFO] Generating equinox manifest jar: <https://builds.apache.org/job/Tuscany-2x/ws/sca-2x/distribution/all/target/features/tuscany-sca-equinox-manifest.jar>
[INFO] Generating ANT build path: <https://builds.apache.org/job/Tuscany-2x/ws/sca-2x/distribution/all/target/features/tuscany-binding-ejb-runtime/build-path.xml>
[INFO] Generating ANT build path: <https://builds.apache.org/job/Tuscany-2x/ws/sca-2x/distribution/all/target/features/tuscany-implementation-osgi-runtime/build-path.xml>
[INFO] Generating ANT build path: <https://builds.apache.org/job/Tuscany-2x/ws/sca-2x/distribution/all/target/features/tuscany-host-jetty/build-path.xml>
[INFO] Generating ANT build path: <https://builds.apache.org/job/Tuscany-2x/ws/sca-2x/distribution/all/target/features/tuscany-binding-ws-runtime-axis2/build-path.xml>
[INFO] Generating ANT build path: <https://builds.apache.org/job/Tuscany-2x/ws/sca-2x/distribution/all/target/features/tuscany-implementation-python-runtime/build-path.xml>
[INFO] Generating ANT build path: <https://builds.apache.org/job/Tuscany-2x/ws/sca-2x/distribution/all/target/features/tuscany-binding-jms-runtime/build-path.xml>
[INFO] Generating ANT build path: <https://builds.apache.org/job/Tuscany-2x/ws/sca-2x/distribution/all/target/features/tuscany-implementation-spring-runtime/build-path.xml>
[INFO] Generating ANT build path: <https://builds.apache.org/job/Tuscany-2x/ws/sca-2x/distribution/all/target/features/tuscany-binding-rest-runtime/build-path.xml>
[INFO] Generating ANT build path: <https://builds.apache.org/job/Tuscany-2x/ws/sca-2x/distribution/all/target/features/tuscany-binding-atom-runtime/build-path.xml>
[INFO] Generating ANT build path: <https://builds.apache.org/job/Tuscany-2x/ws/sca-2x/distribution/all/target/features/tuscany-implementation-widget-runtime/build-path.xml>
[INFO] Generating ANT build path: <https://builds.apache.org/job/Tuscany-2x/ws/sca-2x/distribution/all/target/features/tuscany-base-runtime-pom/build-path.xml>
[INFO] Generating ANT build path: <https://builds.apache.org/job/Tuscany-2x/ws/sca-2x/distribution/all/target/features/tuscany-implementation-bpel-runtime/build-path.xml>
[INFO] Generating ANT build path: <https://builds.apache.org/job/Tuscany-2x/ws/sca-2x/distribution/all/target/features/tuscany-binding-corba-runtime/build-path.xml>
[INFO] Generating ANT build path: <https://builds.apache.org/job/Tuscany-2x/ws/sca-2x/distribution/all/target/features/tuscany-binding-rmi-runtime/build-path.xml>
[INFO] Generating ANT build path: <https://builds.apache.org/job/Tuscany-2x/ws/sca-2x/distribution/all/target/features/tuscany-binding-jsonrpc-runtime/build-path.xml>
[INFO] Generating ANT build path: <https://builds.apache.org/job/Tuscany-2x/ws/sca-2x/distribution/all/target/features/tuscany-implementation-script-runtime/build-path.xml>
[INFO] Generating ANT build path: <https://builds.apache.org/job/Tuscany-2x/ws/sca-2x/distribution/all/target/features/tuscany-binding-jsonp-runtime/build-path.xml>
[INFO] Generating ANT build path: <https://builds.apache.org/job/Tuscany-2x/ws/sca-2x/distribution/all/target/features/tuscany-implementation-web-runtime/build-path.xml>
[INFO] Generating Which Jars: <https://builds.apache.org/job/Tuscany-2x/ws/sca-2x/distribution/all/target/features/tuscany-binding-ejb-runtime/which-jars>
[INFO] Generating Which Jars: <https://builds.apache.org/job/Tuscany-2x/ws/sca-2x/distribution/all/target/features/tuscany-implementation-osgi-runtime/which-jars>
[INFO] Generating Which Jars: <https://builds.apache.org/job/Tuscany-2x/ws/sca-2x/distribution/all/target/features/tuscany-host-jetty/which-jars>
[INFO] Generating Which Jars: <https://builds.apache.org/job/Tuscany-2x/ws/sca-2x/distribution/all/target/features/tuscany-binding-ws-runtime-axis2/which-jars>
[INFO] Generating Which Jars: <https://builds.apache.org/job/Tuscany-2x/ws/sca-2x/distribution/all/target/features/tuscany-implementation-python-runtime/which-jars>
[INFO] Generating Which Jars: <https://builds.apache.org/job/Tuscany-2x/ws/sca-2x/distribution/all/target/features/tuscany-binding-jms-runtime/which-jars>
[INFO] Generating Which Jars: <https://builds.apache.org/job/Tuscany-2x/ws/sca-2x/distribution/all/target/features/tuscany-implementation-spring-runtime/which-jars>
[INFO] Generating Which Jars: <https://builds.apache.org/job/Tuscany-2x/ws/sca-2x/distribution/all/target/features/tuscany-binding-rest-runtime/which-jars>
[INFO] Generating Which Jars: <https://builds.apache.org/job/Tuscany-2x/ws/sca-2x/distribution/all/target/features/tuscany-binding-atom-runtime/which-jars>
[INFO] Generating Which Jars: <https://builds.apache.org/job/Tuscany-2x/ws/sca-2x/distribution/all/target/features/tuscany-implementation-widget-runtime/which-jars>
[INFO] Generating Which Jars: <https://builds.apache.org/job/Tuscany-2x/ws/sca-2x/distribution/all/target/features/tuscany-base-runtime-pom/which-jars>
[INFO] Generating Which Jars: <https://builds.apache.org/job/Tuscany-2x/ws/sca-2x/distribution/all/target/features/tuscany-implementation-bpel-runtime/which-jars>
[INFO] Generating Which Jars: <https://builds.apache.org/job/Tuscany-2x/ws/sca-2x/distribution/all/target/features/tuscany-binding-corba-runtime/which-jars>
[INFO] Generating Which Jars: <https://builds.apache.org/job/Tuscany-2x/ws/sca-2x/distribution/all/target/features/tuscany-binding-rmi-runtime/which-jars>
[INFO] Generating Which Jars: <https://builds.apache.org/job/Tuscany-2x/ws/sca-2x/distribution/all/target/features/tuscany-binding-jsonrpc-runtime/which-jars>
[INFO] Generating Which Jars: <https://builds.apache.org/job/Tuscany-2x/ws/sca-2x/distribution/all/target/features/tuscany-implementation-script-runtime/which-jars>
[INFO] Generating Which Jars: <https://builds.apache.org/job/Tuscany-2x/ws/sca-2x/distribution/all/target/features/tuscany-binding-jsonp-runtime/which-jars>
[INFO] Generating Which Jars: <https://builds.apache.org/job/Tuscany-2x/ws/sca-2x/distribution/all/target/features/tuscany-implementation-web-runtime/which-jars>
[INFO] [site:attach-descriptor {execution: default-attach-descriptor}]
[INFO] [assembly:single {execution: distribution-package}]
[INFO] Reading assembly descriptor: src/main/assembly/bin-distribution.xml
[INFO] Reading assembly descriptor: src/main/assembly/src.xml
[WARNING] POM for 'org.opensaml:opensaml:pom:2.2.3:compile' is invalid.

Its dependencies (if any) will NOT be available to the current build.
[WARNING] Cannot include project artifact: org.apache.tuscany.sca:tuscany-distribution-all:pom:2.5-SNAPSHOT; it doesn't have an associated file or directory.
[WARNING] Cannot include project artifact: org.apache.tuscany.sca:tuscany-distribution-all:pom:2.5-SNAPSHOT; it doesn't have an associated file or directory.
[JENKINS] Archiving disabled
[INFO] ------------------------------------------------------------------------
[ERROR] BUILD ERROR
[INFO] ------------------------------------------------------------------------
[INFO] Failed to create assembly: Error creating assembly archive : Failed to retrieve numeric file attributes using: '/bin/sh -c ls -1laR <https://builds.apache.org/job/Tuscany-2x/ws/sca-2x/distribution/all/../..'>

[INFO] ------------------------------------------------------------------------
[INFO] For more information, run Maven with the -e switch
[INFO] ------------------------------------------------------------------------
[INFO] Total time: 22 minutes 11 seconds
[INFO] Finished at: Wed Feb 13 03:21:05 UTC 2013
[INFO] Final Memory: 547M/729M
[INFO] ------------------------------------------------------------------------
Waiting for Jenkins to finish collecting data
Maven failed with error.
Sending e-mails to: notification@tuscany.apache.org
channel stopped
2013-02-13 03:24:12.914:INFO::Shutdown hook executing
2013-02-13 03:24:12.914:INFO::Shutdown hook complete

Build failed in Jenkins: Tuscany-2x #934

Posted by Apache Jenkins Server <je...@builds.apache.org>.
See <https://builds.apache.org/job/Tuscany-2x/934/>

------------------------------------------
[...truncated 42425 lines...]
[INFO] Processing artifact: org.apache.ws.commons.axiom:axiom-dom:jar:1.2.10:compile
[INFO] Processing artifact: active project artifact:
	artifact = org.apache.tuscany.sca:tuscany-xsd:jar:2.5-SNAPSHOT:compile;
	project: MavenProject: org.apache.tuscany.sca:tuscany-xsd:2.5-SNAPSHOT @ <https://builds.apache.org/job/Tuscany-2x/ws/sca-2x/modules/xsd/pom.xml>
[INFO] Processing artifact: active project artifact:
	artifact = org.apache.tuscany.sca:tuscany-policy-wspolicy:jar:2.5-SNAPSHOT:compile;
	project: MavenProject: org.apache.tuscany.sca:tuscany-policy-wspolicy:2.5-SNAPSHOT @ <https://builds.apache.org/job/Tuscany-2x/ws/sca-2x/modules/policy-wspolicy/pom.xml>
[INFO] Processing artifact: org.eclipse.emf:common:jar:2.2.3:compile
[INFO] Processing artifact: org.eclipse.core:runtime:jar:3.4.0-v20080512:runtime
[INFO] Processing artifact: active project artifact:
	artifact = org.apache.tuscany.sca:tuscany-implementation-script:jar:2.5-SNAPSHOT:compile;
	project: MavenProject: org.apache.tuscany.sca:tuscany-implementation-script:2.5-SNAPSHOT @ <https://builds.apache.org/job/Tuscany-2x/ws/sca-2x/modules/implementation-script/pom.xml>
[INFO] Processing artifact: active project artifact:
	artifact = org.apache.tuscany.sca:tuscany-domain-hazelcast:jar:2.5-SNAPSHOT:compile;
	project: MavenProject: org.apache.tuscany.sca:tuscany-domain-hazelcast:2.5-SNAPSHOT @ <https://builds.apache.org/job/Tuscany-2x/ws/sca-2x/modules/domain-hazelcast/pom.xml>
[INFO] Processing artifact: org.codehaus.groovy:groovy-all:jar:1.7.1:runtime
[INFO] Processing artifact: org.apache.wink:wink-client-apache-httpclient:jar:1.2.0-incubating:compile
[INFO] Processing artifact: org.apache.axis2:org.apache.axis2.osgi:jar:1.5.3:compile
[INFO] Overriding the manifest for org.apache.axis2:org.apache.axis2.osgi:jar:1.5.3:compile
[INFO] Processing artifact: org.apache.ode:ode-bpel-runtime:jar:1.3.2:compile
[INFO] Processing artifact: org.eclipse.emf:ecore-change:jar:2.2.3:compile
[INFO] Processing artifact: org.codehaus.jackson:jackson-mapper-asl:jar:1.9.4:compile
[INFO] Processing artifact: org.apache.openjpa:openjpa:jar:1.2.1:compile
[INFO] Processing artifact: org.apache.geronimo.specs:geronimo-ejb_3.0_spec:jar:1.0.1:compile
[INFO] Processing artifact: active project artifact:
	artifact = org.apache.tuscany.sca:tuscany-binding-ws-runtime-jaxws:jar:2.5-SNAPSHOT:compile;
	project: MavenProject: org.apache.tuscany.sca:tuscany-binding-ws-runtime-jaxws:2.5-SNAPSHOT @ <https://builds.apache.org/job/Tuscany-2x/ws/sca-2x/modules/binding-ws-runtime-jaxws/pom.xml>
[INFO] Processing artifact: jdom:jdom:jar:1.0:compile
[INFO] Processing artifact: org.apache.ode:ode-bpel-compiler:jar:1.3.2:compile
[INFO] Processing artifact: active project artifact:
	artifact = org.apache.tuscany.sca:tuscany-host-corba-jee:jar:2.5-SNAPSHOT:compile;
	project: MavenProject: org.apache.tuscany.sca:tuscany-host-corba-jee:2.5-SNAPSHOT @ <https://builds.apache.org/job/Tuscany-2x/ws/sca-2x/modules/host-corba-jee/pom.xml>
[INFO] Processing artifact: active project artifact:
	artifact = org.apache.tuscany.sca:tuscany-binding-rest-runtime:jar:2.5-SNAPSHOT:compile;
	project: MavenProject: org.apache.tuscany.sca:tuscany-binding-rest-runtime:2.5-SNAPSHOT @ <https://builds.apache.org/job/Tuscany-2x/ws/sca-2x/modules/binding-rest-runtime/pom.xml>
[INFO] Processing artifact: wsdl4j:wsdl4j:jar:1.6.2:compile
[INFO] Processing artifact: org.mortbay.jetty:jetty:jar:6.1.26:compile
[INFO] Processing artifact: org.apache.geronimo.components:geronimo-connector:jar:2.1.4:compile
[INFO] Processing artifact: active project artifact:
	artifact = org.apache.tuscany.sca:tuscany-binding-jsonrpc:jar:2.5-SNAPSHOT:compile;
	project: MavenProject: org.apache.tuscany.sca:tuscany-binding-jsonrpc:2.5-SNAPSHOT @ <https://builds.apache.org/job/Tuscany-2x/ws/sca-2x/modules/binding-jsonrpc/pom.xml>
[INFO] Processing artifact: active project artifact:
	artifact = org.apache.tuscany.sca:tuscany-implementation-python:jar:2.5-SNAPSHOT:compile;
	project: MavenProject: org.apache.tuscany.sca:tuscany-implementation-python:2.5-SNAPSHOT @ <https://builds.apache.org/job/Tuscany-2x/ws/sca-2x/modules/implementation-python/pom.xml>
[INFO] Processing artifact: commons-codec:commons-codec:jar:1.6:compile
[INFO] Generating manifest jar: <https://builds.apache.org/job/Tuscany-2x/ws/sca-2x/distribution/all/target/features/tuscany-binding-ejb-runtime/tuscany-binding-ejb-runtime-manifest.jar>
[INFO] Generating manifest jar: <https://builds.apache.org/job/Tuscany-2x/ws/sca-2x/distribution/all/target/features/tuscany-implementation-osgi-runtime/tuscany-implementation-osgi-runtime-manifest.jar>
[INFO] Generating manifest jar: <https://builds.apache.org/job/Tuscany-2x/ws/sca-2x/distribution/all/target/features/tuscany-host-jetty/tuscany-host-jetty-manifest.jar>
[INFO] Generating manifest jar: <https://builds.apache.org/job/Tuscany-2x/ws/sca-2x/distribution/all/target/features/tuscany-binding-ws-runtime-axis2/tuscany-binding-ws-runtime-axis2-manifest.jar>
[INFO] Generating manifest jar: <https://builds.apache.org/job/Tuscany-2x/ws/sca-2x/distribution/all/target/features/tuscany-implementation-python-runtime/tuscany-implementation-python-runtime-manifest.jar>
[INFO] Generating manifest jar: <https://builds.apache.org/job/Tuscany-2x/ws/sca-2x/distribution/all/target/features/tuscany-binding-jms-runtime/tuscany-binding-jms-runtime-manifest.jar>
[INFO] Generating manifest jar: <https://builds.apache.org/job/Tuscany-2x/ws/sca-2x/distribution/all/target/features/tuscany-implementation-spring-runtime/tuscany-implementation-spring-runtime-manifest.jar>
[INFO] Generating manifest jar: <https://builds.apache.org/job/Tuscany-2x/ws/sca-2x/distribution/all/target/features/tuscany-binding-rest-runtime/tuscany-binding-rest-runtime-manifest.jar>
[INFO] Generating manifest jar: <https://builds.apache.org/job/Tuscany-2x/ws/sca-2x/distribution/all/target/features/tuscany-binding-atom-runtime/tuscany-binding-atom-runtime-manifest.jar>
[INFO] Generating manifest jar: <https://builds.apache.org/job/Tuscany-2x/ws/sca-2x/distribution/all/target/features/tuscany-implementation-widget-runtime/tuscany-implementation-widget-runtime-manifest.jar>
[INFO] Generating manifest jar: <https://builds.apache.org/job/Tuscany-2x/ws/sca-2x/distribution/all/target/features/tuscany-base-runtime-pom/tuscany-base-runtime-pom-manifest.jar>
[INFO] Generating manifest jar: <https://builds.apache.org/job/Tuscany-2x/ws/sca-2x/distribution/all/target/features/tuscany-implementation-bpel-runtime/tuscany-implementation-bpel-runtime-manifest.jar>
[INFO] Generating manifest jar: <https://builds.apache.org/job/Tuscany-2x/ws/sca-2x/distribution/all/target/features/tuscany-binding-corba-runtime/tuscany-binding-corba-runtime-manifest.jar>
[INFO] Generating manifest jar: <https://builds.apache.org/job/Tuscany-2x/ws/sca-2x/distribution/all/target/features/tuscany-binding-rmi-runtime/tuscany-binding-rmi-runtime-manifest.jar>
[INFO] Generating manifest jar: <https://builds.apache.org/job/Tuscany-2x/ws/sca-2x/distribution/all/target/features/tuscany-binding-jsonrpc-runtime/tuscany-binding-jsonrpc-runtime-manifest.jar>
[INFO] Generating manifest jar: <https://builds.apache.org/job/Tuscany-2x/ws/sca-2x/distribution/all/target/features/tuscany-implementation-script-runtime/tuscany-implementation-script-runtime-manifest.jar>
[INFO] Generating manifest jar: <https://builds.apache.org/job/Tuscany-2x/ws/sca-2x/distribution/all/target/features/tuscany-binding-jsonp-runtime/tuscany-binding-jsonp-runtime-manifest.jar>
[INFO] Generating manifest jar: <https://builds.apache.org/job/Tuscany-2x/ws/sca-2x/distribution/all/target/features/tuscany-implementation-web-runtime/tuscany-implementation-web-runtime-manifest.jar>
[INFO] Generating equinox manifest jar: <https://builds.apache.org/job/Tuscany-2x/ws/sca-2x/distribution/all/target/features/tuscany-sca-equinox-manifest.jar>
[INFO] Generating ANT build path: <https://builds.apache.org/job/Tuscany-2x/ws/sca-2x/distribution/all/target/features/tuscany-binding-ejb-runtime/build-path.xml>
[INFO] Generating ANT build path: <https://builds.apache.org/job/Tuscany-2x/ws/sca-2x/distribution/all/target/features/tuscany-implementation-osgi-runtime/build-path.xml>
[INFO] Generating ANT build path: <https://builds.apache.org/job/Tuscany-2x/ws/sca-2x/distribution/all/target/features/tuscany-host-jetty/build-path.xml>
[INFO] Generating ANT build path: <https://builds.apache.org/job/Tuscany-2x/ws/sca-2x/distribution/all/target/features/tuscany-binding-ws-runtime-axis2/build-path.xml>
[INFO] Generating ANT build path: <https://builds.apache.org/job/Tuscany-2x/ws/sca-2x/distribution/all/target/features/tuscany-implementation-python-runtime/build-path.xml>
[INFO] Generating ANT build path: <https://builds.apache.org/job/Tuscany-2x/ws/sca-2x/distribution/all/target/features/tuscany-binding-jms-runtime/build-path.xml>
[INFO] Generating ANT build path: <https://builds.apache.org/job/Tuscany-2x/ws/sca-2x/distribution/all/target/features/tuscany-implementation-spring-runtime/build-path.xml>
[INFO] Generating ANT build path: <https://builds.apache.org/job/Tuscany-2x/ws/sca-2x/distribution/all/target/features/tuscany-binding-rest-runtime/build-path.xml>
[INFO] Generating ANT build path: <https://builds.apache.org/job/Tuscany-2x/ws/sca-2x/distribution/all/target/features/tuscany-binding-atom-runtime/build-path.xml>
[INFO] Generating ANT build path: <https://builds.apache.org/job/Tuscany-2x/ws/sca-2x/distribution/all/target/features/tuscany-implementation-widget-runtime/build-path.xml>
[INFO] Generating ANT build path: <https://builds.apache.org/job/Tuscany-2x/ws/sca-2x/distribution/all/target/features/tuscany-base-runtime-pom/build-path.xml>
[INFO] Generating ANT build path: <https://builds.apache.org/job/Tuscany-2x/ws/sca-2x/distribution/all/target/features/tuscany-implementation-bpel-runtime/build-path.xml>
[INFO] Generating ANT build path: <https://builds.apache.org/job/Tuscany-2x/ws/sca-2x/distribution/all/target/features/tuscany-binding-corba-runtime/build-path.xml>
[INFO] Generating ANT build path: <https://builds.apache.org/job/Tuscany-2x/ws/sca-2x/distribution/all/target/features/tuscany-binding-rmi-runtime/build-path.xml>
[INFO] Generating ANT build path: <https://builds.apache.org/job/Tuscany-2x/ws/sca-2x/distribution/all/target/features/tuscany-binding-jsonrpc-runtime/build-path.xml>
[INFO] Generating ANT build path: <https://builds.apache.org/job/Tuscany-2x/ws/sca-2x/distribution/all/target/features/tuscany-implementation-script-runtime/build-path.xml>
[INFO] Generating ANT build path: <https://builds.apache.org/job/Tuscany-2x/ws/sca-2x/distribution/all/target/features/tuscany-binding-jsonp-runtime/build-path.xml>
[INFO] Generating ANT build path: <https://builds.apache.org/job/Tuscany-2x/ws/sca-2x/distribution/all/target/features/tuscany-implementation-web-runtime/build-path.xml>
[INFO] Generating Which Jars: <https://builds.apache.org/job/Tuscany-2x/ws/sca-2x/distribution/all/target/features/tuscany-binding-ejb-runtime/which-jars>
[INFO] Generating Which Jars: <https://builds.apache.org/job/Tuscany-2x/ws/sca-2x/distribution/all/target/features/tuscany-implementation-osgi-runtime/which-jars>
[INFO] Generating Which Jars: <https://builds.apache.org/job/Tuscany-2x/ws/sca-2x/distribution/all/target/features/tuscany-host-jetty/which-jars>
[INFO] Generating Which Jars: <https://builds.apache.org/job/Tuscany-2x/ws/sca-2x/distribution/all/target/features/tuscany-binding-ws-runtime-axis2/which-jars>
[INFO] Generating Which Jars: <https://builds.apache.org/job/Tuscany-2x/ws/sca-2x/distribution/all/target/features/tuscany-implementation-python-runtime/which-jars>
[INFO] Generating Which Jars: <https://builds.apache.org/job/Tuscany-2x/ws/sca-2x/distribution/all/target/features/tuscany-binding-jms-runtime/which-jars>
[INFO] Generating Which Jars: <https://builds.apache.org/job/Tuscany-2x/ws/sca-2x/distribution/all/target/features/tuscany-implementation-spring-runtime/which-jars>
[INFO] Generating Which Jars: <https://builds.apache.org/job/Tuscany-2x/ws/sca-2x/distribution/all/target/features/tuscany-binding-rest-runtime/which-jars>
[INFO] Generating Which Jars: <https://builds.apache.org/job/Tuscany-2x/ws/sca-2x/distribution/all/target/features/tuscany-binding-atom-runtime/which-jars>
[INFO] Generating Which Jars: <https://builds.apache.org/job/Tuscany-2x/ws/sca-2x/distribution/all/target/features/tuscany-implementation-widget-runtime/which-jars>
[INFO] Generating Which Jars: <https://builds.apache.org/job/Tuscany-2x/ws/sca-2x/distribution/all/target/features/tuscany-base-runtime-pom/which-jars>
[INFO] Generating Which Jars: <https://builds.apache.org/job/Tuscany-2x/ws/sca-2x/distribution/all/target/features/tuscany-implementation-bpel-runtime/which-jars>
[INFO] Generating Which Jars: <https://builds.apache.org/job/Tuscany-2x/ws/sca-2x/distribution/all/target/features/tuscany-binding-corba-runtime/which-jars>
[INFO] Generating Which Jars: <https://builds.apache.org/job/Tuscany-2x/ws/sca-2x/distribution/all/target/features/tuscany-binding-rmi-runtime/which-jars>
[INFO] Generating Which Jars: <https://builds.apache.org/job/Tuscany-2x/ws/sca-2x/distribution/all/target/features/tuscany-binding-jsonrpc-runtime/which-jars>
[INFO] Generating Which Jars: <https://builds.apache.org/job/Tuscany-2x/ws/sca-2x/distribution/all/target/features/tuscany-implementation-script-runtime/which-jars>
[INFO] Generating Which Jars: <https://builds.apache.org/job/Tuscany-2x/ws/sca-2x/distribution/all/target/features/tuscany-binding-jsonp-runtime/which-jars>
[INFO] Generating Which Jars: <https://builds.apache.org/job/Tuscany-2x/ws/sca-2x/distribution/all/target/features/tuscany-implementation-web-runtime/which-jars>
[INFO] [site:attach-descriptor {execution: default-attach-descriptor}]
Downloading: http://repo1.maven.org/maven2/org/apache/maven/shared/maven-common-artifact-filters/1.1/maven-common-artifact-filters-1.1.pom
2K downloaded  (maven-common-artifact-filters-1.1.pom)
Downloading: http://download.java.net/maven/2/org/apache/maven/wagon/wagon-file/1.0-alpha-5/wagon-file-1.0-alpha-5.pom
[INFO] Unable to find resource 'org.apache.maven.wagon:wagon-file:pom:1.0-alpha-5' in repository java.net2 (http://download.java.net/maven/2)
Downloading: http://www.intalio.org/public/maven2/org/apache/maven/wagon/wagon-file/1.0-alpha-5/wagon-file-1.0-alpha-5.pom
[INFO] Unable to find resource 'org.apache.maven.wagon:wagon-file:pom:1.0-alpha-5' in repository intalio.org (http://www.intalio.org/public/maven2)
Downloading: http://svn.apache.org/repos/asf/openejb/repo/org/apache/maven/wagon/wagon-file/1.0-alpha-5/wagon-file-1.0-alpha-5.pom
[INFO] Unable to find resource 'org.apache.maven.wagon:wagon-file:pom:1.0-alpha-5' in repository openejb-repository (http://svn.apache.org/repos/asf/openejb/repo)
Downloading: http://svn.apache.org/repos/asf/tuscany/maven/org/apache/maven/wagon/wagon-file/1.0-alpha-5/wagon-file-1.0-alpha-5.pom
[INFO] Unable to find resource 'org.apache.maven.wagon:wagon-file:pom:1.0-alpha-5' in repository tuscany.repo (http://svn.apache.org/repos/asf/tuscany/maven)
Downloading: https://repository.apache.org/content/groups/public//org/apache/maven/wagon/wagon-file/1.0-alpha-5/wagon-file-1.0-alpha-5.pom

Downloading: http://download.java.net/maven/2/org/apache/maven/maven-plugin-parameter-documenter/2.0/maven-plugin-parameter-documenter-2.0.pom
[INFO] Unable to find resource 'org.apache.maven:maven-plugin-parameter-documenter:pom:2.0' in repository java.net2 (http://download.java.net/maven/2)
Downloading: http://www.intalio.org/public/maven2/org/apache/maven/maven-plugin-parameter-documenter/2.0/maven-plugin-parameter-documenter-2.0.pom
1K downloaded  (maven-plugin-parameter-documenter-2.0.pom)
Downloading: http://download.java.net/maven/2/org/apache/maven/wagon/wagon-http-lightweight/1.0-alpha-5/wagon-http-lightweight-1.0-alpha-5.pom
[INFO] Unable to find resource 'org.apache.maven.wagon:wagon-http-lightweight:pom:1.0-alpha-5' in repository java.net2 (http://download.java.net/maven/2)
Downloading: http://www.intalio.org/public/maven2/org/apache/maven/wagon/wagon-http-lightweight/1.0-alpha-5/wagon-http-lightweight-1.0-alpha-5.pom
[INFO] Unable to find resource 'org.apache.maven.wagon:wagon-http-lightweight:pom:1.0-alpha-5' in repository intalio.org (http://www.intalio.org/public/maven2)
Downloading: http://svn.apache.org/repos/asf/openejb/repo/org/apache/maven/wagon/wagon-http-lightweight/1.0-alpha-5/wagon-http-lightweight-1.0-alpha-5.pom
[INFO] Unable to find resource 'org.apache.maven.wagon:wagon-http-lightweight:pom:1.0-alpha-5' in repository openejb-repository (http://svn.apache.org/repos/asf/openejb/repo)
Downloading: http://svn.apache.org/repos/asf/tuscany/maven/org/apache/maven/wagon/wagon-http-lightweight/1.0-alpha-5/wagon-http-lightweight-1.0-alpha-5.pom
[INFO] Unable to find resource 'org.apache.maven.wagon:wagon-http-lightweight:pom:1.0-alpha-5' in repository tuscany.repo (http://svn.apache.org/repos/asf/tuscany/maven)
Downloading: https://repository.apache.org/content/groups/public//org/apache/maven/wagon/wagon-http-lightweight/1.0-alpha-5/wagon-http-lightweight-1.0-alpha-5.pom

Downloading: http://download.java.net/maven/2/org/apache/maven/reporting/maven-reporting-api/2.0/maven-reporting-api-2.0.pom
[INFO] Unable to find resource 'org.apache.maven.reporting:maven-reporting-api:pom:2.0' in repository java.net2 (http://download.java.net/maven/2)
Downloading: http://www.intalio.org/public/maven2/org/apache/maven/reporting/maven-reporting-api/2.0/maven-reporting-api-2.0.pom
1K downloaded  (maven-reporting-api-2.0.pom)
Downloading: http://download.java.net/maven/2/org/apache/maven/reporting/maven-reporting/2.0/maven-reporting-2.0.pom
[INFO] Unable to find resource 'org.apache.maven.reporting:maven-reporting:pom:2.0' in repository java.net2 (http://download.java.net/maven/2)
Downloading: http://www.intalio.org/public/maven2/org/apache/maven/reporting/maven-reporting/2.0/maven-reporting-2.0.pom
504b downloaded  (maven-reporting-2.0.pom)
Downloading: http://download.java.net/maven/2/doxia/doxia-sink-api/1.0-alpha-4/doxia-sink-api-1.0-alpha-4.pom
[INFO] Unable to find resource 'doxia:doxia-sink-api:pom:1.0-alpha-4' in repository java.net2 (http://download.java.net/maven/2)
Downloading: http://www.intalio.org/public/maven2/doxia/doxia-sink-api/1.0-alpha-4/doxia-sink-api-1.0-alpha-4.pom
1K downloaded  (doxia-sink-api-1.0-alpha-4.pom)
Downloading: http://download.java.net/maven/2/org/apache/maven/maven-error-diagnostics/2.0/maven-error-diagnostics-2.0.pom
[INFO] Unable to find resource 'org.apache.maven:maven-error-diagnostics:pom:2.0' in repository java.net2 (http://download.java.net/maven/2)
Downloading: http://www.intalio.org/public/maven2/org/apache/maven/maven-error-diagnostics/2.0/maven-error-diagnostics-2.0.pom
812b downloaded  (maven-error-diagnostics-2.0.pom)
Downloading: http://download.java.net/maven/2/org/apache/maven/maven-plugin-registry/2.0/maven-plugin-registry-2.0.pom
[INFO] Unable to find resource 'org.apache.maven:maven-plugin-registry:pom:2.0' in repository java.net2 (http://download.java.net/maven/2)
Downloading: http://www.intalio.org/public/maven2/org/apache/maven/maven-plugin-registry/2.0/maven-plugin-registry-2.0.pom
1K downloaded  (maven-plugin-registry-2.0.pom)
Downloading: http://download.java.net/maven/2/org/apache/maven/maven-monitor/2.0/maven-monitor-2.0.pom
[INFO] Unable to find resource 'org.apache.maven:maven-monitor:pom:2.0' in repository java.net2 (http://download.java.net/maven/2)
Downloading: http://www.intalio.org/public/maven2/org/apache/maven/maven-monitor/2.0/maven-monitor-2.0.pom
400b downloaded  (maven-monitor-2.0.pom)
Downloading: http://download.java.net/maven/2/org/apache/maven/wagon/wagon-ssh/1.0-alpha-5/wagon-ssh-1.0-alpha-5.pom
[INFO] Unable to find resource 'org.apache.maven.wagon:wagon-ssh:pom:1.0-alpha-5' in repository java.net2 (http://download.java.net/maven/2)
Downloading: http://www.intalio.org/public/maven2/org/apache/maven/wagon/wagon-ssh/1.0-alpha-5/wagon-ssh-1.0-alpha-5.pom
[INFO] Unable to find resource 'org.apache.maven.wagon:wagon-ssh:pom:1.0-alpha-5' in repository intalio.org (http://www.intalio.org/public/maven2)
Downloading: http://svn.apache.org/repos/asf/openejb/repo/org/apache/maven/wagon/wagon-ssh/1.0-alpha-5/wagon-ssh-1.0-alpha-5.pom
[INFO] Unable to find resource 'org.apache.maven.wagon:wagon-ssh:pom:1.0-alpha-5' in repository openejb-repository (http://svn.apache.org/repos/asf/openejb/repo)
Downloading: http://svn.apache.org/repos/asf/tuscany/maven/org/apache/maven/wagon/wagon-ssh/1.0-alpha-5/wagon-ssh-1.0-alpha-5.pom
[INFO] Unable to find resource 'org.apache.maven.wagon:wagon-ssh:pom:1.0-alpha-5' in repository tuscany.repo (http://svn.apache.org/repos/asf/tuscany/maven)
Downloading: https://repository.apache.org/content/groups/public//org/apache/maven/wagon/wagon-ssh/1.0-alpha-5/wagon-ssh-1.0-alpha-5.pom

Downloading: http://download.java.net/maven/2/com/jcraft/jsch/0.1.23/jsch-0.1.23.pom
[INFO] Unable to find resource 'com.jcraft:jsch:pom:0.1.23' in repository java.net2 (http://download.java.net/maven/2)
Downloading: http://www.intalio.org/public/maven2/com/jcraft/jsch/0.1.23/jsch-0.1.23.pom
[INFO] Unable to find resource 'com.jcraft:jsch:pom:0.1.23' in repository intalio.org (http://www.intalio.org/public/maven2)
Downloading: http://svn.apache.org/repos/asf/openejb/repo/com/jcraft/jsch/0.1.23/jsch-0.1.23.pom
[INFO] Unable to find resource 'com.jcraft:jsch:pom:0.1.23' in repository openejb-repository (http://svn.apache.org/repos/asf/openejb/repo)
Downloading: http://svn.apache.org/repos/asf/tuscany/maven/com/jcraft/jsch/0.1.23/jsch-0.1.23.pom
[INFO] Unable to find resource 'com.jcraft:jsch:pom:0.1.23' in repository tuscany.repo (http://svn.apache.org/repos/asf/tuscany/maven)
Downloading: https://repository.apache.org/content/groups/public//com/jcraft/jsch/0.1.23/jsch-0.1.23.pom
[INFO] Unable to find resource 'com.jcraft:jsch:pom:0.1.23' in repository apache.nexus (https://repository.apache.org/content/groups/public/)
Downloading: http://repo1.maven.org/maven2/com/jcraft/jsch/0.1.23/jsch-0.1.23.pom
485b downloaded  (jsch-0.1.23.pom)
Downloading: http://repo1.maven.org/maven2/org/codehaus/plexus/plexus-interpolation/1.7/plexus-interpolation-1.7.pom
2K downloaded  (plexus-interpolation-1.7.pom)
Downloading: http://repo1.maven.org/maven2/org/codehaus/plexus/plexus-archiver/1.0-alpha-12/plexus-archiver-1.0-alpha-12.pom
1K downloaded  (plexus-archiver-1.0-alpha-12.pom)
Downloading: http://download.java.net/maven/2/org/codehaus/plexus/plexus-io/1.0-alpha-4/plexus-io-1.0-alpha-4.pom
[INFO] Unable to find resource 'org.codehaus.plexus:plexus-io:pom:1.0-alpha-4' in repository java.net2 (http://download.java.net/maven/2)
Downloading: http://www.intalio.org/public/maven2/org/codehaus/plexus/plexus-io/1.0-alpha-4/plexus-io-1.0-alpha-4.pom
1K downloaded  (plexus-io-1.0-alpha-4.pom)
Downloading: http://repo1.maven.org/maven2/org/codehaus/plexus/plexus-active-collections/1.0-beta-2/plexus-active-collections-1.0-beta-2.pom
2K downloaded  (plexus-active-collections-1.0-beta-2.pom)
Downloading: http://download.java.net/maven/2/org/codehaus/plexus/plexus-container-default/1.0-alpha-22/plexus-container-default-1.0-alpha-22.pom
[INFO] Unable to find resource 'org.codehaus.plexus:plexus-container-default:pom:1.0-alpha-22' in repository java.net2 (http://download.java.net/maven/2)
Downloading: http://www.intalio.org/public/maven2/org/codehaus/plexus/plexus-container-default/1.0-alpha-22/plexus-container-default-1.0-alpha-22.pom
[INFO] Unable to find resource 'org.codehaus.plexus:plexus-container-default:pom:1.0-alpha-22' in repository intalio.org (http://www.intalio.org/public/maven2)
Downloading: http://svn.apache.org/repos/asf/openejb/repo/org/codehaus/plexus/plexus-container-default/1.0-alpha-22/plexus-container-default-1.0-alpha-22.pom
[INFO] Unable to find resource 'org.codehaus.plexus:plexus-container-default:pom:1.0-alpha-22' in repository openejb-repository (http://svn.apache.org/repos/asf/openejb/repo)
Downloading: http://svn.apache.org/repos/asf/tuscany/maven/org/codehaus/plexus/plexus-container-default/1.0-alpha-22/plexus-container-default-1.0-alpha-22.pom
[INFO] Unable to find resource 'org.codehaus.plexus:plexus-container-default:pom:1.0-alpha-22' in repository tuscany.repo (http://svn.apache.org/repos/asf/tuscany/maven)
Downloading: https://repository.apache.org/content/groups/public//org/codehaus/plexus/plexus-container-default/1.0-alpha-22/plexus-container-default-1.0-alpha-22.pom
[INFO] Unable to find resource 'org.codehaus.plexus:plexus-container-default:pom:1.0-alpha-22' in repository apache.nexus (https://repository.apache.org/content/groups/public/)
Downloading: http://repo1.maven.org/maven2/org/codehaus/plexus/plexus-container-default/1.0-alpha-22/plexus-container-default-1.0-alpha-22.pom
2K downloaded  (plexus-container-default-1.0-alpha-22.pom)
Downloading: http://download.java.net/maven/2/org/codehaus/plexus/plexus-containers/1.0-alpha-22/plexus-containers-1.0-alpha-22.pom
[INFO] Unable to find resource 'org.codehaus.plexus:plexus-containers:pom:1.0-alpha-22' in repository java.net2 (http://download.java.net/maven/2)
Downloading: http://www.intalio.org/public/maven2/org/codehaus/plexus/plexus-containers/1.0-alpha-22/plexus-containers-1.0-alpha-22.pom
[INFO] Unable to find resource 'org.codehaus.plexus:plexus-containers:pom:1.0-alpha-22' in repository intalio.org (http://www.intalio.org/public/maven2)
Downloading: http://svn.apache.org/repos/asf/openejb/repo/org/codehaus/plexus/plexus-containers/1.0-alpha-22/plexus-containers-1.0-alpha-22.pom
[INFO] Unable to find resource 'org.codehaus.plexus:plexus-containers:pom:1.0-alpha-22' in repository openejb-repository (http://svn.apache.org/repos/asf/openejb/repo)
Downloading: http://svn.apache.org/repos/asf/tuscany/maven/org/codehaus/plexus/plexus-containers/1.0-alpha-22/plexus-containers-1.0-alpha-22.pom
[INFO] Unable to find resource 'org.codehaus.plexus:plexus-containers:pom:1.0-alpha-22' in repository tuscany.repo (http://svn.apache.org/repos/asf/tuscany/maven)
Downloading: https://repository.apache.org/content/groups/public//org/codehaus/plexus/plexus-containers/1.0-alpha-22/plexus-containers-1.0-alpha-22.pom
[INFO] Unable to find resource 'org.codehaus.plexus:plexus-containers:pom:1.0-alpha-22' in repository apache.nexus (https://repository.apache.org/content/groups/public/)
Downloading: http://repo1.maven.org/maven2/org/codehaus/plexus/plexus-containers/1.0-alpha-22/plexus-containers-1.0-alpha-22.pom
1K downloaded  (plexus-containers-1.0-alpha-22.pom)
Downloading: http://repo1.maven.org/maven2/org/codehaus/plexus/plexus-utils/2.0.1/plexus-utils-2.0.1.pom
3K downloaded  (plexus-utils-2.0.1.pom)
Downloading: http://repo1.maven.org/maven2/org/codehaus/plexus/plexus-utils/2.0.1/plexus-utils-2.0.1.jar
Downloading: http://repo1.maven.org/maven2/org/apache/maven/shared/maven-common-artifact-filters/1.1/maven-common-artifact-filters-1.1.jar
29K downloaded  (maven-common-artifact-filters-1.1.jar)
216K downloaded  (plexus-utils-2.0.1.jar)
Downloading: http://repo1.maven.org/maven2/org/codehaus/plexus/plexus-archiver/1.0-alpha-12/plexus-archiver-1.0-alpha-12.jar
172K downloaded  (plexus-archiver-1.0-alpha-12.jar)
Downloading: http://repo1.maven.org/maven2/org/codehaus/plexus/plexus-interpolation/1.7/plexus-interpolation-1.7.jar
49K downloaded  (plexus-interpolation-1.7.jar)
Downloading: http://repo1.maven.org/maven2/org/codehaus/plexus/plexus-io/1.0-alpha-4/plexus-io-1.0-alpha-4.jar
47K downloaded  (plexus-io-1.0-alpha-4.jar)
Downloading: http://repo1.maven.org/maven2/org/codehaus/plexus/plexus-active-collections/1.0-beta-2/plexus-active-collections-1.0-beta-2.jar
20K downloaded  (plexus-active-collections-1.0-beta-2.jar)
[INFO] [assembly:single {execution: distribution-package}]
[INFO] Reading assembly descriptor: src/main/assembly/bin-distribution.xml
[INFO] Reading assembly descriptor: src/main/assembly/src.xml
[WARNING] POM for 'org.opensaml:opensaml:pom:2.2.3:compile' is invalid.

Its dependencies (if any) will NOT be available to the current build.
[WARNING] Cannot include project artifact: org.apache.tuscany.sca:tuscany-distribution-all:pom:2.5-SNAPSHOT; it doesn't have an associated file or directory.
[WARNING] Cannot include project artifact: org.apache.tuscany.sca:tuscany-distribution-all:pom:2.5-SNAPSHOT; it doesn't have an associated file or directory.
[JENKINS] Archiving disabled
[INFO] ------------------------------------------------------------------------
[ERROR] BUILD ERROR
[INFO] ------------------------------------------------------------------------
[INFO] Failed to create assembly: Error creating assembly archive : Failed to retrieve numeric file attributes using: '/bin/sh -c ls -1laR <https://builds.apache.org/job/Tuscany-2x/ws/sca-2x/distribution/all/../..'>

[INFO] ------------------------------------------------------------------------
[INFO] For more information, run Maven with the -e switch
[INFO] ------------------------------------------------------------------------
[INFO] Total time: 25 minutes 56 seconds
[INFO] Finished at: Tue Feb 12 01:55:46 UTC 2013
[INFO] Final Memory: 548M/727M
[INFO] ------------------------------------------------------------------------
Waiting for Jenkins to finish collecting data
Maven failed with error.
Sending e-mails to: notification@tuscany.apache.org
Sending e-mails to: notification@tuscany.apache.org
channel stopped
2013-02-12 01:59:52.068:INFO::Shutdown hook executing
2013-02-12 01:59:52.069:INFO::Shutdown hook complete

Build failed in Jenkins: Tuscany-2x #933

Posted by Apache Jenkins Server <je...@builds.apache.org>.
See <https://builds.apache.org/job/Tuscany-2x/933/>

------------------------------------------
[...truncated 34381 lines...]
[INFO] Processing artifact: active project artifact:
	artifact = org.apache.tuscany.sca:tuscany-tracing-aspectj:jar:2.5-SNAPSHOT:compile;
	project: MavenProject: org.apache.tuscany.sca:tuscany-tracing-aspectj:2.5-SNAPSHOT @ <https://builds.apache.org/job/Tuscany-2x/ws/sca-2x/modules/tracing-aspectj/pom.xml>
[INFO] Processing artifact: org.springframework:spring-aop:jar:3.0.5.RELEASE:compile
[INFO] Processing artifact: com.hazelcast:hazelcast:jar:1.9.2.2:compile
[INFO] Processing artifact: org.springframework:spring-core:jar:3.0.5.RELEASE:compile
[INFO] Processing artifact: active project artifact:
	artifact = org.apache.tuscany.sca:tuscany-assembly:jar:2.5-SNAPSHOT:compile;
	project: MavenProject: org.apache.tuscany.sca:tuscany-assembly:2.5-SNAPSHOT @ <https://builds.apache.org/job/Tuscany-2x/ws/sca-2x/modules/assembly/pom.xml>
[INFO] Processing artifact: active project artifact:
	artifact = org.apache.tuscany.sca:tuscany-interface-java-jaxws:jar:2.5-SNAPSHOT:compile;
	project: MavenProject: org.apache.tuscany.sca:tuscany-interface-java-jaxws:2.5-SNAPSHOT @ <https://builds.apache.org/job/Tuscany-2x/ws/sca-2x/modules/interface-java-jaxws/pom.xml>
[INFO] Processing artifact: org.apache.geronimo.specs:geronimo-annotation_1.1_spec:jar:1.0:compile
[INFO] Processing artifact: active project artifact:
	artifact = org.apache.tuscany.sca:tuscany-host-corba:jar:2.5-SNAPSHOT:compile;
	project: MavenProject: org.apache.tuscany.sca:tuscany-host-corba:2.5-SNAPSHOT @ <https://builds.apache.org/job/Tuscany-2x/ws/sca-2x/modules/host-corba/pom.xml>
[INFO] Processing artifact: active project artifact:
	artifact = org.apache.tuscany.sca:tuscany-node-launcher-equinox:jar:2.5-SNAPSHOT:compile;
	project: MavenProject: org.apache.tuscany.sca:tuscany-node-launcher-equinox:2.5-SNAPSHOT @ <https://builds.apache.org/job/Tuscany-2x/ws/sca-2x/modules/node-launcher-equinox/pom.xml>
[INFO] Processing artifact: active project artifact:
	artifact = org.apache.tuscany.sca:tuscany-data-api:jar:2.5-SNAPSHOT:compile;
	project: MavenProject: org.apache.tuscany.sca:tuscany-data-api:2.5-SNAPSHOT @ <https://builds.apache.org/job/Tuscany-2x/ws/sca-2x/modules/data-api/pom.xml>
[INFO] Processing artifact: org.apache.santuario:xmlsec:jar:1.4.4:compile
[INFO] Processing artifact: org.dojotoolkit:dojo:zip:1.5.0:compile
[INFO] Processing artifact: active project artifact:
	artifact = org.apache.tuscany.sca:tuscany-node-impl-osgi:jar:2.5-SNAPSHOT:compile;
	project: MavenProject: org.apache.tuscany.sca:tuscany-node-impl-osgi:2.5-SNAPSHOT @ <https://builds.apache.org/job/Tuscany-2x/ws/sca-2x/modules/node-impl-osgi/pom.xml>
[INFO] Processing artifact: active project artifact:
	artifact = org.apache.tuscany.sca:tuscany-binding-corba:jar:2.5-SNAPSHOT:compile;
	project: MavenProject: org.apache.tuscany.sca:tuscany-binding-corba:2.5-SNAPSHOT @ <https://builds.apache.org/job/Tuscany-2x/ws/sca-2x/modules/binding-corba/pom.xml>
[INFO] Processing artifact: active project artifact:
	artifact = org.apache.tuscany.sca:tuscany-implementation-java:jar:2.5-SNAPSHOT:compile;
	project: MavenProject: org.apache.tuscany.sca:tuscany-implementation-java:2.5-SNAPSHOT @ <https://builds.apache.org/job/Tuscany-2x/ws/sca-2x/modules/implementation-java/pom.xml>
[INFO] Processing artifact: org.apache.geronimo.specs:geronimo-javamail_1.4_spec:jar:1.6:compile
[INFO] Processing artifact: org.apache.rampart:rampart-trust:jar:1.5.1:compile
[INFO] Processing artifact: org.apache.ode:ode-bpel-dao:jar:1.3.2:compile
[INFO] Processing artifact: active project artifact:
	artifact = org.apache.tuscany.sca:tuscany-policy-logging:jar:2.5-SNAPSHOT:compile;
	project: MavenProject: org.apache.tuscany.sca:tuscany-policy-logging:2.5-SNAPSHOT @ <https://builds.apache.org/job/Tuscany-2x/ws/sca-2x/modules/policy-logging/pom.xml>
[INFO] Processing artifact: active project artifact:
	artifact = org.apache.tuscany.sca:tuscany-monitor:jar:2.5-SNAPSHOT:compile;
	project: MavenProject: org.apache.tuscany.sca:tuscany-monitor:2.5-SNAPSHOT @ <https://builds.apache.org/job/Tuscany-2x/ws/sca-2x/modules/monitor/pom.xml>
[INFO] Processing artifact: active project artifact:
	artifact = org.apache.tuscany.sca:tuscany-binding-atom:jar:2.5-SNAPSHOT:compile;
	project: MavenProject: org.apache.tuscany.sca:tuscany-binding-atom:2.5-SNAPSHOT @ <https://builds.apache.org/job/Tuscany-2x/ws/sca-2x/modules/binding-atom/pom.xml>
[INFO] Processing artifact: active project artifact:
	artifact = org.apache.tuscany.sca:tuscany-binding-ws-runtime-axis2:jar:2.5-SNAPSHOT:compile;
	project: MavenProject: org.apache.tuscany.sca:tuscany-binding-ws-runtime-axis2:2.5-SNAPSHOT @ <https://builds.apache.org/job/Tuscany-2x/ws/sca-2x/modules/binding-ws-runtime-axis2/pom.xml>
[INFO] Processing artifact: active project artifact:
	artifact = org.apache.tuscany.sca:tuscany-host-corba-jse-tns:jar:2.5-SNAPSHOT:compile;
	project: MavenProject: org.apache.tuscany.sca:tuscany-host-corba-jse-tns:2.5-SNAPSHOT @ <https://builds.apache.org/job/Tuscany-2x/ws/sca-2x/modules/host-corba-jse-tns/pom.xml>
[INFO] Processing artifact: org.apache.geronimo.modules:geronimo-kernel:jar:2.0.1:compile
[INFO] Processing artifact: active project artifact:
	artifact = org.apache.tuscany.sca:tuscany-deployment:jar:2.5-SNAPSHOT:compile;
	project: MavenProject: org.apache.tuscany.sca:tuscany-deployment:2.5-SNAPSHOT @ <https://builds.apache.org/job/Tuscany-2x/ws/sca-2x/modules/deployment/pom.xml>
[INFO] Processing artifact: active project artifact:
	artifact = active project artifact:
	artifact = active project artifact:
	artifact = org.apache.tuscany.sca.aggregation:tuscany-base-runtime-aggregation:jar:2.5-SNAPSHOT:compile;
	project: MavenProject: org.apache.tuscany.sca.aggregation:tuscany-base-runtime-aggregation:2.5-SNAPSHOT @ <https://builds.apache.org/job/Tuscany-2x/ws/sca-2x/distribution/aggregations/base-runtime-aggregation/pom.xml;>
	project: MavenProject: org.apache.tuscany.sca.aggregation:tuscany-base-runtime-aggregation:2.5-SNAPSHOT @ <https://builds.apache.org/job/Tuscany-2x/ws/sca-2x/distribution/aggregations/base-runtime-aggregation/pom.xml;>
	project: MavenProject: org.apache.tuscany.sca.aggregation:tuscany-base-runtime-aggregation:2.5-SNAPSHOT @ <https://builds.apache.org/job/Tuscany-2x/ws/sca-2x/distribution/aggregations/base-runtime-aggregation/pom.xml>
[INFO] Processing artifact: org.aspectj:aspectjrt:jar:1.6.8:compile
[INFO] Processing artifact: org.apache.abdera:abdera-client:jar:1.1.1:compile
[INFO] Processing artifact: net.sourceforge.saxon:saxon:jar:xqj:9.1.0.8:compile
[INFO] Processing artifact: active project artifact:
	artifact = org.apache.tuscany.sca:tuscany-binding-jsonrpc-runtime:jar:2.5-SNAPSHOT:compile;
	project: MavenProject: org.apache.tuscany.sca:tuscany-binding-jsonrpc-runtime:2.5-SNAPSHOT @ <https://builds.apache.org/job/Tuscany-2x/ws/sca-2x/modules/binding-jsonrpc-runtime/pom.xml>
[INFO] Processing artifact: org.mortbay.jetty:jetty-util:jar:6.1.26:compile
[INFO] Processing artifact: org.apache.ws.commons.axiom:axiom-api:jar:1.2.10:compile
[INFO] Processing artifact: active project artifact:
	artifact = org.apache.tuscany.sca:tuscany-implementation-spring-runtime:jar:2.5-SNAPSHOT:compile;
	project: MavenProject: org.apache.tuscany.sca:tuscany-implementation-spring-runtime:2.5-SNAPSHOT @ <https://builds.apache.org/job/Tuscany-2x/ws/sca-2x/modules/implementation-spring-runtime/pom.xml>
[INFO] Processing artifact: org.apache.tuscany.sdo:tuscany-sdo-api-r2.1:jar:1.1.1:compile
[INFO] Processing artifact: active project artifact:
	artifact = org.apache.tuscany.sca:tuscany-binding-rmi-runtime:jar:2.5-SNAPSHOT:compile;
	project: MavenProject: org.apache.tuscany.sca:tuscany-binding-rmi-runtime:2.5-SNAPSHOT @ <https://builds.apache.org/job/Tuscany-2x/ws/sca-2x/modules/binding-rmi-runtime/pom.xml>
[INFO] Processing artifact: org.apache.neethi:neethi:jar:2.0.4:compile
[INFO] Processing artifact: active project artifact:
	artifact = org.apache.tuscany.sca:tuscany-web-javascript:jar:2.5-SNAPSHOT:compile;
	project: MavenProject: org.apache.tuscany.sca:tuscany-web-javascript:2.5-SNAPSHOT @ <https://builds.apache.org/job/Tuscany-2x/ws/sca-2x/modules/web-javascript/pom.xml>
[INFO] Processing artifact: org.directwebremoting:dwr:jar:2.0.3:compile
[INFO] Processing artifact: org.apache.ws.commons.axiom:axiom-impl:jar:1.2.10:compile
[INFO] MANIFEST.MF found for org.apache.ws.commons.axiom:axiom-impl:jar:1.2.10:compile (<https://builds.apache.org/job/Tuscany-2x/ws/sca-2x/distribution/all/manifests/axiom-impl-1.2.10.MF)>
[INFO] Processing artifact: org.apache.tuscany.sdo:tuscany-sdo-impl:jar:1.1.1:compile
[INFO] Processing artifact: net.sourceforge.saxon:saxon:jar:xpath:9.1.0.8:compile
[INFO] Processing artifact: active project artifact:
	artifact = org.apache.tuscany.sca:tuscany-host-jetty:jar:2.5-SNAPSHOT:compile;
	project: MavenProject: org.apache.tuscany.sca:tuscany-host-jetty:2.5-SNAPSHOT @ <https://builds.apache.org/job/Tuscany-2x/ws/sca-2x/modules/host-jetty/pom.xml>
[INFO] Processing artifact: active project artifact:
	artifact = org.apache.tuscany.sca:tuscany-myfaces:jar:2.5-SNAPSHOT:compile;
	project: MavenProject: org.apache.tuscany.sca:tuscany-myfaces:2.5-SNAPSHOT @ <https://builds.apache.org/job/Tuscany-2x/ws/sca-2x/modules/myfaces/pom.xml>
[INFO] Processing artifact: org.apache.ode:ode-jacob-ap:jar:1.3.2:compile
[INFO] Processing artifact: net.sourceforge.saxon:saxon:jar:9.1.0.8:compile
[INFO] Processing artifact: net.sourceforge.saxon:saxon:jar:dom:9.1.0.8:compile
[INFO] Processing artifact: active project artifact:
	artifact = org.apache.tuscany.sca:tuscany-sca-client-impl:jar:2.5-SNAPSHOT:compile;
	project: MavenProject: org.apache.tuscany.sca:tuscany-sca-client-impl:2.5-SNAPSHOT @ <https://builds.apache.org/job/Tuscany-2x/ws/sca-2x/modules/sca-client-impl/pom.xml>
[INFO] Processing artifact: active project artifact:
	artifact = org.apache.tuscany.sca:tuscany-assembly-xml:jar:2.5-SNAPSHOT:compile;
	project: MavenProject: org.apache.tuscany.sca:tuscany-assembly-xml:2.5-SNAPSHOT @ <https://builds.apache.org/job/Tuscany-2x/ws/sca-2x/modules/assembly-xml/pom.xml>
[INFO] Processing artifact: org.apache.geronimo.specs:geronimo-j2ee-connector_1.5_spec:jar:2.0.0:compile
[INFO] Processing artifact: active project artifact:
	artifact = org.apache.tuscany.sca:tuscany-databinding-sdo:jar:2.5-SNAPSHOT:compile;
	project: MavenProject: org.apache.tuscany.sca:tuscany-databinding-sdo:2.5-SNAPSHOT @ <https://builds.apache.org/job/Tuscany-2x/ws/sca-2x/modules/databinding-sdo/pom.xml>
[INFO] Processing artifact: active project artifact:
	artifact = org.apache.tuscany.sca:tuscany-sca-api:jar:2.5-SNAPSHOT:compile;
	project: MavenProject: org.apache.tuscany.sca:tuscany-sca-api:2.5-SNAPSHOT @ <https://builds.apache.org/job/Tuscany-2x/ws/sca-2x/modules/sca-api/pom.xml>
[INFO] Processing artifact: active project artifact:
	artifact = org.apache.tuscany.sca:tuscany-implementation-web:jar:2.5-SNAPSHOT:compile;
	project: MavenProject: org.apache.tuscany.sca:tuscany-implementation-web:2.5-SNAPSHOT @ <https://builds.apache.org/job/Tuscany-2x/ws/sca-2x/modules/implementation-web/pom.xml>
[INFO] Processing artifact: org.apache.ode:ode-bpel-epr:jar:1.3.2:compile
[INFO] Processing artifact: active project artifact:
	artifact = org.apache.tuscany.sca:tuscany-implementation-web-client:jar:2.5-SNAPSHOT:compile;
	project: MavenProject: org.apache.tuscany.sca:tuscany-implementation-web-client:2.5-SNAPSHOT @ <https://builds.apache.org/job/Tuscany-2x/ws/sca-2x/modules/implementation-web-client/pom.xml>
[INFO] Processing artifact: active project artifact:
	artifact = active project artifact:
	artifact = active project artifact:
	artifact = org.apache.tuscany.sca:tuscany-feature-all:pom:2.5-SNAPSHOT:compile;
	project: MavenProject: org.apache.tuscany.sca:tuscany-feature-all:2.5-SNAPSHOT @ <https://builds.apache.org/job/Tuscany-2x/ws/sca-2x/features/all/pom.xml;>
	project: MavenProject: org.apache.tuscany.sca:tuscany-feature-all:2.5-SNAPSHOT @ <https://builds.apache.org/job/Tuscany-2x/ws/sca-2x/features/all/pom.xml;>
	project: MavenProject: org.apache.tuscany.sca:tuscany-feature-all:2.5-SNAPSHOT @ <https://builds.apache.org/job/Tuscany-2x/ws/sca-2x/features/all/pom.xml>
[INFO] Processing artifact: org.json:json:jar:20090211:compile
[INFO] Processing artifact: org.apache.ws.commons.axiom:axiom-dom:jar:1.2.10:compile
[INFO] Processing artifact: active project artifact:
	artifact = org.apache.tuscany.sca:tuscany-xsd:jar:2.5-SNAPSHOT:compile;
	project: MavenProject: org.apache.tuscany.sca:tuscany-xsd:2.5-SNAPSHOT @ <https://builds.apache.org/job/Tuscany-2x/ws/sca-2x/modules/xsd/pom.xml>
[INFO] Processing artifact: active project artifact:
	artifact = org.apache.tuscany.sca:tuscany-policy-wspolicy:jar:2.5-SNAPSHOT:compile;
	project: MavenProject: org.apache.tuscany.sca:tuscany-policy-wspolicy:2.5-SNAPSHOT @ <https://builds.apache.org/job/Tuscany-2x/ws/sca-2x/modules/policy-wspolicy/pom.xml>
[INFO] Processing artifact: org.eclipse.emf:common:jar:2.2.3:compile
[INFO] Processing artifact: org.eclipse.core:runtime:jar:3.4.0-v20080512:runtime
[INFO] Processing artifact: active project artifact:
	artifact = org.apache.tuscany.sca:tuscany-implementation-script:jar:2.5-SNAPSHOT:compile;
	project: MavenProject: org.apache.tuscany.sca:tuscany-implementation-script:2.5-SNAPSHOT @ <https://builds.apache.org/job/Tuscany-2x/ws/sca-2x/modules/implementation-script/pom.xml>
[INFO] Processing artifact: active project artifact:
	artifact = org.apache.tuscany.sca:tuscany-domain-hazelcast:jar:2.5-SNAPSHOT:compile;
	project: MavenProject: org.apache.tuscany.sca:tuscany-domain-hazelcast:2.5-SNAPSHOT @ <https://builds.apache.org/job/Tuscany-2x/ws/sca-2x/modules/domain-hazelcast/pom.xml>
[INFO] Processing artifact: org.codehaus.groovy:groovy-all:jar:1.7.1:runtime
[INFO] Processing artifact: org.apache.wink:wink-client-apache-httpclient:jar:1.2.0-incubating:compile
[INFO] Processing artifact: org.apache.axis2:org.apache.axis2.osgi:jar:1.5.3:compile
[INFO] Overriding the manifest for org.apache.axis2:org.apache.axis2.osgi:jar:1.5.3:compile
[INFO] Processing artifact: org.apache.ode:ode-bpel-runtime:jar:1.3.2:compile
[INFO] Processing artifact: org.eclipse.emf:ecore-change:jar:2.2.3:compile
[INFO] Processing artifact: org.codehaus.jackson:jackson-mapper-asl:jar:1.9.4:compile
[INFO] Processing artifact: org.apache.openjpa:openjpa:jar:1.2.1:compile
[INFO] Processing artifact: org.apache.geronimo.specs:geronimo-ejb_3.0_spec:jar:1.0.1:compile
[INFO] Processing artifact: active project artifact:
	artifact = org.apache.tuscany.sca:tuscany-binding-ws-runtime-jaxws:jar:2.5-SNAPSHOT:compile;
	project: MavenProject: org.apache.tuscany.sca:tuscany-binding-ws-runtime-jaxws:2.5-SNAPSHOT @ <https://builds.apache.org/job/Tuscany-2x/ws/sca-2x/modules/binding-ws-runtime-jaxws/pom.xml>
[INFO] Processing artifact: jdom:jdom:jar:1.0:compile
[INFO] Processing artifact: org.apache.ode:ode-bpel-compiler:jar:1.3.2:compile
[INFO] Processing artifact: active project artifact:
	artifact = org.apache.tuscany.sca:tuscany-host-corba-jee:jar:2.5-SNAPSHOT:compile;
	project: MavenProject: org.apache.tuscany.sca:tuscany-host-corba-jee:2.5-SNAPSHOT @ <https://builds.apache.org/job/Tuscany-2x/ws/sca-2x/modules/host-corba-jee/pom.xml>
[INFO] Processing artifact: active project artifact:
	artifact = org.apache.tuscany.sca:tuscany-binding-rest-runtime:jar:2.5-SNAPSHOT:compile;
	project: MavenProject: org.apache.tuscany.sca:tuscany-binding-rest-runtime:2.5-SNAPSHOT @ <https://builds.apache.org/job/Tuscany-2x/ws/sca-2x/modules/binding-rest-runtime/pom.xml>
[INFO] Processing artifact: wsdl4j:wsdl4j:jar:1.6.2:compile
[INFO] Processing artifact: org.mortbay.jetty:jetty:jar:6.1.26:compile
[INFO] Processing artifact: org.apache.geronimo.components:geronimo-connector:jar:2.1.4:compile
[INFO] Processing artifact: active project artifact:
	artifact = org.apache.tuscany.sca:tuscany-binding-jsonrpc:jar:2.5-SNAPSHOT:compile;
	project: MavenProject: org.apache.tuscany.sca:tuscany-binding-jsonrpc:2.5-SNAPSHOT @ <https://builds.apache.org/job/Tuscany-2x/ws/sca-2x/modules/binding-jsonrpc/pom.xml>
[INFO] Processing artifact: active project artifact:
	artifact = org.apache.tuscany.sca:tuscany-implementation-python:jar:2.5-SNAPSHOT:compile;
	project: MavenProject: org.apache.tuscany.sca:tuscany-implementation-python:2.5-SNAPSHOT @ <https://builds.apache.org/job/Tuscany-2x/ws/sca-2x/modules/implementation-python/pom.xml>
[INFO] Processing artifact: commons-codec:commons-codec:jar:1.6:compile
[INFO] Generating manifest jar: <https://builds.apache.org/job/Tuscany-2x/ws/sca-2x/distribution/all/target/features/tuscany-binding-ejb-runtime/tuscany-binding-ejb-runtime-manifest.jar>
[INFO] Generating manifest jar: <https://builds.apache.org/job/Tuscany-2x/ws/sca-2x/distribution/all/target/features/tuscany-implementation-osgi-runtime/tuscany-implementation-osgi-runtime-manifest.jar>
[INFO] Generating manifest jar: <https://builds.apache.org/job/Tuscany-2x/ws/sca-2x/distribution/all/target/features/tuscany-host-jetty/tuscany-host-jetty-manifest.jar>
[INFO] Generating manifest jar: <https://builds.apache.org/job/Tuscany-2x/ws/sca-2x/distribution/all/target/features/tuscany-binding-ws-runtime-axis2/tuscany-binding-ws-runtime-axis2-manifest.jar>
[INFO] Generating manifest jar: <https://builds.apache.org/job/Tuscany-2x/ws/sca-2x/distribution/all/target/features/tuscany-implementation-python-runtime/tuscany-implementation-python-runtime-manifest.jar>
[INFO] Generating manifest jar: <https://builds.apache.org/job/Tuscany-2x/ws/sca-2x/distribution/all/target/features/tuscany-binding-jms-runtime/tuscany-binding-jms-runtime-manifest.jar>
[INFO] Generating manifest jar: <https://builds.apache.org/job/Tuscany-2x/ws/sca-2x/distribution/all/target/features/tuscany-implementation-spring-runtime/tuscany-implementation-spring-runtime-manifest.jar>
[INFO] Generating manifest jar: <https://builds.apache.org/job/Tuscany-2x/ws/sca-2x/distribution/all/target/features/tuscany-binding-rest-runtime/tuscany-binding-rest-runtime-manifest.jar>
[INFO] Generating manifest jar: <https://builds.apache.org/job/Tuscany-2x/ws/sca-2x/distribution/all/target/features/tuscany-binding-atom-runtime/tuscany-binding-atom-runtime-manifest.jar>
[INFO] Generating manifest jar: <https://builds.apache.org/job/Tuscany-2x/ws/sca-2x/distribution/all/target/features/tuscany-implementation-widget-runtime/tuscany-implementation-widget-runtime-manifest.jar>
[INFO] Generating manifest jar: <https://builds.apache.org/job/Tuscany-2x/ws/sca-2x/distribution/all/target/features/tuscany-base-runtime-pom/tuscany-base-runtime-pom-manifest.jar>
[INFO] Generating manifest jar: <https://builds.apache.org/job/Tuscany-2x/ws/sca-2x/distribution/all/target/features/tuscany-implementation-bpel-runtime/tuscany-implementation-bpel-runtime-manifest.jar>
[INFO] Generating manifest jar: <https://builds.apache.org/job/Tuscany-2x/ws/sca-2x/distribution/all/target/features/tuscany-binding-corba-runtime/tuscany-binding-corba-runtime-manifest.jar>
[INFO] Generating manifest jar: <https://builds.apache.org/job/Tuscany-2x/ws/sca-2x/distribution/all/target/features/tuscany-binding-rmi-runtime/tuscany-binding-rmi-runtime-manifest.jar>
[INFO] Generating manifest jar: <https://builds.apache.org/job/Tuscany-2x/ws/sca-2x/distribution/all/target/features/tuscany-binding-jsonrpc-runtime/tuscany-binding-jsonrpc-runtime-manifest.jar>
[INFO] Generating manifest jar: <https://builds.apache.org/job/Tuscany-2x/ws/sca-2x/distribution/all/target/features/tuscany-implementation-script-runtime/tuscany-implementation-script-runtime-manifest.jar>
[INFO] Generating manifest jar: <https://builds.apache.org/job/Tuscany-2x/ws/sca-2x/distribution/all/target/features/tuscany-binding-jsonp-runtime/tuscany-binding-jsonp-runtime-manifest.jar>
[INFO] Generating manifest jar: <https://builds.apache.org/job/Tuscany-2x/ws/sca-2x/distribution/all/target/features/tuscany-implementation-web-runtime/tuscany-implementation-web-runtime-manifest.jar>
[INFO] Generating equinox manifest jar: <https://builds.apache.org/job/Tuscany-2x/ws/sca-2x/distribution/all/target/features/tuscany-sca-equinox-manifest.jar>
[INFO] Generating ANT build path: <https://builds.apache.org/job/Tuscany-2x/ws/sca-2x/distribution/all/target/features/tuscany-binding-ejb-runtime/build-path.xml>
[INFO] Generating ANT build path: <https://builds.apache.org/job/Tuscany-2x/ws/sca-2x/distribution/all/target/features/tuscany-implementation-osgi-runtime/build-path.xml>
[INFO] Generating ANT build path: <https://builds.apache.org/job/Tuscany-2x/ws/sca-2x/distribution/all/target/features/tuscany-host-jetty/build-path.xml>
[INFO] Generating ANT build path: <https://builds.apache.org/job/Tuscany-2x/ws/sca-2x/distribution/all/target/features/tuscany-binding-ws-runtime-axis2/build-path.xml>
[INFO] Generating ANT build path: <https://builds.apache.org/job/Tuscany-2x/ws/sca-2x/distribution/all/target/features/tuscany-implementation-python-runtime/build-path.xml>
[INFO] Generating ANT build path: <https://builds.apache.org/job/Tuscany-2x/ws/sca-2x/distribution/all/target/features/tuscany-binding-jms-runtime/build-path.xml>
[INFO] Generating ANT build path: <https://builds.apache.org/job/Tuscany-2x/ws/sca-2x/distribution/all/target/features/tuscany-implementation-spring-runtime/build-path.xml>
[INFO] Generating ANT build path: <https://builds.apache.org/job/Tuscany-2x/ws/sca-2x/distribution/all/target/features/tuscany-binding-rest-runtime/build-path.xml>
[INFO] Generating ANT build path: <https://builds.apache.org/job/Tuscany-2x/ws/sca-2x/distribution/all/target/features/tuscany-binding-atom-runtime/build-path.xml>
[INFO] Generating ANT build path: <https://builds.apache.org/job/Tuscany-2x/ws/sca-2x/distribution/all/target/features/tuscany-implementation-widget-runtime/build-path.xml>
[INFO] Generating ANT build path: <https://builds.apache.org/job/Tuscany-2x/ws/sca-2x/distribution/all/target/features/tuscany-base-runtime-pom/build-path.xml>
[INFO] Generating ANT build path: <https://builds.apache.org/job/Tuscany-2x/ws/sca-2x/distribution/all/target/features/tuscany-implementation-bpel-runtime/build-path.xml>
[INFO] Generating ANT build path: <https://builds.apache.org/job/Tuscany-2x/ws/sca-2x/distribution/all/target/features/tuscany-binding-corba-runtime/build-path.xml>
[INFO] Generating ANT build path: <https://builds.apache.org/job/Tuscany-2x/ws/sca-2x/distribution/all/target/features/tuscany-binding-rmi-runtime/build-path.xml>
[INFO] Generating ANT build path: <https://builds.apache.org/job/Tuscany-2x/ws/sca-2x/distribution/all/target/features/tuscany-binding-jsonrpc-runtime/build-path.xml>
[INFO] Generating ANT build path: <https://builds.apache.org/job/Tuscany-2x/ws/sca-2x/distribution/all/target/features/tuscany-implementation-script-runtime/build-path.xml>
[INFO] Generating ANT build path: <https://builds.apache.org/job/Tuscany-2x/ws/sca-2x/distribution/all/target/features/tuscany-binding-jsonp-runtime/build-path.xml>
[INFO] Generating ANT build path: <https://builds.apache.org/job/Tuscany-2x/ws/sca-2x/distribution/all/target/features/tuscany-implementation-web-runtime/build-path.xml>
[INFO] Generating Which Jars: <https://builds.apache.org/job/Tuscany-2x/ws/sca-2x/distribution/all/target/features/tuscany-binding-ejb-runtime/which-jars>
[INFO] Generating Which Jars: <https://builds.apache.org/job/Tuscany-2x/ws/sca-2x/distribution/all/target/features/tuscany-implementation-osgi-runtime/which-jars>
[INFO] Generating Which Jars: <https://builds.apache.org/job/Tuscany-2x/ws/sca-2x/distribution/all/target/features/tuscany-host-jetty/which-jars>
[INFO] Generating Which Jars: <https://builds.apache.org/job/Tuscany-2x/ws/sca-2x/distribution/all/target/features/tuscany-binding-ws-runtime-axis2/which-jars>
[INFO] Generating Which Jars: <https://builds.apache.org/job/Tuscany-2x/ws/sca-2x/distribution/all/target/features/tuscany-implementation-python-runtime/which-jars>
[INFO] Generating Which Jars: <https://builds.apache.org/job/Tuscany-2x/ws/sca-2x/distribution/all/target/features/tuscany-binding-jms-runtime/which-jars>
[INFO] Generating Which Jars: <https://builds.apache.org/job/Tuscany-2x/ws/sca-2x/distribution/all/target/features/tuscany-implementation-spring-runtime/which-jars>
[INFO] Generating Which Jars: <https://builds.apache.org/job/Tuscany-2x/ws/sca-2x/distribution/all/target/features/tuscany-binding-rest-runtime/which-jars>
[INFO] Generating Which Jars: <https://builds.apache.org/job/Tuscany-2x/ws/sca-2x/distribution/all/target/features/tuscany-binding-atom-runtime/which-jars>
[INFO] Generating Which Jars: <https://builds.apache.org/job/Tuscany-2x/ws/sca-2x/distribution/all/target/features/tuscany-implementation-widget-runtime/which-jars>
[INFO] Generating Which Jars: <https://builds.apache.org/job/Tuscany-2x/ws/sca-2x/distribution/all/target/features/tuscany-base-runtime-pom/which-jars>
[INFO] Generating Which Jars: <https://builds.apache.org/job/Tuscany-2x/ws/sca-2x/distribution/all/target/features/tuscany-implementation-bpel-runtime/which-jars>
[INFO] Generating Which Jars: <https://builds.apache.org/job/Tuscany-2x/ws/sca-2x/distribution/all/target/features/tuscany-binding-corba-runtime/which-jars>
[INFO] Generating Which Jars: <https://builds.apache.org/job/Tuscany-2x/ws/sca-2x/distribution/all/target/features/tuscany-binding-rmi-runtime/which-jars>
[INFO] Generating Which Jars: <https://builds.apache.org/job/Tuscany-2x/ws/sca-2x/distribution/all/target/features/tuscany-binding-jsonrpc-runtime/which-jars>
[INFO] Generating Which Jars: <https://builds.apache.org/job/Tuscany-2x/ws/sca-2x/distribution/all/target/features/tuscany-implementation-script-runtime/which-jars>
[INFO] Generating Which Jars: <https://builds.apache.org/job/Tuscany-2x/ws/sca-2x/distribution/all/target/features/tuscany-binding-jsonp-runtime/which-jars>
[INFO] Generating Which Jars: <https://builds.apache.org/job/Tuscany-2x/ws/sca-2x/distribution/all/target/features/tuscany-implementation-web-runtime/which-jars>
[INFO] [site:attach-descriptor {execution: default-attach-descriptor}]
[INFO] [assembly:single {execution: distribution-package}]
[INFO] Reading assembly descriptor: src/main/assembly/bin-distribution.xml
[INFO] Reading assembly descriptor: src/main/assembly/src.xml
[WARNING] POM for 'org.opensaml:opensaml:pom:2.2.3:compile' is invalid.

Its dependencies (if any) will NOT be available to the current build.
[WARNING] Cannot include project artifact: org.apache.tuscany.sca:tuscany-distribution-all:pom:2.5-SNAPSHOT; it doesn't have an associated file or directory.
[WARNING] Cannot include project artifact: org.apache.tuscany.sca:tuscany-distribution-all:pom:2.5-SNAPSHOT; it doesn't have an associated file or directory.
[JENKINS] Archiving disabled
[INFO] ------------------------------------------------------------------------
[ERROR] BUILD ERROR
[INFO] ------------------------------------------------------------------------
[INFO] Failed to create assembly: Error creating assembly archive : Failed to retrieve numeric file attributes using: '/bin/sh -c ls -1laR <https://builds.apache.org/job/Tuscany-2x/ws/sca-2x/distribution/all/../..'>

[INFO] ------------------------------------------------------------------------
[INFO] For more information, run Maven with the -e switch
[INFO] ------------------------------------------------------------------------
[INFO] Total time: 36 minutes 10 seconds
[INFO] Finished at: Mon Feb 11 01:38:08 UTC 2013
[INFO] Final Memory: 547M/730M
[INFO] ------------------------------------------------------------------------
Sending e-mails to: notification@tuscany.apache.org
channel stopped
2013-02-11 01:42:09.707:INFO::Shutdown hook executing
2013-02-11 01:42:09.707:INFO::Shutdown hook complete

Build failed in Jenkins: Tuscany-2x #932

Posted by Apache Jenkins Server <je...@builds.apache.org>.
See <https://builds.apache.org/job/Tuscany-2x/932/>

------------------------------------------
[...truncated 42366 lines...]
	project: MavenProject: org.apache.tuscany.sca:tuscany-feature-all:2.5-SNAPSHOT @ <https://builds.apache.org/job/Tuscany-2x/ws/sca-2x/features/all/pom.xml>
[INFO] Processing artifact: org.json:json:jar:20090211:compile
[INFO] Processing artifact: org.apache.ws.commons.axiom:axiom-dom:jar:1.2.10:compile
[INFO] Processing artifact: active project artifact:
	artifact = org.apache.tuscany.sca:tuscany-xsd:jar:2.5-SNAPSHOT:compile;
	project: MavenProject: org.apache.tuscany.sca:tuscany-xsd:2.5-SNAPSHOT @ <https://builds.apache.org/job/Tuscany-2x/ws/sca-2x/modules/xsd/pom.xml>
[INFO] Processing artifact: active project artifact:
	artifact = org.apache.tuscany.sca:tuscany-policy-wspolicy:jar:2.5-SNAPSHOT:compile;
	project: MavenProject: org.apache.tuscany.sca:tuscany-policy-wspolicy:2.5-SNAPSHOT @ <https://builds.apache.org/job/Tuscany-2x/ws/sca-2x/modules/policy-wspolicy/pom.xml>
[INFO] Processing artifact: org.eclipse.emf:common:jar:2.2.3:compile
[INFO] Processing artifact: org.eclipse.core:runtime:jar:3.4.0-v20080512:runtime
[INFO] Processing artifact: active project artifact:
	artifact = org.apache.tuscany.sca:tuscany-implementation-script:jar:2.5-SNAPSHOT:compile;
	project: MavenProject: org.apache.tuscany.sca:tuscany-implementation-script:2.5-SNAPSHOT @ <https://builds.apache.org/job/Tuscany-2x/ws/sca-2x/modules/implementation-script/pom.xml>
[INFO] Processing artifact: active project artifact:
	artifact = org.apache.tuscany.sca:tuscany-domain-hazelcast:jar:2.5-SNAPSHOT:compile;
	project: MavenProject: org.apache.tuscany.sca:tuscany-domain-hazelcast:2.5-SNAPSHOT @ <https://builds.apache.org/job/Tuscany-2x/ws/sca-2x/modules/domain-hazelcast/pom.xml>
[INFO] Processing artifact: org.codehaus.groovy:groovy-all:jar:1.7.1:runtime
[INFO] Processing artifact: org.apache.wink:wink-client-apache-httpclient:jar:1.2.0-incubating:compile
[INFO] Processing artifact: org.apache.axis2:org.apache.axis2.osgi:jar:1.5.3:compile
[INFO] Overriding the manifest for org.apache.axis2:org.apache.axis2.osgi:jar:1.5.3:compile
[INFO] Processing artifact: org.apache.ode:ode-bpel-runtime:jar:1.3.2:compile
[INFO] Processing artifact: org.eclipse.emf:ecore-change:jar:2.2.3:compile
[INFO] Processing artifact: org.codehaus.jackson:jackson-mapper-asl:jar:1.9.4:compile
[INFO] Processing artifact: org.apache.openjpa:openjpa:jar:1.2.1:compile
[INFO] Processing artifact: org.apache.geronimo.specs:geronimo-ejb_3.0_spec:jar:1.0.1:compile
[INFO] Processing artifact: active project artifact:
	artifact = org.apache.tuscany.sca:tuscany-binding-ws-runtime-jaxws:jar:2.5-SNAPSHOT:compile;
	project: MavenProject: org.apache.tuscany.sca:tuscany-binding-ws-runtime-jaxws:2.5-SNAPSHOT @ <https://builds.apache.org/job/Tuscany-2x/ws/sca-2x/modules/binding-ws-runtime-jaxws/pom.xml>
[INFO] Processing artifact: jdom:jdom:jar:1.0:compile
[INFO] Processing artifact: org.apache.ode:ode-bpel-compiler:jar:1.3.2:compile
[INFO] Processing artifact: active project artifact:
	artifact = org.apache.tuscany.sca:tuscany-host-corba-jee:jar:2.5-SNAPSHOT:compile;
	project: MavenProject: org.apache.tuscany.sca:tuscany-host-corba-jee:2.5-SNAPSHOT @ <https://builds.apache.org/job/Tuscany-2x/ws/sca-2x/modules/host-corba-jee/pom.xml>
[INFO] Processing artifact: active project artifact:
	artifact = org.apache.tuscany.sca:tuscany-binding-rest-runtime:jar:2.5-SNAPSHOT:compile;
	project: MavenProject: org.apache.tuscany.sca:tuscany-binding-rest-runtime:2.5-SNAPSHOT @ <https://builds.apache.org/job/Tuscany-2x/ws/sca-2x/modules/binding-rest-runtime/pom.xml>
[INFO] Processing artifact: wsdl4j:wsdl4j:jar:1.6.2:compile
[INFO] Processing artifact: org.mortbay.jetty:jetty:jar:6.1.26:compile
[INFO] Processing artifact: org.apache.geronimo.components:geronimo-connector:jar:2.1.4:compile
[INFO] Processing artifact: active project artifact:
	artifact = org.apache.tuscany.sca:tuscany-binding-jsonrpc:jar:2.5-SNAPSHOT:compile;
	project: MavenProject: org.apache.tuscany.sca:tuscany-binding-jsonrpc:2.5-SNAPSHOT @ <https://builds.apache.org/job/Tuscany-2x/ws/sca-2x/modules/binding-jsonrpc/pom.xml>
[INFO] Processing artifact: active project artifact:
	artifact = org.apache.tuscany.sca:tuscany-implementation-python:jar:2.5-SNAPSHOT:compile;
	project: MavenProject: org.apache.tuscany.sca:tuscany-implementation-python:2.5-SNAPSHOT @ <https://builds.apache.org/job/Tuscany-2x/ws/sca-2x/modules/implementation-python/pom.xml>
[INFO] Processing artifact: commons-codec:commons-codec:jar:1.6:compile
[INFO] Generating manifest jar: <https://builds.apache.org/job/Tuscany-2x/ws/sca-2x/distribution/all/target/features/tuscany-binding-ejb-runtime/tuscany-binding-ejb-runtime-manifest.jar>
[INFO] Generating manifest jar: <https://builds.apache.org/job/Tuscany-2x/ws/sca-2x/distribution/all/target/features/tuscany-implementation-osgi-runtime/tuscany-implementation-osgi-runtime-manifest.jar>
[INFO] Generating manifest jar: <https://builds.apache.org/job/Tuscany-2x/ws/sca-2x/distribution/all/target/features/tuscany-host-jetty/tuscany-host-jetty-manifest.jar>
[INFO] Generating manifest jar: <https://builds.apache.org/job/Tuscany-2x/ws/sca-2x/distribution/all/target/features/tuscany-binding-ws-runtime-axis2/tuscany-binding-ws-runtime-axis2-manifest.jar>
[INFO] Generating manifest jar: <https://builds.apache.org/job/Tuscany-2x/ws/sca-2x/distribution/all/target/features/tuscany-implementation-python-runtime/tuscany-implementation-python-runtime-manifest.jar>
[INFO] Generating manifest jar: <https://builds.apache.org/job/Tuscany-2x/ws/sca-2x/distribution/all/target/features/tuscany-binding-jms-runtime/tuscany-binding-jms-runtime-manifest.jar>
[INFO] Generating manifest jar: <https://builds.apache.org/job/Tuscany-2x/ws/sca-2x/distribution/all/target/features/tuscany-implementation-spring-runtime/tuscany-implementation-spring-runtime-manifest.jar>
[INFO] Generating manifest jar: <https://builds.apache.org/job/Tuscany-2x/ws/sca-2x/distribution/all/target/features/tuscany-binding-rest-runtime/tuscany-binding-rest-runtime-manifest.jar>
[INFO] Generating manifest jar: <https://builds.apache.org/job/Tuscany-2x/ws/sca-2x/distribution/all/target/features/tuscany-binding-atom-runtime/tuscany-binding-atom-runtime-manifest.jar>
[INFO] Generating manifest jar: <https://builds.apache.org/job/Tuscany-2x/ws/sca-2x/distribution/all/target/features/tuscany-implementation-widget-runtime/tuscany-implementation-widget-runtime-manifest.jar>
[INFO] Generating manifest jar: <https://builds.apache.org/job/Tuscany-2x/ws/sca-2x/distribution/all/target/features/tuscany-base-runtime-pom/tuscany-base-runtime-pom-manifest.jar>
[INFO] Generating manifest jar: <https://builds.apache.org/job/Tuscany-2x/ws/sca-2x/distribution/all/target/features/tuscany-implementation-bpel-runtime/tuscany-implementation-bpel-runtime-manifest.jar>
[INFO] Generating manifest jar: <https://builds.apache.org/job/Tuscany-2x/ws/sca-2x/distribution/all/target/features/tuscany-binding-corba-runtime/tuscany-binding-corba-runtime-manifest.jar>
[INFO] Generating manifest jar: <https://builds.apache.org/job/Tuscany-2x/ws/sca-2x/distribution/all/target/features/tuscany-binding-rmi-runtime/tuscany-binding-rmi-runtime-manifest.jar>
[INFO] Generating manifest jar: <https://builds.apache.org/job/Tuscany-2x/ws/sca-2x/distribution/all/target/features/tuscany-binding-jsonrpc-runtime/tuscany-binding-jsonrpc-runtime-manifest.jar>
[INFO] Generating manifest jar: <https://builds.apache.org/job/Tuscany-2x/ws/sca-2x/distribution/all/target/features/tuscany-implementation-script-runtime/tuscany-implementation-script-runtime-manifest.jar>
[INFO] Generating manifest jar: <https://builds.apache.org/job/Tuscany-2x/ws/sca-2x/distribution/all/target/features/tuscany-binding-jsonp-runtime/tuscany-binding-jsonp-runtime-manifest.jar>
[INFO] Generating manifest jar: <https://builds.apache.org/job/Tuscany-2x/ws/sca-2x/distribution/all/target/features/tuscany-implementation-web-runtime/tuscany-implementation-web-runtime-manifest.jar>
[INFO] Generating equinox manifest jar: <https://builds.apache.org/job/Tuscany-2x/ws/sca-2x/distribution/all/target/features/tuscany-sca-equinox-manifest.jar>
[INFO] Generating ANT build path: <https://builds.apache.org/job/Tuscany-2x/ws/sca-2x/distribution/all/target/features/tuscany-binding-ejb-runtime/build-path.xml>
[INFO] Generating ANT build path: <https://builds.apache.org/job/Tuscany-2x/ws/sca-2x/distribution/all/target/features/tuscany-implementation-osgi-runtime/build-path.xml>
[INFO] Generating ANT build path: <https://builds.apache.org/job/Tuscany-2x/ws/sca-2x/distribution/all/target/features/tuscany-host-jetty/build-path.xml>
[INFO] Generating ANT build path: <https://builds.apache.org/job/Tuscany-2x/ws/sca-2x/distribution/all/target/features/tuscany-binding-ws-runtime-axis2/build-path.xml>
[INFO] Generating ANT build path: <https://builds.apache.org/job/Tuscany-2x/ws/sca-2x/distribution/all/target/features/tuscany-implementation-python-runtime/build-path.xml>
[INFO] Generating ANT build path: <https://builds.apache.org/job/Tuscany-2x/ws/sca-2x/distribution/all/target/features/tuscany-binding-jms-runtime/build-path.xml>
[INFO] Generating ANT build path: <https://builds.apache.org/job/Tuscany-2x/ws/sca-2x/distribution/all/target/features/tuscany-implementation-spring-runtime/build-path.xml>
[INFO] Generating ANT build path: <https://builds.apache.org/job/Tuscany-2x/ws/sca-2x/distribution/all/target/features/tuscany-binding-rest-runtime/build-path.xml>
[INFO] Generating ANT build path: <https://builds.apache.org/job/Tuscany-2x/ws/sca-2x/distribution/all/target/features/tuscany-binding-atom-runtime/build-path.xml>
[INFO] Generating ANT build path: <https://builds.apache.org/job/Tuscany-2x/ws/sca-2x/distribution/all/target/features/tuscany-implementation-widget-runtime/build-path.xml>
[INFO] Generating ANT build path: <https://builds.apache.org/job/Tuscany-2x/ws/sca-2x/distribution/all/target/features/tuscany-base-runtime-pom/build-path.xml>
[INFO] Generating ANT build path: <https://builds.apache.org/job/Tuscany-2x/ws/sca-2x/distribution/all/target/features/tuscany-implementation-bpel-runtime/build-path.xml>
[INFO] Generating ANT build path: <https://builds.apache.org/job/Tuscany-2x/ws/sca-2x/distribution/all/target/features/tuscany-binding-corba-runtime/build-path.xml>
[INFO] Generating ANT build path: <https://builds.apache.org/job/Tuscany-2x/ws/sca-2x/distribution/all/target/features/tuscany-binding-rmi-runtime/build-path.xml>
[INFO] Generating ANT build path: <https://builds.apache.org/job/Tuscany-2x/ws/sca-2x/distribution/all/target/features/tuscany-binding-jsonrpc-runtime/build-path.xml>
[INFO] Generating ANT build path: <https://builds.apache.org/job/Tuscany-2x/ws/sca-2x/distribution/all/target/features/tuscany-implementation-script-runtime/build-path.xml>
[INFO] Generating ANT build path: <https://builds.apache.org/job/Tuscany-2x/ws/sca-2x/distribution/all/target/features/tuscany-binding-jsonp-runtime/build-path.xml>
[INFO] Generating ANT build path: <https://builds.apache.org/job/Tuscany-2x/ws/sca-2x/distribution/all/target/features/tuscany-implementation-web-runtime/build-path.xml>
[INFO] Generating Which Jars: <https://builds.apache.org/job/Tuscany-2x/ws/sca-2x/distribution/all/target/features/tuscany-binding-ejb-runtime/which-jars>
[INFO] Generating Which Jars: <https://builds.apache.org/job/Tuscany-2x/ws/sca-2x/distribution/all/target/features/tuscany-implementation-osgi-runtime/which-jars>
[INFO] Generating Which Jars: <https://builds.apache.org/job/Tuscany-2x/ws/sca-2x/distribution/all/target/features/tuscany-host-jetty/which-jars>
[INFO] Generating Which Jars: <https://builds.apache.org/job/Tuscany-2x/ws/sca-2x/distribution/all/target/features/tuscany-binding-ws-runtime-axis2/which-jars>
[INFO] Generating Which Jars: <https://builds.apache.org/job/Tuscany-2x/ws/sca-2x/distribution/all/target/features/tuscany-implementation-python-runtime/which-jars>
[INFO] Generating Which Jars: <https://builds.apache.org/job/Tuscany-2x/ws/sca-2x/distribution/all/target/features/tuscany-binding-jms-runtime/which-jars>
[INFO] Generating Which Jars: <https://builds.apache.org/job/Tuscany-2x/ws/sca-2x/distribution/all/target/features/tuscany-implementation-spring-runtime/which-jars>
[INFO] Generating Which Jars: <https://builds.apache.org/job/Tuscany-2x/ws/sca-2x/distribution/all/target/features/tuscany-binding-rest-runtime/which-jars>
[INFO] Generating Which Jars: <https://builds.apache.org/job/Tuscany-2x/ws/sca-2x/distribution/all/target/features/tuscany-binding-atom-runtime/which-jars>
[INFO] Generating Which Jars: <https://builds.apache.org/job/Tuscany-2x/ws/sca-2x/distribution/all/target/features/tuscany-implementation-widget-runtime/which-jars>
[INFO] Generating Which Jars: <https://builds.apache.org/job/Tuscany-2x/ws/sca-2x/distribution/all/target/features/tuscany-base-runtime-pom/which-jars>
[INFO] Generating Which Jars: <https://builds.apache.org/job/Tuscany-2x/ws/sca-2x/distribution/all/target/features/tuscany-implementation-bpel-runtime/which-jars>
[INFO] Generating Which Jars: <https://builds.apache.org/job/Tuscany-2x/ws/sca-2x/distribution/all/target/features/tuscany-binding-corba-runtime/which-jars>
[INFO] Generating Which Jars: <https://builds.apache.org/job/Tuscany-2x/ws/sca-2x/distribution/all/target/features/tuscany-binding-rmi-runtime/which-jars>
[INFO] Generating Which Jars: <https://builds.apache.org/job/Tuscany-2x/ws/sca-2x/distribution/all/target/features/tuscany-binding-jsonrpc-runtime/which-jars>
[INFO] Generating Which Jars: <https://builds.apache.org/job/Tuscany-2x/ws/sca-2x/distribution/all/target/features/tuscany-implementation-script-runtime/which-jars>
[INFO] Generating Which Jars: <https://builds.apache.org/job/Tuscany-2x/ws/sca-2x/distribution/all/target/features/tuscany-binding-jsonp-runtime/which-jars>
[INFO] Generating Which Jars: <https://builds.apache.org/job/Tuscany-2x/ws/sca-2x/distribution/all/target/features/tuscany-implementation-web-runtime/which-jars>
[INFO] [site:attach-descriptor {execution: default-attach-descriptor}]
Downloading: http://repo1.maven.org/maven2/org/apache/maven/shared/maven-common-artifact-filters/1.1/maven-common-artifact-filters-1.1.pom
2K downloaded  (maven-common-artifact-filters-1.1.pom)
Downloading: http://download.java.net/maven/2/org/apache/maven/wagon/wagon-file/1.0-alpha-5/wagon-file-1.0-alpha-5.pom
[INFO] Unable to find resource 'org.apache.maven.wagon:wagon-file:pom:1.0-alpha-5' in repository java.net2 (http://download.java.net/maven/2)
Downloading: http://www.intalio.org/public/maven2/org/apache/maven/wagon/wagon-file/1.0-alpha-5/wagon-file-1.0-alpha-5.pom
[INFO] Unable to find resource 'org.apache.maven.wagon:wagon-file:pom:1.0-alpha-5' in repository intalio.org (http://www.intalio.org/public/maven2)
Downloading: http://svn.apache.org/repos/asf/openejb/repo/org/apache/maven/wagon/wagon-file/1.0-alpha-5/wagon-file-1.0-alpha-5.pom
[INFO] Unable to find resource 'org.apache.maven.wagon:wagon-file:pom:1.0-alpha-5' in repository openejb-repository (http://svn.apache.org/repos/asf/openejb/repo)
Downloading: http://svn.apache.org/repos/asf/tuscany/maven/org/apache/maven/wagon/wagon-file/1.0-alpha-5/wagon-file-1.0-alpha-5.pom
[INFO] Unable to find resource 'org.apache.maven.wagon:wagon-file:pom:1.0-alpha-5' in repository tuscany.repo (http://svn.apache.org/repos/asf/tuscany/maven)
Downloading: https://repository.apache.org/content/groups/public//org/apache/maven/wagon/wagon-file/1.0-alpha-5/wagon-file-1.0-alpha-5.pom

Downloading: http://download.java.net/maven/2/org/apache/maven/maven-plugin-parameter-documenter/2.0/maven-plugin-parameter-documenter-2.0.pom
[INFO] Unable to find resource 'org.apache.maven:maven-plugin-parameter-documenter:pom:2.0' in repository java.net2 (http://download.java.net/maven/2)
Downloading: http://www.intalio.org/public/maven2/org/apache/maven/maven-plugin-parameter-documenter/2.0/maven-plugin-parameter-documenter-2.0.pom
1K downloaded  (maven-plugin-parameter-documenter-2.0.pom)
Downloading: http://download.java.net/maven/2/org/apache/maven/wagon/wagon-http-lightweight/1.0-alpha-5/wagon-http-lightweight-1.0-alpha-5.pom
[INFO] Unable to find resource 'org.apache.maven.wagon:wagon-http-lightweight:pom:1.0-alpha-5' in repository java.net2 (http://download.java.net/maven/2)
Downloading: http://www.intalio.org/public/maven2/org/apache/maven/wagon/wagon-http-lightweight/1.0-alpha-5/wagon-http-lightweight-1.0-alpha-5.pom
[INFO] Unable to find resource 'org.apache.maven.wagon:wagon-http-lightweight:pom:1.0-alpha-5' in repository intalio.org (http://www.intalio.org/public/maven2)
Downloading: http://svn.apache.org/repos/asf/openejb/repo/org/apache/maven/wagon/wagon-http-lightweight/1.0-alpha-5/wagon-http-lightweight-1.0-alpha-5.pom
[INFO] Unable to find resource 'org.apache.maven.wagon:wagon-http-lightweight:pom:1.0-alpha-5' in repository openejb-repository (http://svn.apache.org/repos/asf/openejb/repo)
Downloading: http://svn.apache.org/repos/asf/tuscany/maven/org/apache/maven/wagon/wagon-http-lightweight/1.0-alpha-5/wagon-http-lightweight-1.0-alpha-5.pom
[INFO] Unable to find resource 'org.apache.maven.wagon:wagon-http-lightweight:pom:1.0-alpha-5' in repository tuscany.repo (http://svn.apache.org/repos/asf/tuscany/maven)
Downloading: https://repository.apache.org/content/groups/public//org/apache/maven/wagon/wagon-http-lightweight/1.0-alpha-5/wagon-http-lightweight-1.0-alpha-5.pom

Downloading: http://download.java.net/maven/2/org/apache/maven/reporting/maven-reporting-api/2.0/maven-reporting-api-2.0.pom
[INFO] Unable to find resource 'org.apache.maven.reporting:maven-reporting-api:pom:2.0' in repository java.net2 (http://download.java.net/maven/2)
Downloading: http://www.intalio.org/public/maven2/org/apache/maven/reporting/maven-reporting-api/2.0/maven-reporting-api-2.0.pom
1K downloaded  (maven-reporting-api-2.0.pom)
Downloading: http://download.java.net/maven/2/org/apache/maven/reporting/maven-reporting/2.0/maven-reporting-2.0.pom
[INFO] Unable to find resource 'org.apache.maven.reporting:maven-reporting:pom:2.0' in repository java.net2 (http://download.java.net/maven/2)
Downloading: http://www.intalio.org/public/maven2/org/apache/maven/reporting/maven-reporting/2.0/maven-reporting-2.0.pom
504b downloaded  (maven-reporting-2.0.pom)
Downloading: http://download.java.net/maven/2/doxia/doxia-sink-api/1.0-alpha-4/doxia-sink-api-1.0-alpha-4.pom
[INFO] Unable to find resource 'doxia:doxia-sink-api:pom:1.0-alpha-4' in repository java.net2 (http://download.java.net/maven/2)
Downloading: http://www.intalio.org/public/maven2/doxia/doxia-sink-api/1.0-alpha-4/doxia-sink-api-1.0-alpha-4.pom
1K downloaded  (doxia-sink-api-1.0-alpha-4.pom)
Downloading: http://download.java.net/maven/2/org/apache/maven/maven-error-diagnostics/2.0/maven-error-diagnostics-2.0.pom
[INFO] Unable to find resource 'org.apache.maven:maven-error-diagnostics:pom:2.0' in repository java.net2 (http://download.java.net/maven/2)
Downloading: http://www.intalio.org/public/maven2/org/apache/maven/maven-error-diagnostics/2.0/maven-error-diagnostics-2.0.pom
812b downloaded  (maven-error-diagnostics-2.0.pom)
Downloading: http://download.java.net/maven/2/org/apache/maven/maven-plugin-registry/2.0/maven-plugin-registry-2.0.pom
[INFO] Unable to find resource 'org.apache.maven:maven-plugin-registry:pom:2.0' in repository java.net2 (http://download.java.net/maven/2)
Downloading: http://www.intalio.org/public/maven2/org/apache/maven/maven-plugin-registry/2.0/maven-plugin-registry-2.0.pom
1K downloaded  (maven-plugin-registry-2.0.pom)
Downloading: http://download.java.net/maven/2/org/apache/maven/maven-monitor/2.0/maven-monitor-2.0.pom
[INFO] Unable to find resource 'org.apache.maven:maven-monitor:pom:2.0' in repository java.net2 (http://download.java.net/maven/2)
Downloading: http://www.intalio.org/public/maven2/org/apache/maven/maven-monitor/2.0/maven-monitor-2.0.pom
400b downloaded  (maven-monitor-2.0.pom)
Downloading: http://download.java.net/maven/2/org/apache/maven/wagon/wagon-ssh/1.0-alpha-5/wagon-ssh-1.0-alpha-5.pom
[INFO] Unable to find resource 'org.apache.maven.wagon:wagon-ssh:pom:1.0-alpha-5' in repository java.net2 (http://download.java.net/maven/2)
Downloading: http://www.intalio.org/public/maven2/org/apache/maven/wagon/wagon-ssh/1.0-alpha-5/wagon-ssh-1.0-alpha-5.pom
[INFO] Unable to find resource 'org.apache.maven.wagon:wagon-ssh:pom:1.0-alpha-5' in repository intalio.org (http://www.intalio.org/public/maven2)
Downloading: http://svn.apache.org/repos/asf/openejb/repo/org/apache/maven/wagon/wagon-ssh/1.0-alpha-5/wagon-ssh-1.0-alpha-5.pom
[INFO] Unable to find resource 'org.apache.maven.wagon:wagon-ssh:pom:1.0-alpha-5' in repository openejb-repository (http://svn.apache.org/repos/asf/openejb/repo)
Downloading: http://svn.apache.org/repos/asf/tuscany/maven/org/apache/maven/wagon/wagon-ssh/1.0-alpha-5/wagon-ssh-1.0-alpha-5.pom
[INFO] Unable to find resource 'org.apache.maven.wagon:wagon-ssh:pom:1.0-alpha-5' in repository tuscany.repo (http://svn.apache.org/repos/asf/tuscany/maven)
Downloading: https://repository.apache.org/content/groups/public//org/apache/maven/wagon/wagon-ssh/1.0-alpha-5/wagon-ssh-1.0-alpha-5.pom

Downloading: http://download.java.net/maven/2/com/jcraft/jsch/0.1.23/jsch-0.1.23.pom
[INFO] Unable to find resource 'com.jcraft:jsch:pom:0.1.23' in repository java.net2 (http://download.java.net/maven/2)
Downloading: http://www.intalio.org/public/maven2/com/jcraft/jsch/0.1.23/jsch-0.1.23.pom
[INFO] Unable to find resource 'com.jcraft:jsch:pom:0.1.23' in repository intalio.org (http://www.intalio.org/public/maven2)
Downloading: http://svn.apache.org/repos/asf/openejb/repo/com/jcraft/jsch/0.1.23/jsch-0.1.23.pom
[INFO] Unable to find resource 'com.jcraft:jsch:pom:0.1.23' in repository openejb-repository (http://svn.apache.org/repos/asf/openejb/repo)
Downloading: http://svn.apache.org/repos/asf/tuscany/maven/com/jcraft/jsch/0.1.23/jsch-0.1.23.pom
[INFO] Unable to find resource 'com.jcraft:jsch:pom:0.1.23' in repository tuscany.repo (http://svn.apache.org/repos/asf/tuscany/maven)
Downloading: https://repository.apache.org/content/groups/public//com/jcraft/jsch/0.1.23/jsch-0.1.23.pom
[INFO] Unable to find resource 'com.jcraft:jsch:pom:0.1.23' in repository apache.nexus (https://repository.apache.org/content/groups/public/)
Downloading: http://repo1.maven.org/maven2/com/jcraft/jsch/0.1.23/jsch-0.1.23.pom
485b downloaded  (jsch-0.1.23.pom)
Downloading: http://repo1.maven.org/maven2/org/codehaus/plexus/plexus-interpolation/1.7/plexus-interpolation-1.7.pom
2K downloaded  (plexus-interpolation-1.7.pom)
Downloading: http://repo1.maven.org/maven2/org/codehaus/plexus/plexus-archiver/1.0-alpha-12/plexus-archiver-1.0-alpha-12.pom
1K downloaded  (plexus-archiver-1.0-alpha-12.pom)
Downloading: http://download.java.net/maven/2/org/codehaus/plexus/plexus-io/1.0-alpha-4/plexus-io-1.0-alpha-4.pom
[INFO] Unable to find resource 'org.codehaus.plexus:plexus-io:pom:1.0-alpha-4' in repository java.net2 (http://download.java.net/maven/2)
Downloading: http://www.intalio.org/public/maven2/org/codehaus/plexus/plexus-io/1.0-alpha-4/plexus-io-1.0-alpha-4.pom
1K downloaded  (plexus-io-1.0-alpha-4.pom)
Downloading: http://repo1.maven.org/maven2/org/codehaus/plexus/plexus-active-collections/1.0-beta-2/plexus-active-collections-1.0-beta-2.pom
2K downloaded  (plexus-active-collections-1.0-beta-2.pom)
Downloading: http://download.java.net/maven/2/org/codehaus/plexus/plexus-container-default/1.0-alpha-22/plexus-container-default-1.0-alpha-22.pom
[INFO] Unable to find resource 'org.codehaus.plexus:plexus-container-default:pom:1.0-alpha-22' in repository java.net2 (http://download.java.net/maven/2)
Downloading: http://www.intalio.org/public/maven2/org/codehaus/plexus/plexus-container-default/1.0-alpha-22/plexus-container-default-1.0-alpha-22.pom
[INFO] Unable to find resource 'org.codehaus.plexus:plexus-container-default:pom:1.0-alpha-22' in repository intalio.org (http://www.intalio.org/public/maven2)
Downloading: http://svn.apache.org/repos/asf/openejb/repo/org/codehaus/plexus/plexus-container-default/1.0-alpha-22/plexus-container-default-1.0-alpha-22.pom
[INFO] Unable to find resource 'org.codehaus.plexus:plexus-container-default:pom:1.0-alpha-22' in repository openejb-repository (http://svn.apache.org/repos/asf/openejb/repo)
Downloading: http://svn.apache.org/repos/asf/tuscany/maven/org/codehaus/plexus/plexus-container-default/1.0-alpha-22/plexus-container-default-1.0-alpha-22.pom
[INFO] Unable to find resource 'org.codehaus.plexus:plexus-container-default:pom:1.0-alpha-22' in repository tuscany.repo (http://svn.apache.org/repos/asf/tuscany/maven)
Downloading: https://repository.apache.org/content/groups/public//org/codehaus/plexus/plexus-container-default/1.0-alpha-22/plexus-container-default-1.0-alpha-22.pom
[INFO] Unable to find resource 'org.codehaus.plexus:plexus-container-default:pom:1.0-alpha-22' in repository apache.nexus (https://repository.apache.org/content/groups/public/)
Downloading: http://repo1.maven.org/maven2/org/codehaus/plexus/plexus-container-default/1.0-alpha-22/plexus-container-default-1.0-alpha-22.pom
2K downloaded  (plexus-container-default-1.0-alpha-22.pom)
Downloading: http://download.java.net/maven/2/org/codehaus/plexus/plexus-containers/1.0-alpha-22/plexus-containers-1.0-alpha-22.pom
[INFO] Unable to find resource 'org.codehaus.plexus:plexus-containers:pom:1.0-alpha-22' in repository java.net2 (http://download.java.net/maven/2)
Downloading: http://www.intalio.org/public/maven2/org/codehaus/plexus/plexus-containers/1.0-alpha-22/plexus-containers-1.0-alpha-22.pom
[INFO] Unable to find resource 'org.codehaus.plexus:plexus-containers:pom:1.0-alpha-22' in repository intalio.org (http://www.intalio.org/public/maven2)
Downloading: http://svn.apache.org/repos/asf/openejb/repo/org/codehaus/plexus/plexus-containers/1.0-alpha-22/plexus-containers-1.0-alpha-22.pom
[INFO] Unable to find resource 'org.codehaus.plexus:plexus-containers:pom:1.0-alpha-22' in repository openejb-repository (http://svn.apache.org/repos/asf/openejb/repo)
Downloading: http://svn.apache.org/repos/asf/tuscany/maven/org/codehaus/plexus/plexus-containers/1.0-alpha-22/plexus-containers-1.0-alpha-22.pom
[INFO] Unable to find resource 'org.codehaus.plexus:plexus-containers:pom:1.0-alpha-22' in repository tuscany.repo (http://svn.apache.org/repos/asf/tuscany/maven)
Downloading: https://repository.apache.org/content/groups/public//org/codehaus/plexus/plexus-containers/1.0-alpha-22/plexus-containers-1.0-alpha-22.pom
[INFO] Unable to find resource 'org.codehaus.plexus:plexus-containers:pom:1.0-alpha-22' in repository apache.nexus (https://repository.apache.org/content/groups/public/)
Downloading: http://repo1.maven.org/maven2/org/codehaus/plexus/plexus-containers/1.0-alpha-22/plexus-containers-1.0-alpha-22.pom
1K downloaded  (plexus-containers-1.0-alpha-22.pom)
Downloading: http://repo1.maven.org/maven2/org/codehaus/plexus/plexus-utils/2.0.1/plexus-utils-2.0.1.pom
3K downloaded  (plexus-utils-2.0.1.pom)
Downloading: http://repo1.maven.org/maven2/org/codehaus/plexus/plexus-utils/2.0.1/plexus-utils-2.0.1.jar
Downloading: http://repo1.maven.org/maven2/org/apache/maven/shared/maven-common-artifact-filters/1.1/maven-common-artifact-filters-1.1.jar
29K downloaded  (maven-common-artifact-filters-1.1.jar)
216K downloaded  (plexus-utils-2.0.1.jar)
Downloading: http://repo1.maven.org/maven2/org/codehaus/plexus/plexus-archiver/1.0-alpha-12/plexus-archiver-1.0-alpha-12.jar
172K downloaded  (plexus-archiver-1.0-alpha-12.jar)
Downloading: http://repo1.maven.org/maven2/org/codehaus/plexus/plexus-interpolation/1.7/plexus-interpolation-1.7.jar
49K downloaded  (plexus-interpolation-1.7.jar)
Downloading: http://repo1.maven.org/maven2/org/codehaus/plexus/plexus-io/1.0-alpha-4/plexus-io-1.0-alpha-4.jar
47K downloaded  (plexus-io-1.0-alpha-4.jar)
Downloading: http://repo1.maven.org/maven2/org/codehaus/plexus/plexus-active-collections/1.0-beta-2/plexus-active-collections-1.0-beta-2.jar
20K downloaded  (plexus-active-collections-1.0-beta-2.jar)
[INFO] [assembly:single {execution: distribution-package}]
[INFO] Reading assembly descriptor: src/main/assembly/bin-distribution.xml
[INFO] Reading assembly descriptor: src/main/assembly/src.xml
[WARNING] POM for 'org.opensaml:opensaml:pom:2.2.3:compile' is invalid.

Its dependencies (if any) will NOT be available to the current build.
[WARNING] Cannot include project artifact: org.apache.tuscany.sca:tuscany-distribution-all:pom:2.5-SNAPSHOT; it doesn't have an associated file or directory.
[WARNING] Cannot include project artifact: org.apache.tuscany.sca:tuscany-distribution-all:pom:2.5-SNAPSHOT; it doesn't have an associated file or directory.
[JENKINS] Archiving disabled
[INFO] ------------------------------------------------------------------------
[ERROR] BUILD ERROR
[INFO] ------------------------------------------------------------------------
[INFO] Failed to create assembly: Error creating assembly archive : Failed to retrieve numeric file attributes using: '/bin/sh -c ls -1laR <https://builds.apache.org/job/Tuscany-2x/ws/sca-2x/distribution/all/../..'>

[INFO] ------------------------------------------------------------------------
[INFO] For more information, run Maven with the -e switch
[INFO] ------------------------------------------------------------------------
[INFO] Total time: 40 minutes 8 seconds
[INFO] Finished at: Sun Feb 10 01:16:07 UTC 2013
[INFO] Final Memory: 548M/729M
[INFO] ------------------------------------------------------------------------
Sending e-mails to: notification@tuscany.apache.org
Sending e-mails to: notification@tuscany.apache.org
channel stopped
2013-02-10 01:19:57.787:INFO::Shutdown hook executing
2013-02-10 01:19:57.802:INFO::Shutdown hook complete

Build failed in Jenkins: Tuscany-2x #931

Posted by Apache Jenkins Server <je...@builds.apache.org>.
See <https://builds.apache.org/job/Tuscany-2x/931/>

------------------------------------------
[...truncated 23537 lines...]
[WARNING]     @parameter property="property"
[WARNING]   instead.
[INFO] Mojo extractor for language: java found 2 mojo descriptors.
[INFO] Applying mojo extractor for language: bsh
[INFO] Mojo extractor for language: bsh found 0 mojo descriptors.
[INFO] [remote-resources:process {execution: default}]
[INFO] [resources:resources {execution: default-resources}]
[INFO] Using 'UTF-8' encoding to copy filtered resources.
[INFO] skip non existing resourceDirectory <https://builds.apache.org/job/Tuscany-2x/ws/sca-2x/maven/tuscany-diagram-plugin/src/main/resources>
[INFO] Copying 3 resources
[INFO] Copying 3 resources
[INFO] [compiler:compile {execution: default-compile}]
[INFO] Compiling 2 source files to <https://builds.apache.org/job/Tuscany-2x/ws/sca-2x/maven/tuscany-diagram-plugin/target/classes>
[INFO] [resources:testResources {execution: default-testResources}]
[INFO] Using 'UTF-8' encoding to copy filtered resources.
[INFO] skip non existing resourceDirectory <https://builds.apache.org/job/Tuscany-2x/ws/sca-2x/maven/tuscany-diagram-plugin/src/test/resources>
[INFO] Copying 3 resources
[INFO] [compiler:testCompile {execution: default-testCompile}]
[INFO] No sources to compile
[INFO] [surefire:test {execution: default-test}]
[INFO] Surefire report directory: <https://builds.apache.org/job/Tuscany-2x/ws/sca-2x/maven/tuscany-diagram-plugin/target/surefire-reports>

-------------------------------------------------------
 T E S T S
-------------------------------------------------------
There are no tests to run.

Results :

Tests run: 0, Failures: 0, Errors: 0, Skipped: 0

[JENKINS] Recording test results
[INFO] [jar:jar {execution: default-jar}]
[INFO] Building jar: <https://builds.apache.org/job/Tuscany-2x/ws/sca-2x/maven/tuscany-diagram-plugin/target/tuscany-diagram-plugin-2.5-SNAPSHOT.jar>
[INFO] [plugin:addPluginArtifactMetadata {execution: default-addPluginArtifactMetadata}]
[INFO] [install:install {execution: default-install}]
[INFO] Installing <https://builds.apache.org/job/Tuscany-2x/ws/sca-2x/maven/tuscany-diagram-plugin/target/tuscany-diagram-plugin-2.5-SNAPSHOT.jar> to <https://builds.apache.org/job/Tuscany-2x/ws/.repository/org/apache/tuscany/sca/tuscany-diagram-plugin/2.5-SNAPSHOT/tuscany-diagram-plugin-2.5-SNAPSHOT.jar>
[JENKINS] Archiving disabled
[INFO] ------------------------------------------------------------------------
[INFO] Building Apache Tuscany SCA Web JavaScript
[INFO]    task-segment: [clean, install]
[INFO] ------------------------------------------------------------------------
[INFO] [clean:clean {execution: default-clean}]
[INFO] [enforcer:enforce {execution: enforce-plugin-versions}]
[INFO] [remote-resources:process {execution: default}]
[INFO] [resources:resources {execution: default-resources}]
[INFO] Using 'UTF-8' encoding to copy filtered resources.
[INFO] Copying 3 resources
[INFO] Copying 3 resources
[INFO] Copying 3 resources
[INFO] [compiler:compile {execution: default-compile}]
[INFO] Compiling 6 source files to <https://builds.apache.org/job/Tuscany-2x/ws/sca-2x/modules/web-javascript/target/classes>
[INFO] [resources:testResources {execution: default-testResources}]
[INFO] Using 'UTF-8' encoding to copy filtered resources.
[INFO] skip non existing resourceDirectory <https://builds.apache.org/job/Tuscany-2x/ws/sca-2x/modules/web-javascript/src/test/resources>
[INFO] Copying 3 resources
[INFO] [compiler:testCompile {execution: default-testCompile}]
[INFO] No sources to compile
[INFO] [surefire:test {execution: default-test}]
[INFO] Surefire report directory: <https://builds.apache.org/job/Tuscany-2x/ws/sca-2x/modules/web-javascript/target/surefire-reports>

-------------------------------------------------------
 T E S T S
-------------------------------------------------------
There are no tests to run.

Results :

Tests run: 0, Failures: 0, Errors: 0, Skipped: 0

[JENKINS] Recording test results
[INFO] [jar:jar {execution: default-jar}]
[INFO] Building jar: <https://builds.apache.org/job/Tuscany-2x/ws/sca-2x/modules/web-javascript/target/tuscany-web-javascript-2.5-SNAPSHOT.jar>
[INFO] [source:jar-no-fork {execution: attach-sources}]
[INFO] Building jar: <https://builds.apache.org/job/Tuscany-2x/ws/sca-2x/modules/web-javascript/target/tuscany-web-javascript-2.5-SNAPSHOT-sources.jar>
[INFO] [install:install {execution: default-install}]
[INFO] Installing <https://builds.apache.org/job/Tuscany-2x/ws/sca-2x/modules/web-javascript/target/tuscany-web-javascript-2.5-SNAPSHOT.jar> to <https://builds.apache.org/job/Tuscany-2x/ws/.repository/org/apache/tuscany/sca/tuscany-web-javascript/2.5-SNAPSHOT/tuscany-web-javascript-2.5-SNAPSHOT.jar>
[INFO] Installing <https://builds.apache.org/job/Tuscany-2x/ws/sca-2x/modules/web-javascript/target/tuscany-web-javascript-2.5-SNAPSHOT-sources.jar> to <https://builds.apache.org/job/Tuscany-2x/ws/.repository/org/apache/tuscany/sca/tuscany-web-javascript/2.5-SNAPSHOT/tuscany-web-javascript-2.5-SNAPSHOT-sources.jar>
[JENKINS] Archiving disabled
[INFO] ------------------------------------------------------------------------
[INFO] Building Apache Tuscany SCA Abdera Atom Feed Binding Extension
[INFO]    task-segment: [clean, install]
[INFO] ------------------------------------------------------------------------
[INFO] [clean:clean {execution: default-clean}]
[INFO] [enforcer:enforce {execution: enforce-plugin-versions}]
[INFO] [remote-resources:process {execution: default}]
[INFO] [resources:resources {execution: default-resources}]
[INFO] Using 'UTF-8' encoding to copy filtered resources.
[INFO] Copying 2 resources
[INFO] Copying 3 resources
[INFO] Copying 3 resources
[INFO] [compiler:compile {execution: default-compile}]
[INFO] Compiling 11 source files to <https://builds.apache.org/job/Tuscany-2x/ws/sca-2x/modules/binding-atom-runtime/target/classes>
[INFO] [resources:testResources {execution: default-testResources}]
[INFO] Using 'UTF-8' encoding to copy filtered resources.
[INFO] Copying 8 resources
[INFO] Copying 3 resources
[INFO] [compiler:testCompile {execution: default-testCompile}]
[INFO] Compiling 29 source files to <https://builds.apache.org/job/Tuscany-2x/ws/sca-2x/modules/binding-atom-runtime/target/test-classes>
[INFO] [surefire:test {execution: default-test}]
[INFO] Tests are skipped.
[INFO] [jar:jar {execution: default-jar}]
[INFO] Building jar: <https://builds.apache.org/job/Tuscany-2x/ws/sca-2x/modules/binding-atom-runtime/target/tuscany-binding-atom-runtime-2.5-SNAPSHOT.jar>
[INFO] [source:jar-no-fork {execution: attach-sources}]
[INFO] Building jar: <https://builds.apache.org/job/Tuscany-2x/ws/sca-2x/modules/binding-atom-runtime/target/tuscany-binding-atom-runtime-2.5-SNAPSHOT-sources.jar>
[INFO] [install:install {execution: default-install}]
[INFO] Installing <https://builds.apache.org/job/Tuscany-2x/ws/sca-2x/modules/binding-atom-runtime/target/tuscany-binding-atom-runtime-2.5-SNAPSHOT.jar> to <https://builds.apache.org/job/Tuscany-2x/ws/.repository/org/apache/tuscany/sca/tuscany-binding-atom-runtime/2.5-SNAPSHOT/tuscany-binding-atom-runtime-2.5-SNAPSHOT.jar>
[INFO] Installing <https://builds.apache.org/job/Tuscany-2x/ws/sca-2x/modules/binding-atom-runtime/target/tuscany-binding-atom-runtime-2.5-SNAPSHOT-sources.jar> to <https://builds.apache.org/job/Tuscany-2x/ws/.repository/org/apache/tuscany/sca/tuscany-binding-atom-runtime/2.5-SNAPSHOT/tuscany-binding-atom-runtime-2.5-SNAPSHOT-sources.jar>
[JENKINS] Archiving disabled
[INFO] ------------------------------------------------------------------------
[INFO] Building Apache Tuscany SCA Comet Binding Model
[INFO]    task-segment: [clean, install]
[INFO] ------------------------------------------------------------------------
[INFO] [clean:clean {execution: default-clean}]
[INFO] [enforcer:enforce {execution: enforce-plugin-versions}]
[INFO] [remote-resources:process {execution: default}]
[INFO] [resources:resources {execution: default-resources}]
[INFO] Using 'UTF-8' encoding to copy filtered resources.
[INFO] Copying 4 resources
[INFO] Copying 3 resources
[INFO] Copying 3 resources
[INFO] [compiler:compile {execution: default-compile}]
[INFO] Compiling 4 source files to <https://builds.apache.org/job/Tuscany-2x/ws/sca-2x/modules/binding-comet/target/classes>
[INFO] [resources:testResources {execution: default-testResources}]
[INFO] Using 'UTF-8' encoding to copy filtered resources.
[INFO] skip non existing resourceDirectory <https://builds.apache.org/job/Tuscany-2x/ws/sca-2x/modules/binding-comet/src/test/resources>
[INFO] Copying 3 resources
[INFO] [compiler:testCompile {execution: default-testCompile}]
[INFO] No sources to compile
[INFO] [surefire:test {execution: default-test}]
[INFO] Surefire report directory: <https://builds.apache.org/job/Tuscany-2x/ws/sca-2x/modules/binding-comet/target/surefire-reports>

-------------------------------------------------------
 T E S T S
-------------------------------------------------------
There are no tests to run.

Results :

Tests run: 0, Failures: 0, Errors: 0, Skipped: 0

[JENKINS] Recording test results
[INFO] [jar:jar {execution: default-jar}]
[INFO] Building jar: <https://builds.apache.org/job/Tuscany-2x/ws/sca-2x/modules/binding-comet/target/tuscany-binding-comet-2.5-SNAPSHOT.jar>
[INFO] [source:jar-no-fork {execution: attach-sources}]
[INFO] Building jar: <https://builds.apache.org/job/Tuscany-2x/ws/sca-2x/modules/binding-comet/target/tuscany-binding-comet-2.5-SNAPSHOT-sources.jar>
[INFO] [install:install {execution: default-install}]
[INFO] Installing <https://builds.apache.org/job/Tuscany-2x/ws/sca-2x/modules/binding-comet/target/tuscany-binding-comet-2.5-SNAPSHOT.jar> to <https://builds.apache.org/job/Tuscany-2x/ws/.repository/org/apache/tuscany/sca/tuscany-binding-comet/2.5-SNAPSHOT/tuscany-binding-comet-2.5-SNAPSHOT.jar>
[INFO] Installing <https://builds.apache.org/job/Tuscany-2x/ws/sca-2x/modules/binding-comet/target/tuscany-binding-comet-2.5-SNAPSHOT-sources.jar> to <https://builds.apache.org/job/Tuscany-2x/ws/.repository/org/apache/tuscany/sca/tuscany-binding-comet/2.5-SNAPSHOT/tuscany-binding-comet-2.5-SNAPSHOT-sources.jar>
[JENKINS] Archiving disabled
[INFO] ------------------------------------------------------------------------
[INFO] Building Apache Tuscany SCA EJB Binding Runtime
[INFO]    task-segment: [clean, install]
[INFO] ------------------------------------------------------------------------
[INFO] [clean:clean {execution: default-clean}]
[WARNING] POM for 'log4j:log4j:pom:1.2.12:test' is invalid.

Its dependencies (if any) will NOT be available to the current build.
[WARNING] POM for 'commons-cli:commons-cli:pom:1.1:test' is invalid.

Its dependencies (if any) will NOT be available to the current build.
[WARNING] POM for 'backport-util-concurrent:backport-util-concurrent:pom:2.1:test' is invalid.

Its dependencies (if any) will NOT be available to the current build.
[WARNING] POM for 'commons-logging:commons-logging:pom:1.1:test' is invalid.

Its dependencies (if any) will NOT be available to the current build.
[WARNING] POM for 'org.apache.geronimo.specs:geronimo-jms_1.1_spec:pom:1.0:test' is invalid.

Its dependencies (if any) will NOT be available to the current build.
[WARNING] POM for 'org.apache.geronimo.specs:geronimo-j2ee-management_1.0_spec:pom:1.0:test' is invalid.

Its dependencies (if any) will NOT be available to the current build.
[WARNING] POM for 'activemq:jmdns:pom:1.0-RC2:test' is invalid.

Its dependencies (if any) will NOT be available to the current build.
[WARNING] POM for 'org.codehaus.swizzle:swizzle-stream:pom:1.0.1:test' is invalid.

Its dependencies (if any) will NOT be available to the current build.
[INFO] [enforcer:enforce {execution: enforce-plugin-versions}]
[INFO] [remote-resources:process {execution: default}]
[WARNING] POM for 'log4j:log4j:pom:1.2.12:test' is invalid.

Its dependencies (if any) will NOT be available to the current build.
[WARNING] POM for 'commons-cli:commons-cli:pom:1.1:test' is invalid.

Its dependencies (if any) will NOT be available to the current build.
[WARNING] POM for 'backport-util-concurrent:backport-util-concurrent:pom:2.1:test' is invalid.

Its dependencies (if any) will NOT be available to the current build.
[WARNING] POM for 'commons-logging:commons-logging:pom:1.1:test' is invalid.

Its dependencies (if any) will NOT be available to the current build.
[WARNING] POM for 'org.apache.geronimo.specs:geronimo-jms_1.1_spec:pom:1.0:test' is invalid.

Its dependencies (if any) will NOT be available to the current build.
[WARNING] POM for 'org.apache.geronimo.specs:geronimo-j2ee-management_1.0_spec:pom:1.0:test' is invalid.

Its dependencies (if any) will NOT be available to the current build.
[WARNING] POM for 'activemq:jmdns:pom:1.0-RC2:test' is invalid.

Its dependencies (if any) will NOT be available to the current build.
[WARNING] POM for 'org.codehaus.swizzle:swizzle-stream:pom:1.0.1:test' is invalid.

Its dependencies (if any) will NOT be available to the current build.
[INFO] [resources:resources {execution: default-resources}]
[INFO] Using 'UTF-8' encoding to copy filtered resources.
[INFO] Copying 2 resources
[INFO] Copying 3 resources
[INFO] Copying 3 resources
[INFO] [compiler:compile {execution: default-compile}]
[INFO] Compiling 17 source files to <https://builds.apache.org/job/Tuscany-2x/ws/sca-2x/modules/binding-ejb-runtime/target/classes>
[INFO] [resources:testResources {execution: default-testResources}]
[INFO] Using 'UTF-8' encoding to copy filtered resources.
[INFO] Copying 1 resource
[INFO] Copying 3 resources
[INFO] [compiler:testCompile {execution: default-testCompile}]
[INFO] Compiling 10 source files to <https://builds.apache.org/job/Tuscany-2x/ws/sca-2x/modules/binding-ejb-runtime/target/test-classes>
[INFO] -------------------------------------------------------------
[ERROR] COMPILATION ERROR : 
[INFO] -------------------------------------------------------------
[ERROR] error: error reading <https://builds.apache.org/job/Tuscany-2x/ws/.repository/log4j/log4j/1.2.12/log4j-1.2.12.jar;> error in opening zip file
[ERROR] error: error reading <https://builds.apache.org/job/Tuscany-2x/ws/.repository/commons-cli/commons-cli/1.1/commons-cli-1.1.jar;> error in opening zip file
[ERROR] error: error reading <https://builds.apache.org/job/Tuscany-2x/ws/.repository/backport-util-concurrent/backport-util-concurrent/2.1/backport-util-concurrent-2.1.jar;> error in opening zip file
[ERROR] error: error reading <https://builds.apache.org/job/Tuscany-2x/ws/.repository/activemq/jmdns/1.0-RC2/jmdns-1.0-RC2.jar;> error in opening zip file
[ERROR] error: error reading <https://builds.apache.org/job/Tuscany-2x/ws/.repository/org/codehaus/swizzle/swizzle-stream/1.0.1/swizzle-stream-1.0.1.jar;> error in opening zip file
[INFO] 5 errors 
[INFO] -------------------------------------------------------------
[JENKINS] Archiving disabled
[INFO] ------------------------------------------------------------------------
[ERROR] BUILD FAILURE
[INFO] ------------------------------------------------------------------------
[INFO] Compilation failure

error: error reading <https://builds.apache.org/job/Tuscany-2x/ws/.repository/log4j/log4j/1.2.12/log4j-1.2.12.jar;> error in opening zip file
error: error reading <https://builds.apache.org/job/Tuscany-2x/ws/.repository/commons-cli/commons-cli/1.1/commons-cli-1.1.jar;> error in opening zip file
error: error reading <https://builds.apache.org/job/Tuscany-2x/ws/.repository/backport-util-concurrent/backport-util-concurrent/2.1/backport-util-concurrent-2.1.jar;> error in opening zip file
error: error reading <https://builds.apache.org/job/Tuscany-2x/ws/.repository/activemq/jmdns/1.0-RC2/jmdns-1.0-RC2.jar;> error in opening zip file
error: error reading <https://builds.apache.org/job/Tuscany-2x/ws/.repository/org/codehaus/swizzle/swizzle-stream/1.0.1/swizzle-stream-1.0.1.jar;> error in opening zip file

[INFO] ------------------------------------------------------------------------
[INFO] For more information, run Maven with the -e switch
[INFO] ------------------------------------------------------------------------
[INFO] Total time: 10 minutes 55 seconds
[INFO] Finished at: Sat Feb 09 03:24:19 UTC 2013
[INFO] Final Memory: 244M/722M
[INFO] ------------------------------------------------------------------------
Sending e-mails to: notification@tuscany.apache.org
channel stopped

Build failed in Jenkins: Tuscany-2x #930

Posted by Apache Jenkins Server <je...@builds.apache.org>.
See <https://builds.apache.org/job/Tuscany-2x/930/>

------------------------------------------
[...truncated 23603 lines...]
[WARNING]     @parameter property="property"
[WARNING]   instead.
[INFO] Mojo extractor for language: java found 2 mojo descriptors.
[INFO] Applying mojo extractor for language: bsh
[INFO] Mojo extractor for language: bsh found 0 mojo descriptors.
[INFO] [remote-resources:process {execution: default}]
[INFO] [resources:resources {execution: default-resources}]
[INFO] Using 'UTF-8' encoding to copy filtered resources.
[INFO] skip non existing resourceDirectory <https://builds.apache.org/job/Tuscany-2x/ws/sca-2x/maven/tuscany-diagram-plugin/src/main/resources>
[INFO] Copying 3 resources
[INFO] Copying 3 resources
[INFO] [compiler:compile {execution: default-compile}]
[INFO] Compiling 2 source files to <https://builds.apache.org/job/Tuscany-2x/ws/sca-2x/maven/tuscany-diagram-plugin/target/classes>
[INFO] [resources:testResources {execution: default-testResources}]
[INFO] Using 'UTF-8' encoding to copy filtered resources.
[INFO] skip non existing resourceDirectory <https://builds.apache.org/job/Tuscany-2x/ws/sca-2x/maven/tuscany-diagram-plugin/src/test/resources>
[INFO] Copying 3 resources
[INFO] [compiler:testCompile {execution: default-testCompile}]
[INFO] No sources to compile
[INFO] [surefire:test {execution: default-test}]
[INFO] Surefire report directory: <https://builds.apache.org/job/Tuscany-2x/ws/sca-2x/maven/tuscany-diagram-plugin/target/surefire-reports>

-------------------------------------------------------
 T E S T S
-------------------------------------------------------
There are no tests to run.

Results :

Tests run: 0, Failures: 0, Errors: 0, Skipped: 0

[JENKINS] Recording test results
[INFO] [jar:jar {execution: default-jar}]
[INFO] Building jar: <https://builds.apache.org/job/Tuscany-2x/ws/sca-2x/maven/tuscany-diagram-plugin/target/tuscany-diagram-plugin-2.5-SNAPSHOT.jar>
[INFO] [plugin:addPluginArtifactMetadata {execution: default-addPluginArtifactMetadata}]
[INFO] [install:install {execution: default-install}]
[INFO] Installing <https://builds.apache.org/job/Tuscany-2x/ws/sca-2x/maven/tuscany-diagram-plugin/target/tuscany-diagram-plugin-2.5-SNAPSHOT.jar> to <https://builds.apache.org/job/Tuscany-2x/ws/.repository/org/apache/tuscany/sca/tuscany-diagram-plugin/2.5-SNAPSHOT/tuscany-diagram-plugin-2.5-SNAPSHOT.jar>
[JENKINS] Archiving disabled
[INFO] ------------------------------------------------------------------------
[INFO] Building Apache Tuscany SCA Web JavaScript
[INFO]    task-segment: [clean, install]
[INFO] ------------------------------------------------------------------------
[INFO] [clean:clean {execution: default-clean}]
[INFO] [enforcer:enforce {execution: enforce-plugin-versions}]
[INFO] [remote-resources:process {execution: default}]
[INFO] [resources:resources {execution: default-resources}]
[INFO] Using 'UTF-8' encoding to copy filtered resources.
[INFO] Copying 3 resources
[INFO] Copying 3 resources
[INFO] Copying 3 resources
[INFO] [compiler:compile {execution: default-compile}]
[INFO] Compiling 6 source files to <https://builds.apache.org/job/Tuscany-2x/ws/sca-2x/modules/web-javascript/target/classes>
[INFO] [resources:testResources {execution: default-testResources}]
[INFO] Using 'UTF-8' encoding to copy filtered resources.
[INFO] skip non existing resourceDirectory <https://builds.apache.org/job/Tuscany-2x/ws/sca-2x/modules/web-javascript/src/test/resources>
[INFO] Copying 3 resources
[INFO] [compiler:testCompile {execution: default-testCompile}]
[INFO] No sources to compile
[INFO] [surefire:test {execution: default-test}]
[INFO] Surefire report directory: <https://builds.apache.org/job/Tuscany-2x/ws/sca-2x/modules/web-javascript/target/surefire-reports>

-------------------------------------------------------
 T E S T S
-------------------------------------------------------
There are no tests to run.

Results :

Tests run: 0, Failures: 0, Errors: 0, Skipped: 0
[JENKINS] Recording test results

[INFO] [jar:jar {execution: default-jar}]
[INFO] Building jar: <https://builds.apache.org/job/Tuscany-2x/ws/sca-2x/modules/web-javascript/target/tuscany-web-javascript-2.5-SNAPSHOT.jar>
[INFO] [source:jar-no-fork {execution: attach-sources}]
[INFO] Building jar: <https://builds.apache.org/job/Tuscany-2x/ws/sca-2x/modules/web-javascript/target/tuscany-web-javascript-2.5-SNAPSHOT-sources.jar>
[INFO] [install:install {execution: default-install}]
[INFO] Installing <https://builds.apache.org/job/Tuscany-2x/ws/sca-2x/modules/web-javascript/target/tuscany-web-javascript-2.5-SNAPSHOT.jar> to <https://builds.apache.org/job/Tuscany-2x/ws/.repository/org/apache/tuscany/sca/tuscany-web-javascript/2.5-SNAPSHOT/tuscany-web-javascript-2.5-SNAPSHOT.jar>
[INFO] Installing <https://builds.apache.org/job/Tuscany-2x/ws/sca-2x/modules/web-javascript/target/tuscany-web-javascript-2.5-SNAPSHOT-sources.jar> to <https://builds.apache.org/job/Tuscany-2x/ws/.repository/org/apache/tuscany/sca/tuscany-web-javascript/2.5-SNAPSHOT/tuscany-web-javascript-2.5-SNAPSHOT-sources.jar>
[JENKINS] Archiving disabled
[INFO] ------------------------------------------------------------------------
[INFO] Building Apache Tuscany SCA Abdera Atom Feed Binding Extension
[INFO]    task-segment: [clean, install]
[INFO] ------------------------------------------------------------------------
[INFO] [clean:clean {execution: default-clean}]
[INFO] [enforcer:enforce {execution: enforce-plugin-versions}]
[INFO] [remote-resources:process {execution: default}]
[INFO] [resources:resources {execution: default-resources}]
[INFO] Using 'UTF-8' encoding to copy filtered resources.
[INFO] Copying 2 resources
[INFO] Copying 3 resources
[INFO] Copying 3 resources
[INFO] [compiler:compile {execution: default-compile}]
[INFO] Compiling 11 source files to <https://builds.apache.org/job/Tuscany-2x/ws/sca-2x/modules/binding-atom-runtime/target/classes>
[INFO] [resources:testResources {execution: default-testResources}]
[INFO] Using 'UTF-8' encoding to copy filtered resources.
[INFO] Copying 8 resources
[INFO] Copying 3 resources
[INFO] [compiler:testCompile {execution: default-testCompile}]
[INFO] Compiling 29 source files to <https://builds.apache.org/job/Tuscany-2x/ws/sca-2x/modules/binding-atom-runtime/target/test-classes>
[INFO] [surefire:test {execution: default-test}]
[INFO] Tests are skipped.
[INFO] [jar:jar {execution: default-jar}]
[INFO] Building jar: <https://builds.apache.org/job/Tuscany-2x/ws/sca-2x/modules/binding-atom-runtime/target/tuscany-binding-atom-runtime-2.5-SNAPSHOT.jar>
[INFO] [source:jar-no-fork {execution: attach-sources}]
[INFO] Building jar: <https://builds.apache.org/job/Tuscany-2x/ws/sca-2x/modules/binding-atom-runtime/target/tuscany-binding-atom-runtime-2.5-SNAPSHOT-sources.jar>
[INFO] [install:install {execution: default-install}]
[INFO] Installing <https://builds.apache.org/job/Tuscany-2x/ws/sca-2x/modules/binding-atom-runtime/target/tuscany-binding-atom-runtime-2.5-SNAPSHOT.jar> to <https://builds.apache.org/job/Tuscany-2x/ws/.repository/org/apache/tuscany/sca/tuscany-binding-atom-runtime/2.5-SNAPSHOT/tuscany-binding-atom-runtime-2.5-SNAPSHOT.jar>
[INFO] Installing <https://builds.apache.org/job/Tuscany-2x/ws/sca-2x/modules/binding-atom-runtime/target/tuscany-binding-atom-runtime-2.5-SNAPSHOT-sources.jar> to <https://builds.apache.org/job/Tuscany-2x/ws/.repository/org/apache/tuscany/sca/tuscany-binding-atom-runtime/2.5-SNAPSHOT/tuscany-binding-atom-runtime-2.5-SNAPSHOT-sources.jar>
[JENKINS] Archiving disabled
[INFO] ------------------------------------------------------------------------
[INFO] Building Apache Tuscany SCA Comet Binding Model
[INFO]    task-segment: [clean, install]
[INFO] ------------------------------------------------------------------------
[INFO] [clean:clean {execution: default-clean}]
[INFO] [enforcer:enforce {execution: enforce-plugin-versions}]
[INFO] [remote-resources:process {execution: default}]
[INFO] [resources:resources {execution: default-resources}]
[INFO] Using 'UTF-8' encoding to copy filtered resources.
[INFO] Copying 4 resources
[INFO] Copying 3 resources
[INFO] Copying 3 resources
[INFO] [compiler:compile {execution: default-compile}]
[INFO] Compiling 4 source files to <https://builds.apache.org/job/Tuscany-2x/ws/sca-2x/modules/binding-comet/target/classes>
[INFO] [resources:testResources {execution: default-testResources}]
[INFO] Using 'UTF-8' encoding to copy filtered resources.
[INFO] skip non existing resourceDirectory <https://builds.apache.org/job/Tuscany-2x/ws/sca-2x/modules/binding-comet/src/test/resources>
[INFO] Copying 3 resources
[INFO] [compiler:testCompile {execution: default-testCompile}]
[INFO] No sources to compile
[INFO] [surefire:test {execution: default-test}]
[INFO] Surefire report directory: <https://builds.apache.org/job/Tuscany-2x/ws/sca-2x/modules/binding-comet/target/surefire-reports>

-------------------------------------------------------
 T E S T S
-------------------------------------------------------
There are no tests to run.

Results :

Tests run: 0, Failures: 0, Errors: 0, Skipped: 0

[JENKINS] Recording test results
[INFO] [jar:jar {execution: default-jar}]
[INFO] Building jar: <https://builds.apache.org/job/Tuscany-2x/ws/sca-2x/modules/binding-comet/target/tuscany-binding-comet-2.5-SNAPSHOT.jar>
[INFO] [source:jar-no-fork {execution: attach-sources}]
[INFO] Building jar: <https://builds.apache.org/job/Tuscany-2x/ws/sca-2x/modules/binding-comet/target/tuscany-binding-comet-2.5-SNAPSHOT-sources.jar>
[INFO] [install:install {execution: default-install}]
[INFO] Installing <https://builds.apache.org/job/Tuscany-2x/ws/sca-2x/modules/binding-comet/target/tuscany-binding-comet-2.5-SNAPSHOT.jar> to <https://builds.apache.org/job/Tuscany-2x/ws/.repository/org/apache/tuscany/sca/tuscany-binding-comet/2.5-SNAPSHOT/tuscany-binding-comet-2.5-SNAPSHOT.jar>
[INFO] Installing <https://builds.apache.org/job/Tuscany-2x/ws/sca-2x/modules/binding-comet/target/tuscany-binding-comet-2.5-SNAPSHOT-sources.jar> to <https://builds.apache.org/job/Tuscany-2x/ws/.repository/org/apache/tuscany/sca/tuscany-binding-comet/2.5-SNAPSHOT/tuscany-binding-comet-2.5-SNAPSHOT-sources.jar>
[JENKINS] Archiving disabled
[INFO] ------------------------------------------------------------------------
[INFO] Building Apache Tuscany SCA EJB Binding Runtime
[INFO]    task-segment: [clean, install]
[INFO] ------------------------------------------------------------------------
[INFO] [clean:clean {execution: default-clean}]
[WARNING] POM for 'log4j:log4j:pom:1.2.12:test' is invalid.

Its dependencies (if any) will NOT be available to the current build.
[WARNING] POM for 'commons-cli:commons-cli:pom:1.1:test' is invalid.

Its dependencies (if any) will NOT be available to the current build.
[WARNING] POM for 'backport-util-concurrent:backport-util-concurrent:pom:2.1:test' is invalid.

Its dependencies (if any) will NOT be available to the current build.
[WARNING] POM for 'commons-logging:commons-logging:pom:1.1:test' is invalid.

Its dependencies (if any) will NOT be available to the current build.
[WARNING] POM for 'org.apache.geronimo.specs:geronimo-jms_1.1_spec:pom:1.0:test' is invalid.

Its dependencies (if any) will NOT be available to the current build.
[WARNING] POM for 'org.apache.geronimo.specs:geronimo-j2ee-management_1.0_spec:pom:1.0:test' is invalid.

Its dependencies (if any) will NOT be available to the current build.
[WARNING] POM for 'activemq:jmdns:pom:1.0-RC2:test' is invalid.

Its dependencies (if any) will NOT be available to the current build.
[WARNING] POM for 'org.codehaus.swizzle:swizzle-stream:pom:1.0.1:test' is invalid.

Its dependencies (if any) will NOT be available to the current build.
[INFO] [enforcer:enforce {execution: enforce-plugin-versions}]
[INFO] [remote-resources:process {execution: default}]
[WARNING] POM for 'log4j:log4j:pom:1.2.12:test' is invalid.

Its dependencies (if any) will NOT be available to the current build.
[WARNING] POM for 'commons-cli:commons-cli:pom:1.1:test' is invalid.

Its dependencies (if any) will NOT be available to the current build.
[WARNING] POM for 'backport-util-concurrent:backport-util-concurrent:pom:2.1:test' is invalid.

Its dependencies (if any) will NOT be available to the current build.
[WARNING] POM for 'commons-logging:commons-logging:pom:1.1:test' is invalid.

Its dependencies (if any) will NOT be available to the current build.
[WARNING] POM for 'org.apache.geronimo.specs:geronimo-jms_1.1_spec:pom:1.0:test' is invalid.

Its dependencies (if any) will NOT be available to the current build.
[WARNING] POM for 'org.apache.geronimo.specs:geronimo-j2ee-management_1.0_spec:pom:1.0:test' is invalid.

Its dependencies (if any) will NOT be available to the current build.
[WARNING] POM for 'activemq:jmdns:pom:1.0-RC2:test' is invalid.

Its dependencies (if any) will NOT be available to the current build.
[WARNING] POM for 'org.codehaus.swizzle:swizzle-stream:pom:1.0.1:test' is invalid.

Its dependencies (if any) will NOT be available to the current build.
[INFO] [resources:resources {execution: default-resources}]
[INFO] Using 'UTF-8' encoding to copy filtered resources.
[INFO] Copying 2 resources
[INFO] Copying 3 resources
[INFO] Copying 3 resources
[INFO] [compiler:compile {execution: default-compile}]
[INFO] Compiling 17 source files to <https://builds.apache.org/job/Tuscany-2x/ws/sca-2x/modules/binding-ejb-runtime/target/classes>
[INFO] [resources:testResources {execution: default-testResources}]
[INFO] Using 'UTF-8' encoding to copy filtered resources.
[INFO] Copying 1 resource
[INFO] Copying 3 resources
[INFO] [compiler:testCompile {execution: default-testCompile}]
[INFO] Compiling 10 source files to <https://builds.apache.org/job/Tuscany-2x/ws/sca-2x/modules/binding-ejb-runtime/target/test-classes>
[INFO] -------------------------------------------------------------
[ERROR] COMPILATION ERROR : 
[INFO] -------------------------------------------------------------
[ERROR] error: error reading <https://builds.apache.org/job/Tuscany-2x/ws/.repository/log4j/log4j/1.2.12/log4j-1.2.12.jar;> error in opening zip file
[ERROR] error: error reading <https://builds.apache.org/job/Tuscany-2x/ws/.repository/commons-cli/commons-cli/1.1/commons-cli-1.1.jar;> error in opening zip file
[ERROR] error: error reading <https://builds.apache.org/job/Tuscany-2x/ws/.repository/backport-util-concurrent/backport-util-concurrent/2.1/backport-util-concurrent-2.1.jar;> error in opening zip file
[ERROR] error: error reading <https://builds.apache.org/job/Tuscany-2x/ws/.repository/activemq/jmdns/1.0-RC2/jmdns-1.0-RC2.jar;> error in opening zip file
[ERROR] error: error reading <https://builds.apache.org/job/Tuscany-2x/ws/.repository/org/codehaus/swizzle/swizzle-stream/1.0.1/swizzle-stream-1.0.1.jar;> error in opening zip file
[INFO] 5 errors 
[INFO] -------------------------------------------------------------
[JENKINS] Archiving disabled
[INFO] ------------------------------------------------------------------------
[ERROR] BUILD FAILURE
[INFO] ------------------------------------------------------------------------
[INFO] Compilation failure

error: error reading <https://builds.apache.org/job/Tuscany-2x/ws/.repository/log4j/log4j/1.2.12/log4j-1.2.12.jar;> error in opening zip file
error: error reading <https://builds.apache.org/job/Tuscany-2x/ws/.repository/commons-cli/commons-cli/1.1/commons-cli-1.1.jar;> error in opening zip file
error: error reading <https://builds.apache.org/job/Tuscany-2x/ws/.repository/backport-util-concurrent/backport-util-concurrent/2.1/backport-util-concurrent-2.1.jar;> error in opening zip file
error: error reading <https://builds.apache.org/job/Tuscany-2x/ws/.repository/activemq/jmdns/1.0-RC2/jmdns-1.0-RC2.jar;> error in opening zip file
error: error reading <https://builds.apache.org/job/Tuscany-2x/ws/.repository/org/codehaus/swizzle/swizzle-stream/1.0.1/swizzle-stream-1.0.1.jar;> error in opening zip file

[INFO] ------------------------------------------------------------------------
[INFO] For more information, run Maven with the -e switch
[INFO] ------------------------------------------------------------------------
[INFO] Total time: 12 minutes 
[INFO] Finished at: Fri Feb 08 05:26:24 UTC 2013
[INFO] Final Memory: 244M/722M
[INFO] ------------------------------------------------------------------------
Sending e-mails to: notification@tuscany.apache.org
channel stopped

Build failed in Jenkins: Tuscany-2x #929

Posted by Apache Jenkins Server <je...@builds.apache.org>.
See <https://builds.apache.org/job/Tuscany-2x/929/>

------------------------------------------
[...truncated 23573 lines...]
[WARNING]     @parameter property="property"
[WARNING]   instead.
[INFO] Mojo extractor for language: java found 2 mojo descriptors.
[INFO] Applying mojo extractor for language: bsh
[INFO] Mojo extractor for language: bsh found 0 mojo descriptors.
[INFO] [remote-resources:process {execution: default}]
[INFO] [resources:resources {execution: default-resources}]
[INFO] Using 'UTF-8' encoding to copy filtered resources.
[INFO] skip non existing resourceDirectory <https://builds.apache.org/job/Tuscany-2x/ws/sca-2x/maven/tuscany-diagram-plugin/src/main/resources>
[INFO] Copying 3 resources
[INFO] Copying 3 resources
[INFO] [compiler:compile {execution: default-compile}]
[INFO] Compiling 2 source files to <https://builds.apache.org/job/Tuscany-2x/ws/sca-2x/maven/tuscany-diagram-plugin/target/classes>
[INFO] [resources:testResources {execution: default-testResources}]
[INFO] Using 'UTF-8' encoding to copy filtered resources.
[INFO] skip non existing resourceDirectory <https://builds.apache.org/job/Tuscany-2x/ws/sca-2x/maven/tuscany-diagram-plugin/src/test/resources>
[INFO] Copying 3 resources
[INFO] [compiler:testCompile {execution: default-testCompile}]
[INFO] No sources to compile
[INFO] [surefire:test {execution: default-test}]
[INFO] Surefire report directory: <https://builds.apache.org/job/Tuscany-2x/ws/sca-2x/maven/tuscany-diagram-plugin/target/surefire-reports>

-------------------------------------------------------
 T E S T S
-------------------------------------------------------
There are no tests to run.

Results :

Tests run: 0, Failures: 0, Errors: 0, Skipped: 0

[JENKINS] Recording test results
[INFO] [jar:jar {execution: default-jar}]
[INFO] Building jar: <https://builds.apache.org/job/Tuscany-2x/ws/sca-2x/maven/tuscany-diagram-plugin/target/tuscany-diagram-plugin-2.5-SNAPSHOT.jar>
[INFO] [plugin:addPluginArtifactMetadata {execution: default-addPluginArtifactMetadata}]
[INFO] [install:install {execution: default-install}]
[INFO] Installing <https://builds.apache.org/job/Tuscany-2x/ws/sca-2x/maven/tuscany-diagram-plugin/target/tuscany-diagram-plugin-2.5-SNAPSHOT.jar> to <https://builds.apache.org/job/Tuscany-2x/ws/.repository/org/apache/tuscany/sca/tuscany-diagram-plugin/2.5-SNAPSHOT/tuscany-diagram-plugin-2.5-SNAPSHOT.jar>
[JENKINS] Archiving disabled
[INFO] ------------------------------------------------------------------------
[INFO] Building Apache Tuscany SCA Web JavaScript
[INFO]    task-segment: [clean, install]
[INFO] ------------------------------------------------------------------------
[INFO] [clean:clean {execution: default-clean}]
[INFO] [enforcer:enforce {execution: enforce-plugin-versions}]
[INFO] [remote-resources:process {execution: default}]
[INFO] [resources:resources {execution: default-resources}]
[INFO] Using 'UTF-8' encoding to copy filtered resources.
[INFO] Copying 3 resources
[INFO] Copying 3 resources
[INFO] Copying 3 resources
[INFO] [compiler:compile {execution: default-compile}]
[INFO] Compiling 6 source files to <https://builds.apache.org/job/Tuscany-2x/ws/sca-2x/modules/web-javascript/target/classes>
[INFO] [resources:testResources {execution: default-testResources}]
[INFO] Using 'UTF-8' encoding to copy filtered resources.
[INFO] skip non existing resourceDirectory <https://builds.apache.org/job/Tuscany-2x/ws/sca-2x/modules/web-javascript/src/test/resources>
[INFO] Copying 3 resources
[INFO] [compiler:testCompile {execution: default-testCompile}]
[INFO] No sources to compile
[INFO] [surefire:test {execution: default-test}]
[INFO] Surefire report directory: <https://builds.apache.org/job/Tuscany-2x/ws/sca-2x/modules/web-javascript/target/surefire-reports>

-------------------------------------------------------
 T E S T S
-------------------------------------------------------
There are no tests to run.

Results :

Tests run: 0, Failures: 0, Errors: 0, Skipped: 0

[JENKINS] Recording test results
[INFO] [jar:jar {execution: default-jar}]
[INFO] Building jar: <https://builds.apache.org/job/Tuscany-2x/ws/sca-2x/modules/web-javascript/target/tuscany-web-javascript-2.5-SNAPSHOT.jar>
[INFO] [source:jar-no-fork {execution: attach-sources}]
[INFO] Building jar: <https://builds.apache.org/job/Tuscany-2x/ws/sca-2x/modules/web-javascript/target/tuscany-web-javascript-2.5-SNAPSHOT-sources.jar>
[INFO] [install:install {execution: default-install}]
[INFO] Installing <https://builds.apache.org/job/Tuscany-2x/ws/sca-2x/modules/web-javascript/target/tuscany-web-javascript-2.5-SNAPSHOT.jar> to <https://builds.apache.org/job/Tuscany-2x/ws/.repository/org/apache/tuscany/sca/tuscany-web-javascript/2.5-SNAPSHOT/tuscany-web-javascript-2.5-SNAPSHOT.jar>
[INFO] Installing <https://builds.apache.org/job/Tuscany-2x/ws/sca-2x/modules/web-javascript/target/tuscany-web-javascript-2.5-SNAPSHOT-sources.jar> to <https://builds.apache.org/job/Tuscany-2x/ws/.repository/org/apache/tuscany/sca/tuscany-web-javascript/2.5-SNAPSHOT/tuscany-web-javascript-2.5-SNAPSHOT-sources.jar>
[JENKINS] Archiving disabled
[INFO] ------------------------------------------------------------------------
[INFO] Building Apache Tuscany SCA Abdera Atom Feed Binding Extension
[INFO]    task-segment: [clean, install]
[INFO] ------------------------------------------------------------------------
[INFO] [clean:clean {execution: default-clean}]
[INFO] [enforcer:enforce {execution: enforce-plugin-versions}]
[INFO] [remote-resources:process {execution: default}]
[INFO] [resources:resources {execution: default-resources}]
[INFO] Using 'UTF-8' encoding to copy filtered resources.
[INFO] Copying 2 resources
[INFO] Copying 3 resources
[INFO] Copying 3 resources
[INFO] [compiler:compile {execution: default-compile}]
[INFO] Compiling 11 source files to <https://builds.apache.org/job/Tuscany-2x/ws/sca-2x/modules/binding-atom-runtime/target/classes>
[INFO] [resources:testResources {execution: default-testResources}]
[INFO] Using 'UTF-8' encoding to copy filtered resources.
[INFO] Copying 8 resources
[INFO] Copying 3 resources
[INFO] [compiler:testCompile {execution: default-testCompile}]
[INFO] Compiling 29 source files to <https://builds.apache.org/job/Tuscany-2x/ws/sca-2x/modules/binding-atom-runtime/target/test-classes>
[INFO] [surefire:test {execution: default-test}]
[INFO] Tests are skipped.
[INFO] [jar:jar {execution: default-jar}]
[INFO] Building jar: <https://builds.apache.org/job/Tuscany-2x/ws/sca-2x/modules/binding-atom-runtime/target/tuscany-binding-atom-runtime-2.5-SNAPSHOT.jar>
[INFO] [source:jar-no-fork {execution: attach-sources}]
[INFO] Building jar: <https://builds.apache.org/job/Tuscany-2x/ws/sca-2x/modules/binding-atom-runtime/target/tuscany-binding-atom-runtime-2.5-SNAPSHOT-sources.jar>
[INFO] [install:install {execution: default-install}]
[INFO] Installing <https://builds.apache.org/job/Tuscany-2x/ws/sca-2x/modules/binding-atom-runtime/target/tuscany-binding-atom-runtime-2.5-SNAPSHOT.jar> to <https://builds.apache.org/job/Tuscany-2x/ws/.repository/org/apache/tuscany/sca/tuscany-binding-atom-runtime/2.5-SNAPSHOT/tuscany-binding-atom-runtime-2.5-SNAPSHOT.jar>
[INFO] Installing <https://builds.apache.org/job/Tuscany-2x/ws/sca-2x/modules/binding-atom-runtime/target/tuscany-binding-atom-runtime-2.5-SNAPSHOT-sources.jar> to <https://builds.apache.org/job/Tuscany-2x/ws/.repository/org/apache/tuscany/sca/tuscany-binding-atom-runtime/2.5-SNAPSHOT/tuscany-binding-atom-runtime-2.5-SNAPSHOT-sources.jar>
[JENKINS] Archiving disabled
[INFO] ------------------------------------------------------------------------
[INFO] Building Apache Tuscany SCA Comet Binding Model
[INFO]    task-segment: [clean, install]
[INFO] ------------------------------------------------------------------------
[INFO] [clean:clean {execution: default-clean}]
[INFO] [enforcer:enforce {execution: enforce-plugin-versions}]
[INFO] [remote-resources:process {execution: default}]
[INFO] [resources:resources {execution: default-resources}]
[INFO] Using 'UTF-8' encoding to copy filtered resources.
[INFO] Copying 4 resources
[INFO] Copying 3 resources
[INFO] Copying 3 resources
[INFO] [compiler:compile {execution: default-compile}]
[INFO] Compiling 4 source files to <https://builds.apache.org/job/Tuscany-2x/ws/sca-2x/modules/binding-comet/target/classes>
[INFO] [resources:testResources {execution: default-testResources}]
[INFO] Using 'UTF-8' encoding to copy filtered resources.
[INFO] skip non existing resourceDirectory <https://builds.apache.org/job/Tuscany-2x/ws/sca-2x/modules/binding-comet/src/test/resources>
[INFO] Copying 3 resources
[INFO] [compiler:testCompile {execution: default-testCompile}]
[INFO] No sources to compile
[INFO] [surefire:test {execution: default-test}]
[INFO] Surefire report directory: <https://builds.apache.org/job/Tuscany-2x/ws/sca-2x/modules/binding-comet/target/surefire-reports>

-------------------------------------------------------
 T E S T S
-------------------------------------------------------
There are no tests to run.

Results :

Tests run: 0, Failures: 0, Errors: 0, Skipped: 0

[JENKINS] Recording test results
[INFO] [jar:jar {execution: default-jar}]
[INFO] Building jar: <https://builds.apache.org/job/Tuscany-2x/ws/sca-2x/modules/binding-comet/target/tuscany-binding-comet-2.5-SNAPSHOT.jar>
[INFO] [source:jar-no-fork {execution: attach-sources}]
[INFO] Building jar: <https://builds.apache.org/job/Tuscany-2x/ws/sca-2x/modules/binding-comet/target/tuscany-binding-comet-2.5-SNAPSHOT-sources.jar>
[INFO] [install:install {execution: default-install}]
[INFO] Installing <https://builds.apache.org/job/Tuscany-2x/ws/sca-2x/modules/binding-comet/target/tuscany-binding-comet-2.5-SNAPSHOT.jar> to <https://builds.apache.org/job/Tuscany-2x/ws/.repository/org/apache/tuscany/sca/tuscany-binding-comet/2.5-SNAPSHOT/tuscany-binding-comet-2.5-SNAPSHOT.jar>
[INFO] Installing <https://builds.apache.org/job/Tuscany-2x/ws/sca-2x/modules/binding-comet/target/tuscany-binding-comet-2.5-SNAPSHOT-sources.jar> to <https://builds.apache.org/job/Tuscany-2x/ws/.repository/org/apache/tuscany/sca/tuscany-binding-comet/2.5-SNAPSHOT/tuscany-binding-comet-2.5-SNAPSHOT-sources.jar>
[JENKINS] Archiving disabled
[INFO] ------------------------------------------------------------------------
[INFO] Building Apache Tuscany SCA EJB Binding Runtime
[INFO]    task-segment: [clean, install]
[INFO] ------------------------------------------------------------------------
[INFO] [clean:clean {execution: default-clean}]
[WARNING] POM for 'log4j:log4j:pom:1.2.12:test' is invalid.

Its dependencies (if any) will NOT be available to the current build.
[WARNING] POM for 'commons-cli:commons-cli:pom:1.1:test' is invalid.

Its dependencies (if any) will NOT be available to the current build.
[WARNING] POM for 'backport-util-concurrent:backport-util-concurrent:pom:2.1:test' is invalid.

Its dependencies (if any) will NOT be available to the current build.
[WARNING] POM for 'commons-logging:commons-logging:pom:1.1:test' is invalid.

Its dependencies (if any) will NOT be available to the current build.
[WARNING] POM for 'org.apache.geronimo.specs:geronimo-jms_1.1_spec:pom:1.0:test' is invalid.

Its dependencies (if any) will NOT be available to the current build.
[WARNING] POM for 'org.apache.geronimo.specs:geronimo-j2ee-management_1.0_spec:pom:1.0:test' is invalid.

Its dependencies (if any) will NOT be available to the current build.
[WARNING] POM for 'activemq:jmdns:pom:1.0-RC2:test' is invalid.

Its dependencies (if any) will NOT be available to the current build.
[WARNING] POM for 'org.codehaus.swizzle:swizzle-stream:pom:1.0.1:test' is invalid.

Its dependencies (if any) will NOT be available to the current build.
[INFO] [enforcer:enforce {execution: enforce-plugin-versions}]
[INFO] [remote-resources:process {execution: default}]
[WARNING] POM for 'log4j:log4j:pom:1.2.12:test' is invalid.

Its dependencies (if any) will NOT be available to the current build.
[WARNING] POM for 'commons-cli:commons-cli:pom:1.1:test' is invalid.

Its dependencies (if any) will NOT be available to the current build.
[WARNING] POM for 'backport-util-concurrent:backport-util-concurrent:pom:2.1:test' is invalid.

Its dependencies (if any) will NOT be available to the current build.
[WARNING] POM for 'commons-logging:commons-logging:pom:1.1:test' is invalid.

Its dependencies (if any) will NOT be available to the current build.
[WARNING] POM for 'org.apache.geronimo.specs:geronimo-jms_1.1_spec:pom:1.0:test' is invalid.

Its dependencies (if any) will NOT be available to the current build.
[WARNING] POM for 'org.apache.geronimo.specs:geronimo-j2ee-management_1.0_spec:pom:1.0:test' is invalid.

Its dependencies (if any) will NOT be available to the current build.
[WARNING] POM for 'activemq:jmdns:pom:1.0-RC2:test' is invalid.

Its dependencies (if any) will NOT be available to the current build.
[WARNING] POM for 'org.codehaus.swizzle:swizzle-stream:pom:1.0.1:test' is invalid.

Its dependencies (if any) will NOT be available to the current build.
[INFO] [resources:resources {execution: default-resources}]
[INFO] Using 'UTF-8' encoding to copy filtered resources.
[INFO] Copying 2 resources
[INFO] Copying 3 resources
[INFO] Copying 3 resources
[INFO] [compiler:compile {execution: default-compile}]
[INFO] Compiling 17 source files to <https://builds.apache.org/job/Tuscany-2x/ws/sca-2x/modules/binding-ejb-runtime/target/classes>
[INFO] [resources:testResources {execution: default-testResources}]
[INFO] Using 'UTF-8' encoding to copy filtered resources.
[INFO] Copying 1 resource
[INFO] Copying 3 resources
[INFO] [compiler:testCompile {execution: default-testCompile}]
[INFO] Compiling 10 source files to <https://builds.apache.org/job/Tuscany-2x/ws/sca-2x/modules/binding-ejb-runtime/target/test-classes>
[INFO] -------------------------------------------------------------
[ERROR] COMPILATION ERROR : 
[INFO] -------------------------------------------------------------
[ERROR] error: error reading <https://builds.apache.org/job/Tuscany-2x/ws/.repository/log4j/log4j/1.2.12/log4j-1.2.12.jar;> error in opening zip file
[ERROR] error: error reading <https://builds.apache.org/job/Tuscany-2x/ws/.repository/commons-cli/commons-cli/1.1/commons-cli-1.1.jar;> error in opening zip file
[ERROR] error: error reading <https://builds.apache.org/job/Tuscany-2x/ws/.repository/backport-util-concurrent/backport-util-concurrent/2.1/backport-util-concurrent-2.1.jar;> error in opening zip file
[ERROR] error: error reading <https://builds.apache.org/job/Tuscany-2x/ws/.repository/activemq/jmdns/1.0-RC2/jmdns-1.0-RC2.jar;> error in opening zip file
[ERROR] error: error reading <https://builds.apache.org/job/Tuscany-2x/ws/.repository/org/codehaus/swizzle/swizzle-stream/1.0.1/swizzle-stream-1.0.1.jar;> error in opening zip file
[INFO] 5 errors 
[INFO] -------------------------------------------------------------
[JENKINS] Archiving disabled
[INFO] ------------------------------------------------------------------------
[ERROR] BUILD FAILURE
[INFO] ------------------------------------------------------------------------
[INFO] Compilation failure

error: error reading <https://builds.apache.org/job/Tuscany-2x/ws/.repository/log4j/log4j/1.2.12/log4j-1.2.12.jar;> error in opening zip file
error: error reading <https://builds.apache.org/job/Tuscany-2x/ws/.repository/commons-cli/commons-cli/1.1/commons-cli-1.1.jar;> error in opening zip file
error: error reading <https://builds.apache.org/job/Tuscany-2x/ws/.repository/backport-util-concurrent/backport-util-concurrent/2.1/backport-util-concurrent-2.1.jar;> error in opening zip file
error: error reading <https://builds.apache.org/job/Tuscany-2x/ws/.repository/activemq/jmdns/1.0-RC2/jmdns-1.0-RC2.jar;> error in opening zip file
error: error reading <https://builds.apache.org/job/Tuscany-2x/ws/.repository/org/codehaus/swizzle/swizzle-stream/1.0.1/swizzle-stream-1.0.1.jar;> error in opening zip file

[INFO] ------------------------------------------------------------------------
[INFO] For more information, run Maven with the -e switch
[INFO] ------------------------------------------------------------------------
[INFO] Total time: 134 minutes 34 seconds
[INFO] Finished at: Thu Feb 07 06:37:06 UTC 2013
[INFO] Final Memory: 243M/728M
[INFO] ------------------------------------------------------------------------
Sending e-mails to: notification@tuscany.apache.org
channel stopped