You are viewing a plain text version of this content. The canonical link for it is here.
Posted to dev@logging.apache.org by Apache Jenkins Server <je...@builds.apache.org> on 2018/12/07 01:27:33 UTC

Build failed in Jenkins: logging-log4net » PR-40 #1

See <https://builds.apache.org/job/logging-log4net/job/PR-40/1/display/redirect>

------------------------------------------
[...truncated 547 B...]
[Pipeline] node
Running on windows-2012-1 in f:\jenkins\jenkins-slave\workspace\logging-log4net_PR-40-U7PGWKSLRWDTCWA2IXLVSQG67XJ3FYULYCVEYDNZ7INNXQKWXRIA
[Pipeline] {
[Pipeline] stage
[Pipeline] { (Declarative: Checkout SCM)
[Pipeline] checkout
Cloning the remote Git repository
Cloning with configured refspecs honoured and without tags
Cloning repository https://github.com/apache/logging-log4net.git
 > git init f:\jenkins\jenkins-slave\workspace\logging-log4net_PR-40-U7PGWKSLRWDTCWA2IXLVSQG67XJ3FYULYCVEYDNZ7INNXQKWXRIA # timeout=10
Fetching upstream changes from https://github.com/apache/logging-log4net.git
 > git --version # timeout=10
using GIT_ASKPASS to set credentials dpsenner at github
 > git fetch --no-tags --progress https://github.com/apache/logging-log4net.git +refs/pull/40/head:refs/remotes/origin/PR-40 +refs/heads/master:refs/remotes/origin/master
 > git config remote.origin.url https://github.com/apache/logging-log4net.git # timeout=10
 > git config --add remote.origin.fetch +refs/pull/40/head:refs/remotes/origin/PR-40 # timeout=10
 > git config --add remote.origin.fetch +refs/heads/master:refs/remotes/origin/master # timeout=10
 > git config remote.origin.url https://github.com/apache/logging-log4net.git # timeout=10
Fetching without tags
Fetching upstream changes from https://github.com/apache/logging-log4net.git
using GIT_ASKPASS to set credentials dpsenner at github
 > git fetch --no-tags --progress https://github.com/apache/logging-log4net.git +refs/pull/40/head:refs/remotes/origin/PR-40 +refs/heads/master:refs/remotes/origin/master
Merging remotes/origin/master commit c04a774240fd4500ed3206124aba5b4bc8bc4933 into PR head commit fb85f8e3c308c0838806b63497726bd991f99931
 > git config core.sparsecheckout # timeout=10
 > git checkout -f fb85f8e3c308c0838806b63497726bd991f99931
 > git merge c04a774240fd4500ed3206124aba5b4bc8bc4933 # timeout=10
 > git rev-parse "HEAD^{commit}" # timeout=10
Merge succeeded, producing fb85f8e3c308c0838806b63497726bd991f99931
Checking out Revision fb85f8e3c308c0838806b63497726bd991f99931 (PR-40)
 > git config core.sparsecheckout # timeout=10
 > git checkout -f fb85f8e3c308c0838806b63497726bd991f99931
Commit message: "This fixes the Mutex name in the RollingFileAppender and the FileAppender to use the ApplicationUniqueId since the base file path isn't enough in hosted web applications"
First time build. Skipping changelog.
[Pipeline] }
[Pipeline] // stage
[Pipeline] withEnv
[Pipeline] {
[Pipeline] withEnv
[Pipeline] {
[Pipeline] timeout
Timeout set to expire in 1 hr 0 min
[Pipeline] {
[Pipeline] stage
[Pipeline] { (Declarative: Tool Install)
[Pipeline] tool
[Pipeline] envVarsForTool
[Pipeline] tool
[Pipeline] envVarsForTool
[Pipeline] }
[Pipeline] // stage
[Pipeline] withEnv
[Pipeline] {
[Pipeline] stage
[Pipeline] { (Checkout)
[Pipeline] tool
[Pipeline] envVarsForTool
[Pipeline] tool
[Pipeline] envVarsForTool
[Pipeline] withEnv
[Pipeline] {
[Pipeline] checkout
 > git rev-parse --is-inside-work-tree # timeout=10
Fetching changes from the remote Git repository
 > git config remote.origin.url https://github.com/apache/logging-log4net.git # timeout=10
Fetching without tags
Fetching upstream changes from https://github.com/apache/logging-log4net.git
 > git --version # timeout=10
using GIT_ASKPASS to set credentials dpsenner at github
 > git fetch --no-tags --progress https://github.com/apache/logging-log4net.git +refs/pull/40/head:refs/remotes/origin/PR-40 +refs/heads/master:refs/remotes/origin/master
Merging remotes/origin/master commit c04a774240fd4500ed3206124aba5b4bc8bc4933 into PR head commit fb85f8e3c308c0838806b63497726bd991f99931
 > git config core.sparsecheckout # timeout=10
 > git checkout -f fb85f8e3c308c0838806b63497726bd991f99931
 > git merge c04a774240fd4500ed3206124aba5b4bc8bc4933 # timeout=10
 > git rev-parse "HEAD^{commit}" # timeout=10
Merge succeeded, producing fb85f8e3c308c0838806b63497726bd991f99931
Checking out Revision fb85f8e3c308c0838806b63497726bd991f99931 (PR-40)
 > git config core.sparsecheckout # timeout=10
 > git checkout -f fb85f8e3c308c0838806b63497726bd991f99931
Commit message: "This fixes the Mutex name in the RollingFileAppender and the FileAppender to use the ApplicationUniqueId since the base file path isn't enough in hosted web applications"
[Pipeline] }
[Pipeline] // withEnv
[Pipeline] }
[Pipeline] // stage
[Pipeline] stage
[Pipeline] { (Build)
[Pipeline] tool
[Pipeline] envVarsForTool
[Pipeline] tool
[Pipeline] envVarsForTool
[Pipeline] withEnv
[Pipeline] {
[Pipeline] bat
[logging-log4net_PR-40-U7PGWKSLRWDTCWA2IXLVSQG67XJ3FYULYCVEYDNZ7INNXQKWXRIA] Running batch script

f:\jenkins\jenkins-slave\workspace\logging-log4net_PR-40-U7PGWKSLRWDTCWA2IXLVSQG67XJ3FYULYCVEYDNZ7INNXQKWXRIA>F:\jenkins\tools\nant\nant-0.92\bin\NAnt.exe -buildfile:log4net.build 
NAnt 0.92 (Build 0.92.4543.0; release; 6/9/2012)
Copyright (C) 2001-2012 Gerry Shaw
http://nant.sourceforge.net

Buildfile: file:///f:/jenkins/jenkins-slave/workspace/logging-log4net_PR-40-U7PGWKSLRWDTCWA2IXLVSQG67XJ3FYULYCVEYDNZ7INNXQKWXRIA/log4net.build
Target framework: Microsoft .NET Framework 4.0
Target(s) specified: compile-all 


check-current-build-config:


set-build-configuration:


set-debug-build-configuration:


check-current-build-config:


set-build-configuration-flags:


check-current-build-config:


set-framework-configuration:


check-bin-dir:

    [mkdir] Creating directory 'f:\jenkins\jenkins-slave\workspace\logging-log4net_PR-40-U7PGWKSLRWDTCWA2IXLVSQG67XJ3FYULYCVEYDNZ7INNXQKWXRIA\bin'.

check-doc-dir:

    [mkdir] Creating directory 'f:\jenkins\jenkins-slave\workspace\logging-log4net_PR-40-U7PGWKSLRWDTCWA2IXLVSQG67XJ3FYULYCVEYDNZ7INNXQKWXRIA\doc'.

check-sdkdoc-dir:


check-sdkdoc-debug:


check-current-build-config:


check-build-debug:


check-build-defines:


set-net-4.0-runtime-configuration:


generate-assembly-description:

    [sleep] Sleeping for 500 milliseconds.
   [delete] Deleting file f:\jenkins\jenkins-slave\workspace\logging-log4net_PR-40-U7PGWKSLRWDTCWA2IXLVSQG67XJ3FYULYCVEYDNZ7INNXQKWXRIA\_gitrevision.
   [delete] Deleting file f:\jenkins\jenkins-slave\workspace\logging-log4net_PR-40-U7PGWKSLRWDTCWA2IXLVSQG67XJ3FYULYCVEYDNZ7INNXQKWXRIA\_giturl.
  [asminfo] Generated file 'f:\jenkins\jenkins-slave\workspace\logging-log4net_PR-40-U7PGWKSLRWDTCWA2IXLVSQG67XJ3FYULYCVEYDNZ7INNXQKWXRIA\src\GeneratedAssemblyInfo.cs'.

compile-all:

     [echo] Compiling all build configurations for all runtime configurations.

set-debug-build-configuration:


check-current-build-config:


set-build-configuration-flags:


compile-build:

     [echo] Compiling all framework versions for the debug build configuration.
     [echo] The .NET Framework 1.0 is not available. Build skipped.
     [echo] The .NET Framework 1.1 is not available. Build skipped.

check-bin-dir:


check-doc-dir:


check-sdkdoc-dir:


check-sdkdoc-debug:


check-current-build-config:


check-build-debug:


check-build-defines:


set-net-2.0-runtime-configuration:

 [property] Target framework changed to "Microsoft .NET Framework 2.0".

check-log4net-basedir:


check-current-bin-dir:

    [mkdir] Creating directory 'f:\jenkins\jenkins-slave\workspace\logging-log4net_PR-40-U7PGWKSLRWDTCWA2IXLVSQG67XJ3FYULYCVEYDNZ7INNXQKWXRIA\bin\net\2.0\debug'.

clean-current-bin-dir:

     [echo] Cleaning the bin/net/2.0/debug binaries directory.
   [delete] Deleting directory 'f:\jenkins\jenkins-slave\workspace\logging-log4net_PR-40-U7PGWKSLRWDTCWA2IXLVSQG67XJ3FYULYCVEYDNZ7INNXQKWXRIA\bin\net\2.0\debug'.
    [mkdir] Creating directory 'f:\jenkins\jenkins-slave\workspace\logging-log4net_PR-40-U7PGWKSLRWDTCWA2IXLVSQG67XJ3FYULYCVEYDNZ7INNXQKWXRIA\bin\net\2.0\debug'.

compile-net-2.0:

      [csc] Compiling 227 files to 'f:\jenkins\jenkins-slave\workspace\logging-log4net_PR-40-U7PGWKSLRWDTCWA2IXLVSQG67XJ3FYULYCVEYDNZ7INNXQKWXRIA\bin\net\2.0\debug\log4net.dll'.
      [csc] f:\jenkins\jenkins-slave\workspace\logging-log4net_PR-40-U7PGWKSLRWDTCWA2IXLVSQG67XJ3FYULYCVEYDNZ7INNXQKWXRIA\src\Util\SystemInfo.cs(32,14): error CS0234: The type or namespace name 'Linq' does not exist in the namespace 'System' (are you missing an assembly reference?)

BUILD FAILED

f:\jenkins\jenkins-slave\workspace\logging-log4net_PR-40-U7PGWKSLRWDTCWA2IXLVSQG67XJ3FYULYCVEYDNZ7INNXQKWXRIA\log4net.build(681,6):
External Program Failed: C:\Windows\Microsoft.NET\Framework64\v2.0.50727\csc.exe (return code was 1)

Total time: 2.4 seconds.

[Pipeline] }
[Pipeline] // withEnv
[Pipeline] }
[Pipeline] // stage
[Pipeline] stage
[Pipeline] { (Test on Windows)
Stage "Test on Windows" skipped due to earlier failure(s)
[Pipeline] }
[Pipeline] // stage
[Pipeline] stage
[Pipeline] { (Build-Site)
Stage "Build-Site" skipped due to earlier failure(s)
[Pipeline] }
[Pipeline] // stage
[Pipeline] stage
[Pipeline] { (Deploy-Site)
Stage "Deploy-Site" skipped due to earlier failure(s)
[Pipeline] }
[Pipeline] // stage
[Pipeline] stage
[Pipeline] { (Declarative: Post Actions)
[Pipeline] step

Build failed in Jenkins: logging-log4net » PR-40 #4

Posted by Apache Jenkins Server <je...@builds.apache.org>.
See <https://builds.apache.org/job/logging-log4net/job/PR-40/4/display/redirect>

Changes:


------------------------------------------
[...truncated 1551 lines...]
Setting up libmono-system-net-http-formatting4.0-cil (3.2.8+dfsg-10+deb8u1) ...
Setting up libmono-system-reactive-windows-forms2.2-cil (3.2.8+dfsg-10+deb8u1) ...
Setting up libmono-system-runtime-caching4.0-cil (3.2.8+dfsg-10+deb8u1) ...
Setting up libmono-system-serviceprocess4.0-cil (3.2.8+dfsg-10+deb8u1) ...
Setting up libmono-system-web-http4.0-cil (3.2.8+dfsg-10+deb8u1) ...
Setting up libmono-system-windows-forms-datavisualization4.0a-cil (3.2.8+dfsg-10+deb8u1) ...
Setting up libmono-webmatrix-data4.0-cil (3.2.8+dfsg-10+deb8u1) ...
Setting up libmono-winforms2.0-cil (3.2.8+dfsg-10+deb8u1) ...
Setting up libmono-system-web4.0-cil (3.2.8+dfsg-10+deb8u1) ...
Setting up liblog4net1.2-cil (1.2.10+dfsg-6) ...
* Installing 1 assembly from liblog4net1.2-cil into Mono
Setting up libmono-http4.0-cil (3.2.8+dfsg-10+deb8u1) ...
Setting up libmono-microsoft-web-infrastructure1.0-cil (3.2.8+dfsg-10+deb8u1) ...
Setting up libmono-system-design4.0-cil (3.2.8+dfsg-10+deb8u1) ...
Setting up libmono-system-runtime4.0-cil (3.2.8+dfsg-10+deb8u1) ...
Setting up libmono-system-web-abstractions4.0-cil (3.2.8+dfsg-10+deb8u1) ...
Setting up libmono-system-web-extensions-design4.0-cil (3.2.8+dfsg-10+deb8u1) ...
Setting up libmono-system-web-http-webhost4.0-cil (3.2.8+dfsg-10+deb8u1) ...
Setting up libmono-system-web-webpages-deployment2.0-cil (3.2.8+dfsg-10+deb8u1) ...
Setting up libmono-system-web-webpages2.0-cil (3.2.8+dfsg-10+deb8u1) ...
Setting up libmono-system-web-webpages-razor2.0-cil (3.2.8+dfsg-10+deb8u1) ...
Setting up libmono-system-web-routing4.0-cil (3.2.8+dfsg-10+deb8u1) ...
Setting up libnunit-util2.6.3-cil (2.6.3+dfsg-1) ...
* Installing 1 assembly from libnunit-util2.6.3-cil into Mono
Setting up libnunit-console-runner2.6.3-cil (2.6.3+dfsg-1) ...
* Installing 1 assembly from libnunit-console-runner2.6.3-cil into Mono
Setting up libnunit-cil-dev (2.6.3+dfsg-1) ...
Setting up libmono-system-web-services4.0-cil (3.2.8+dfsg-10+deb8u1) ...
Setting up libmono-system-servicemodel4.0a-cil (3.2.8+dfsg-10+deb8u1) ...
Setting up libmono-system-web-extensions4.0-cil (3.2.8+dfsg-10+deb8u1) ...
Setting up libmono-system-servicemodel-web4.0-cil (3.2.8+dfsg-10+deb8u1) ...
Setting up libmono-system-data-services4.0-cil (3.2.8+dfsg-10+deb8u1) ...
Setting up libmono-system-servicemodel-discovery4.0-cil (3.2.8+dfsg-10+deb8u1) ...
Setting up libmono-system-servicemodel-routing4.0-cil (3.2.8+dfsg-10+deb8u1) ...
Setting up libmono-system-web-dynamicdata4.0-cil (3.2.8+dfsg-10+deb8u1) ...
Setting up libmono-system-web-http-selfhost4.0-cil (3.2.8+dfsg-10+deb8u1) ...
Setting up libmono-system-web-mvc3.0-cil (3.2.8+dfsg-10+deb8u1) ...
Setting up libmono-system-xml-serialization4.0-cil (3.2.8+dfsg-10+deb8u1) ...
Setting up libmono-cil-dev (3.2.8+dfsg-10+deb8u1) ...
Setting up mono-devel (3.2.8+dfsg-10+deb8u1) ...
update-alternatives: using /usr/bin/mono-csc to provide /usr/bin/cli-csc (c-sharp-compiler) in auto mode
update-alternatives: using /usr/bin/resgen to provide /usr/bin/cli-resgen (resource-file-generator) in auto mode
update-alternatives: using /usr/bin/al to provide /usr/bin/cli-al (assembly-linker) in auto mode
update-alternatives: using /usr/bin/sn to provide /usr/bin/cli-sn (strong-name-tool) in auto mode
Setting up nant (0.92~rc1+dfsg-4) ...
Processing triggers for libc-bin (2.19-18+deb8u10) ...
Processing triggers for systemd (215-17+deb8u7) ...
Processing triggers for sgml-base (1.26+nmu4) ...
Removing intermediate container 89c0747c2dd3
 ---> a4525aa9e70e
Successfully built a4525aa9e70e
Successfully tagged builder-netstandard-1.3:latest
[Pipeline] sh
+ docker inspect -f . builder-netstandard-1.3:latest
.
[Pipeline] withDockerContainer
H24 does not seem to be running inside a container
$ docker run -t -d -u 910:910 -w /home/jenkins/jenkins-slave/workspace/logging-log4net_PR-40 -v /home/jenkins/jenkins-slave/workspace/logging-log4net_PR-40:/home/jenkins/jenkins-slave/workspace/logging-log4net_PR-40:rw,z -v /home/jenkins/jenkins-slave/workspace/logging-log4net_PR-40@tmp:/home/jenkins/jenkins-slave/workspace/logging-log4net_PR-40@tmp:rw,z -e ******** -e ******** -e ******** -e ******** -e ******** -e ******** -e ******** -e ******** -e ******** -e ******** -e ******** -e ******** -e ******** -e ******** -e ******** -e ******** -e ******** -e ******** -e ******** -e ******** -e ******** -e ******** -e ******** -e ******** -e ******** -e ******** -e ******** -e ******** -e ******** -e ******** -e ******** -e ******** -e ******** -e ******** -e ******** builder-netstandard-1.3:latest cat
$ docker top 8cf8437e1f4f1d119728bd380b2c5a49cb7cc1890230cfc6894209b4dd2d0428 -eo pid,comm
[Pipeline] {
[Pipeline] sh
+ nant compile-netstandard-1.3
NAnt 0.92 (Build 0.92.4526.0; rc1; 05/23/2012)
Copyright (C) 2001-2012 Gerry Shaw
http://nant.sourceforge.net

Buildfile: file:///home/jenkins/jenkins-slave/workspace/logging-log4net_PR-40/log4net.build
Target framework: Mono 4.0 Profile
Target(s) specified: compile-netstandard-1.3 


check-current-build-config:


set-build-configuration:


set-debug-build-configuration:


check-current-build-config:


set-build-configuration-flags:


compile-netstandard-1.3:


set-debug-build-configuration:


check-current-build-config:


set-build-configuration-flags:


compile-netstandard-1.3-current-configuration:

     [echo] dotnet --version
     [exec] 2.1.202
     [echo] dotnet restore log4net.netstandard.sln
     [exec] 
     [exec] Welcome to .NET Core!
     [exec] ---------------------
     [exec] Learn more about .NET Core @ https://aka.ms/dotnet-docs. Use dotnet --help to see available commands or go to https://aka.ms/dotnet-cli-docs.
     [exec] 
     [exec] Telemetry
     [exec] --------------
     [exec] The .NET Core tools collect usage data in order to improve your experience. The data is anonymous and does not include command-line arguments. The data is collected by Microsoft and shared with the community.
     [exec] You can opt out of telemetry by setting a DOTNET_CLI_TELEMETRY_OPTOUT environment variable to 1 using your favorite shell.
     [exec] You can read more about .NET Core tools telemetry @ https://aka.ms/dotnet-cli-telemetry.
     [exec]   Restoring packages for /home/jenkins/jenkins-slave/workspace/logging-log4net_PR-40/netstandard/1.3/log4net.tests/log4net.tests.csproj...
     [exec]   Restoring packages for /home/jenkins/jenkins-slave/workspace/logging-log4net_PR-40/netstandard/1.3/log4net/log4net.csproj...
     [exec]   Installing System.Security.Claims 4.0.1.
     [exec]   Installing System.Security.Principal.Windows 4.0.0.
     [exec]   Installing System.Net.WebHeaderCollection 4.0.1.
     [exec]   Installing System.Net.NameResolution 4.0.0.
     [exec]   Installing System.Net.Requests 4.0.11.
     [exec]   Installing System.Diagnostics.StackTrace 4.0.1.
     [exec]   Installing System.IO.FileSystem.Watcher 4.0.0.
     [exec]   Installing System.ComponentModel 4.0.1.
     [exec]   Installing System.ComponentModel.Primitives 4.1.0.
     [exec]   Installing System.Collections.Specialized 4.0.1.
     [exec]   Installing System.ComponentModel.TypeConverter 4.1.0.
     [exec]   Installing System.Diagnostics.TextWriterTraceListener 4.0.0.
     [exec]   Installing System.ComponentModel.EventBasedAsync 4.0.11.
     [exec]   Installing Microsoft.DotNet.PlatformAbstractions 1.0.3.
     [exec]   Installing Microsoft.TestPlatform.ObjectModel 15.5.0.
     [exec]   Installing Microsoft.Extensions.DependencyModel 1.0.3.
     [exec]   Installing Microsoft.Win32.Registry 4.3.0.
     [exec]   Installing Microsoft.TestPlatform.TestHost 15.5.0.
     [exec]   Installing Microsoft.CodeCoverage 1.0.3.
     [exec]   Installing System.Diagnostics.Process 4.3.0.
     [exec]   Installing System.Xml.XPath.XmlDocument 4.3.0.
     [exec]   Installing System.ComponentModel.EventBasedAsync 4.3.0.
     [exec]   Installing Microsoft.DotNet.InternalAbstractions 1.0.0.
     [exec]   Installing NUnit 3.10.1.
     [exec]   Installing NUnit3TestAdapter 3.10.0.
     [exec]   Installing Microsoft.NET.Test.Sdk 15.5.0.
     [exec]   Generating MSBuild file /home/jenkins/jenkins-slave/workspace/logging-log4net_PR-40/netstandard/1.3/log4net/obj/log4net.csproj.nuget.g.props.
     [exec]   Generating MSBuild file /home/jenkins/jenkins-slave/workspace/logging-log4net_PR-40/netstandard/1.3/log4net/obj/log4net.csproj.nuget.g.targets.
     [exec]   Restore completed in 1.4 sec for /home/jenkins/jenkins-slave/workspace/logging-log4net_PR-40/netstandard/1.3/log4net/log4net.csproj.
     [exec]   Generating MSBuild file /home/jenkins/jenkins-slave/workspace/logging-log4net_PR-40/netstandard/1.3/log4net.tests/obj/log4net.tests.csproj.nuget.g.props.
     [exec]   Generating MSBuild file /home/jenkins/jenkins-slave/workspace/logging-log4net_PR-40/netstandard/1.3/log4net.tests/obj/log4net.tests.csproj.nuget.g.targets.
     [exec]   Restore completed in 1.83 sec for /home/jenkins/jenkins-slave/workspace/logging-log4net_PR-40/netstandard/1.3/log4net.tests/log4net.tests.csproj.
     [echo] dotnet build log4net
     [exec] Microsoft (R) Build Engine version 15.7.179.6572 for .NET Core
     [exec] Copyright (C) Microsoft Corporation. All rights reserved.
     [exec] 
     [exec]   Restore completed in 69.14 ms for /home/jenkins/jenkins-slave/workspace/logging-log4net_PR-40/netstandard/1.3/log4net/log4net.csproj.
     [exec] /home/jenkins/jenkins-slave/workspace/logging-log4net_PR-40/src/Util/SystemInfo.cs(31,7): warning CS0105: The using directive for 'System.Globalization' appeared previously in this namespace [/home/jenkins/jenkins-slave/workspace/logging-log4net_PR-40/netstandard/1.3/log4net/log4net.csproj]
     [exec] /home/jenkins/jenkins-slave/workspace/logging-log4net_PR-40/src/Util/SystemInfo.cs(34,14): error CS0234: The type or namespace name 'Web' does not exist in the namespace 'System' (are you missing an assembly reference?) [/home/jenkins/jenkins-slave/workspace/logging-log4net_PR-40/netstandard/1.3/log4net/log4net.csproj]
     [exec] /home/jenkins/jenkins-slave/workspace/logging-log4net_PR-40/src/Util/SystemInfo.cs(35,14): error CS0234: The type or namespace name 'Web' does not exist in the namespace 'System' (are you missing an assembly reference?) [/home/jenkins/jenkins-slave/workspace/logging-log4net_PR-40/netstandard/1.3/log4net/log4net.csproj]
     [exec] 
     [exec] Build FAILED.
     [exec] 
     [exec] /home/jenkins/jenkins-slave/workspace/logging-log4net_PR-40/src/Util/SystemInfo.cs(31,7): warning CS0105: The using directive for 'System.Globalization' appeared previously in this namespace [/home/jenkins/jenkins-slave/workspace/logging-log4net_PR-40/netstandard/1.3/log4net/log4net.csproj]
     [exec] /home/jenkins/jenkins-slave/workspace/logging-log4net_PR-40/src/Util/SystemInfo.cs(34,14): error CS0234: The type or namespace name 'Web' does not exist in the namespace 'System' (are you missing an assembly reference?) [/home/jenkins/jenkins-slave/workspace/logging-log4net_PR-40/netstandard/1.3/log4net/log4net.csproj]
     [exec] /home/jenkins/jenkins-slave/workspace/logging-log4net_PR-40/src/Util/SystemInfo.cs(35,14): error CS0234: The type or namespace name 'Web' does not exist in the namespace 'System' (are you missing an assembly reference?) [/home/jenkins/jenkins-slave/workspace/logging-log4net_PR-40/netstandard/1.3/log4net/log4net.csproj]
     [exec]     1 Warning(s)
     [exec]     2 Error(s)
     [exec] 
     [exec] Time Elapsed 00:00:03.72

BUILD FAILED

/home/jenkins/jenkins-slave/workspace/logging-log4net_PR-40/log4net.build(1778,5):
External Program Failed: dotnet (return code was 1)

Total time: 10.4 seconds.

[Pipeline] }
$ docker stop --time=1 8cf8437e1f4f1d119728bd380b2c5a49cb7cc1890230cfc6894209b4dd2d0428
$ docker rm -f 8cf8437e1f4f1d119728bd380b2c5a49cb7cc1890230cfc6894209b4dd2d0428
[Pipeline] // withDockerContainer
[Pipeline] }
[Pipeline] // script
[Pipeline] }
[Pipeline] // stage
[Pipeline] stage
[Pipeline] { (build net-2.0)
Stage "build net-2.0" skipped due to earlier failure(s)
[Pipeline] }
[Pipeline] // stage
[Pipeline] stage
[Pipeline] { (build net-3.5)
Stage "build net-3.5" skipped due to earlier failure(s)
[Pipeline] }
[Pipeline] // stage
[Pipeline] stage
[Pipeline] { (build net-3.5-cp)
Stage "build net-3.5-cp" skipped due to earlier failure(s)
[Pipeline] }
[Pipeline] // stage
[Pipeline] stage
[Pipeline] { (build net-4.0)
Stage "build net-4.0" skipped due to earlier failure(s)
[Pipeline] }
[Pipeline] // stage
[Pipeline] stage
[Pipeline] { (build net-4.0-cp)
Stage "build net-4.0-cp" skipped due to earlier failure(s)
[Pipeline] }
[Pipeline] // stage
[Pipeline] stage
[Pipeline] { (build net-4.5)
Stage "build net-4.5" skipped due to earlier failure(s)
[Pipeline] }
[Pipeline] // stage
[Pipeline] stage
[Pipeline] { (build mono-2.0)
Stage "build mono-2.0" skipped due to earlier failure(s)
[Pipeline] }
[Pipeline] // stage
[Pipeline] stage
[Pipeline] { (build mono-3.5)
Stage "build mono-3.5" skipped due to earlier failure(s)
[Pipeline] }
[Pipeline] // stage
[Pipeline] stage
[Pipeline] { (build mono-4.0)
Stage "build mono-4.0" skipped due to earlier failure(s)
[Pipeline] }
[Pipeline] // stage
[Pipeline] stage
[Pipeline] { (build site)
Stage "build site" skipped due to earlier failure(s)
[Pipeline] }
[Pipeline] // stage
[Pipeline] stage
[Pipeline] { (prepare package)
Stage "prepare package" skipped due to earlier failure(s)
[Pipeline] }
[Pipeline] // stage
[Pipeline] stage
[Pipeline] { (check test results)
Stage "check test results" skipped due to earlier failure(s)
[Pipeline] }
[Pipeline] // stage
[Pipeline] stage
[Pipeline] { (publish site)
Stage "publish site" skipped due to earlier failure(s)
[Pipeline] }
[Pipeline] // stage
[Pipeline] stage
[Pipeline] { (Declarative: Post Actions)
[Pipeline] step

Build failed in Jenkins: logging-log4net » PR-40 #3

Posted by Apache Jenkins Server <je...@builds.apache.org>.
See <https://builds.apache.org/job/logging-log4net/job/PR-40/3/display/redirect>

------------------------------------------
Branch indexing
Connecting to https://api.github.com using dpsenner/****** (dpsenner at github)
Loading trusted files from base branch develop at f238e175ca4f23410af7a226a1efc711e2d210b7 rather than 69090d66917b768f4a649b50fdd8d63c83973b05
Obtained Jenkinsfile from f238e175ca4f23410af7a226a1efc711e2d210b7
Running in Durability level: MAX_SURVIVABILITY
[Pipeline] Start of Pipeline
[Pipeline] node
Running on H23 in /home/jenkins/jenkins-slave/workspace/logging-log4net_PR-40
[Pipeline] {
[Pipeline] timeout
Timeout set to expire in 4 hr 0 min
[Pipeline] {
[Pipeline] stage
[Pipeline] { (checkout)
[Pipeline] deleteDir
[Pipeline] checkout
using credential github-logging-log4net-dpsenner
Cloning the remote Git repository
Cloning with configured refspecs honoured and without tags
Cloning repository https://github.com/apache/logging-log4net.git
 > git init /home/jenkins/jenkins-slave/workspace/logging-log4net_PR-40 # timeout=10
Fetching upstream changes from https://github.com/apache/logging-log4net.git
 > git --version # timeout=10
using GIT_ASKPASS to set credentials dpsenner at github
 > git fetch --no-tags --progress https://github.com/apache/logging-log4net.git +refs/pull/40/head:refs/remotes/origin/PR-40 +refs/heads/develop:refs/remotes/origin/develop
Fetching without tags
 > git config remote.origin.url https://github.com/apache/logging-log4net.git # timeout=10
 > git config --add remote.origin.fetch +refs/pull/40/head:refs/remotes/origin/PR-40 # timeout=10
 > git config --add remote.origin.fetch +refs/heads/develop:refs/remotes/origin/develop # timeout=10
 > git config remote.origin.url https://github.com/apache/logging-log4net.git # timeout=10
Fetching upstream changes from https://github.com/apache/logging-log4net.git
using GIT_ASKPASS to set credentials dpsenner at github
 > git fetch --no-tags --progress https://github.com/apache/logging-log4net.git +refs/pull/40/head:refs/remotes/origin/PR-40 +refs/heads/develop:refs/remotes/origin/develop
Merging remotes/origin/develop commit f238e175ca4f23410af7a226a1efc711e2d210b7 into PR head commit 69090d66917b768f4a649b50fdd8d63c83973b05
Merge succeeded, producing 69090d66917b768f4a649b50fdd8d63c83973b05
Checking out Revision 69090d66917b768f4a649b50fdd8d63c83973b05 (PR-40)
 > git config core.sparsecheckout # timeout=10
 > git checkout -f 69090d66917b768f4a649b50fdd8d63c83973b05
 > git merge f238e175ca4f23410af7a226a1efc711e2d210b7 # timeout=10
 > git rev-parse HEAD^{commit} # timeout=10
Commit message: "removes uneeded using"
 > git config core.sparsecheckout # timeout=10
 > git checkout -f 69090d66917b768f4a649b50fdd8d63c83973b05
 > git rev-list --no-walk 65571171975aeca507b7f4da9894afe57d32e433 # timeout=10
[Pipeline] }
[Pipeline] // stage
[Pipeline] stage
[Pipeline] { (build netstandard-1.3)
[Pipeline] script
[Pipeline] {
[Pipeline] checkout
using credential github-logging-log4net-dpsenner
Fetching changes from the remote Git repository
Fetching without tags
 > git rev-parse --is-inside-work-tree # timeout=10
 > git config remote.origin.url https://github.com/apache/logging-log4net.git # timeout=10
Fetching upstream changes from https://github.com/apache/logging-log4net.git
 > git --version # timeout=10
using GIT_ASKPASS to set credentials dpsenner at github
 > git fetch --no-tags --progress https://github.com/apache/logging-log4net.git +refs/pull/40/head:refs/remotes/origin/PR-40 +refs/heads/develop:refs/remotes/origin/develop
Merging remotes/origin/develop commit f238e175ca4f23410af7a226a1efc711e2d210b7 into PR head commit 69090d66917b768f4a649b50fdd8d63c83973b05
 > git config core.sparsecheckout # timeout=10
 > git checkout -f 69090d66917b768f4a649b50fdd8d63c83973b05
Merge succeeded, producing 69090d66917b768f4a649b50fdd8d63c83973b05
Checking out Revision 69090d66917b768f4a649b50fdd8d63c83973b05 (PR-40)
Commit message: "removes uneeded using"
 > git merge f238e175ca4f23410af7a226a1efc711e2d210b7 # timeout=10
 > git rev-parse HEAD^{commit} # timeout=10
 > git config core.sparsecheckout # timeout=10
 > git checkout -f 69090d66917b768f4a649b50fdd8d63c83973b05
[Pipeline] sh
+ stat -c %u buildtools/docker/builder-netstandard-1.3
[Pipeline] sh
+ stat -c %g buildtools/docker/builder-netstandard-1.3
[Pipeline] sh
+ docker build -t builder-netstandard-1.3:latest --file buildtools/docker/builder-netstandard-1.3/Dockerfile --build-arg JENKINS_UID=910 --build-arg JENKINS_GID=910 buildtools/docker/builder-netstandard-1.3
Sending build context to Docker daemon  3.072kB

Step 1/8 : FROM microsoft/dotnet:2-sdk-jessie
2-sdk-jessie: Pulling from microsoft/dotnet
f189db1b88b3: Pulling fs layer
3d06cf2f1b5e: Pulling fs layer
687ebdda822c: Pulling fs layer
daf1e490a12c: Pulling fs layer
ec186084720c: Pulling fs layer
d45209686dd4: Pulling fs layer
ec186084720c: Waiting
d45209686dd4: Waiting
687ebdda822c: Verifying Checksum
687ebdda822c: Download complete
3d06cf2f1b5e: Verifying Checksum
3d06cf2f1b5e: Download complete
f189db1b88b3: Verifying Checksum
f189db1b88b3: Download complete
daf1e490a12c: Verifying Checksum
daf1e490a12c: Download complete
d45209686dd4: Verifying Checksum
d45209686dd4: Download complete
f189db1b88b3: Pull complete
ec186084720c: Verifying Checksum
ec186084720c: Download complete
3d06cf2f1b5e: Pull complete
687ebdda822c: Pull complete
daf1e490a12c: Pull complete
ec186084720c: Pull complete
d45209686dd4: Pull complete
Digest: sha256:e6ce49937ae72c95424dfbd4d1b6bc6bf59165239f66492b69901728cf325ff9
Status: Downloaded newer image for microsoft/dotnet:2-sdk-jessie
 ---> 50e5c5d1fb01
Step 2/8 : ARG JENKINS_UID
 ---> Running in 0c925086a8cc
 ---> 51a60076b9e7
Removing intermediate container 0c925086a8cc
Step 3/8 : ARG JENKINS_GID
 ---> Running in b5a3155505d8
 ---> fda2fce0f8f7
Removing intermediate container b5a3155505d8
Step 4/8 : MAINTAINER "dev@logging.apache.org"
 ---> Running in 5dda6cf5bf35
 ---> 004a5cdced89
Removing intermediate container 5dda6cf5bf35
Step 5/8 : RUN mkdir -p /var/workspaces && chmod 0777 /var/workspaces
 ---> Running in 985136f41f9e
 ---> ad62b886a612
Removing intermediate container 985136f41f9e
Step 6/8 : RUN groupadd -r -g $JENKINS_GID jenkins-slave
 ---> Running in 063dbdebe1d6
 ---> 90cfbaf5553d
Removing intermediate container 063dbdebe1d6
Step 7/8 : RUN useradd --base-dir /var/workspaces --create-home --shell /bin/bash --uid $JENKINS_UID --gid $JENKINS_GID --groups $JENKINS_GID -p -M jenkins
 ---> Running in a461eab381ff
 ---> a52b79998636
Removing intermediate container a461eab381ff
Step 8/8 : RUN apt-get update && apt-get install -y nant git
 ---> Running in 4372da07cd5b
Get:1 http://security.debian.org jessie/updates InRelease [44.9 kB]
Get:2 http://security.debian.org jessie/updates/main amd64 Packages [831 kB]
Ign http://deb.debian.org jessie InRelease
Get:3 http://deb.debian.org jessie-updates InRelease [7340 B]
Get:4 http://deb.debian.org jessie Release.gpg [2420 B]
Get:5 http://deb.debian.org jessie Release [148 kB]
Get:6 http://deb.debian.org jessie/main amd64 Packages [9098 kB]
Fetched 10.1 MB in 2min 4s (81.7 kB/s)
W: Failed to fetch http://deb.debian.org/debian/dists/jessie-updates/InRelease  Unable to find expected entry 'main/binary-amd64/Packages' in Release file (Wrong sources.list entry or malformed file)

E: Some index files failed to download. They have been ignored, or old ones used instead.
The command '/bin/sh -c apt-get update && apt-get install -y nant git' returned a non-zero code: 100
[Pipeline] }
[Pipeline] // script
[Pipeline] }
[Pipeline] // stage
[Pipeline] stage
[Pipeline] { (build net-2.0)
Stage "build net-2.0" skipped due to earlier failure(s)
[Pipeline] }
[Pipeline] // stage
[Pipeline] stage
[Pipeline] { (build net-3.5)
Stage "build net-3.5" skipped due to earlier failure(s)
[Pipeline] }
[Pipeline] // stage
[Pipeline] stage
[Pipeline] { (build net-3.5-cp)
Stage "build net-3.5-cp" skipped due to earlier failure(s)
[Pipeline] }
[Pipeline] // stage
[Pipeline] stage
[Pipeline] { (build net-4.0)
Stage "build net-4.0" skipped due to earlier failure(s)
[Pipeline] }
[Pipeline] // stage
[Pipeline] stage
[Pipeline] { (build net-4.0-cp)
Stage "build net-4.0-cp" skipped due to earlier failure(s)
[Pipeline] }
[Pipeline] // stage
[Pipeline] stage
[Pipeline] { (build net-4.5)
Stage "build net-4.5" skipped due to earlier failure(s)
[Pipeline] }
[Pipeline] // stage
[Pipeline] stage
[Pipeline] { (build mono-2.0)
Stage "build mono-2.0" skipped due to earlier failure(s)
[Pipeline] }
[Pipeline] // stage
[Pipeline] stage
[Pipeline] { (build mono-3.5)
Stage "build mono-3.5" skipped due to earlier failure(s)
[Pipeline] }
[Pipeline] // stage
[Pipeline] stage
[Pipeline] { (build mono-4.0)
Stage "build mono-4.0" skipped due to earlier failure(s)
[Pipeline] }
[Pipeline] // stage
[Pipeline] stage
[Pipeline] { (build site)
Stage "build site" skipped due to earlier failure(s)
[Pipeline] }
[Pipeline] // stage
[Pipeline] stage
[Pipeline] { (prepare package)
Stage "prepare package" skipped due to earlier failure(s)
[Pipeline] }
[Pipeline] // stage
[Pipeline] stage
[Pipeline] { (check test results)
Stage "check test results" skipped due to earlier failure(s)
[Pipeline] }
[Pipeline] // stage
[Pipeline] stage
[Pipeline] { (publish site)
Stage "publish site" skipped due to earlier failure(s)
[Pipeline] }
[Pipeline] // stage
[Pipeline] stage
[Pipeline] { (Declarative: Post Actions)
[Pipeline] step

Build failed in Jenkins: logging-log4net » PR-40 #2

Posted by Apache Jenkins Server <je...@builds.apache.org>.
See <https://builds.apache.org/job/logging-log4net/job/PR-40/2/display/redirect>

------------------------------------------
Branch indexing
Connecting to https://api.github.com using dpsenner/****** (dpsenner at github)
Loading trusted files from base branch develop at f238e175ca4f23410af7a226a1efc711e2d210b7 rather than 65571171975aeca507b7f4da9894afe57d32e433
Obtained Jenkinsfile from f238e175ca4f23410af7a226a1efc711e2d210b7
Running in Durability level: MAX_SURVIVABILITY
[Pipeline] Start of Pipeline
[Pipeline] node
Running on H32 in /home/jenkins/jenkins-slave/workspace/logging-log4net_PR-40
[Pipeline] {
[Pipeline] timeout
Timeout set to expire in 4 hr 0 min
[Pipeline] {
[Pipeline] stage
[Pipeline] { (checkout)
[Pipeline] deleteDir
[Pipeline] checkout
using credential github-logging-log4net-dpsenner
Cloning the remote Git repository
Cloning with configured refspecs honoured and without tags
Cloning repository https://github.com/apache/logging-log4net.git
 > git init /home/jenkins/jenkins-slave/workspace/logging-log4net_PR-40 # timeout=10
Fetching upstream changes from https://github.com/apache/logging-log4net.git
 > git --version # timeout=10
using GIT_ASKPASS to set credentials dpsenner at github
 > git fetch --no-tags --progress https://github.com/apache/logging-log4net.git +refs/pull/40/head:refs/remotes/origin/PR-40 +refs/heads/develop:refs/remotes/origin/develop
Fetching without tags
 > git config remote.origin.url https://github.com/apache/logging-log4net.git # timeout=10
 > git config --add remote.origin.fetch +refs/pull/40/head:refs/remotes/origin/PR-40 # timeout=10
 > git config --add remote.origin.fetch +refs/heads/develop:refs/remotes/origin/develop # timeout=10
 > git config remote.origin.url https://github.com/apache/logging-log4net.git # timeout=10
Fetching upstream changes from https://github.com/apache/logging-log4net.git
using GIT_ASKPASS to set credentials dpsenner at github
 > git fetch --no-tags --progress https://github.com/apache/logging-log4net.git +refs/pull/40/head:refs/remotes/origin/PR-40 +refs/heads/develop:refs/remotes/origin/develop
Merging remotes/origin/develop commit f238e175ca4f23410af7a226a1efc711e2d210b7 into PR head commit 65571171975aeca507b7f4da9894afe57d32e433
Merge succeeded, producing 65571171975aeca507b7f4da9894afe57d32e433
Checking out Revision 65571171975aeca507b7f4da9894afe57d32e433 (PR-40)
 > git config core.sparsecheckout # timeout=10
 > git checkout -f 65571171975aeca507b7f4da9894afe57d32e433
 > git merge f238e175ca4f23410af7a226a1efc711e2d210b7 # timeout=10
 > git rev-parse HEAD^{commit} # timeout=10
Commit message: "This fixes the Mutex name in the RollingFileAppender and the FileAppender to use the ApplicationUniqueId since the base file path isn't enough in hosted web applications"
First time build. Skipping changelog.
 > git config core.sparsecheckout # timeout=10
 > git checkout -f 65571171975aeca507b7f4da9894afe57d32e433
 > git rev-list --no-walk fb85f8e3c308c0838806b63497726bd991f99931 # timeout=10
[Pipeline] }
[Pipeline] // stage
[Pipeline] stage
[Pipeline] { (build netstandard-1.3)
[Pipeline] script
[Pipeline] {
[Pipeline] checkout
using credential github-logging-log4net-dpsenner
Fetching changes from the remote Git repository
Fetching without tags
 > git rev-parse --is-inside-work-tree # timeout=10
 > git config remote.origin.url https://github.com/apache/logging-log4net.git # timeout=10
Fetching upstream changes from https://github.com/apache/logging-log4net.git
 > git --version # timeout=10
using GIT_ASKPASS to set credentials dpsenner at github
 > git fetch --no-tags --progress https://github.com/apache/logging-log4net.git +refs/pull/40/head:refs/remotes/origin/PR-40 +refs/heads/develop:refs/remotes/origin/develop
Merging remotes/origin/develop commit f238e175ca4f23410af7a226a1efc711e2d210b7 into PR head commit 65571171975aeca507b7f4da9894afe57d32e433
 > git config core.sparsecheckout # timeout=10
 > git checkout -f 65571171975aeca507b7f4da9894afe57d32e433
Merge succeeded, producing 65571171975aeca507b7f4da9894afe57d32e433
Checking out Revision 65571171975aeca507b7f4da9894afe57d32e433 (PR-40)
Commit message: "This fixes the Mutex name in the RollingFileAppender and the FileAppender to use the ApplicationUniqueId since the base file path isn't enough in hosted web applications"
 > git merge f238e175ca4f23410af7a226a1efc711e2d210b7 # timeout=10
 > git rev-parse HEAD^{commit} # timeout=10
 > git config core.sparsecheckout # timeout=10
 > git checkout -f 65571171975aeca507b7f4da9894afe57d32e433
[Pipeline] sh
+ stat -c %u buildtools/docker/builder-netstandard-1.3
[Pipeline] sh
+ stat -c %g buildtools/docker/builder-netstandard-1.3
[Pipeline] sh
+ docker build -t builder-netstandard-1.3:latest --file buildtools/docker/builder-netstandard-1.3/Dockerfile --build-arg JENKINS_UID=910 --build-arg JENKINS_GID=910 buildtools/docker/builder-netstandard-1.3
Sending build context to Docker daemon  3.072kB

Step 1/8 : FROM microsoft/dotnet:2-sdk-jessie
2-sdk-jessie: Pulling from microsoft/dotnet
Digest: sha256:e6ce49937ae72c95424dfbd4d1b6bc6bf59165239f66492b69901728cf325ff9
Status: Downloaded newer image for microsoft/dotnet:2-sdk-jessie
 ---> 50e5c5d1fb01
Step 2/8 : ARG JENKINS_UID
 ---> Using cache
 ---> 2965abbe69ea
Step 3/8 : ARG JENKINS_GID
 ---> Using cache
 ---> 3436f622a2eb
Step 4/8 : MAINTAINER "dev@logging.apache.org"
 ---> Using cache
 ---> 9fabdc17befd
Step 5/8 : RUN mkdir -p /var/workspaces && chmod 0777 /var/workspaces
 ---> Using cache
 ---> c6c079c5ecbe
Step 6/8 : RUN groupadd -r -g $JENKINS_GID jenkins-slave
 ---> Using cache
 ---> e15cc1afba19
Step 7/8 : RUN useradd --base-dir /var/workspaces --create-home --shell /bin/bash --uid $JENKINS_UID --gid $JENKINS_GID --groups $JENKINS_GID -p -M jenkins
 ---> Using cache
 ---> 2c15f16b97f0
Step 8/8 : RUN apt-get update && apt-get install -y nant git
 ---> Running in 4dfcdbfd5e0b
Get:1 http://security.debian.org jessie/updates InRelease [44.9 kB]
Ign http://deb.debian.org jessie InRelease
Get:2 http://deb.debian.org jessie-updates InRelease [7340 B]
Get:3 http://deb.debian.org jessie Release.gpg [2420 B]
Get:4 http://deb.debian.org jessie Release [148 kB]
Get:5 http://security.debian.org jessie/updates/main amd64 Packages [831 kB]
Get:6 http://deb.debian.org jessie/main amd64 Packages [9098 kB]
Fetched 10.1 MB in 12s (806 kB/s)
W: Failed to fetch http://deb.debian.org/debian/dists/jessie-updates/InRelease  Unable to find expected entry 'main/binary-amd64/Packages' in Release file (Wrong sources.list entry or malformed file)

E: Some index files failed to download. They have been ignored, or old ones used instead.
The command '/bin/sh -c apt-get update && apt-get install -y nant git' returned a non-zero code: 100
[Pipeline] }
[Pipeline] // script
[Pipeline] }
[Pipeline] // stage
[Pipeline] stage
[Pipeline] { (build net-2.0)
Stage "build net-2.0" skipped due to earlier failure(s)
[Pipeline] }
[Pipeline] // stage
[Pipeline] stage
[Pipeline] { (build net-3.5)
Stage "build net-3.5" skipped due to earlier failure(s)
[Pipeline] }
[Pipeline] // stage
[Pipeline] stage
[Pipeline] { (build net-3.5-cp)
Stage "build net-3.5-cp" skipped due to earlier failure(s)
[Pipeline] }
[Pipeline] // stage
[Pipeline] stage
[Pipeline] { (build net-4.0)
Stage "build net-4.0" skipped due to earlier failure(s)
[Pipeline] }
[Pipeline] // stage
[Pipeline] stage
[Pipeline] { (build net-4.0-cp)
Stage "build net-4.0-cp" skipped due to earlier failure(s)
[Pipeline] }
[Pipeline] // stage
[Pipeline] stage
[Pipeline] { (build net-4.5)
Stage "build net-4.5" skipped due to earlier failure(s)
[Pipeline] }
[Pipeline] // stage
[Pipeline] stage
[Pipeline] { (build mono-2.0)
Stage "build mono-2.0" skipped due to earlier failure(s)
[Pipeline] }
[Pipeline] // stage
[Pipeline] stage
[Pipeline] { (build mono-3.5)
Stage "build mono-3.5" skipped due to earlier failure(s)
[Pipeline] }
[Pipeline] // stage
[Pipeline] stage
[Pipeline] { (build mono-4.0)
Stage "build mono-4.0" skipped due to earlier failure(s)
[Pipeline] }
[Pipeline] // stage
[Pipeline] stage
[Pipeline] { (build site)
Stage "build site" skipped due to earlier failure(s)
[Pipeline] }
[Pipeline] // stage
[Pipeline] stage
[Pipeline] { (prepare package)
Stage "prepare package" skipped due to earlier failure(s)
[Pipeline] }
[Pipeline] // stage
[Pipeline] stage
[Pipeline] { (check test results)
Stage "check test results" skipped due to earlier failure(s)
[Pipeline] }
[Pipeline] // stage
[Pipeline] stage
[Pipeline] { (publish site)
Stage "publish site" skipped due to earlier failure(s)
[Pipeline] }
[Pipeline] // stage
[Pipeline] stage
[Pipeline] { (Declarative: Post Actions)
[Pipeline] step