You are viewing a plain text version of this content. The canonical link for it is here.
Posted to dev@commons.apache.org by Ted Husted <te...@husted.com> on 2003/01/07 14:11:38 UTC
[GUMP] Build Failure - commons-collections
----------------------------------------------------
This email is autogenerated from the output from:
<http://cvs.apache.org/builds/gump/2003-01-07/commons-collections.html>
----------------------------------------------------
Buildfile: build.xml
init:
build-java:
[mkdir] Created dir: /home/rubys/jakarta/jakarta-commons/collections/dist/classes
[javac] Compiling 106 source files to /home/rubys/jakarta/jakarta-commons/collections/dist/classes
build-test:
[javac] Compiling 77 source files to /home/rubys/jakarta/jakarta-commons/collections/dist/classes
[javac] /home/rubys/jakarta/jakarta-commons/collections/src/test/org/apache/commons/collections/primitives/TestAbstractIntArrayList.java:82: warning: org.apache.commons.collections.primitives.AbstractIntList in org.apache.commons.collections.primitives has been deprecated
[javac] abstract protected AbstractIntList createList();
[javac] ^
[javac] /home/rubys/jakarta/jakarta-commons/collections/src/test/org/apache/commons/collections/primitives/TestIntArrayList.java:88: warning: org.apache.commons.collections.primitives.AbstractIntList in org.apache.commons.collections.primitives has been deprecated
[javac] protected AbstractIntList createList() {
[javac] ^
[javac] /home/rubys/jakarta/jakarta-commons/collections/src/test/org/apache/commons/collections/primitives/TestUnsignedShortArrayList.java:88: warning: org.apache.commons.collections.primitives.AbstractIntList in org.apache.commons.collections.primitives has been deprecated
[javac] protected AbstractIntList createList() {
[javac] ^
[javac] /home/rubys/jakarta/jakarta-commons/collections/src/test/org/apache/commons/collections/primitives/TestAbstractIntArrayList.java:93: warning: org.apache.commons.collections.primitives.AbstractIntList in org.apache.commons.collections.primitives has been deprecated
[javac] AbstractIntList list = createList();
[javac] ^
[javac] /home/rubys/jakarta/jakarta-commons/collections/src/test/org/apache/commons/collections/primitives/TestAbstractIntArrayList.java:103: warning: org.apache.commons.collections.primitives.AbstractIntList in org.apache.commons.collections.primitives has been deprecated
[javac] AbstractIntList list = createList();
[javac] ^
[javac] /home/rubys/jakarta/jakarta-commons/collections/src/test/org/apache/commons/collections/primitives/TestAbstractIntArrayList.java:117: warning: org.apache.commons.collections.primitives.AbstractIntList in org.apache.commons.collections.primitives has been deprecated
[javac] AbstractIntList list = createList();
[javac] ^
[javac] /home/rubys/jakarta/jakarta-commons/collections/src/test/org/apache/commons/collections/primitives/TestIntArrayList.java:89: warning: org.apache.commons.collections.primitives.IntArrayList in org.apache.commons.collections.primitives has been deprecated
[javac] return new IntArrayList();
[javac] ^
[javac] /home/rubys/jakarta/jakarta-commons/collections/src/test/org/apache/commons/collections/primitives/TestIntArrayList.java:95: warning: org.apache.commons.collections.primitives.IntArrayList in org.apache.commons.collections.primitives has been deprecated
[javac] IntArrayList list = new IntArrayList(0);
[javac] ^
[javac] /home/rubys/jakarta/jakarta-commons/collections/src/test/org/apache/commons/collections/primitives/TestIntArrayList.java:95: warning: org.apache.commons.collections.primitives.IntArrayList in org.apache.commons.collections.primitives has been deprecated
[javac] IntArrayList list = new IntArrayList(0);
[javac] ^
[javac] /home/rubys/jakarta/jakarta-commons/collections/src/test/org/apache/commons/collections/primitives/TestUnsignedShortArrayList.java:89: warning: org.apache.commons.collections.primitives.UnsignedShortArrayList in org.apache.commons.collections.primitives has been deprecated
[javac] return new UnsignedShortArrayList();
[javac] ^
[javac] /home/rubys/jakarta/jakarta-commons/collections/src/test/org/apache/commons/collections/primitives/TestUnsignedShortArrayList.java:95: warning: org.apache.commons.collections.primitives.UnsignedShortArrayList in org.apache.commons.collections.primitives has been deprecated
[javac] UnsignedShortArrayList list = new UnsignedShortArrayList(0);
[javac] ^
[javac] /home/rubys/jakarta/jakarta-commons/collections/src/test/org/apache/commons/collections/primitives/TestUnsignedShortArrayList.java:95: warning: org.apache.commons.collections.primitives.UnsignedShortArrayList in org.apache.commons.collections.primitives has been deprecated
[javac] UnsignedShortArrayList list = new UnsignedShortArrayList(0);
[javac] ^
[javac] 12 warnings
test:
[java] .........................................
[java] .........................................
[java] .........................................
[java] .........................................
[java] .........................................
[java] .........................................
[java] .........................................
[java] .........................................
[java] .........................................
[java] .........................................
[java] .........................................
[java] .........................................
[java] .........................................
[java] .........................................
[java] .........................................
[java] .........................................
[java] .........................................
[java] .........................................
[java] .........................................
[java] .........................................
[java] .........................................
[java] .........................................
[java] .........................................
[java] .........................................
[java] .........................................
[java] .........................................
[java] .........................................
[java] .........................................
[java] .........................................
[java] .........................................
[java] .........................................
[java] .........................................
[java] .........................................
[java] .........................................
[java] .........................................
[java] .........................................
[java] .........................................
[java] .........................................
[java] .........................................
[java] ...............E.E.........................
[java] .........................................
[java] .........F.F...............................
[java] .........................................
[java] .........................................
[java] .........................................
[java] .........................................
[java] .........................................
[java] .........................................
[java] .........................................
[java] .........................................
[java] .........................................
[java] .........................................
[java] .........................................
[java] .........................................
[java] .........................................
[java] .........................
[java] Time: 5.192
[java] There were 2 errors:
[java] 1) testEmptyListCompatibility(TestNodeCachingLinkedList.testEmptyListCompatibility) java.io.FileNotFoundException: data/test/NodeCachingLinkedList.emptyCollection.version1.obj (No such file or directory)
[java] at java.io.FileInputStream.open(Native Method)
[java] at java.io.FileInputStream.<init>(FileInputStream.java:103)
[java] at java.io.FileInputStream.<init>(FileInputStream.java:66)
[java] at org.apache.commons.collections.TestObject.readExternalFormFromDisk(TestObject.java:197)
[java] at org.apache.commons.collections.TestList.testEmptyListCompatibility(TestList.java:894)
[java] at sun.reflect.NativeMethodAccessorImpl.invoke0(Native Method)
[java] at sun.reflect.NativeMethodAccessorImpl.invoke(NativeMethodAccessorImpl.java:39)
[java] at sun.reflect.DelegatingMethodAccessorImpl.invoke(DelegatingMethodAccessorImpl.java:25)
[java] 2) testFullListCompatibility(TestNodeCachingLinkedList.testFullListCompatibility) java.io.FileNotFoundException: data/test/NodeCachingLinkedList.fullCollection.version1.obj (No such file or directory)
[java] at java.io.FileInputStream.open(Native Method)
[java] at java.io.FileInputStream.<init>(FileInputStream.java:103)
[java] at java.io.FileInputStream.<init>(FileInputStream.java:66)
[java] at org.apache.commons.collections.TestObject.readExternalFormFromDisk(TestObject.java:197)
[java] at org.apache.commons.collections.TestList.testFullListCompatibility(TestList.java:913)
[java] at sun.reflect.NativeMethodAccessorImpl.invoke0(Native Method)
[java] at sun.reflect.NativeMethodAccessorImpl.invoke(NativeMethodAccessorImpl.java:39)
[java] at sun.reflect.DelegatingMethodAccessorImpl.invoke(DelegatingMethodAccessorImpl.java:25)
[java] There were 2 failures:
[java] 1) testCanonicalEmptyCollectionExists(TestNodeCachingLinkedList.testCanonicalEmptyCollectionExists) junit.framework.AssertionFailedError: Canonical empty collection (data/test/NodeCachingLinkedList.emptyCollection.version1.obj) is not in CVS
[java] at org.apache.commons.collections.TestObject.testCanonicalEmptyCollectionExists(TestObject.java:294)
[java] at sun.reflect.GeneratedMethodAccessor156.invoke(Unknown Source)
[java] at sun.reflect.DelegatingMethodAccessorImpl.invoke(DelegatingMethodAccessorImpl.java:25)
[java] 2) testCanonicalFullCollectionExists(TestNodeCachingLinkedList.testCanonicalFullCollectionExists) junit.framework.AssertionFailedError: Canonical full collection (data/test/NodeCachingLinkedList.fullCollection.version1.obj) is not in CVS
[java] at org.apache.commons.collections.TestObject.testCanonicalFullCollectionExists(TestObject.java:313)
[java] at sun.reflect.GeneratedMethodAccessor157.invoke(Unknown Source)
[java] at sun.reflect.DelegatingMethodAccessorImpl.invoke(DelegatingMethodAccessorImpl.java:25)
[java] FAILURES!!!
[java] Tests run: 2280, Failures: 2, Errors: 2
BUILD FAILED
file:///home/rubys/jakarta/jakarta-commons/collections/build.xml:240: Java returned: 1
Total time: 13 seconds
--
To unsubscribe, e-mail: <ma...@jakarta.apache.org>
For additional commands, e-mail: <ma...@jakarta.apache.org>