You are viewing a plain text version of this content. The canonical link for it is here.
Posted to builds@beam.apache.org by Apache Jenkins Server <je...@builds.apache.org> on 2023/12/31 16:02:40 UTC

Build failed in Jenkins: beam_PostCommit_Python_Examples_Flink #2741

See <https://ci-beam.apache.org/job/beam_PostCommit_Python_Examples_Flink/2741/display/redirect>

Changes:


------------------------------------------
[...truncated 55.88 MB...]
    File "<https://ci-beam.apache.org/job/beam_PostCommit_Python_Examples_Flink/ws/src/sdks/python/apache_beam/runners/worker/data_plane.py",> line 686, in <lambda>
      target=lambda: self._read_inputs(elements_iterator),
    File "<https://ci-beam.apache.org/job/beam_PostCommit_Python_Examples_Flink/ws/src/sdks/python/apache_beam/runners/worker/data_plane.py",> line 669, in _read_inputs
      for elements in elements_iterator:
    File "<https://ci-beam.apache.org/job/beam_PostCommit_Python_Examples_Flink/ws/src/build/gradleenv/2022703442/lib/python3.8/site-packages/grpc/_channel.py",> line 540, in __next__
      return self._next()
    File "<https://ci-beam.apache.org/job/beam_PostCommit_Python_Examples_Flink/ws/src/build/gradleenv/2022703442/lib/python3.8/site-packages/grpc/_channel.py",> line 966, in _next
      raise self
  grpc._channel._MultiThreadedRendezvous: <_MultiThreadedRendezvous of RPC that terminated with:
  	status = StatusCode.CANCELLED
  	details = "Multiplexer hanging up"
  	debug_error_string = "UNKNOWN:Error received from peer ipv6:%5B::1%5D:43665 {grpc_message:"Multiplexer hanging up", grpc_status:1, created_time:"2023-12-31T15:47:27.471786652+00:00"}"
  >
  
    warnings.warn(pytest.PytestUnhandledThreadExceptionWarning(msg))

apache_beam/examples/complete/game/user_score_it_test.py::UserScoreIT::test_userscore_output_checksum_on_small_input
  <https://ci-beam.apache.org/job/beam_PostCommit_Python_Examples_Flink/ws/src/build/gradleenv/2022703442/lib/python3.8/site-packages/_pytest/threadexception.py>:73: PytestUnhandledThreadExceptionWarning: Exception in thread read_grpc_client_inputs
  
  Traceback (most recent call last):
    File "/usr/lib/python3.8/threading.py", line 932, in _bootstrap_inner
      self.run()
    File "/usr/lib/python3.8/threading.py", line 870, in run
      self._target(*self._args, **self._kwargs)
    File "<https://ci-beam.apache.org/job/beam_PostCommit_Python_Examples_Flink/ws/src/sdks/python/apache_beam/runners/worker/data_plane.py",> line 686, in <lambda>
      target=lambda: self._read_inputs(elements_iterator),
    File "<https://ci-beam.apache.org/job/beam_PostCommit_Python_Examples_Flink/ws/src/sdks/python/apache_beam/runners/worker/data_plane.py",> line 669, in _read_inputs
      for elements in elements_iterator:
    File "<https://ci-beam.apache.org/job/beam_PostCommit_Python_Examples_Flink/ws/src/build/gradleenv/2022703442/lib/python3.8/site-packages/grpc/_channel.py",> line 540, in __next__
      return self._next()
    File "<https://ci-beam.apache.org/job/beam_PostCommit_Python_Examples_Flink/ws/src/build/gradleenv/2022703442/lib/python3.8/site-packages/grpc/_channel.py",> line 966, in _next
      raise self
  grpc._channel._MultiThreadedRendezvous: <_MultiThreadedRendezvous of RPC that terminated with:
  	status = StatusCode.CANCELLED
  	details = "Multiplexer hanging up"
  	debug_error_string = "UNKNOWN:Error received from peer ipv6:%5B::1%5D:39255 {created_time:"2023-12-31T15:47:56.065640173+00:00", grpc_status:1, grpc_message:"Multiplexer hanging up"}"
  >
  
    warnings.warn(pytest.PytestUnhandledThreadExceptionWarning(msg))

apache_beam/examples/cookbook/bigquery_tornadoes_it_test.py::BigqueryTornadoesIT::test_bigquery_tornadoes_it
apache_beam/examples/cookbook/filters_test.py::FiltersTest::test_filters_output_bigquery_matcher
  <https://ci-beam.apache.org/job/beam_PostCommit_Python_Examples_Flink/ws/src/sdks/python/apache_beam/io/gcp/tests/utils.py>:100: PendingDeprecationWarning: Client.dataset is deprecated and will be removed in a future version. Use a string like 'my_project.my_dataset' or a cloud.google.bigquery.DatasetReference object, instead.
    table_ref = client.dataset(dataset_id).table(table_id)

apache_beam/examples/cookbook/bigquery_tornadoes_it_test.py::BigqueryTornadoesIT::test_bigquery_tornadoes_it
  <https://ci-beam.apache.org/job/beam_PostCommit_Python_Examples_Flink/ws/src/build/gradleenv/2022703442/lib/python3.8/site-packages/_pytest/threadexception.py>:73: PytestUnhandledThreadExceptionWarning: Exception in thread read_grpc_client_inputs
  
  Traceback (most recent call last):
    File "/usr/lib/python3.8/threading.py", line 932, in _bootstrap_inner
      self.run()
    File "/usr/lib/python3.8/threading.py", line 870, in run
      self._target(*self._args, **self._kwargs)
    File "<https://ci-beam.apache.org/job/beam_PostCommit_Python_Examples_Flink/ws/src/sdks/python/apache_beam/runners/worker/data_plane.py",> line 686, in <lambda>
      target=lambda: self._read_inputs(elements_iterator),
    File "<https://ci-beam.apache.org/job/beam_PostCommit_Python_Examples_Flink/ws/src/sdks/python/apache_beam/runners/worker/data_plane.py",> line 669, in _read_inputs
      for elements in elements_iterator:
    File "<https://ci-beam.apache.org/job/beam_PostCommit_Python_Examples_Flink/ws/src/build/gradleenv/2022703442/lib/python3.8/site-packages/grpc/_channel.py",> line 540, in __next__
      return self._next()
    File "<https://ci-beam.apache.org/job/beam_PostCommit_Python_Examples_Flink/ws/src/build/gradleenv/2022703442/lib/python3.8/site-packages/grpc/_channel.py",> line 966, in _next
      raise self
  grpc._channel._MultiThreadedRendezvous: <_MultiThreadedRendezvous of RPC that terminated with:
  	status = StatusCode.CANCELLED
  	details = "Multiplexer hanging up"
  	debug_error_string = "UNKNOWN:Error received from peer ipv6:%5B::1%5D:34723 {grpc_message:"Multiplexer hanging up", grpc_status:1, created_time:"2023-12-31T15:58:36.386026299+00:00"}"
  >
  
    warnings.warn(pytest.PytestUnhandledThreadExceptionWarning(msg))

apache_beam/examples/cookbook/coders_it_test.py::CodersIT::test_coders_output_files_on_small_input
  <https://ci-beam.apache.org/job/beam_PostCommit_Python_Examples_Flink/ws/src/build/gradleenv/2022703442/lib/python3.8/site-packages/_pytest/threadexception.py>:73: PytestUnhandledThreadExceptionWarning: Exception in thread read_grpc_client_inputs
  
  Traceback (most recent call last):
    File "/usr/lib/python3.8/threading.py", line 932, in _bootstrap_inner
      self.run()
    File "/usr/lib/python3.8/threading.py", line 870, in run
      self._target(*self._args, **self._kwargs)
    File "<https://ci-beam.apache.org/job/beam_PostCommit_Python_Examples_Flink/ws/src/sdks/python/apache_beam/runners/worker/data_plane.py",> line 686, in <lambda>
      target=lambda: self._read_inputs(elements_iterator),
    File "<https://ci-beam.apache.org/job/beam_PostCommit_Python_Examples_Flink/ws/src/sdks/python/apache_beam/runners/worker/data_plane.py",> line 669, in _read_inputs
      for elements in elements_iterator:
    File "<https://ci-beam.apache.org/job/beam_PostCommit_Python_Examples_Flink/ws/src/build/gradleenv/2022703442/lib/python3.8/site-packages/grpc/_channel.py",> line 540, in __next__
      return self._next()
    File "<https://ci-beam.apache.org/job/beam_PostCommit_Python_Examples_Flink/ws/src/build/gradleenv/2022703442/lib/python3.8/site-packages/grpc/_channel.py",> line 966, in _next
      raise self
  grpc._channel._MultiThreadedRendezvous: <_MultiThreadedRendezvous of RPC that terminated with:
  	status = StatusCode.CANCELLED
  	details = "Multiplexer hanging up"
  	debug_error_string = "UNKNOWN:Error received from peer ipv6:%5B::1%5D:40109 {grpc_message:"Multiplexer hanging up", grpc_status:1, created_time:"2023-12-31T15:59:01.510879884+00:00"}"
  >
  
    warnings.warn(pytest.PytestUnhandledThreadExceptionWarning(msg))

apache_beam/examples/cookbook/custom_ptransform_it_test.py::CustomPTransformIT::test_custom_ptransform_output_files_on_small_input
  <https://ci-beam.apache.org/job/beam_PostCommit_Python_Examples_Flink/ws/src/build/gradleenv/2022703442/lib/python3.8/site-packages/_pytest/threadexception.py>:73: PytestUnhandledThreadExceptionWarning: Exception in thread read_grpc_client_inputs
  
  Traceback (most recent call last):
    File "/usr/lib/python3.8/threading.py", line 932, in _bootstrap_inner
      self.run()
    File "/usr/lib/python3.8/threading.py", line 870, in run
      self._target(*self._args, **self._kwargs)
    File "<https://ci-beam.apache.org/job/beam_PostCommit_Python_Examples_Flink/ws/src/sdks/python/apache_beam/runners/worker/data_plane.py",> line 686, in <lambda>
      target=lambda: self._read_inputs(elements_iterator),
    File "<https://ci-beam.apache.org/job/beam_PostCommit_Python_Examples_Flink/ws/src/sdks/python/apache_beam/runners/worker/data_plane.py",> line 669, in _read_inputs
      for elements in elements_iterator:
    File "<https://ci-beam.apache.org/job/beam_PostCommit_Python_Examples_Flink/ws/src/build/gradleenv/2022703442/lib/python3.8/site-packages/grpc/_channel.py",> line 540, in __next__
      return self._next()
    File "<https://ci-beam.apache.org/job/beam_PostCommit_Python_Examples_Flink/ws/src/build/gradleenv/2022703442/lib/python3.8/site-packages/grpc/_channel.py",> line 966, in _next
      raise self
  grpc._channel._MultiThreadedRendezvous: <_MultiThreadedRendezvous of RPC that terminated with:
  	status = StatusCode.CANCELLED
  	details = "Multiplexer hanging up"
  	debug_error_string = "UNKNOWN:Error received from peer ipv6:%5B::1%5D:41123 {grpc_message:"Multiplexer hanging up", grpc_status:1, created_time:"2023-12-31T15:59:37.792263816+00:00"}"
  >
  
    warnings.warn(pytest.PytestUnhandledThreadExceptionWarning(msg))

apache_beam/examples/cookbook/filters_test.py::FiltersTest::test_filters_output_bigquery_matcher
  <https://ci-beam.apache.org/job/beam_PostCommit_Python_Examples_Flink/ws/src/build/gradleenv/2022703442/lib/python3.8/site-packages/_pytest/threadexception.py>:73: PytestUnhandledThreadExceptionWarning: Exception in thread read_grpc_client_inputs
  
  Traceback (most recent call last):
    File "/usr/lib/python3.8/threading.py", line 932, in _bootstrap_inner
      self.run()
    File "/usr/lib/python3.8/threading.py", line 870, in run
      self._target(*self._args, **self._kwargs)
    File "<https://ci-beam.apache.org/job/beam_PostCommit_Python_Examples_Flink/ws/src/sdks/python/apache_beam/runners/worker/data_plane.py",> line 686, in <lambda>
      target=lambda: self._read_inputs(elements_iterator),
    File "<https://ci-beam.apache.org/job/beam_PostCommit_Python_Examples_Flink/ws/src/sdks/python/apache_beam/runners/worker/data_plane.py",> line 669, in _read_inputs
      for elements in elements_iterator:
    File "<https://ci-beam.apache.org/job/beam_PostCommit_Python_Examples_Flink/ws/src/build/gradleenv/2022703442/lib/python3.8/site-packages/grpc/_channel.py",> line 540, in __next__
      return self._next()
    File "<https://ci-beam.apache.org/job/beam_PostCommit_Python_Examples_Flink/ws/src/build/gradleenv/2022703442/lib/python3.8/site-packages/grpc/_channel.py",> line 966, in _next
      raise self
  grpc._channel._MultiThreadedRendezvous: <_MultiThreadedRendezvous of RPC that terminated with:
  	status = StatusCode.CANCELLED
  	details = "Multiplexer hanging up"
  	debug_error_string = "UNKNOWN:Error received from peer ipv6:%5B::1%5D:42919 {grpc_message:"Multiplexer hanging up", grpc_status:1, created_time:"2023-12-31T16:00:35.683377463+00:00"}"
  >
  
    warnings.warn(pytest.PytestUnhandledThreadExceptionWarning(msg))

apache_beam/examples/cookbook/group_with_coder_test.py::GroupWithCoderTest::test_basics_with_type_check
  <https://ci-beam.apache.org/job/beam_PostCommit_Python_Examples_Flink/ws/src/build/gradleenv/2022703442/lib/python3.8/site-packages/_pytest/threadexception.py>:73: PytestUnhandledThreadExceptionWarning: Exception in thread read_grpc_client_inputs
  
  Traceback (most recent call last):
    File "/usr/lib/python3.8/threading.py", line 932, in _bootstrap_inner
      self.run()
    File "/usr/lib/python3.8/threading.py", line 870, in run
      self._target(*self._args, **self._kwargs)
    File "<https://ci-beam.apache.org/job/beam_PostCommit_Python_Examples_Flink/ws/src/sdks/python/apache_beam/runners/worker/data_plane.py",> line 686, in <lambda>
      target=lambda: self._read_inputs(elements_iterator),
    File "<https://ci-beam.apache.org/job/beam_PostCommit_Python_Examples_Flink/ws/src/sdks/python/apache_beam/runners/worker/data_plane.py",> line 669, in _read_inputs
      for elements in elements_iterator:
    File "<https://ci-beam.apache.org/job/beam_PostCommit_Python_Examples_Flink/ws/src/build/gradleenv/2022703442/lib/python3.8/site-packages/grpc/_channel.py",> line 540, in __next__
      return self._next()
    File "<https://ci-beam.apache.org/job/beam_PostCommit_Python_Examples_Flink/ws/src/build/gradleenv/2022703442/lib/python3.8/site-packages/grpc/_channel.py",> line 966, in _next
      raise self
  grpc._channel._MultiThreadedRendezvous: <_MultiThreadedRendezvous of RPC that terminated with:
  	status = StatusCode.CANCELLED
  	details = "Multiplexer hanging up"
  	debug_error_string = "UNKNOWN:Error received from peer ipv6:%5B::1%5D:39467 {created_time:"2023-12-31T16:00:53.919599808+00:00", grpc_status:1, grpc_message:"Multiplexer hanging up"}"
  >
  
    warnings.warn(pytest.PytestUnhandledThreadExceptionWarning(msg))

apache_beam/examples/cookbook/group_with_coder_test.py::GroupWithCoderTest::test_basics_without_type_check
  <https://ci-beam.apache.org/job/beam_PostCommit_Python_Examples_Flink/ws/src/build/gradleenv/2022703442/lib/python3.8/site-packages/_pytest/threadexception.py>:73: PytestUnhandledThreadExceptionWarning: Exception in thread read_grpc_client_inputs
  
  Traceback (most recent call last):
    File "/usr/lib/python3.8/threading.py", line 932, in _bootstrap_inner
      self.run()
    File "/usr/lib/python3.8/threading.py", line 870, in run
      self._target(*self._args, **self._kwargs)
    File "<https://ci-beam.apache.org/job/beam_PostCommit_Python_Examples_Flink/ws/src/sdks/python/apache_beam/runners/worker/data_plane.py",> line 686, in <lambda>
      target=lambda: self._read_inputs(elements_iterator),
    File "<https://ci-beam.apache.org/job/beam_PostCommit_Python_Examples_Flink/ws/src/sdks/python/apache_beam/runners/worker/data_plane.py",> line 669, in _read_inputs
      for elements in elements_iterator:
    File "<https://ci-beam.apache.org/job/beam_PostCommit_Python_Examples_Flink/ws/src/build/gradleenv/2022703442/lib/python3.8/site-packages/grpc/_channel.py",> line 540, in __next__
      return self._next()
    File "<https://ci-beam.apache.org/job/beam_PostCommit_Python_Examples_Flink/ws/src/build/gradleenv/2022703442/lib/python3.8/site-packages/grpc/_channel.py",> line 966, in _next
      raise self
  grpc._channel._MultiThreadedRendezvous: <_MultiThreadedRendezvous of RPC that terminated with:
  	status = StatusCode.CANCELLED
  	details = "Multiplexer hanging up"
  	debug_error_string = "UNKNOWN:Error received from peer ipv6:%5B::1%5D:38553 {grpc_message:"Multiplexer hanging up", grpc_status:1, created_time:"2023-12-31T16:01:10.904414299+00:00"}"
  >
  
    warnings.warn(pytest.PytestUnhandledThreadExceptionWarning(msg))

apache_beam/examples/dataframe/flight_delays_it_test.py: 46 warnings
  <https://ci-beam.apache.org/job/beam_PostCommit_Python_Examples_Flink/ws/src/sdks/python/apache_beam/examples/dataframe/flight_delays.py>:47: FutureWarning: The default value of numeric_only in DataFrame.mean is deprecated. In a future version, it will default to False. In addition, specifying 'numeric_only=None' is deprecated. Select only valid columns or specify the value of numeric_only to silence this warning.
    return airline_df[at_top_airports].mean()

-- Docs: https://docs.pytest.org/en/stable/how-to/capture-warnings.html
- generated xml file: <https://ci-beam.apache.org/job/beam_PostCommit_Python_Examples_Flink/ws/src/sdks/python/pytest_postCommitExamples-flink-py38.xml> -
=========================== short test summary info ============================
FAILED apache_beam/examples/complete/juliaset/juliaset/juliaset_test.py::JuliaSetTest::test_output_file_format - Failed: Timeout >600.0s [while running 'WriteToText/Write/WriteImpl/PreFinalize']
= 1 failed, 18 passed, 18 skipped, 7259 deselected, 65 warnings in 1094.34s (0:18:14) =

> Task :sdks:python:test-suites:portable:py38:flinkExamples FAILED

FAILURE: Build completed with 2 failures.

1: Task failed with an exception.
-----------
* Where:
Script '<https://ci-beam.apache.org/job/beam_PostCommit_Python_Examples_Flink/ws/src/sdks/python/test-suites/portable/common.gradle'> line: 245

* What went wrong:
Execution failed for task ':sdks:python:test-suites:portable:py311:flinkExamples'.
> Process 'command 'sh'' finished with non-zero exit value 1

* Try:
> Run with --stacktrace option to get the stack trace.
> Run with --info or --debug option to get more log output.
> Get more help at https://help.gradle.org.
==============================================================================

2: Task failed with an exception.
-----------
* Where:
Script '<https://ci-beam.apache.org/job/beam_PostCommit_Python_Examples_Flink/ws/src/sdks/python/test-suites/portable/common.gradle'> line: 245

* What went wrong:
Execution failed for task ':sdks:python:test-suites:portable:py38:flinkExamples'.
> Process 'command 'sh'' finished with non-zero exit value 1

* Try:
> Run with --stacktrace option to get the stack trace.
> Run with --info or --debug option to get more log output.
> Get more help at https://help.gradle.org.
==============================================================================

Deprecated Gradle features were used in this build, making it incompatible with Gradle 9.0.

You can use '--warning-mode all' to show the individual deprecation warnings and determine if they come from your own scripts or plugins.

For more on this, please refer to https://docs.gradle.org/8.4/userguide/command_line_interface.html#sec:command_line_warnings in the Gradle documentation.

BUILD FAILED in 24m 16s
136 actionable tasks: 90 executed, 46 from cache

Publishing build scan...

The request was rejected.
Gradle Enterprise plugin version 3.16 is newer than the newest version supported by Gradle Enterprise 2023.3.4 which is 3.15. Please update to a newer version of Gradle Enterprise.

Build step 'Invoke Gradle script' changed build result to FAILURE
Build step 'Invoke Gradle script' marked build as failure

---------------------------------------------------------------------
To unsubscribe, e-mail: builds-unsubscribe@beam.apache.org
For additional commands, e-mail: builds-help@beam.apache.org


Jenkins build is back to normal : beam_PostCommit_Python_Examples_Flink #2743

Posted by Apache Jenkins Server <je...@builds.apache.org>.
See <https://ci-beam.apache.org/job/beam_PostCommit_Python_Examples_Flink/2743/display/redirect>


---------------------------------------------------------------------
To unsubscribe, e-mail: builds-unsubscribe@beam.apache.org
For additional commands, e-mail: builds-help@beam.apache.org


Build failed in Jenkins: beam_PostCommit_Python_Examples_Flink #2742

Posted by Apache Jenkins Server <je...@builds.apache.org>.
See <https://ci-beam.apache.org/job/beam_PostCommit_Python_Examples_Flink/2742/display/redirect>

Changes:


------------------------------------------
[...truncated 50.83 MB...]
    File "<https://ci-beam.apache.org/job/beam_PostCommit_Python_Examples_Flink/ws/src/build/gradleenv/2022703442/lib/python3.8/site-packages/grpc/_channel.py",> line 540, in __next__
      return self._next()
    File "<https://ci-beam.apache.org/job/beam_PostCommit_Python_Examples_Flink/ws/src/build/gradleenv/2022703442/lib/python3.8/site-packages/grpc/_channel.py",> line 966, in _next
      raise self
  grpc._channel._MultiThreadedRendezvous: <_MultiThreadedRendezvous of RPC that terminated with:
  	status = StatusCode.CANCELLED
  	details = "Multiplexer hanging up"
  	debug_error_string = "UNKNOWN:Error received from peer ipv6:%5B::1%5D:45387 {grpc_message:"Multiplexer hanging up", grpc_status:1, created_time:"2023-12-31T21:46:43.619578725+00:00"}"
  >
  
    warnings.warn(pytest.PytestUnhandledThreadExceptionWarning(msg))

apache_beam/examples/complete/top_wikipedia_sessions_it_test.py::ComputeTopSessionsIT::test_top_wikipedia_sessions_output_files_on_small_input
  <https://ci-beam.apache.org/job/beam_PostCommit_Python_Examples_Flink/ws/src/build/gradleenv/2022703442/lib/python3.8/site-packages/_pytest/threadexception.py>:73: PytestUnhandledThreadExceptionWarning: Exception in thread read_grpc_client_inputs
  
  Traceback (most recent call last):
    File "/usr/lib/python3.8/threading.py", line 932, in _bootstrap_inner
      self.run()
    File "/usr/lib/python3.8/threading.py", line 870, in run
      self._target(*self._args, **self._kwargs)
    File "<https://ci-beam.apache.org/job/beam_PostCommit_Python_Examples_Flink/ws/src/sdks/python/apache_beam/runners/worker/data_plane.py",> line 686, in <lambda>
      target=lambda: self._read_inputs(elements_iterator),
    File "<https://ci-beam.apache.org/job/beam_PostCommit_Python_Examples_Flink/ws/src/sdks/python/apache_beam/runners/worker/data_plane.py",> line 669, in _read_inputs
      for elements in elements_iterator:
    File "<https://ci-beam.apache.org/job/beam_PostCommit_Python_Examples_Flink/ws/src/build/gradleenv/2022703442/lib/python3.8/site-packages/grpc/_channel.py",> line 540, in __next__
      return self._next()
    File "<https://ci-beam.apache.org/job/beam_PostCommit_Python_Examples_Flink/ws/src/build/gradleenv/2022703442/lib/python3.8/site-packages/grpc/_channel.py",> line 966, in _next
      raise self
  grpc._channel._MultiThreadedRendezvous: <_MultiThreadedRendezvous of RPC that terminated with:
  	status = StatusCode.CANCELLED
  	details = "Multiplexer hanging up"
  	debug_error_string = "UNKNOWN:Error received from peer ipv6:%5B::1%5D:44133 {created_time:"2023-12-31T21:47:00.268857992+00:00", grpc_status:1, grpc_message:"Multiplexer hanging up"}"
  >
  
    warnings.warn(pytest.PytestUnhandledThreadExceptionWarning(msg))

apache_beam/examples/complete/game/hourly_team_score_it_test.py::HourlyTeamScoreIT::test_hourly_team_score_output_checksum_on_small_input
  <https://ci-beam.apache.org/job/beam_PostCommit_Python_Examples_Flink/ws/src/sdks/python/apache_beam/io/gcp/tests/utils.py>:63: PendingDeprecationWarning: Client.dataset is deprecated and will be removed in a future version. Use a string like 'my_project.my_dataset' or a cloud.google.bigquery.DatasetReference object, instead.
    dataset_ref = client.dataset(unique_dataset_name, project=project)

apache_beam/examples/complete/game/hourly_team_score_it_test.py::HourlyTeamScoreIT::test_hourly_team_score_output_checksum_on_small_input
  <https://ci-beam.apache.org/job/beam_PostCommit_Python_Examples_Flink/ws/src/build/gradleenv/2022703442/lib/python3.8/site-packages/_pytest/threadexception.py>:73: PytestUnhandledThreadExceptionWarning: Exception in thread read_grpc_client_inputs
  
  Traceback (most recent call last):
    File "/usr/lib/python3.8/threading.py", line 932, in _bootstrap_inner
      self.run()
    File "/usr/lib/python3.8/threading.py", line 870, in run
      self._target(*self._args, **self._kwargs)
    File "<https://ci-beam.apache.org/job/beam_PostCommit_Python_Examples_Flink/ws/src/sdks/python/apache_beam/runners/worker/data_plane.py",> line 686, in <lambda>
      target=lambda: self._read_inputs(elements_iterator),
    File "<https://ci-beam.apache.org/job/beam_PostCommit_Python_Examples_Flink/ws/src/sdks/python/apache_beam/runners/worker/data_plane.py",> line 669, in _read_inputs
      for elements in elements_iterator:
    File "<https://ci-beam.apache.org/job/beam_PostCommit_Python_Examples_Flink/ws/src/build/gradleenv/2022703442/lib/python3.8/site-packages/grpc/_channel.py",> line 540, in __next__
      return self._next()
    File "<https://ci-beam.apache.org/job/beam_PostCommit_Python_Examples_Flink/ws/src/build/gradleenv/2022703442/lib/python3.8/site-packages/grpc/_channel.py",> line 966, in _next
      raise self
  grpc._channel._MultiThreadedRendezvous: <_MultiThreadedRendezvous of RPC that terminated with:
  	status = StatusCode.CANCELLED
  	details = "Multiplexer hanging up"
  	debug_error_string = "UNKNOWN:Error received from peer ipv6:%5B::1%5D:38197 {grpc_message:"Multiplexer hanging up", grpc_status:1, created_time:"2023-12-31T21:47:27.398029474+00:00"}"
  >
  
    warnings.warn(pytest.PytestUnhandledThreadExceptionWarning(msg))

apache_beam/examples/complete/game/user_score_it_test.py::UserScoreIT::test_userscore_output_checksum_on_small_input
  <https://ci-beam.apache.org/job/beam_PostCommit_Python_Examples_Flink/ws/src/build/gradleenv/2022703442/lib/python3.8/site-packages/_pytest/threadexception.py>:73: PytestUnhandledThreadExceptionWarning: Exception in thread read_grpc_client_inputs
  
  Traceback (most recent call last):
    File "/usr/lib/python3.8/threading.py", line 932, in _bootstrap_inner
      self.run()
    File "/usr/lib/python3.8/threading.py", line 870, in run
      self._target(*self._args, **self._kwargs)
    File "<https://ci-beam.apache.org/job/beam_PostCommit_Python_Examples_Flink/ws/src/sdks/python/apache_beam/runners/worker/data_plane.py",> line 686, in <lambda>
      target=lambda: self._read_inputs(elements_iterator),
    File "<https://ci-beam.apache.org/job/beam_PostCommit_Python_Examples_Flink/ws/src/sdks/python/apache_beam/runners/worker/data_plane.py",> line 669, in _read_inputs
      for elements in elements_iterator:
    File "<https://ci-beam.apache.org/job/beam_PostCommit_Python_Examples_Flink/ws/src/build/gradleenv/2022703442/lib/python3.8/site-packages/grpc/_channel.py",> line 540, in __next__
      return self._next()
    File "<https://ci-beam.apache.org/job/beam_PostCommit_Python_Examples_Flink/ws/src/build/gradleenv/2022703442/lib/python3.8/site-packages/grpc/_channel.py",> line 966, in _next
      raise self
  grpc._channel._MultiThreadedRendezvous: <_MultiThreadedRendezvous of RPC that terminated with:
  	status = StatusCode.CANCELLED
  	details = "Multiplexer hanging up"
  	debug_error_string = "UNKNOWN:Error received from peer ipv6:%5B::1%5D:34499 {created_time:"2023-12-31T21:47:58.034349509+00:00", grpc_status:1, grpc_message:"Multiplexer hanging up"}"
  >
  
    warnings.warn(pytest.PytestUnhandledThreadExceptionWarning(msg))

apache_beam/examples/cookbook/bigquery_tornadoes_it_test.py::BigqueryTornadoesIT::test_bigquery_tornadoes_it
apache_beam/examples/cookbook/filters_test.py::FiltersTest::test_filters_output_bigquery_matcher
  <https://ci-beam.apache.org/job/beam_PostCommit_Python_Examples_Flink/ws/src/sdks/python/apache_beam/io/gcp/tests/utils.py>:100: PendingDeprecationWarning: Client.dataset is deprecated and will be removed in a future version. Use a string like 'my_project.my_dataset' or a cloud.google.bigquery.DatasetReference object, instead.
    table_ref = client.dataset(dataset_id).table(table_id)

apache_beam/examples/cookbook/coders_it_test.py::CodersIT::test_coders_output_files_on_small_input
  <https://ci-beam.apache.org/job/beam_PostCommit_Python_Examples_Flink/ws/src/build/gradleenv/2022703442/lib/python3.8/site-packages/_pytest/threadexception.py>:73: PytestUnhandledThreadExceptionWarning: Exception in thread read_grpc_client_inputs
  
  Traceback (most recent call last):
    File "/usr/lib/python3.8/threading.py", line 932, in _bootstrap_inner
      self.run()
    File "/usr/lib/python3.8/threading.py", line 870, in run
      self._target(*self._args, **self._kwargs)
    File "<https://ci-beam.apache.org/job/beam_PostCommit_Python_Examples_Flink/ws/src/sdks/python/apache_beam/runners/worker/data_plane.py",> line 686, in <lambda>
      target=lambda: self._read_inputs(elements_iterator),
    File "<https://ci-beam.apache.org/job/beam_PostCommit_Python_Examples_Flink/ws/src/sdks/python/apache_beam/runners/worker/data_plane.py",> line 669, in _read_inputs
      for elements in elements_iterator:
    File "<https://ci-beam.apache.org/job/beam_PostCommit_Python_Examples_Flink/ws/src/build/gradleenv/2022703442/lib/python3.8/site-packages/grpc/_channel.py",> line 540, in __next__
      return self._next()
    File "<https://ci-beam.apache.org/job/beam_PostCommit_Python_Examples_Flink/ws/src/build/gradleenv/2022703442/lib/python3.8/site-packages/grpc/_channel.py",> line 966, in _next
      raise self
  grpc._channel._MultiThreadedRendezvous: <_MultiThreadedRendezvous of RPC that terminated with:
  	status = StatusCode.CANCELLED
  	details = "Multiplexer hanging up"
  	debug_error_string = "UNKNOWN:Error received from peer ipv6:%5B::1%5D:33345 {created_time:"2023-12-31T21:58:57.783579148+00:00", grpc_status:1, grpc_message:"Multiplexer hanging up"}"
  >
  
    warnings.warn(pytest.PytestUnhandledThreadExceptionWarning(msg))

apache_beam/examples/cookbook/custom_ptransform_it_test.py::CustomPTransformIT::test_custom_ptransform_output_files_on_small_input
  <https://ci-beam.apache.org/job/beam_PostCommit_Python_Examples_Flink/ws/src/build/gradleenv/2022703442/lib/python3.8/site-packages/_pytest/threadexception.py>:73: PytestUnhandledThreadExceptionWarning: Exception in thread read_grpc_client_inputs
  
  Traceback (most recent call last):
    File "/usr/lib/python3.8/threading.py", line 932, in _bootstrap_inner
      self.run()
    File "/usr/lib/python3.8/threading.py", line 870, in run
      self._target(*self._args, **self._kwargs)
    File "<https://ci-beam.apache.org/job/beam_PostCommit_Python_Examples_Flink/ws/src/sdks/python/apache_beam/runners/worker/data_plane.py",> line 686, in <lambda>
      target=lambda: self._read_inputs(elements_iterator),
    File "<https://ci-beam.apache.org/job/beam_PostCommit_Python_Examples_Flink/ws/src/sdks/python/apache_beam/runners/worker/data_plane.py",> line 669, in _read_inputs
      for elements in elements_iterator:
    File "<https://ci-beam.apache.org/job/beam_PostCommit_Python_Examples_Flink/ws/src/build/gradleenv/2022703442/lib/python3.8/site-packages/grpc/_channel.py",> line 540, in __next__
      return self._next()
    File "<https://ci-beam.apache.org/job/beam_PostCommit_Python_Examples_Flink/ws/src/build/gradleenv/2022703442/lib/python3.8/site-packages/grpc/_channel.py",> line 966, in _next
      raise self
  grpc._channel._MultiThreadedRendezvous: <_MultiThreadedRendezvous of RPC that terminated with:
  	status = StatusCode.CANCELLED
  	details = "Multiplexer hanging up"
  	debug_error_string = "UNKNOWN:Error received from peer ipv6:%5B::1%5D:41397 {grpc_message:"Multiplexer hanging up", grpc_status:1, created_time:"2023-12-31T21:59:50.947507912+00:00"}"
  >
  
    warnings.warn(pytest.PytestUnhandledThreadExceptionWarning(msg))

apache_beam/examples/cookbook/filters_test.py::FiltersTest::test_filters_output_bigquery_matcher
  <https://ci-beam.apache.org/job/beam_PostCommit_Python_Examples_Flink/ws/src/build/gradleenv/2022703442/lib/python3.8/site-packages/_pytest/threadexception.py>:73: PytestUnhandledThreadExceptionWarning: Exception in thread read_grpc_client_inputs
  
  Traceback (most recent call last):
    File "/usr/lib/python3.8/threading.py", line 932, in _bootstrap_inner
      self.run()
    File "/usr/lib/python3.8/threading.py", line 870, in run
      self._target(*self._args, **self._kwargs)
    File "<https://ci-beam.apache.org/job/beam_PostCommit_Python_Examples_Flink/ws/src/sdks/python/apache_beam/runners/worker/data_plane.py",> line 686, in <lambda>
      target=lambda: self._read_inputs(elements_iterator),
    File "<https://ci-beam.apache.org/job/beam_PostCommit_Python_Examples_Flink/ws/src/sdks/python/apache_beam/runners/worker/data_plane.py",> line 669, in _read_inputs
      for elements in elements_iterator:
    File "<https://ci-beam.apache.org/job/beam_PostCommit_Python_Examples_Flink/ws/src/build/gradleenv/2022703442/lib/python3.8/site-packages/grpc/_channel.py",> line 540, in __next__
      return self._next()
    File "<https://ci-beam.apache.org/job/beam_PostCommit_Python_Examples_Flink/ws/src/build/gradleenv/2022703442/lib/python3.8/site-packages/grpc/_channel.py",> line 966, in _next
      raise self
  grpc._channel._MultiThreadedRendezvous: <_MultiThreadedRendezvous of RPC that terminated with:
  	status = StatusCode.CANCELLED
  	details = "Multiplexer hanging up"
  	debug_error_string = "UNKNOWN:Error received from peer ipv6:%5B::1%5D:46333 {created_time:"2023-12-31T22:00:19.552907611+00:00", grpc_status:1, grpc_message:"Multiplexer hanging up"}"
  >
  
    warnings.warn(pytest.PytestUnhandledThreadExceptionWarning(msg))

apache_beam/examples/cookbook/group_with_coder_test.py::GroupWithCoderTest::test_basics_without_type_check
  <https://ci-beam.apache.org/job/beam_PostCommit_Python_Examples_Flink/ws/src/build/gradleenv/2022703442/lib/python3.8/site-packages/_pytest/threadexception.py>:73: PytestUnhandledThreadExceptionWarning: Exception in thread read_grpc_client_inputs
  
  Traceback (most recent call last):
    File "/usr/lib/python3.8/threading.py", line 932, in _bootstrap_inner
      self.run()
    File "/usr/lib/python3.8/threading.py", line 870, in run
      self._target(*self._args, **self._kwargs)
    File "<https://ci-beam.apache.org/job/beam_PostCommit_Python_Examples_Flink/ws/src/sdks/python/apache_beam/runners/worker/data_plane.py",> line 686, in <lambda>
      target=lambda: self._read_inputs(elements_iterator),
    File "<https://ci-beam.apache.org/job/beam_PostCommit_Python_Examples_Flink/ws/src/sdks/python/apache_beam/runners/worker/data_plane.py",> line 669, in _read_inputs
      for elements in elements_iterator:
    File "<https://ci-beam.apache.org/job/beam_PostCommit_Python_Examples_Flink/ws/src/build/gradleenv/2022703442/lib/python3.8/site-packages/grpc/_channel.py",> line 540, in __next__
      return self._next()
    File "<https://ci-beam.apache.org/job/beam_PostCommit_Python_Examples_Flink/ws/src/build/gradleenv/2022703442/lib/python3.8/site-packages/grpc/_channel.py",> line 966, in _next
      raise self
  grpc._channel._MultiThreadedRendezvous: <_MultiThreadedRendezvous of RPC that terminated with:
  	status = StatusCode.CANCELLED
  	details = "Multiplexer hanging up"
  	debug_error_string = "UNKNOWN:Error received from peer ipv6:%5B::1%5D:34729 {created_time:"2023-12-31T22:01:05.312252402+00:00", grpc_status:1, grpc_message:"Multiplexer hanging up"}"
  >
  
    warnings.warn(pytest.PytestUnhandledThreadExceptionWarning(msg))

apache_beam/examples/dataframe/flight_delays_it_test.py: 46 warnings
  <https://ci-beam.apache.org/job/beam_PostCommit_Python_Examples_Flink/ws/src/sdks/python/apache_beam/examples/dataframe/flight_delays.py>:47: FutureWarning: The default value of numeric_only in DataFrame.mean is deprecated. In a future version, it will default to False. In addition, specifying 'numeric_only=None' is deprecated. Select only valid columns or specify the value of numeric_only to silence this warning.
    return airline_df[at_top_airports].mean()

-- Docs: https://docs.pytest.org/en/stable/how-to/capture-warnings.html
- generated xml file: <https://ci-beam.apache.org/job/beam_PostCommit_Python_Examples_Flink/ws/src/sdks/python/pytest_postCommitExamples-flink-py38.xml> -
=========================== short test summary info ============================
FAILED apache_beam/examples/complete/juliaset/juliaset/juliaset_test.py::JuliaSetTest::test_output_file_format - Failed: Timeout >600.0s [while running 'WriteToText/Write/WriteImpl/PreFinalize']
= 1 failed, 18 passed, 18 skipped, 7259 deselected, 63 warnings in 1085.37s (0:18:05) =

> Task :sdks:python:test-suites:portable:py38:flinkExamples FAILED

FAILURE: Build completed with 2 failures.

1: Task failed with an exception.
-----------
* Where:
Script '<https://ci-beam.apache.org/job/beam_PostCommit_Python_Examples_Flink/ws/src/sdks/python/test-suites/portable/common.gradle'> line: 245

* What went wrong:
Execution failed for task ':sdks:python:test-suites:portable:py311:flinkExamples'.
> Process 'command 'sh'' finished with non-zero exit value 1

* Try:
> Run with --stacktrace option to get the stack trace.
> Run with --info or --debug option to get more log output.
> Get more help at https://help.gradle.org.
==============================================================================

2: Task failed with an exception.
-----------
* Where:
Script '<https://ci-beam.apache.org/job/beam_PostCommit_Python_Examples_Flink/ws/src/sdks/python/test-suites/portable/common.gradle'> line: 245

* What went wrong:
Execution failed for task ':sdks:python:test-suites:portable:py38:flinkExamples'.
> Process 'command 'sh'' finished with non-zero exit value 1

* Try:
> Run with --stacktrace option to get the stack trace.
> Run with --info or --debug option to get more log output.
> Get more help at https://help.gradle.org.
==============================================================================

Deprecated Gradle features were used in this build, making it incompatible with Gradle 9.0.

You can use '--warning-mode all' to show the individual deprecation warnings and determine if they come from your own scripts or plugins.

For more on this, please refer to https://docs.gradle.org/8.4/userguide/command_line_interface.html#sec:command_line_warnings in the Gradle documentation.

BUILD FAILED in 24m 8s
136 actionable tasks: 90 executed, 46 from cache

Publishing build scan...

The request was rejected.
Gradle Enterprise plugin version 3.16 is newer than the newest version supported by Gradle Enterprise 2023.3.4 which is 3.15. Please update to a newer version of Gradle Enterprise.

Build step 'Invoke Gradle script' changed build result to FAILURE
Build step 'Invoke Gradle script' marked build as failure

---------------------------------------------------------------------
To unsubscribe, e-mail: builds-unsubscribe@beam.apache.org
For additional commands, e-mail: builds-help@beam.apache.org