You are viewing a plain text version of this content. The canonical link for it is here.
Posted to dev@kafka.apache.org by Apache Jenkins Server <je...@builds.apache.org> on 2017/01/23 18:05:02 UTC
Build failed in Jenkins: kafka-trunk-jdk8 #1203
See <https://builds.apache.org/job/kafka-trunk-jdk8/1203/changes>
Changes:
[ismael] MINOR: Pass RecordingLevel to MetricConfig in the broker
------------------------------------------
[...truncated 20927 lines...]
org.apache.kafka.connect.runtime.WorkerSinkTaskThreadedTest > testCommitTimeout PASSED
org.apache.kafka.connect.runtime.WorkerSinkTaskThreadedTest > testAssignmentPauseResume STARTED
org.apache.kafka.connect.runtime.WorkerSinkTaskThreadedTest > testAssignmentPauseResume PASSED
org.apache.kafka.connect.runtime.distributed.WorkerCoordinatorTest > testLeaderPerformAssignmentSingleTaskConnectors STARTED
org.apache.kafka.connect.runtime.distributed.WorkerCoordinatorTest > testLeaderPerformAssignmentSingleTaskConnectors PASSED
org.apache.kafka.connect.runtime.distributed.WorkerCoordinatorTest > testNormalJoinGroupFollower STARTED
org.apache.kafka.connect.runtime.distributed.WorkerCoordinatorTest > testNormalJoinGroupFollower PASSED
org.apache.kafka.connect.runtime.distributed.WorkerCoordinatorTest > testMetadata STARTED
org.apache.kafka.connect.runtime.distributed.WorkerCoordinatorTest > testMetadata PASSED
org.apache.kafka.connect.runtime.distributed.WorkerCoordinatorTest > testLeaderPerformAssignment1 STARTED
org.apache.kafka.connect.runtime.distributed.WorkerCoordinatorTest > testLeaderPerformAssignment1 PASSED
org.apache.kafka.connect.runtime.distributed.WorkerCoordinatorTest > testLeaderPerformAssignment2 STARTED
org.apache.kafka.connect.runtime.distributed.WorkerCoordinatorTest > testLeaderPerformAssignment2 PASSED
org.apache.kafka.connect.runtime.distributed.WorkerCoordinatorTest > testJoinLeaderCannotAssign STARTED
org.apache.kafka.connect.runtime.distributed.WorkerCoordinatorTest > testJoinLeaderCannotAssign PASSED
org.apache.kafka.connect.runtime.distributed.WorkerCoordinatorTest > testRejoinGroup STARTED
org.apache.kafka.connect.runtime.distributed.WorkerCoordinatorTest > testRejoinGroup PASSED
org.apache.kafka.connect.runtime.distributed.WorkerCoordinatorTest > testNormalJoinGroupLeader STARTED
org.apache.kafka.connect.runtime.distributed.WorkerCoordinatorTest > testNormalJoinGroupLeader PASSED
org.apache.kafka.connect.runtime.distributed.DistributedHerderTest > testPutConnectorConfig STARTED
org.apache.kafka.connect.runtime.distributed.DistributedHerderTest > testPutConnectorConfig PASSED
org.apache.kafka.connect.runtime.distributed.DistributedHerderTest > testAccessors STARTED
org.apache.kafka.connect.runtime.distributed.DistributedHerderTest > testAccessors PASSED
org.apache.kafka.connect.runtime.distributed.DistributedHerderTest > testCreateConnectorFailedBasicValidation STARTED
org.apache.kafka.connect.runtime.distributed.DistributedHerderTest > testCreateConnectorFailedBasicValidation PASSED
org.apache.kafka.connect.runtime.distributed.DistributedHerderTest > testDestroyConnector STARTED
org.apache.kafka.connect.runtime.distributed.DistributedHerderTest > testDestroyConnector PASSED
org.apache.kafka.connect.runtime.distributed.DistributedHerderTest > testRestartConnector STARTED
org.apache.kafka.connect.runtime.distributed.DistributedHerderTest > testRestartConnector PASSED
org.apache.kafka.connect.runtime.distributed.DistributedHerderTest > testCreateConnectorAlreadyExists STARTED
org.apache.kafka.connect.runtime.distributed.DistributedHerderTest > testCreateConnectorAlreadyExists PASSED
org.apache.kafka.connect.runtime.distributed.DistributedHerderTest > testCreateConnector STARTED
org.apache.kafka.connect.runtime.distributed.DistributedHerderTest > testCreateConnector PASSED
org.apache.kafka.connect.runtime.distributed.DistributedHerderTest > testRestartTask STARTED
org.apache.kafka.connect.runtime.distributed.DistributedHerderTest > testRestartTask PASSED
org.apache.kafka.connect.runtime.distributed.DistributedHerderTest > testCreateConnectorFailedCustomValidation STARTED
org.apache.kafka.connect.runtime.distributed.DistributedHerderTest > testCreateConnectorFailedCustomValidation PASSED
org.apache.kafka.connect.runtime.distributed.DistributedHerderTest > testJoinAssignment STARTED
org.apache.kafka.connect.runtime.distributed.DistributedHerderTest > testJoinAssignment PASSED
org.apache.kafka.connect.runtime.distributed.DistributedHerderTest > testRebalance STARTED
org.apache.kafka.connect.runtime.distributed.DistributedHerderTest > testRebalance PASSED
org.apache.kafka.connect.runtime.distributed.DistributedHerderTest > testRebalanceFailedConnector STARTED
org.apache.kafka.connect.runtime.distributed.DistributedHerderTest > testRebalanceFailedConnector PASSED
org.apache.kafka.connect.runtime.distributed.DistributedHerderTest > testHaltCleansUpWorker STARTED
org.apache.kafka.connect.runtime.distributed.DistributedHerderTest > testHaltCleansUpWorker PASSED
org.apache.kafka.connect.runtime.distributed.DistributedHerderTest > testConnectorNameConflictsWithWorkerGroupId STARTED
org.apache.kafka.connect.runtime.distributed.DistributedHerderTest > testConnectorNameConflictsWithWorkerGroupId PASSED
org.apache.kafka.connect.runtime.distributed.DistributedHerderTest > testRestartUnknownConnector STARTED
org.apache.kafka.connect.runtime.distributed.DistributedHerderTest > testRestartUnknownConnector PASSED
org.apache.kafka.connect.runtime.distributed.DistributedHerderTest > testRestartConnectorRedirectToLeader STARTED
org.apache.kafka.connect.runtime.distributed.DistributedHerderTest > testRestartConnectorRedirectToLeader PASSED
org.apache.kafka.connect.runtime.distributed.DistributedHerderTest > testRestartConnectorRedirectToOwner STARTED
org.apache.kafka.connect.runtime.distributed.DistributedHerderTest > testRestartConnectorRedirectToOwner PASSED
org.apache.kafka.connect.runtime.distributed.DistributedHerderTest > testRestartUnknownTask STARTED
org.apache.kafka.connect.runtime.distributed.DistributedHerderTest > testRestartUnknownTask PASSED
org.apache.kafka.connect.runtime.distributed.DistributedHerderTest > testRequestProcessingOrder STARTED
org.apache.kafka.connect.runtime.distributed.DistributedHerderTest > testRequestProcessingOrder PASSED
org.apache.kafka.connect.runtime.distributed.DistributedHerderTest > testRestartTaskRedirectToLeader STARTED
org.apache.kafka.connect.runtime.distributed.DistributedHerderTest > testRestartTaskRedirectToLeader PASSED
org.apache.kafka.connect.runtime.distributed.DistributedHerderTest > testRestartTaskRedirectToOwner STARTED
org.apache.kafka.connect.runtime.distributed.DistributedHerderTest > testRestartTaskRedirectToOwner PASSED
org.apache.kafka.connect.runtime.distributed.DistributedHerderTest > testConnectorConfigAdded STARTED
org.apache.kafka.connect.runtime.distributed.DistributedHerderTest > testConnectorConfigAdded PASSED
org.apache.kafka.connect.runtime.distributed.DistributedHerderTest > testConnectorConfigUpdate STARTED
org.apache.kafka.connect.runtime.distributed.DistributedHerderTest > testConnectorConfigUpdate PASSED
org.apache.kafka.connect.runtime.distributed.DistributedHerderTest > testConnectorPaused STARTED
org.apache.kafka.connect.runtime.distributed.DistributedHerderTest > testConnectorPaused PASSED
org.apache.kafka.connect.runtime.distributed.DistributedHerderTest > testConnectorResumed STARTED
org.apache.kafka.connect.runtime.distributed.DistributedHerderTest > testConnectorResumed PASSED
org.apache.kafka.connect.runtime.distributed.DistributedHerderTest > testUnknownConnectorPaused STARTED
org.apache.kafka.connect.runtime.distributed.DistributedHerderTest > testUnknownConnectorPaused PASSED
org.apache.kafka.connect.runtime.distributed.DistributedHerderTest > testConnectorPausedRunningTaskOnly STARTED
org.apache.kafka.connect.runtime.distributed.DistributedHerderTest > testConnectorPausedRunningTaskOnly PASSED
org.apache.kafka.connect.runtime.distributed.DistributedHerderTest > testConnectorResumedRunningTaskOnly STARTED
org.apache.kafka.connect.runtime.distributed.DistributedHerderTest > testConnectorResumedRunningTaskOnly PASSED
org.apache.kafka.connect.runtime.distributed.DistributedHerderTest > testTaskConfigAdded STARTED
org.apache.kafka.connect.runtime.distributed.DistributedHerderTest > testTaskConfigAdded PASSED
org.apache.kafka.connect.runtime.distributed.DistributedHerderTest > testJoinLeaderCatchUpFails STARTED
org.apache.kafka.connect.runtime.distributed.DistributedHerderTest > testJoinLeaderCatchUpFails PASSED
org.apache.kafka.connect.runtime.distributed.DistributedHerderTest > testInconsistentConfigs STARTED
org.apache.kafka.connect.runtime.distributed.DistributedHerderTest > testInconsistentConfigs PASSED
org.apache.kafka.connect.runtime.ConnectorConfigTest > unconfiguredTransform STARTED
org.apache.kafka.connect.runtime.ConnectorConfigTest > unconfiguredTransform PASSED
org.apache.kafka.connect.runtime.ConnectorConfigTest > multipleTransformsOneDangling STARTED
org.apache.kafka.connect.runtime.ConnectorConfigTest > multipleTransformsOneDangling PASSED
org.apache.kafka.connect.runtime.ConnectorConfigTest > misconfiguredTransform STARTED
org.apache.kafka.connect.runtime.ConnectorConfigTest > misconfiguredTransform PASSED
org.apache.kafka.connect.runtime.ConnectorConfigTest > noTransforms STARTED
org.apache.kafka.connect.runtime.ConnectorConfigTest > noTransforms PASSED
org.apache.kafka.connect.runtime.ConnectorConfigTest > danglingTransformAlias STARTED
org.apache.kafka.connect.runtime.ConnectorConfigTest > danglingTransformAlias PASSED
org.apache.kafka.connect.runtime.ConnectorConfigTest > multipleTransforms STARTED
org.apache.kafka.connect.runtime.ConnectorConfigTest > multipleTransforms PASSED
org.apache.kafka.connect.runtime.ConnectorConfigTest > singleTransform STARTED
org.apache.kafka.connect.runtime.ConnectorConfigTest > singleTransform PASSED
org.apache.kafka.connect.runtime.ConnectorConfigTest > wrongTransformationType STARTED
org.apache.kafka.connect.runtime.ConnectorConfigTest > wrongTransformationType PASSED
org.apache.kafka.connect.util.ShutdownableThreadTest > testGracefulShutdown STARTED
org.apache.kafka.connect.util.ShutdownableThreadTest > testGracefulShutdown PASSED
org.apache.kafka.connect.util.ShutdownableThreadTest > testForcibleShutdown STARTED
org.apache.kafka.connect.util.ShutdownableThreadTest > testForcibleShutdown PASSED
org.apache.kafka.connect.util.KafkaBasedLogTest > testStartStop STARTED
org.apache.kafka.connect.util.KafkaBasedLogTest > testStartStop PASSED
org.apache.kafka.connect.util.KafkaBasedLogTest > testReloadOnStart STARTED
org.apache.kafka.connect.util.KafkaBasedLogTest > testReloadOnStart PASSED
org.apache.kafka.connect.util.KafkaBasedLogTest > testReloadOnStartWithNoNewRecordsPresent STARTED
org.apache.kafka.connect.util.KafkaBasedLogTest > testReloadOnStartWithNoNewRecordsPresent PASSED
org.apache.kafka.connect.util.KafkaBasedLogTest > testSendAndReadToEnd STARTED
org.apache.kafka.connect.util.KafkaBasedLogTest > testSendAndReadToEnd PASSED
org.apache.kafka.connect.util.KafkaBasedLogTest > testConsumerError STARTED
org.apache.kafka.connect.util.KafkaBasedLogTest > testConsumerError PASSED
org.apache.kafka.connect.util.KafkaBasedLogTest > testProducerError STARTED
org.apache.kafka.connect.util.KafkaBasedLogTest > testProducerError PASSED
org.apache.kafka.connect.util.TableTest > basicOperations STARTED
org.apache.kafka.connect.util.TableTest > basicOperations PASSED
199 tests completed, 1 failed
:connect:runtime:test FAILED
FAILURE: Build failed with an exception.
* What went wrong:
Execution failed for task ':connect:runtime:test'.
> There were failing tests. See the report at: file://<https://builds.apache.org/job/kafka-trunk-jdk8/ws/connect/runtime/build/reports/tests/test/index.html>
* Try:
Run with --stacktrace option to get the stack trace. Run with --info or --debug option to get more log output.
BUILD FAILED
Total time: 1 hrs 50 mins 53.737 secs
Build step 'Execute shell' marked build as failure
Recording test results
Setting GRADLE_2_4_RC_2_HOME=/home/jenkins/jenkins-slave/tools/hudson.plugins.gradle.GradleInstallation/Gradle_2.4-rc-2
Setting GRADLE_2_4_RC_2_HOME=/home/jenkins/jenkins-slave/tools/hudson.plugins.gradle.GradleInstallation/Gradle_2.4-rc-2
Build failed in Jenkins: kafka-trunk-jdk8 #1205
Posted by Apache Jenkins Server <je...@builds.apache.org>.
See <https://builds.apache.org/job/kafka-trunk-jdk8/1205/changes>
Changes:
[wangguoz] KAFKA-4060 Follow-up: update docs accordingly
[jason] KAFKA-4633; Always using regex pattern subscription in StreamThread
------------------------------------------
[...truncated 8401 lines...]
kafka.integration.SaslPlaintextTopicMetadataTest > testIsrAfterBrokerShutDownAndJoinsBack STARTED
kafka.integration.SaslPlaintextTopicMetadataTest > testIsrAfterBrokerShutDownAndJoinsBack PASSED
kafka.integration.SaslPlaintextTopicMetadataTest > testAutoCreateTopicWithCollision STARTED
kafka.integration.SaslPlaintextTopicMetadataTest > testAutoCreateTopicWithCollision PASSED
kafka.integration.SaslPlaintextTopicMetadataTest > testAliveBrokerListWithNoTopics STARTED
kafka.integration.SaslPlaintextTopicMetadataTest > testAliveBrokerListWithNoTopics PASSED
kafka.integration.SaslPlaintextTopicMetadataTest > testAutoCreateTopic STARTED
kafka.integration.SaslPlaintextTopicMetadataTest > testAutoCreateTopic PASSED
kafka.integration.SaslPlaintextTopicMetadataTest > testGetAllTopicMetadata STARTED
kafka.integration.SaslPlaintextTopicMetadataTest > testGetAllTopicMetadata PASSED
kafka.integration.SaslPlaintextTopicMetadataTest > testAliveBrokersListWithNoTopicsAfterNewBrokerStartup STARTED
kafka.integration.SaslPlaintextTopicMetadataTest > testAliveBrokersListWithNoTopicsAfterNewBrokerStartup PASSED
kafka.integration.SaslPlaintextTopicMetadataTest > testBasicTopicMetadata STARTED
kafka.integration.SaslPlaintextTopicMetadataTest > testBasicTopicMetadata PASSED
kafka.integration.SaslPlaintextTopicMetadataTest > testAutoCreateTopicWithInvalidReplication STARTED
kafka.integration.SaslPlaintextTopicMetadataTest > testAutoCreateTopicWithInvalidReplication PASSED
kafka.integration.SaslPlaintextTopicMetadataTest > testAliveBrokersListWithNoTopicsAfterABrokerShutdown STARTED
kafka.integration.SaslPlaintextTopicMetadataTest > testAliveBrokersListWithNoTopicsAfterABrokerShutdown PASSED
kafka.integration.PrimitiveApiTest > testMultiProduce STARTED
kafka.integration.PrimitiveApiTest > testMultiProduce PASSED
kafka.integration.PrimitiveApiTest > testDefaultEncoderProducerAndFetch STARTED
kafka.integration.PrimitiveApiTest > testDefaultEncoderProducerAndFetch PASSED
kafka.integration.PrimitiveApiTest > testFetchRequestCanProperlySerialize STARTED
kafka.integration.PrimitiveApiTest > testFetchRequestCanProperlySerialize PASSED
kafka.integration.PrimitiveApiTest > testPipelinedProduceRequests STARTED
kafka.integration.PrimitiveApiTest > testPipelinedProduceRequests PASSED
kafka.integration.PrimitiveApiTest > testProduceAndMultiFetch STARTED
kafka.integration.PrimitiveApiTest > testProduceAndMultiFetch PASSED
kafka.integration.PrimitiveApiTest > testDefaultEncoderProducerAndFetchWithCompression STARTED
kafka.integration.PrimitiveApiTest > testDefaultEncoderProducerAndFetchWithCompression PASSED
kafka.integration.PrimitiveApiTest > testConsumerEmptyTopic STARTED
kafka.integration.PrimitiveApiTest > testConsumerEmptyTopic PASSED
kafka.integration.PrimitiveApiTest > testEmptyFetchRequest STARTED
kafka.integration.PrimitiveApiTest > testEmptyFetchRequest PASSED
kafka.integration.PlaintextTopicMetadataTest > testIsrAfterBrokerShutDownAndJoinsBack STARTED
kafka.integration.PlaintextTopicMetadataTest > testIsrAfterBrokerShutDownAndJoinsBack PASSED
kafka.integration.PlaintextTopicMetadataTest > testAutoCreateTopicWithCollision STARTED
kafka.integration.PlaintextTopicMetadataTest > testAutoCreateTopicWithCollision PASSED
kafka.integration.PlaintextTopicMetadataTest > testAliveBrokerListWithNoTopics STARTED
kafka.integration.PlaintextTopicMetadataTest > testAliveBrokerListWithNoTopics PASSED
kafka.integration.PlaintextTopicMetadataTest > testAutoCreateTopic STARTED
kafka.integration.PlaintextTopicMetadataTest > testAutoCreateTopic PASSED
kafka.integration.PlaintextTopicMetadataTest > testGetAllTopicMetadata STARTED
kafka.integration.PlaintextTopicMetadataTest > testGetAllTopicMetadata PASSED
kafka.integration.PlaintextTopicMetadataTest > testAliveBrokersListWithNoTopicsAfterNewBrokerStartup STARTED
kafka.integration.PlaintextTopicMetadataTest > testAliveBrokersListWithNoTopicsAfterNewBrokerStartup PASSED
kafka.integration.PlaintextTopicMetadataTest > testBasicTopicMetadata STARTED
kafka.integration.PlaintextTopicMetadataTest > testBasicTopicMetadata PASSED
kafka.integration.PlaintextTopicMetadataTest > testAutoCreateTopicWithInvalidReplication STARTED
kafka.integration.PlaintextTopicMetadataTest > testAutoCreateTopicWithInvalidReplication PASSED
kafka.integration.PlaintextTopicMetadataTest > testAliveBrokersListWithNoTopicsAfterABrokerShutdown STARTED
kafka.integration.PlaintextTopicMetadataTest > testAliveBrokersListWithNoTopicsAfterABrokerShutdown PASSED
kafka.integration.AutoOffsetResetTest > testResetToLatestWhenOffsetTooLow STARTED
kafka.integration.AutoOffsetResetTest > testResetToLatestWhenOffsetTooLow PASSED
kafka.integration.AutoOffsetResetTest > testResetToEarliestWhenOffsetTooLow STARTED
kafka.integration.AutoOffsetResetTest > testResetToEarliestWhenOffsetTooLow PASSED
kafka.integration.AutoOffsetResetTest > testResetToEarliestWhenOffsetTooHigh STARTED
kafka.integration.AutoOffsetResetTest > testResetToEarliestWhenOffsetTooHigh PASSED
kafka.integration.AutoOffsetResetTest > testResetToLatestWhenOffsetTooHigh STARTED
kafka.integration.AutoOffsetResetTest > testResetToLatestWhenOffsetTooHigh PASSED
kafka.integration.SslTopicMetadataTest > testIsrAfterBrokerShutDownAndJoinsBack STARTED
kafka.integration.SslTopicMetadataTest > testIsrAfterBrokerShutDownAndJoinsBack PASSED
kafka.integration.SslTopicMetadataTest > testAutoCreateTopicWithCollision STARTED
kafka.integration.SslTopicMetadataTest > testAutoCreateTopicWithCollision PASSED
kafka.integration.SslTopicMetadataTest > testAliveBrokerListWithNoTopics STARTED
kafka.integration.SslTopicMetadataTest > testAliveBrokerListWithNoTopics PASSED
kafka.integration.SslTopicMetadataTest > testAutoCreateTopic STARTED
kafka.integration.SslTopicMetadataTest > testAutoCreateTopic PASSED
kafka.integration.SslTopicMetadataTest > testGetAllTopicMetadata STARTED
kafka.integration.SslTopicMetadataTest > testGetAllTopicMetadata PASSED
kafka.integration.SslTopicMetadataTest > testAliveBrokersListWithNoTopicsAfterNewBrokerStartup STARTED
kafka.integration.SslTopicMetadataTest > testAliveBrokersListWithNoTopicsAfterNewBrokerStartup PASSED
kafka.integration.SslTopicMetadataTest > testBasicTopicMetadata STARTED
kafka.integration.SslTopicMetadataTest > testBasicTopicMetadata PASSED
kafka.integration.SslTopicMetadataTest > testAutoCreateTopicWithInvalidReplication STARTED
kafka.integration.SslTopicMetadataTest > testAutoCreateTopicWithInvalidReplication PASSED
kafka.integration.SslTopicMetadataTest > testAliveBrokersListWithNoTopicsAfterABrokerShutdown STARTED
kafka.integration.SslTopicMetadataTest > testAliveBrokersListWithNoTopicsAfterABrokerShutdown PASSED
kafka.integration.SaslSslTopicMetadataTest > testIsrAfterBrokerShutDownAndJoinsBack STARTED
kafka.integration.SaslSslTopicMetadataTest > testIsrAfterBrokerShutDownAndJoinsBack PASSED
kafka.integration.SaslSslTopicMetadataTest > testAutoCreateTopicWithCollision STARTED
kafka.integration.SaslSslTopicMetadataTest > testAutoCreateTopicWithCollision PASSED
kafka.integration.SaslSslTopicMetadataTest > testAliveBrokerListWithNoTopics STARTED
kafka.integration.SaslSslTopicMetadataTest > testAliveBrokerListWithNoTopics PASSED
kafka.integration.SaslSslTopicMetadataTest > testAutoCreateTopic STARTED
kafka.integration.SaslSslTopicMetadataTest > testAutoCreateTopic PASSED
kafka.integration.SaslSslTopicMetadataTest > testGetAllTopicMetadata STARTED
kafka.integration.SaslSslTopicMetadataTest > testGetAllTopicMetadata PASSED
kafka.integration.SaslSslTopicMetadataTest > testAliveBrokersListWithNoTopicsAfterNewBrokerStartup STARTED
kafka.integration.SaslSslTopicMetadataTest > testAliveBrokersListWithNoTopicsAfterNewBrokerStartup PASSED
kafka.integration.SaslSslTopicMetadataTest > testBasicTopicMetadata STARTED
kafka.integration.SaslSslTopicMetadataTest > testBasicTopicMetadata PASSED
kafka.integration.SaslSslTopicMetadataTest > testAutoCreateTopicWithInvalidReplication STARTED
kafka.integration.SaslSslTopicMetadataTest > testAutoCreateTopicWithInvalidReplication PASSED
kafka.integration.SaslSslTopicMetadataTest > testAliveBrokersListWithNoTopicsAfterABrokerShutdown STARTED
kafka.integration.SaslSslTopicMetadataTest > testAliveBrokersListWithNoTopicsAfterABrokerShutdown PASSED
kafka.integration.FetcherTest > testFetcher STARTED
kafka.integration.FetcherTest > testFetcher PASSED
kafka.integration.UncleanLeaderElectionTest > testUncleanLeaderElectionEnabled STARTED
kafka.integration.UncleanLeaderElectionTest > testUncleanLeaderElectionEnabled PASSED
kafka.integration.UncleanLeaderElectionTest > testCleanLeaderElectionDisabledByTopicOverride STARTED
kafka.integration.UncleanLeaderElectionTest > testCleanLeaderElectionDisabledByTopicOverride PASSED
kafka.integration.UncleanLeaderElectionTest > testUncleanLeaderElectionDisabled STARTED
kafka.integration.UncleanLeaderElectionTest > testUncleanLeaderElectionDisabled PASSED
kafka.integration.UncleanLeaderElectionTest > testUncleanLeaderElectionInvalidTopicOverride STARTED
kafka.integration.UncleanLeaderElectionTest > testUncleanLeaderElectionInvalidTopicOverride PASSED
kafka.integration.UncleanLeaderElectionTest > testUncleanLeaderElectionEnabledByTopicOverride STARTED
kafka.integration.UncleanLeaderElectionTest > testUncleanLeaderElectionEnabledByTopicOverride PASSED
kafka.integration.MinIsrConfigTest > testDefaultKafkaConfig STARTED
kafka.integration.MinIsrConfigTest > testDefaultKafkaConfig PASSED
unit.kafka.server.ApiVersionsTest > testApiVersions STARTED
unit.kafka.server.ApiVersionsTest > testApiVersions PASSED
integration.kafka.api.GroupCoordinatorIntegrationTest > testGroupCoordinatorPropagatesOfffsetsTopicCompressionCodec STARTED
integration.kafka.api.GroupCoordinatorIntegrationTest > testGroupCoordinatorPropagatesOfffsetsTopicCompressionCodec PASSED
1047 tests completed, 1 failed
:kafka-trunk-jdk8:core:test FAILED
:test_core_2_11 FAILED
FAILURE: Build failed with an exception.
* What went wrong:
Execution failed for task ':core:test'.
> There were failing tests. See the report at: file://<https://builds.apache.org/job/kafka-trunk-jdk8/ws/core/build/reports/tests/test/index.html>
* Try:
Run with --stacktrace option to get the stack trace. Run with --info or --debug option to get more log output.
BUILD FAILED
Total time: 1 hrs 41 mins 30.328 secs
Build step 'Execute shell' marked build as failure
Recording test results
Setting GRADLE_2_4_RC_2_HOME=/home/jenkins/jenkins-slave/tools/hudson.plugins.gradle.GradleInstallation/Gradle_2.4-rc-2
Setting GRADLE_2_4_RC_2_HOME=/home/jenkins/jenkins-slave/tools/hudson.plugins.gradle.GradleInstallation/Gradle_2.4-rc-2
Build failed in Jenkins: kafka-trunk-jdk8 #1204
Posted by Apache Jenkins Server <je...@builds.apache.org>.
See <https://builds.apache.org/job/kafka-trunk-jdk8/1204/changes>
Changes:
[ismael] MINOR: Improve scaladoc for Authorizer
[wangguoz] HOTFIX: KAFKA-4060 and KAFKA-4476 follow up
------------------------------------------
[...truncated 28498 lines...]
org.apache.kafka.common.security.scram.ScramCredentialUtilsTest > generateCredential PASSED
org.apache.kafka.common.security.scram.ScramCredentialUtilsTest > extraneousFields STARTED
org.apache.kafka.common.security.scram.ScramCredentialUtilsTest > extraneousFields PASSED
org.apache.kafka.common.security.scram.ScramCredentialUtilsTest > scramCredentialCache STARTED
org.apache.kafka.common.security.scram.ScramCredentialUtilsTest > scramCredentialCache PASSED
org.apache.kafka.common.security.scram.ScramCredentialUtilsTest > invalidCredential STARTED
org.apache.kafka.common.security.scram.ScramCredentialUtilsTest > invalidCredential PASSED
org.apache.kafka.common.security.scram.ScramFormatterTest > rfc7677Example STARTED
org.apache.kafka.common.security.scram.ScramFormatterTest > rfc7677Example PASSED
org.apache.kafka.common.security.scram.ScramFormatterTest > saslName STARTED
org.apache.kafka.common.security.scram.ScramFormatterTest > saslName PASSED
org.apache.kafka.common.security.scram.ScramMessagesTest > validClientFirstMessage STARTED
org.apache.kafka.common.security.scram.ScramMessagesTest > validClientFirstMessage PASSED
org.apache.kafka.common.security.scram.ScramMessagesTest > invalidClientFinalMessage STARTED
org.apache.kafka.common.security.scram.ScramMessagesTest > invalidClientFinalMessage PASSED
org.apache.kafka.common.security.scram.ScramMessagesTest > validServerFirstMessage STARTED
org.apache.kafka.common.security.scram.ScramMessagesTest > validServerFirstMessage PASSED
org.apache.kafka.common.security.scram.ScramMessagesTest > invalidServerFinalMessage STARTED
org.apache.kafka.common.security.scram.ScramMessagesTest > invalidServerFinalMessage PASSED
org.apache.kafka.common.security.scram.ScramMessagesTest > invalidClientFirstMessage STARTED
org.apache.kafka.common.security.scram.ScramMessagesTest > invalidClientFirstMessage PASSED
org.apache.kafka.common.security.scram.ScramMessagesTest > validClientFinalMessage STARTED
org.apache.kafka.common.security.scram.ScramMessagesTest > validClientFinalMessage PASSED
org.apache.kafka.common.security.scram.ScramMessagesTest > invalidServerFirstMessage STARTED
org.apache.kafka.common.security.scram.ScramMessagesTest > invalidServerFirstMessage PASSED
org.apache.kafka.common.security.scram.ScramMessagesTest > validServerFinalMessage STARTED
org.apache.kafka.common.security.scram.ScramMessagesTest > validServerFinalMessage PASSED
org.apache.kafka.common.security.ssl.SslFactoryTest > testClientMode STARTED
org.apache.kafka.common.security.ssl.SslFactoryTest > testClientMode PASSED
org.apache.kafka.common.security.ssl.SslFactoryTest > testSslFactoryConfiguration STARTED
org.apache.kafka.common.security.ssl.SslFactoryTest > testSslFactoryConfiguration PASSED
org.apache.kafka.common.security.kerberos.KerberosNameTest > testParse STARTED
org.apache.kafka.common.security.kerberos.KerberosNameTest > testParse PASSED
org.apache.kafka.common.security.auth.KafkaPrincipalTest > testPrincipalNameCanContainSeparator STARTED
org.apache.kafka.common.security.auth.KafkaPrincipalTest > testPrincipalNameCanContainSeparator PASSED
org.apache.kafka.common.security.auth.KafkaPrincipalTest > testEqualsAndHashCode STARTED
org.apache.kafka.common.security.auth.KafkaPrincipalTest > testEqualsAndHashCode PASSED
org.apache.kafka.common.security.JaasUtilsTest > testMissingOptionValue STARTED
org.apache.kafka.common.security.JaasUtilsTest > testMissingOptionValue PASSED
org.apache.kafka.common.security.JaasUtilsTest > testSingleOption STARTED
org.apache.kafka.common.security.JaasUtilsTest > testSingleOption PASSED
org.apache.kafka.common.security.JaasUtilsTest > testNumericOptionWithoutQuotes STARTED
org.apache.kafka.common.security.JaasUtilsTest > testNumericOptionWithoutQuotes PASSED
org.apache.kafka.common.security.JaasUtilsTest > testConfigNoOptions STARTED
org.apache.kafka.common.security.JaasUtilsTest > testConfigNoOptions PASSED
org.apache.kafka.common.security.JaasUtilsTest > testNumericOptionWithQuotes STARTED
org.apache.kafka.common.security.JaasUtilsTest > testNumericOptionWithQuotes PASSED
org.apache.kafka.common.security.JaasUtilsTest > testQuotedOptionValue STARTED
org.apache.kafka.common.security.JaasUtilsTest > testQuotedOptionValue PASSED
org.apache.kafka.common.security.JaasUtilsTest > testMissingLoginModule STARTED
org.apache.kafka.common.security.JaasUtilsTest > testMissingLoginModule PASSED
org.apache.kafka.common.security.JaasUtilsTest > testMissingSemicolon STARTED
org.apache.kafka.common.security.JaasUtilsTest > testMissingSemicolon PASSED
org.apache.kafka.common.security.JaasUtilsTest > testMultipleOptions STARTED
org.apache.kafka.common.security.JaasUtilsTest > testMultipleOptions PASSED
org.apache.kafka.common.security.JaasUtilsTest > testMultipleLoginModules STARTED
org.apache.kafka.common.security.JaasUtilsTest > testMultipleLoginModules PASSED
org.apache.kafka.common.security.JaasUtilsTest > testMissingControlFlag STARTED
org.apache.kafka.common.security.JaasUtilsTest > testMissingControlFlag PASSED
org.apache.kafka.common.security.JaasUtilsTest > testQuotedOptionName STARTED
org.apache.kafka.common.security.JaasUtilsTest > testQuotedOptionName PASSED
org.apache.kafka.common.security.JaasUtilsTest > testControlFlag STARTED
org.apache.kafka.common.security.JaasUtilsTest > testControlFlag PASSED
org.apache.kafka.common.security.authenticator.SaslAuthenticatorTest > testMissingUsernameSaslPlain STARTED
org.apache.kafka.common.security.authenticator.SaslAuthenticatorTest > testMissingUsernameSaslPlain PASSED
org.apache.kafka.common.security.authenticator.SaslAuthenticatorTest > testValidSaslScramMechanisms STARTED
org.apache.kafka.common.security.authenticator.SaslAuthenticatorTest > testValidSaslScramMechanisms PASSED
org.apache.kafka.common.security.authenticator.SaslAuthenticatorTest > testUnauthenticatedApiVersionsRequestOverPlaintext STARTED
org.apache.kafka.common.security.authenticator.SaslAuthenticatorTest > testUnauthenticatedApiVersionsRequestOverPlaintext PASSED
org.apache.kafka.common.security.authenticator.SaslAuthenticatorTest > testMechanismPluggability STARTED
org.apache.kafka.common.security.authenticator.SaslAuthenticatorTest > testMechanismPluggability PASSED
org.apache.kafka.common.security.authenticator.SaslAuthenticatorTest > testScramUsernameWithSpecialCharacters STARTED
org.apache.kafka.common.security.authenticator.SaslAuthenticatorTest > testScramUsernameWithSpecialCharacters PASSED
org.apache.kafka.common.security.authenticator.SaslAuthenticatorTest > testApiVersionsRequestWithUnsupportedVersion STARTED
org.apache.kafka.common.security.authenticator.SaslAuthenticatorTest > testApiVersionsRequestWithUnsupportedVersion PASSED
org.apache.kafka.common.security.authenticator.SaslAuthenticatorTest > testMissingPasswordSaslPlain STARTED
org.apache.kafka.common.security.authenticator.SaslAuthenticatorTest > testMissingPasswordSaslPlain PASSED
org.apache.kafka.common.security.authenticator.SaslAuthenticatorTest > testInvalidLoginModule STARTED
org.apache.kafka.common.security.authenticator.SaslAuthenticatorTest > testInvalidLoginModule PASSED
org.apache.kafka.common.security.authenticator.SaslAuthenticatorTest > testValidSaslScramSha256 STARTED
org.apache.kafka.common.security.authenticator.SaslAuthenticatorTest > testValidSaslScramSha256 PASSED
org.apache.kafka.common.security.authenticator.SaslAuthenticatorTest > testInvalidMechanism STARTED
org.apache.kafka.common.security.authenticator.SaslAuthenticatorTest > testInvalidMechanism PASSED
org.apache.kafka.common.security.authenticator.SaslAuthenticatorTest > testDisabledMechanism STARTED
org.apache.kafka.common.security.authenticator.SaslAuthenticatorTest > testDisabledMechanism PASSED
org.apache.kafka.common.security.authenticator.SaslAuthenticatorTest > testDynamicJaasConfiguration STARTED
org.apache.kafka.common.security.authenticator.SaslAuthenticatorTest > testDynamicJaasConfiguration PASSED
org.apache.kafka.common.security.authenticator.SaslAuthenticatorTest > testPacketSizeTooBig STARTED
org.apache.kafka.common.security.authenticator.SaslAuthenticatorTest > testPacketSizeTooBig PASSED
org.apache.kafka.common.security.authenticator.SaslAuthenticatorTest > testInvalidUsernameSaslPlain STARTED
org.apache.kafka.common.security.authenticator.SaslAuthenticatorTest > testInvalidUsernameSaslPlain PASSED
org.apache.kafka.common.security.authenticator.SaslAuthenticatorTest > testUserCredentialsUnavailableForScramMechanism STARTED
org.apache.kafka.common.security.authenticator.SaslAuthenticatorTest > testUserCredentialsUnavailableForScramMechanism PASSED
org.apache.kafka.common.security.authenticator.SaslAuthenticatorTest > testMultipleServerMechanisms STARTED
org.apache.kafka.common.security.authenticator.SaslAuthenticatorTest > testMultipleServerMechanisms PASSED
org.apache.kafka.common.security.authenticator.SaslAuthenticatorTest > testValidSaslPlainOverPlaintext STARTED
org.apache.kafka.common.security.authenticator.SaslAuthenticatorTest > testValidSaslPlainOverPlaintext PASSED
org.apache.kafka.common.security.authenticator.SaslAuthenticatorTest > testValidSaslPlainOverSsl STARTED
org.apache.kafka.common.security.authenticator.SaslAuthenticatorTest > testValidSaslPlainOverSsl PASSED
org.apache.kafka.common.security.authenticator.SaslAuthenticatorTest > testInvalidApiVersionsRequestSequence STARTED
org.apache.kafka.common.security.authenticator.SaslAuthenticatorTest > testInvalidApiVersionsRequestSequence PASSED
org.apache.kafka.common.security.authenticator.SaslAuthenticatorTest > testDisallowedKafkaRequestsBeforeAuthentication STARTED
org.apache.kafka.common.security.authenticator.SaslAuthenticatorTest > testDisallowedKafkaRequestsBeforeAuthentication PASSED
org.apache.kafka.common.security.authenticator.SaslAuthenticatorTest > testUnauthenticatedApiVersionsRequestOverSsl STARTED
org.apache.kafka.common.security.authenticator.SaslAuthenticatorTest > testUnauthenticatedApiVersionsRequestOverSsl PASSED
org.apache.kafka.common.security.authenticator.SaslAuthenticatorTest > testInvalidPasswordSaslPlain STARTED
org.apache.kafka.common.security.authenticator.SaslAuthenticatorTest > testInvalidPasswordSaslPlain PASSED
org.apache.kafka.common.security.authenticator.SaslAuthenticatorTest > testInvalidPasswordSaslScram STARTED
org.apache.kafka.common.security.authenticator.SaslAuthenticatorTest > testInvalidPasswordSaslScram PASSED
org.apache.kafka.common.security.authenticator.SaslAuthenticatorTest > testInvalidSaslPacket STARTED
org.apache.kafka.common.security.authenticator.SaslAuthenticatorTest > testInvalidSaslPacket PASSED
org.apache.kafka.common.security.authenticator.SaslAuthenticatorTest > testSaslHandshakeRequestWithUnsupportedVersion STARTED
org.apache.kafka.common.security.authenticator.SaslAuthenticatorTest > testSaslHandshakeRequestWithUnsupportedVersion PASSED
org.apache.kafka.common.security.authenticator.SaslAuthenticatorTest > testUnknownUserSaslScram STARTED
org.apache.kafka.common.security.authenticator.SaslAuthenticatorTest > testUnknownUserSaslScram PASSED
1851 tests completed, 1 failed
:clients:test FAILED
FAILURE: Build failed with an exception.
* What went wrong:
Execution failed for task ':clients:test'.
> There were failing tests. See the report at: file://<https://builds.apache.org/job/kafka-trunk-jdk8/ws/clients/build/reports/tests/test/index.html>
* Try:
Run with --stacktrace option to get the stack trace. Run with --info or --debug option to get more log output.
BUILD FAILED
Total time: 1 mins 22.489 secs
Build step 'Execute shell' marked build as failure
Recording test results
Setting GRADLE_2_4_RC_2_HOME=/home/jenkins/jenkins-slave/tools/hudson.plugins.gradle.GradleInstallation/Gradle_2.4-rc-2
Setting GRADLE_2_4_RC_2_HOME=/home/jenkins/jenkins-slave/tools/hudson.plugins.gradle.GradleInstallation/Gradle_2.4-rc-2