You are viewing a plain text version of this content. The canonical link for it is here.
Posted to dev@lucene.apache.org by Policeman Jenkins Server <je...@thetaphi.de> on 2013/12/26 16:54:06 UTC

[JENKINS] Lucene-Solr-4.x-Windows (64bit/jdk1.8.0-ea-b120) - Build # 3529 - Failure!

Build: http://jenkins.thetaphi.de/job/Lucene-Solr-4.x-Windows/3529/
Java: 64bit/jdk1.8.0-ea-b120 -XX:+UseCompressedOops -XX:+UseConcMarkSweepGC

1 tests failed.
FAILED:  junit.framework.TestSuite.org.apache.solr.search.similarities.TestDFRSimilarityFactory

Error Message:
Suite timeout exceeded (>= 7200000 msec).

Stack Trace:
java.lang.Exception: Suite timeout exceeded (>= 7200000 msec).
	at __randomizedtesting.SeedInfo.seed([EF97650E05F7CA25]:0)




Build Log:
[...truncated 10293 lines...]
   [junit4] Suite: org.apache.solr.search.similarities.TestDFRSimilarityFactory
   [junit4]   2> 264094 T1036 oas.SolrTestCaseJ4.initCore ####initCore
   [junit4]   2> Creating dataDir: C:\Users\JenkinsSlave\workspace\Lucene-Solr-4.x-Windows\solr\build\solr-core\test\J0\.\solrtest-TestDFRSimilarityFactory-1388063962841
   [junit4]   2> 264094 T1036 oasc.SolrResourceLoader.<init> new SolrResourceLoader for directory: 'C:\Users\JenkinsSlave\workspace\Lucene-Solr-4.x-Windows\solr\build\solr-core\test-files\solr\collection1\'
   [junit4]   2> 264094 T1036 oasc.SolrResourceLoader.replaceClassLoader Adding 'file:/C:/Users/JenkinsSlave/workspace/Lucene-Solr-4.x-Windows/solr/build/solr-core/test-files/solr/collection1/lib/classes/' to classloader
   [junit4]   2> 264094 T1036 oasc.SolrResourceLoader.replaceClassLoader Adding 'file:/C:/Users/JenkinsSlave/workspace/Lucene-Solr-4.x-Windows/solr/build/solr-core/test-files/solr/collection1/lib/README' to classloader
   [junit4]   2> 264195 T1036 oasc.SolrConfig.<init> Using Lucene MatchVersion: LUCENE_47
   [junit4]   2> 264212 T1036 oasc.SolrConfig.<init> Loaded SolrConfig: solrconfig-basic.xml
   [junit4]   2> 264212 T1036 oass.IndexSchema.readSchema Reading Solr Schema from schema-dfr.xml
   [junit4]   2> 264212 T1036 oass.IndexSchema.readSchema [null] Schema name=test
   [junit4]   2> 264245 T1036 oass.IndexSchema.readSchema default search field in schema is text
   [junit4]   2> 264245 T1036 oass.IndexSchema.readSchema unique key field: id
   [junit4]   2> 264245 T1036 oasc.SolrResourceLoader.locateSolrHome JNDI not configured for solr (NoInitialContextEx)
   [junit4]   2> 264245 T1036 oasc.SolrResourceLoader.locateSolrHome using system property solr.solr.home: C:\Users\JenkinsSlave\workspace\Lucene-Solr-4.x-Windows\solr\build\solr-core\test-files\solr
   [junit4]   2> 264245 T1036 oasc.SolrResourceLoader.<init> new SolrResourceLoader for directory: 'C:\Users\JenkinsSlave\workspace\Lucene-Solr-4.x-Windows\solr\build\solr-core\test-files\solr\'
   [junit4]   2> 264262 T1036 oasc.SolrResourceLoader.locateSolrHome JNDI not configured for solr (NoInitialContextEx)
   [junit4]   2> 264262 T1036 oasc.SolrResourceLoader.locateSolrHome using system property solr.solr.home: C:\Users\JenkinsSlave\workspace\Lucene-Solr-4.x-Windows\solr\build\solr-core\test-files\solr
   [junit4]   2> 264262 T1036 oasc.SolrResourceLoader.<init> new SolrResourceLoader for deduced Solr Home: 'C:\Users\JenkinsSlave\workspace\Lucene-Solr-4.x-Windows\solr\build\solr-core\test-files\solr\'
   [junit4]   2> 264279 T1036 oasc.CoreContainer.<init> New CoreContainer 1284151865
   [junit4]   2> 264279 T1036 oasc.CoreContainer.load Loading cores into CoreContainer [instanceDir=C:\Users\JenkinsSlave\workspace\Lucene-Solr-4.x-Windows\solr\build\solr-core\test-files\solr\]
   [junit4]   2> 264296 T1036 oashc.HttpShardHandlerFactory.getParameter Setting socketTimeout to: 0
   [junit4]   2> 264296 T1036 oashc.HttpShardHandlerFactory.getParameter Setting urlScheme to: http://
   [junit4]   2> 264296 T1036 oashc.HttpShardHandlerFactory.getParameter Setting connTimeout to: 0
   [junit4]   2> 264296 T1036 oashc.HttpShardHandlerFactory.getParameter Setting maxConnectionsPerHost to: 20
   [junit4]   2> 264296 T1036 oashc.HttpShardHandlerFactory.getParameter Setting corePoolSize to: 0
   [junit4]   2> 264296 T1036 oashc.HttpShardHandlerFactory.getParameter Setting maximumPoolSize to: 2147483647
   [junit4]   2> 264296 T1036 oashc.HttpShardHandlerFactory.getParameter Setting maxThreadIdleTime to: 5
   [junit4]   2> 264296 T1036 oashc.HttpShardHandlerFactory.getParameter Setting sizeOfQueue to: -1
   [junit4]   2> 264296 T1036 oashc.HttpShardHandlerFactory.getParameter Setting fairnessPolicy to: false
   [junit4]   2> 264313 T1036 oasl.LogWatcher.createWatcher SLF4J impl is org.slf4j.impl.Log4jLoggerFactory
   [junit4]   2> 264313 T1036 oasl.LogWatcher.newRegisteredLogWatcher Registering Log Listener [Log4j (org.slf4j.impl.Log4jLoggerFactory)]
   [junit4]   2> 264313 T1036 oasc.CoreContainer.load Host Name: 
   [junit4]   2> 264313 T1037 oasc.CoreContainer.create Creating SolrCore 'collection1' using instanceDir: C:\Users\JenkinsSlave\workspace\Lucene-Solr-4.x-Windows\solr\build\solr-core\test-files\solr\collection1
   [junit4]   2> 264313 T1037 oasc.SolrResourceLoader.<init> new SolrResourceLoader for directory: 'C:\Users\JenkinsSlave\workspace\Lucene-Solr-4.x-Windows\solr\build\solr-core\test-files\solr\collection1\'
   [junit4]   2> 264313 T1037 oasc.SolrResourceLoader.replaceClassLoader Adding 'file:/C:/Users/JenkinsSlave/workspace/Lucene-Solr-4.x-Windows/solr/build/solr-core/test-files/solr/collection1/lib/classes/' to classloader
   [junit4]   2> 264313 T1037 oasc.SolrResourceLoader.replaceClassLoader Adding 'file:/C:/Users/JenkinsSlave/workspace/Lucene-Solr-4.x-Windows/solr/build/solr-core/test-files/solr/collection1/lib/README' to classloader
   [junit4]   2> 264346 T1037 oasc.SolrConfig.<init> Using Lucene MatchVersion: LUCENE_47
   [junit4]   2> 264346 T1037 oasc.SolrConfig.<init> Loaded SolrConfig: solrconfig-basic.xml
   [junit4]   2> 264346 T1037 oass.IndexSchema.readSchema Reading Solr Schema from schema-dfr.xml
   [junit4]   2> 264346 T1037 oass.IndexSchema.readSchema [collection1] Schema name=test
   [junit4]   2> 264363 T1037 oass.IndexSchema.readSchema default search field in schema is text
   [junit4]   2> 264380 T1037 oass.IndexSchema.readSchema unique key field: id
   [junit4]   2> 264380 T1037 oasc.SolrCore.initDirectoryFactory org.apache.solr.core.MockDirectoryFactory
   [junit4]   2> 264380 T1037 oasc.SolrCore.<init> [collection1] Opening new SolrCore at C:\Users\JenkinsSlave\workspace\Lucene-Solr-4.x-Windows\solr\build\solr-core\test-files\solr\collection1\, dataDir=C:\Users\JenkinsSlave\workspace\Lucene-Solr-4.x-Windows\solr\build\solr-core\test\J0\.\solrtest-TestDFRSimilarityFactory-1388063962841\
   [junit4]   2> 264380 T1037 oasc.SolrCore.<init> JMX monitoring not detected for core: collection1
   [junit4]   2> 264380 T1037 oasc.CachingDirectoryFactory.get return new directory for C:\Users\JenkinsSlave\workspace\Lucene-Solr-4.x-Windows\solr\build\solr-core\test\J0\.\solrtest-TestDFRSimilarityFactory-1388063962841\
   [junit4]   2> 264380 T1037 oasc.SolrCore.getNewIndexDir New index directory detected: old=null new=C:\Users\JenkinsSlave\workspace\Lucene-Solr-4.x-Windows\solr\build\solr-core\test\J0\.\solrtest-TestDFRSimilarityFactory-1388063962841\index/
   [junit4]   2> 264380 T1037 oasc.SolrCore.initIndex WARN [collection1] Solr index directory 'C:\Users\JenkinsSlave\workspace\Lucene-Solr-4.x-Windows\solr\build\solr-core\test\J0\.\solrtest-TestDFRSimilarityFactory-1388063962841\index' doesn't exist. Creating new index...
   [junit4]   2> 264380 T1037 oasc.CachingDirectoryFactory.get return new directory for C:\Users\JenkinsSlave\workspace\Lucene-Solr-4.x-Windows\solr\build\solr-core\test\J0\.\solrtest-TestDFRSimilarityFactory-1388063962841\index
   [junit4]   2> 264380 T1037 oasu.RandomMergePolicy.<init> RandomMergePolicy wrapping class org.apache.lucene.index.LogDocMergePolicy: [LogDocMergePolicy: minMergeSize=1000, mergeFactor=11, maxMergeSize=9223372036854775807, maxMergeSizeForForcedMerge=9223372036854775807, calibrateSizeByDeletes=false, maxMergeDocs=2147483647, maxCFSSegmentSizeMB=8.796093022207999E12, noCFSRatio=0.0]
   [junit4]   2> 264380 T1037 oasc.SolrDeletionPolicy.onCommit SolrDeletionPolicy.onCommit: commits: num=1
   [junit4]   2> 		commit{dir=MockDirectoryWrapper(org.apache.lucene.store.RAMDirectory@b71990c lockFactory=org.apache.lucene.store.SingleInstanceLockFactory@104e41af),segFN=segments_1,generation=1}
   [junit4]   2> 264380 T1037 oasc.SolrDeletionPolicy.updateCommits newest commit generation = 1
   [junit4]   2> 264380 T1037 oasc.SolrCore.loadUpdateProcessorChains no updateRequestProcessorChain defined as default, creating implicit default
   [junit4]   2> 264380 T1037 oasc.RequestHandlers.initHandlersFromConfig created standard: solr.StandardRequestHandler
   [junit4]   2> 264380 T1037 oasc.RequestHandlers.initHandlersFromConfig created /update: solr.UpdateRequestHandler
   [junit4]   2> 264380 T1037 oashl.XMLLoader.init xsltCacheLifetimeSeconds=60
   [junit4]   2> 264397 T1037 oasu.CommitTracker.<init> Hard AutoCommit: disabled
   [junit4]   2> 264397 T1037 oasu.CommitTracker.<init> Soft AutoCommit: disabled
   [junit4]   2> 264397 T1037 oasu.RandomMergePolicy.<init> RandomMergePolicy wrapping class org.apache.lucene.index.TieredMergePolicy: [TieredMergePolicy: maxMergeAtOnce=32, maxMergeAtOnceExplicit=21, maxMergedSegmentMB=1.2626953125, floorSegmentMB=2.0712890625, forceMergeDeletesPctAllowed=15.727895582197169, segmentsPerTier=15.0, maxCFSSegmentSizeMB=8.796093022207999E12, noCFSRatio=0.23948868843749826
   [junit4]   2> 264397 T1037 oasc.SolrDeletionPolicy.onInit SolrDeletionPolicy.onInit: commits: num=1
   [junit4]   2> 		commit{dir=MockDirectoryWrapper(org.apache.lucene.store.RAMDirectory@b71990c lockFactory=org.apache.lucene.store.SingleInstanceLockFactory@104e41af),segFN=segments_1,generation=1}
   [junit4]   2> 264397 T1037 oasc.SolrDeletionPolicy.updateCommits newest commit generation = 1
   [junit4]   2> 264397 T1037 oass.SolrIndexSearcher.<init> Opening Searcher@28691094 main
   [junit4]   2> 264397 T1037 oasc.CoreContainer.registerCore registering core: collection1
   [junit4]   2> 264397 T1038 oasc.SolrCore.registerSearcher [collection1] Registered new searcher Searcher@28691094 main{StandardDirectoryReader(segments_1:1:nrt)}
   [junit4]   2> 264397 T1036 oas.SolrTestCaseJ4.initCore ####initCore end
   [junit4]   2> 264397 T1036 oas.SolrTestCaseJ4.setUp ###Starting testParameterC
   [junit4]   2> 264397 T1036 oas.SolrTestCaseJ4.tearDown ###Ending testParameterC
   [junit4]   2> 264414 T1036 oas.SolrTestCaseJ4.setUp ###Starting testParameters
   [junit4]   2> 264414 T1036 oas.SolrTestCaseJ4.tearDown ###Ending testParameters
   [junit4]   2> 264414 T1036 oas.SolrTestCaseJ4.setUp ###Starting test
   [junit4]   2> 264414 T1036 oas.SolrTestCaseJ4.tearDown ###Ending test
   [junit4]   2> 264414 T1036 oas.SolrTestCaseJ4.deleteCore ###deleteCore
   [junit4]   2> 264414 T1036 oasc.CoreContainer.shutdown Shutting down CoreContainer instance=1284151865
   [junit4]   2> 7219383 T1035 ccr.ThreadLeakControl$2.evaluate WARNING Suite execution timed out: org.apache.solr.search.similarities.TestDFRSimilarityFactory
   [junit4]   2> 	==== jstack at approximately timeout time ====
   [junit4]   2> 	"Thread-497" ID=1039 WAITING on java.lang.Object@32a589cf
   [junit4]   2> 		at java.lang.Object.wait(Native Method)
   [junit4]   2> 		- waiting on java.lang.Object@32a589cf
   [junit4]   2> 		at java.lang.Object.wait(Object.java:502)
   [junit4]   2> 		at org.apache.solr.core.CloserThread.run(CoreContainer.java:1011)
   [junit4]   2> 	
   [junit4]   2> 	"searcherExecutor-656-thread-1" ID=1038 WAITING on java.util.concurrent.locks.AbstractQueuedSynchronizer$ConditionObject@34eddbae
   [junit4]   2> 		at sun.misc.Unsafe.park(Native Method)
   [junit4]   2> 		- waiting on java.util.concurrent.locks.AbstractQueuedSynchronizer$ConditionObject@34eddbae
   [junit4]   2> 		at java.util.concurrent.locks.LockSupport.park(LockSupport.java:175)
   [junit4]   2> 		at java.util.concurrent.locks.AbstractQueuedSynchronizer$ConditionObject.await(AbstractQueuedSynchronizer.java:2039)
   [junit4]   2> 		at java.util.concurrent.LinkedBlockingQueue.take(LinkedBlockingQueue.java:442)
   [junit4]   2> 		at java.util.concurrent.ThreadPoolExecutor.getTask(ThreadPoolExecutor.java:1067)
   [junit4]   2> 		at java.util.concurrent.ThreadPoolExecutor.runWorker(ThreadPoolExecutor.java:1127)
   [junit4]   2> 		at java.util.concurrent.ThreadPoolExecutor$Worker.run(ThreadPoolExecutor.java:617)
   [junit4]   2> 		at java.lang.Thread.run(Thread.java:744)
   [junit4]   2> 	
   [junit4]   2> 	"SUITE-TestDFRSimilarityFactory-seed#[EF97650E05F7CA25]-worker" ID=1036 WAITING on org.apache.solr.core.CloserThread@54d7f5fc
   [junit4]   2> 		at java.lang.Object.wait(Native Method)
   [junit4]   2> 		- waiting on org.apache.solr.core.CloserThread@54d7f5fc
   [junit4]   2> 		at java.lang.Thread.join(Thread.java:1244)
   [junit4]   2> 		at java.lang.Thread.join(Thread.java:1318)
   [junit4]   2> 		at org.apache.solr.core.CoreContainer.shutdown(CoreContainer.java:374)
   [junit4]   2> 		at org.apache.solr.util.TestHarness.close(TestHarness.java:337)
   [junit4]   2> 		at org.apache.solr.SolrTestCaseJ4.deleteCore(SolrTestCaseJ4.java:544)
   [junit4]   2> 		at org.apache.solr.SolrTestCaseJ4.afterClass(SolrTestCaseJ4.java:137)
   [junit4]   2> 		at sun.reflect.GeneratedMethodAccessor25.invoke(Unknown Source)
   [junit4]   2> 		at sun.reflect.DelegatingMethodAccessorImpl.invoke(DelegatingMethodAccessorImpl.java:43)
   [junit4]   2> 		at java.lang.reflect.Method.invoke(Method.java:483)
   [junit4]   2> 		at com.carrotsearch.randomizedtesting.RandomizedRunner.invoke(RandomizedRunner.java:1559)
   [junit4]   2> 		at com.carrotsearch.randomizedtesting.RandomizedRunner.access$600(RandomizedRunner.java:79)
   [junit4]   2> 		at com.carrotsearch.randomizedtesting.RandomizedRunner$5.evaluate(RandomizedRunner.java:700)
   [junit4]   2> 		at com.carrotsearch.randomizedtesting.rules.StatementAdapter.evaluate(StatementAdapter.java:36)
   [junit4]   2> 		at com.carrotsearch.randomizedtesting.rules.SystemPropertiesRestoreRule$1.evaluate(SystemPropertiesRestoreRule.java:53)
   [junit4]   2> 		at org.apache.lucene.util.AbstractBeforeAfterRule$1.evaluate(AbstractBeforeAfterRule.java:46)
   [junit4]   2> 		at org.apache.lucene.util.TestRuleStoreClassName$1.evaluate(TestRuleStoreClassName.java:42)
   [junit4]   2> 		at com.carrotsearch.randomizedtesting.rules.SystemPropertiesInvariantRule$1.evaluate(SystemPropertiesInvariantRule.java:55)
   [junit4]   2> 		at com.carrotsearch.randomizedtesting.rules.NoShadowingOrOverridesOnMethodsRule$1.evaluate(NoShadowingOrOverridesOnMethodsRule.java:39)
   [junit4]   2> 		at com.carrotsearch.randomizedtesting.rules.NoShadowingOrOverridesOnMethodsRule$1.evaluate(NoShadowingOrOverridesOnMethodsRule.java:39)
   [junit4]   2> 		at com.carrotsearch.randomizedtesting.rules.StatementAdapter.evaluate(StatementAdapter.java:36)
   [junit4]   2> 		at org.apache.lucene.util.TestRuleAssertionsRequired$1.evaluate(TestRuleAssertionsRequired.java:43)
   [junit4]   2> 		at org.apache.lucene.util.TestRuleMarkFailure$1.evaluate(TestRuleMarkFailure.java:48)
   [junit4]   2> 		at org.apache.lucene.util.TestRuleIgnoreAfterMaxFailures$1.evaluate(TestRuleIgnoreAfterMaxFailures.java:70)
   [junit4]   2> 		at org.apache.lucene.util.TestRuleIgnoreTestSuites$1.evaluate(TestRuleIgnoreTestSuites.java:55)
   [junit4]   2> 		at com.carrotsearch.randomizedtesting.rules.StatementAdapter.evaluate(StatementAdapter.java:36)
   [junit4]   2> 		at com.carrotsearch.randomizedtesting.ThreadLeakControl$StatementRunner.run(ThreadLeakControl.java:358)
   [junit4]   2> 		at java.lang.Thread.run(Thread.java:744)
   [junit4]   2> 	
   [junit4]   2> 	"SUITE-TestDFRSimilarityFactory-seed#[EF97650E05F7CA25]" ID=1035 RUNNABLE
   [junit4]   2> 		at sun.management.ThreadImpl.dumpThreads0(Native Method)
   [junit4]   2> 		at sun.management.ThreadImpl.dumpAllThreads(ThreadImpl.java:446)
   [junit4]   2> 		at com.carrotsearch.randomizedtesting.ThreadLeakControl.formatThreadStacksFull(ThreadLeakControl.java:655)
   [junit4]   2> 		at com.carrotsearch.randomizedtesting.ThreadLeakControl.access$800(ThreadLeakControl.java:60)
   [junit4]   2> 		at com.carrotsearch.randomizedtesting.ThreadLeakControl$2.evaluate(ThreadLeakControl.java:396)
   [junit4]   2> 		- locked java.lang.Object@3dd79e4
   [junit4]   2> 		at com.carrotsearch.randomizedtesting.RandomizedRunner.runSuite(RandomizedRunner.java:556)
   [junit4]   2> 		at com.carrotsearch.randomizedtesting.RandomizedRunner.access$200(RandomizedRunner.java:79)
   [junit4]   2> 		at com.carrotsearch.randomizedtesting.RandomizedRunner$1.run(RandomizedRunner.java:492)
   [junit4]   2> 	
   [junit4]   2> 	"TimeLimitedCollector timer thread" ID=812 TIMED_WAITING
   [junit4]   2> 		at java.lang.Thread.sleep(Native Method)
   [junit4]   2> 		at org.apache.lucene.search.TimeLimitingCollector$TimerThread.run(TimeLimitingCollector.java:267)
   [junit4]   2> 	
   [junit4]   2> 	"Attach Listener" ID=6 RUNNABLE
   [junit4]   2> 	
   [junit4]   2> 	"Signal Dispatcher" ID=5 RUNNABLE
   [junit4]   2> 	
   [junit4]   2> 	"Finalizer" ID=3 WAITING on java.lang.ref.ReferenceQueue$Lock@4c7f7531
   [junit4]   2> 		at java.lang.Object.wait(Native Method)
   [junit4]   2> 		- waiting on java.lang.ref.ReferenceQueue$Lock@4c7f7531
   [junit4]   2> 		at java.lang.ref.ReferenceQueue.remove(ReferenceQueue.java:142)
   [junit4]   2> 		at java.lang.ref.ReferenceQueue.remove(ReferenceQueue.java:158)
   [junit4]   2> 		at java.lang.ref.Finalizer$FinalizerThread.run(Finalizer.java:209)
   [junit4]   2> 	
   [junit4]   2> 	"Reference Handler" ID=2 WAITING on java.lang.ref.Reference$Lock@528a7680
   [junit4]   2> 		at java.lang.Object.wait(Native Method)
   [junit4]   2> 		- waiting on java.lang.ref.Reference$Lock@528a7680
   [junit4]   2> 		at java.lang.Object.wait(Object.java:502)
   [junit4]   2> 		at java.lang.ref.Reference$ReferenceHandler.run(Reference.java:157)
   [junit4]   2> 	
   [junit4]   2> 	"main" ID=1 WAITING on com.carrotsearch.randomizedtesting.RandomizedRunner$1@739883f4
   [junit4]   2> 		at java.lang.Object.wait(Native Method)
   [junit4]   2> 		- waiting on com.carrotsearch.randomizedtesting.RandomizedRunner$1@739883f4
   [junit4]   2> 		at java.lang.Thread.join(Thread.java:1244)
   [junit4]   2> 		at java.lang.Thread.join(Thread.java:1318)
   [junit4]   2> 		at com.carrotsearch.randomizedtesting.RandomizedRunner.runSuite(RandomizedRunner.java:502)
   [junit4]   2> 		at com.carrotsearch.randomizedtesting.RandomizedRunner.run(RandomizedRunner.java:399)
   [junit4]   2> 		at com.carrotsearch.ant.tasks.junit4.slave.SlaveMain.execute(SlaveMain.java:180)
   [junit4]   2> 		at com.carrotsearch.ant.tasks.junit4.slave.SlaveMain.main(SlaveMain.java:275)
   [junit4]   2> 		at com.carrotsearch.ant.tasks.junit4.slave.SlaveMainSafe.main(SlaveMainSafe.java:12)
   [junit4]   2> 	
   [junit4]   2> 	^^==============================================
   [junit4]   2> 	
   [junit4]   2> 7219388 T1035 ccr.ThreadLeakControl.checkThreadLeaks WARNING Will linger awaiting termination of 3 leaked thread(s).
   [junit4]   2> 7239516 T1035 ccr.ThreadLeakControl.checkThreadLeaks SEVERE 3 threads leaked from SUITE scope at org.apache.solr.search.similarities.TestDFRSimilarityFactory: 
   [junit4]   2> 	   1) Thread[id=1036, name=SUITE-TestDFRSimilarityFactory-seed#[EF97650E05F7CA25]-worker, state=WAITING, group=TGRP-TestDFRSimilarityFactory]
   [junit4]   2> 	        at java.lang.Object.wait(Native Method)
   [junit4]   2> 	        at java.lang.Thread.join(Thread.java:1244)
   [junit4]   2> 	        at java.lang.Thread.join(Thread.java:1318)
   [junit4]   2> 	        at org.apache.solr.core.CoreContainer.shutdown(CoreContainer.java:374)
   [junit4]   2> 	        at org.apache.solr.util.TestHarness.close(TestHarness.java:337)
   [junit4]   2> 	        at org.apache.solr.SolrTestCaseJ4.deleteCore(SolrTestCaseJ4.java:544)
   [junit4]   2> 	        at org.apache.solr.SolrTestCaseJ4.afterClass(SolrTestCaseJ4.java:137)
   [junit4]   2> 	        at sun.reflect.GeneratedMethodAccessor25.invoke(Unknown Source)
   [junit4]   2> 	        at sun.reflect.DelegatingMethodAccessorImpl.invoke(DelegatingMethodAccessorImpl.java:43)
   [junit4]   2> 	        at java.lang.reflect.Method.invoke(Method.java:483)
   [junit4]   2> 	        at com.carrotsearch.randomizedtesting.RandomizedRunner.invoke(RandomizedRunner.java:1559)
   [junit4]   2> 	        at com.carrotsearch.randomizedtesting.RandomizedRunner.access$600(RandomizedRunner.java:79)
   [junit4]   2> 	        at com.carrotsearch.randomizedtesting.RandomizedRunner$5.evaluate(RandomizedRunner.java:700)
   [junit4]   2> 	        at com.carrotsearch.randomizedtesting.rules.StatementAdapter.evaluate(StatementAdapter.java:36)
   [junit4]   2> 	        at com.carrotsearch.randomizedtesting.rules.SystemPropertiesRestoreRule$1.evaluate(SystemPropertiesRestoreRule.java:53)
   [junit4]   2> 	        at org.apache.lucene.util.AbstractBeforeAfterRule$1.evaluate(AbstractBeforeAfterRule.java:46)
   [junit4]   2> 	        at org.apache.lucene.util.TestRuleStoreClassName$1.evaluate(TestRuleStoreClassName.java:42)
   [junit4]   2> 	        at com.carrotsearch.randomizedtesting.rules.SystemPropertiesInvariantRule$1.evaluate(SystemPropertiesInvariantRule.java:55)
   [junit4]   2> 	        at com.carrotsearch.randomizedtesting.rules.NoShadowingOrOverridesOnMethodsRule$1.evaluate(NoShadowingOrOverridesOnMethodsRule.java:39)
   [junit4]   2> 	        at com.carrotsearch.randomizedtesting.rules.NoShadowingOrOverridesOnMethodsRule$1.evaluate(NoShadowingOrOverridesOnMethodsRule.java:39)
   [junit4]   2> 	        at com.carrotsearch.randomizedtesting.rules.StatementAdapter.evaluate(StatementAdapter.java:36)
   [junit4]   2> 	        at org.apache.lucene.util.TestRuleAssertionsRequired$1.evaluate(TestRuleAssertionsRequired.java:43)
   [junit4]   2> 	        at org.apache.lucene.util.TestRuleMarkFailure$1.evaluate(TestRuleMarkFailure.java:48)
   [junit4]   2> 	        at org.apache.lucene.util.TestRuleIgnoreAfterMaxFailures$1.evaluate(TestRuleIgnoreAfterMaxFailures.java:70)
   [junit4]   2> 	        at org.apache.lucene.util.TestRuleIgnoreTestSuites$1.evaluate(TestRuleIgnoreTestSuites.java:55)
   [junit4]   2> 	        at com.carrotsearch.randomizedtesting.rules.StatementAdapter.evaluate(StatementAdapter.java:36)
   [junit4]   2> 	        at com.carrotsearch.randomizedtesting.ThreadLeakControl$StatementRunner.run(ThreadLeakControl.java:358)
   [junit4]   2> 	        at java.lang.Thread.run(Thread.java:744)
   [junit4]   2> 	   2) Thread[id=1039, name=Thread-497, state=WAITING, group=TGRP-TestDFRSimilarityFactory]
   [junit4]   2> 	        at java.lang.Object.wait(Native Method)
   [junit4]   2> 	        at java.lang.Object.wait(Object.java:502)
   [junit4]   2> 	        at org.apache.solr.core.CloserThread.run(CoreContainer.java:1011)
   [junit4]   2> 	   3) Thread[id=1038, name=searcherExecutor-656-thread-1, state=WAITING, group=TGRP-TestDFRSimilarityFactory]
   [junit4]   2> 	        at sun.misc.Unsafe.park(Native Method)
   [junit4]   2> 	        at java.util.concurrent.locks.LockSupport.park(LockSupport.java:175)
   [junit4]   2> 	        at java.util.concurrent.locks.AbstractQueuedSynchronizer$ConditionObject.await(AbstractQueuedSynchronizer.java:2039)
   [junit4]   2> 	        at java.util.concurrent.LinkedBlockingQueue.take(LinkedBlockingQueue.java:442)
   [junit4]   2> 	        at java.util.concurrent.ThreadPoolExecutor.getTask(ThreadPoolExecutor.java:1067)
   [junit4]   2> 	        at java.util.concurrent.ThreadPoolExecutor.runWorker(ThreadPoolExecutor.java:1127)
   [junit4]   2> 	        at java.util.concurrent.ThreadPoolExecutor$Worker.run(ThreadPoolExecutor.java:617)
   [junit4]   2> 	        at java.lang.Thread.run(Thread.java:744)
   [junit4]   2> 7239517 T1035 ccr.ThreadLeakControl.tryToInterruptAll Starting to interrupt leaked threads:
   [junit4]   2> 	   1) Thread[id=1036, name=SUITE-TestDFRSimilarityFactory-seed#[EF97650E05F7CA25]-worker, state=WAITING, group=TGRP-TestDFRSimilarityFactory]
   [junit4]   2> 	   2) Thread[id=1039, name=Thread-497, state=WAITING, group=TGRP-TestDFRSimilarityFactory]
   [junit4]   2> 	   3) Thread[id=1038, name=searcherExecutor-656-thread-1, state=WAITING, group=TGRP-TestDFRSimilarityFactory]
   [junit4]   2> 7503613 T1036 oasc.SolrCore.close [collection1]  CLOSING SolrCore org.apache.solr.core.SolrCore@248d60d4
   [junit4]   2> 7503613 T1036 oasu.DirectUpdateHandler2.close closing DirectUpdateHandler2{commits=0,autocommits=0,soft autocommits=0,optimizes=0,rollbacks=0,expungeDeletes=0,docsPending=0,adds=0,deletesById=0,deletesByQuery=0,errors=0,cumulative_adds=0,cumulative_deletesById=0,cumulative_deletesByQuery=0,cumulative_errors=0}
   [junit4]   2> 7503613 T1036 oasu.SolrCoreState.decrefSolrCoreState Closing SolrCoreState
   [junit4]   2> 7503613 T1036 oasu.DefaultSolrCoreState.closeIndexWriter SolrCoreState ref count has reached 0 - closing IndexWriter
   [junit4]   2> 7503613 T1036 oasu.DefaultSolrCoreState.closeIndexWriter closing IndexWriter with IndexWriterCloser
   [junit4]   2> 7503626 T1036 oasc.SolrCore.closeSearcher [collection1] Closing main searcher on request.
   [junit4]   2> 7503627 T1036 oasc.CachingDirectoryFactory.close Closing MockDirectoryFactory - 2 directories currently being tracked
   [junit4]   2> 7503627 T1036 oasc.CachingDirectoryFactory.closeCacheValue looking to close C:\Users\JenkinsSlave\workspace\Lucene-Solr-4.x-Windows\solr\build\solr-core\test\J0\.\solrtest-TestDFRSimilarityFactory-1388063962841\index [CachedDir<<refCount=0;path=C:\Users\JenkinsSlave\workspace\Lucene-Solr-4.x-Windows\solr\build\solr-core\test\J0\.\solrtest-TestDFRSimilarityFactory-1388063962841\index;done=false>>]
   [junit4]   2> 7503627 T1036 oasc.CachingDirectoryFactory.close Closing directory: C:\Users\JenkinsSlave\workspace\Lucene-Solr-4.x-Windows\solr\build\solr-core\test\J0\.\solrtest-TestDFRSimilarityFactory-1388063962841\index
   [junit4]   2> 7503627 T1036 oasc.CachingDirectoryFactory.closeCacheValue looking to close C:\Users\JenkinsSlave\workspace\Lucene-Solr-4.x-Windows\solr\build\solr-core\test\J0\.\solrtest-TestDFRSimilarityFactory-1388063962841\ [CachedDir<<refCount=0;path=C:\Users\JenkinsSlave\workspace\Lucene-Solr-4.x-Windows\solr\build\solr-core\test\J0\.\solrtest-TestDFRSimilarityFactory-1388063962841\;done=false>>]
   [junit4]   2> 7503627 T1036 oasc.CachingDirectoryFactory.close Closing directory: C:\Users\JenkinsSlave\workspace\Lucene-Solr-4.x-Windows\solr\build\solr-core\test\J0\.\solrtest-TestDFRSimilarityFactory-1388063962841\
   [junit4]   2> 7239538 T1035 ccr.ThreadLeakControl.tryToInterruptAll All leaked threads terminated.
   [junit4]   2> NOTE: test params are: codec=Asserting, sim=DefaultSimilarity, locale=vi_VN, timezone=Africa/Malabo
   [junit4]   2> NOTE: Windows 7 6.1 amd64/Oracle Corporation 1.8.0-ea (64-bit)/cpus=2,threads=1,free=31515512,total=77611008
   [junit4]   2> NOTE: All tests run in this JVM: [PathHierarchyTokenizerFactoryTest, TestDistribDocBasedVersion, DebugComponentTest, TestQueryTypes, TestSolrXmlPersistence, DocumentBuilderTest, TestLMDirichletSimilarityFactory, SystemInfoHandlerTest, EchoParamsTest, ConvertedLegacyTest, SolrIndexConfigTest, OpenCloseCoreStressTest, NumericFieldsTest, CurrencyFieldXmlFileTest, TestDistributedMissingSort, HdfsBasicDistributedZk2Test, TestSchemaResource, TestUtils, TestSearchPerf, SampleTest, TestSolrCoreProperties, PrimUtilsTest, TestDocumentBuilder, TestShardHandlerFactory, BasicDistributedZk2Test, TestCollationField, BadIndexSchemaTest, TestFieldCollectionResource, PreAnalyzedFieldTest, TestExtendedDismaxParser, DOMUtilTest, SearchHandlerTest, TestIBSimilarityFactory, TestSolrJ, TestGroupingSearch, TestFuzzyAnalyzedSuggestions, TestZkChroot, DirectSolrConnectionTest, TestReversedWildcardFilterFactory, SolrPluginUtilsTest, TestFieldTypeResource, TestQueryUtils, DeleteReplicaTest, QueryResultKeyTest, TestDFRSimilarityFactory]
   [junit4]   2> NOTE: reproduce with: ant test  -Dtestcase=TestDFRSimilarityFactory -Dtests.seed=EF97650E05F7CA25 -Dtests.slow=true -Dtests.locale=vi_VN -Dtests.timezone=Africa/Malabo -Dtests.file.encoding=ISO-8859-1
   [junit4] ERROR   0.00s | TestDFRSimilarityFactory (suite) <<<
   [junit4]    > Throwable #1: java.lang.Exception: Suite timeout exceeded (>= 7200000 msec).
   [junit4]    > 	at __randomizedtesting.SeedInfo.seed([EF97650E05F7CA25]:0)
   [junit4] Completed in 7239.58s, 3 tests, 1 error <<< FAILURES!

[...truncated 936 lines...]
BUILD FAILED
C:\Users\JenkinsSlave\workspace\Lucene-Solr-4.x-Windows\build.xml:459: The following error occurred while executing this line:
C:\Users\JenkinsSlave\workspace\Lucene-Solr-4.x-Windows\build.xml:439: The following error occurred while executing this line:
C:\Users\JenkinsSlave\workspace\Lucene-Solr-4.x-Windows\build.xml:39: The following error occurred while executing this line:
C:\Users\JenkinsSlave\workspace\Lucene-Solr-4.x-Windows\extra-targets.xml:37: The following error occurred while executing this line:
C:\Users\JenkinsSlave\workspace\Lucene-Solr-4.x-Windows\solr\build.xml:189: The following error occurred while executing this line:
C:\Users\JenkinsSlave\workspace\Lucene-Solr-4.x-Windows\solr\common-build.xml:491: The following error occurred while executing this line:
C:\Users\JenkinsSlave\workspace\Lucene-Solr-4.x-Windows\lucene\common-build.xml:1307: The following error occurred while executing this line:
C:\Users\JenkinsSlave\workspace\Lucene-Solr-4.x-Windows\lucene\common-build.xml:940: There were test failures: 347 suites, 1517 tests, 1 suite-level error, 39 ignored (11 assumptions)

Total time: 187 minutes 47 seconds
Build step 'Invoke Ant' marked build as failure
Description set: Java: 64bit/jdk1.8.0-ea-b120 -XX:+UseCompressedOops -XX:+UseConcMarkSweepGC
Archiving artifacts
Recording test results
Email was triggered for: Failure
Sending email for trigger: Failure