You are viewing a plain text version of this content. The canonical link for it is here.
Posted to dev@lucene.apache.org by Policeman Jenkins Server <je...@thetaphi.de> on 2016/05/12 12:25:54 UTC
[JENKINS] Lucene-Solr-master-Solaris (64bit/jdk1.8.0) - Build # 574
- Still Failing!
Build: http://jenkins.thetaphi.de/job/Lucene-Solr-master-Solaris/574/
Java: 64bit/jdk1.8.0 -XX:-UseCompressedOops -XX:+UseG1GC
1 tests failed.
FAILED: org.apache.solr.handler.TestReplicationHandler.doTestStressReplication
Error Message:
timed out waiting for collection1 startAt time to exceed: Thu May 12 21:20:31 AEST 2016
Stack Trace:
java.lang.AssertionError: timed out waiting for collection1 startAt time to exceed: Thu May 12 21:20:31 AEST 2016
at __randomizedtesting.SeedInfo.seed([4910211677A01E90:92BB21D072887723]:0)
at org.junit.Assert.fail(Assert.java:93)
at org.apache.solr.handler.TestReplicationHandler.watchCoreStartAt(TestReplicationHandler.java:1506)
at org.apache.solr.handler.TestReplicationHandler.doTestStressReplication(TestReplicationHandler.java:856)
at sun.reflect.NativeMethodAccessorImpl.invoke0(Native Method)
at sun.reflect.NativeMethodAccessorImpl.invoke(NativeMethodAccessorImpl.java:62)
at sun.reflect.DelegatingMethodAccessorImpl.invoke(DelegatingMethodAccessorImpl.java:43)
at java.lang.reflect.Method.invoke(Method.java:498)
at com.carrotsearch.randomizedtesting.RandomizedRunner.invoke(RandomizedRunner.java:1764)
at com.carrotsearch.randomizedtesting.RandomizedRunner$8.evaluate(RandomizedRunner.java:871)
at com.carrotsearch.randomizedtesting.RandomizedRunner$9.evaluate(RandomizedRunner.java:907)
at com.carrotsearch.randomizedtesting.RandomizedRunner$10.evaluate(RandomizedRunner.java:921)
at com.carrotsearch.randomizedtesting.rules.SystemPropertiesRestoreRule$1.evaluate(SystemPropertiesRestoreRule.java:57)
at org.apache.lucene.util.TestRuleSetupTeardownChained$1.evaluate(TestRuleSetupTeardownChained.java:49)
at org.apache.lucene.util.AbstractBeforeAfterRule$1.evaluate(AbstractBeforeAfterRule.java:45)
at org.apache.lucene.util.TestRuleThreadAndTestName$1.evaluate(TestRuleThreadAndTestName.java:48)
at org.apache.lucene.util.TestRuleIgnoreAfterMaxFailures$1.evaluate(TestRuleIgnoreAfterMaxFailures.java:64)
at org.apache.lucene.util.TestRuleMarkFailure$1.evaluate(TestRuleMarkFailure.java:47)
at com.carrotsearch.randomizedtesting.rules.StatementAdapter.evaluate(StatementAdapter.java:36)
at com.carrotsearch.randomizedtesting.ThreadLeakControl$StatementRunner.run(ThreadLeakControl.java:367)
at com.carrotsearch.randomizedtesting.ThreadLeakControl.forkTimeoutingTask(ThreadLeakControl.java:809)
at com.carrotsearch.randomizedtesting.ThreadLeakControl$3.evaluate(ThreadLeakControl.java:460)
at com.carrotsearch.randomizedtesting.RandomizedRunner.runSingleTest(RandomizedRunner.java:880)
at com.carrotsearch.randomizedtesting.RandomizedRunner$5.evaluate(RandomizedRunner.java:781)
at com.carrotsearch.randomizedtesting.RandomizedRunner$6.evaluate(RandomizedRunner.java:816)
at com.carrotsearch.randomizedtesting.RandomizedRunner$7.evaluate(RandomizedRunner.java:827)
at com.carrotsearch.randomizedtesting.rules.StatementAdapter.evaluate(StatementAdapter.java:36)
at com.carrotsearch.randomizedtesting.rules.SystemPropertiesRestoreRule$1.evaluate(SystemPropertiesRestoreRule.java:57)
at org.apache.lucene.util.AbstractBeforeAfterRule$1.evaluate(AbstractBeforeAfterRule.java:45)
at com.carrotsearch.randomizedtesting.rules.StatementAdapter.evaluate(StatementAdapter.java:36)
at org.apache.lucene.util.TestRuleStoreClassName$1.evaluate(TestRuleStoreClassName.java:41)
at com.carrotsearch.randomizedtesting.rules.NoShadowingOrOverridesOnMethodsRule$1.evaluate(NoShadowingOrOverridesOnMethodsRule.java:40)
at com.carrotsearch.randomizedtesting.rules.NoShadowingOrOverridesOnMethodsRule$1.evaluate(NoShadowingOrOverridesOnMethodsRule.java:40)
at com.carrotsearch.randomizedtesting.rules.StatementAdapter.evaluate(StatementAdapter.java:36)
at com.carrotsearch.randomizedtesting.rules.StatementAdapter.evaluate(StatementAdapter.java:36)
at com.carrotsearch.randomizedtesting.rules.StatementAdapter.evaluate(StatementAdapter.java:36)
at org.apache.lucene.util.TestRuleAssertionsRequired$1.evaluate(TestRuleAssertionsRequired.java:53)
at org.apache.lucene.util.TestRuleMarkFailure$1.evaluate(TestRuleMarkFailure.java:47)
at org.apache.lucene.util.TestRuleIgnoreAfterMaxFailures$1.evaluate(TestRuleIgnoreAfterMaxFailures.java:64)
at org.apache.lucene.util.TestRuleIgnoreTestSuites$1.evaluate(TestRuleIgnoreTestSuites.java:54)
at com.carrotsearch.randomizedtesting.rules.StatementAdapter.evaluate(StatementAdapter.java:36)
at com.carrotsearch.randomizedtesting.ThreadLeakControl$StatementRunner.run(ThreadLeakControl.java:367)
at java.lang.Thread.run(Thread.java:745)
Build Log:
[...truncated 10760 lines...]
[junit4] Suite: org.apache.solr.handler.TestReplicationHandler
[junit4] 2> Creating dataDir: /export/home/jenkins/workspace/Lucene-Solr-master-Solaris/solr/build/solr-core/test/J0/temp/solr.handler.TestReplicationHandler_4910211677A01E90-001/init-core-data-001
[junit4] 2> 569241 INFO (TEST-TestReplicationHandler.doTestReplicateAfterWrite2Slave-seed#[4910211677A01E90]) [ ] o.a.s.SolrTestCaseJ4 ###Starting doTestReplicateAfterWrite2Slave
[junit4] 2> 569242 INFO (TEST-TestReplicationHandler.doTestReplicateAfterWrite2Slave-seed#[4910211677A01E90]) [ ] o.a.s.SolrTestCaseJ4 Writing core.properties file to /export/home/jenkins/workspace/Lucene-Solr-master-Solaris/solr/build/solr-core/test/J0/temp/solr.handler.TestReplicationHandler_4910211677A01E90-001/solr-instance-001/collection1
[junit4] 2> 569245 INFO (TEST-TestReplicationHandler.doTestReplicateAfterWrite2Slave-seed#[4910211677A01E90]) [ ] o.e.j.s.Server jetty-9.3.8.v20160314
[junit4] 2> 569247 INFO (TEST-TestReplicationHandler.doTestReplicateAfterWrite2Slave-seed#[4910211677A01E90]) [ ] o.e.j.s.h.ContextHandler Started o.e.j.s.ServletContextHandler@1ebb35ef{/solr,null,AVAILABLE}
[junit4] 2> 569249 INFO (TEST-TestReplicationHandler.doTestReplicateAfterWrite2Slave-seed#[4910211677A01E90]) [ ] o.e.j.s.ServerConnector Started ServerConnector@74ad7cdd{HTTP/1.1,[http/1.1]}{127.0.0.1:57551}
[junit4] 2> 569249 INFO (TEST-TestReplicationHandler.doTestReplicateAfterWrite2Slave-seed#[4910211677A01E90]) [ ] o.e.j.s.Server Started @574998ms
[junit4] 2> 569249 INFO (TEST-TestReplicationHandler.doTestReplicateAfterWrite2Slave-seed#[4910211677A01E90]) [ ] o.a.s.c.s.e.JettySolrRunner Jetty properties: {solr.data.dir=/export/home/jenkins/workspace/Lucene-Solr-master-Solaris/solr/build/solr-core/test/J0/temp/solr.handler.TestReplicationHandler_4910211677A01E90-001/solr-instance-001/collection1/data, hostContext=/solr, hostPort=57551}
[junit4] 2> 569249 INFO (TEST-TestReplicationHandler.doTestReplicateAfterWrite2Slave-seed#[4910211677A01E90]) [ ] o.a.s.s.SolrDispatchFilter SolrDispatchFilter.init(): sun.misc.Launcher$AppClassLoader@6d06d69c
[junit4] 2> 569249 INFO (TEST-TestReplicationHandler.doTestReplicateAfterWrite2Slave-seed#[4910211677A01E90]) [ ] o.a.s.c.SolrResourceLoader new SolrResourceLoader for directory: '/export/home/jenkins/workspace/Lucene-Solr-master-Solaris/solr/build/solr-core/test/J0/temp/solr.handler.TestReplicationHandler_4910211677A01E90-001/solr-instance-001'
[junit4] 2> 569250 INFO (TEST-TestReplicationHandler.doTestReplicateAfterWrite2Slave-seed#[4910211677A01E90]) [ ] o.a.s.c.SolrResourceLoader JNDI not configured for solr (NoInitialContextEx)
[junit4] 2> 569250 INFO (TEST-TestReplicationHandler.doTestReplicateAfterWrite2Slave-seed#[4910211677A01E90]) [ ] o.a.s.c.SolrResourceLoader solr home defaulted to 'solr/' (could not find system property or JNDI)
[junit4] 2> 569250 INFO (TEST-TestReplicationHandler.doTestReplicateAfterWrite2Slave-seed#[4910211677A01E90]) [ ] o.a.s.c.SolrXmlConfig Loading container configuration from /export/home/jenkins/workspace/Lucene-Solr-master-Solaris/solr/build/solr-core/test/J0/temp/solr.handler.TestReplicationHandler_4910211677A01E90-001/solr-instance-001/solr.xml
[junit4] 2> 569255 INFO (TEST-TestReplicationHandler.doTestReplicateAfterWrite2Slave-seed#[4910211677A01E90]) [ ] o.a.s.c.CorePropertiesLocator Config-defined core root directory: /export/home/jenkins/workspace/Lucene-Solr-master-Solaris/solr/build/solr-core/test/J0/temp/solr.handler.TestReplicationHandler_4910211677A01E90-001/solr-instance-001/.
[junit4] 2> 569255 INFO (TEST-TestReplicationHandler.doTestReplicateAfterWrite2Slave-seed#[4910211677A01E90]) [ ] o.a.s.c.CoreContainer New CoreContainer 1579311588
[junit4] 2> 569255 INFO (TEST-TestReplicationHandler.doTestReplicateAfterWrite2Slave-seed#[4910211677A01E90]) [ ] o.a.s.c.CoreContainer Loading cores into CoreContainer [instanceDir=/export/home/jenkins/workspace/Lucene-Solr-master-Solaris/solr/build/solr-core/test/J0/temp/solr.handler.TestReplicationHandler_4910211677A01E90-001/solr-instance-001]
[junit4] 2> 569255 WARN (TEST-TestReplicationHandler.doTestReplicateAfterWrite2Slave-seed#[4910211677A01E90]) [ ] o.a.s.c.CoreContainer Couldn't add files from /export/home/jenkins/workspace/Lucene-Solr-master-Solaris/solr/build/solr-core/test/J0/temp/solr.handler.TestReplicationHandler_4910211677A01E90-001/solr-instance-001/lib to classpath: /export/home/jenkins/workspace/Lucene-Solr-master-Solaris/solr/build/solr-core/test/J0/temp/solr.handler.TestReplicationHandler_4910211677A01E90-001/solr-instance-001/lib
[junit4] 2> 569255 INFO (TEST-TestReplicationHandler.doTestReplicateAfterWrite2Slave-seed#[4910211677A01E90]) [ ] o.a.s.h.c.HttpShardHandlerFactory created with socketTimeout : 90000,urlScheme : ,connTimeout : 15000,maxConnectionsPerHost : 20,maxConnections : 10000,corePoolSize : 0,maximumPoolSize : 2147483647,maxThreadIdleTime : 5,sizeOfQueue : -1,fairnessPolicy : false,
[junit4] 2> 569257 INFO (TEST-TestReplicationHandler.doTestReplicateAfterWrite2Slave-seed#[4910211677A01E90]) [ ] o.a.s.u.UpdateShardHandler Creating UpdateShardHandler HTTP client with params:
[junit4] 2> 569258 INFO (TEST-TestReplicationHandler.doTestReplicateAfterWrite2Slave-seed#[4910211677A01E90]) [ ] o.a.s.l.LogWatcher SLF4J impl is org.slf4j.impl.Log4jLoggerFactory
[junit4] 2> 569258 INFO (TEST-TestReplicationHandler.doTestReplicateAfterWrite2Slave-seed#[4910211677A01E90]) [ ] o.a.s.l.LogWatcher Registering Log Listener [Log4j (org.slf4j.impl.Log4jLoggerFactory)]
[junit4] 2> 569258 INFO (TEST-TestReplicationHandler.doTestReplicateAfterWrite2Slave-seed#[4910211677A01E90]) [ ] o.a.s.c.CoreContainer Security conf doesn't exist. Skipping setup for authorization module.
[junit4] 2> 569258 INFO (TEST-TestReplicationHandler.doTestReplicateAfterWrite2Slave-seed#[4910211677A01E90]) [ ] o.a.s.c.CoreContainer No authentication plugin used.
[junit4] 2> 569259 INFO (TEST-TestReplicationHandler.doTestReplicateAfterWrite2Slave-seed#[4910211677A01E90]) [ ] o.a.s.c.CorePropertiesLocator Looking for core definitions underneath /export/home/jenkins/workspace/Lucene-Solr-master-Solaris/solr/build/solr-core/test/J0/temp/solr.handler.TestReplicationHandler_4910211677A01E90-001/solr-instance-001/.
[junit4] 2> 569260 INFO (TEST-TestReplicationHandler.doTestReplicateAfterWrite2Slave-seed#[4910211677A01E90]) [ ] o.a.s.c.CoreDescriptor Created CoreDescriptor: {name=collection1, config=solrconfig.xml, loadOnStartup=true, schema=schema.xml, configSetProperties=configsetprops.json, transient=false, dataDir=data/}
[junit4] 2> 569260 INFO (TEST-TestReplicationHandler.doTestReplicateAfterWrite2Slave-seed#[4910211677A01E90]) [ ] o.a.s.c.CorePropertiesLocator Found core collection1 in /export/home/jenkins/workspace/Lucene-Solr-master-Solaris/solr/build/solr-core/test/J0/temp/solr.handler.TestReplicationHandler_4910211677A01E90-001/solr-instance-001/./collection1
[junit4] 2> 569260 INFO (TEST-TestReplicationHandler.doTestReplicateAfterWrite2Slave-seed#[4910211677A01E90]) [ ] o.a.s.c.CorePropertiesLocator Found 1 core definitions
[junit4] 2> 569261 INFO (TEST-TestReplicationHandler.doTestReplicateAfterWrite2Slave-seed#[4910211677A01E90]) [ ] o.a.s.s.SolrDispatchFilter user.dir=/export/home/jenkins/workspace/Lucene-Solr-master-Solaris/solr/build/solr-core/test/J0
[junit4] 2> 569261 INFO (TEST-TestReplicationHandler.doTestReplicateAfterWrite2Slave-seed#[4910211677A01E90]) [ ] o.a.s.s.SolrDispatchFilter SolrDispatchFilter.init() done
[junit4] 2> 569261 INFO (coreLoadExecutor-1640-thread-1) [ ] o.a.s.c.SolrResourceLoader new SolrResourceLoader for directory: '/export/home/jenkins/workspace/Lucene-Solr-master-Solaris/solr/build/solr-core/test/J0/temp/solr.handler.TestReplicationHandler_4910211677A01E90-001/solr-instance-001/collection1'
[junit4] 2> 569263 INFO (coreLoadExecutor-1640-thread-1) [ ] o.a.s.c.SolrResourceLoader JNDI not configured for solr (NoInitialContextEx)
[junit4] 2> 569263 INFO (coreLoadExecutor-1640-thread-1) [ ] o.a.s.c.SolrResourceLoader solr home defaulted to 'solr/' (could not find system property or JNDI)
[junit4] 2> 569271 INFO (coreLoadExecutor-1640-thread-1) [ ] o.a.s.c.SolrConfig current version of requestparams : -1
[junit4] 2> 569273 INFO (coreLoadExecutor-1640-thread-1) [ ] o.a.s.c.SolrConfig Using Lucene MatchVersion: 7.0.0
[junit4] 2> 569277 INFO (coreLoadExecutor-1640-thread-1) [ ] o.a.s.c.SolrConfig Loaded SolrConfig: solrconfig.xml
[junit4] 2> 569279 INFO (coreLoadExecutor-1640-thread-1) [ ] o.a.s.s.IndexSchema [collection1] Schema name=test
[junit4] 2> 569282 INFO (coreLoadExecutor-1640-thread-1) [ ] o.a.s.s.IndexSchema unique key field: id
[junit4] 2> 569283 INFO (coreLoadExecutor-1640-thread-1) [ ] o.a.s.c.ConfigSetProperties Did not find ConfigSet properties, assuming default properties: Can't find resource 'configsetprops.json' in classpath or '/export/home/jenkins/workspace/Lucene-Solr-master-Solaris/solr/build/solr-core/test/J0/temp/solr.handler.TestReplicationHandler_4910211677A01E90-001/solr-instance-001/collection1'
[junit4] 2> 569283 INFO (coreLoadExecutor-1640-thread-1) [ ] o.a.s.c.CoreContainer Creating SolrCore 'collection1' using configuration from instancedir /export/home/jenkins/workspace/Lucene-Solr-master-Solaris/solr/build/solr-core/test/J0/temp/solr.handler.TestReplicationHandler_4910211677A01E90-001/solr-instance-001/./collection1
[junit4] 2> 569283 INFO (coreLoadExecutor-1640-thread-1) [ x:collection1] o.a.s.c.SolrCore org.apache.solr.core.MockDirectoryFactory
[junit4] 2> 569283 INFO (coreLoadExecutor-1640-thread-1) [ x:collection1] o.a.s.c.SolrCore [[collection1] ] Opening new SolrCore at [/export/home/jenkins/workspace/Lucene-Solr-master-Solaris/solr/build/solr-core/test/J0/temp/solr.handler.TestReplicationHandler_4910211677A01E90-001/solr-instance-001/collection1], dataDir=[/export/home/jenkins/workspace/Lucene-Solr-master-Solaris/solr/build/solr-core/test/J0/temp/solr.handler.TestReplicationHandler_4910211677A01E90-001/solr-instance-001/./collection1/data/]
[junit4] 2> 569284 INFO (coreLoadExecutor-1640-thread-1) [ x:collection1] o.a.s.c.SolrCore JMX monitoring not detected for core: collection1
[junit4] 2> 569284 INFO (coreLoadExecutor-1640-thread-1) [ x:collection1] o.a.s.c.CachingDirectoryFactory return new directory for /export/home/jenkins/workspace/Lucene-Solr-master-Solaris/solr/build/solr-core/test/J0/temp/solr.handler.TestReplicationHandler_4910211677A01E90-001/solr-instance-001/./collection1/data
[junit4] 2> 569284 INFO (coreLoadExecutor-1640-thread-1) [ x:collection1] o.a.s.c.SolrCore New index directory detected: old=null new=/export/home/jenkins/workspace/Lucene-Solr-master-Solaris/solr/build/solr-core/test/J0/temp/solr.handler.TestReplicationHandler_4910211677A01E90-001/solr-instance-001/./collection1/data/index/
[junit4] 2> 569284 WARN (coreLoadExecutor-1640-thread-1) [ x:collection1] o.a.s.c.SolrCore [collection1] Solr index directory '/export/home/jenkins/workspace/Lucene-Solr-master-Solaris/solr/build/solr-core/test/J0/temp/solr.handler.TestReplicationHandler_4910211677A01E90-001/solr-instance-001/./collection1/data/index' doesn't exist. Creating new index...
[junit4] 2> 569284 INFO (coreLoadExecutor-1640-thread-1) [ x:collection1] o.a.s.c.CachingDirectoryFactory return new directory for /export/home/jenkins/workspace/Lucene-Solr-master-Solaris/solr/build/solr-core/test/J0/temp/solr.handler.TestReplicationHandler_4910211677A01E90-001/solr-instance-001/./collection1/data/index
[junit4] 2> 569285 INFO (coreLoadExecutor-1640-thread-1) [ x:collection1] o.a.s.u.RandomMergePolicy RandomMergePolicy wrapping class org.apache.lucene.index.AlcoholicMergePolicy: [AlcoholicMergePolicy: minMergeSize=0, mergeFactor=10, maxMergeSize=834398127, maxMergeSizeForForcedMerge=9223372036854775807, calibrateSizeByDeletes=true, maxMergeDocs=2147483647, maxCFSSegmentSizeMB=8.796093022207999E12, noCFSRatio=0.1]
[junit4] 2> 569285 INFO (coreLoadExecutor-1640-thread-1) [ x:collection1] o.a.s.c.SolrDeletionPolicy SolrDeletionPolicy.onCommit: commits: num=1
[junit4] 2> commit{dir=MockDirectoryWrapper(RAMDirectory@6aaeac44 lockFactory=org.apache.lucene.store.SingleInstanceLockFactory@3f2888e3),segFN=segments_1,generation=1}
[junit4] 2> 569285 INFO (coreLoadExecutor-1640-thread-1) [ x:collection1] o.a.s.c.SolrDeletionPolicy newest commit generation = 1
[junit4] 2> 569286 INFO (OldIndexDirectoryCleanupThreadForCore-collection1) [ x:collection1] o.a.s.c.SolrCore Looking for old index directories to cleanup for core collection1 in /export/home/jenkins/workspace/Lucene-Solr-master-Solaris/solr/build/solr-core/test/J0/temp/solr.handler.TestReplicationHandler_4910211677A01E90-001/solr-instance-001/./collection1/data/
[junit4] 2> 569287 INFO (coreLoadExecutor-1640-thread-1) [ x:collection1] o.a.s.c.SolrCore no updateRequestProcessorChain defined as default, creating implicit default
[junit4] 2> 569289 INFO (coreLoadExecutor-1640-thread-1) [ x:collection1] o.a.s.h.l.XMLLoader xsltCacheLifetimeSeconds=60
[junit4] 2> 569289 INFO (coreLoadExecutor-1640-thread-1) [ x:collection1] o.a.s.h.l.XMLLoader xsltCacheLifetimeSeconds=60
[junit4] 2> 569290 INFO (coreLoadExecutor-1640-thread-1) [ x:collection1] o.a.s.h.l.XMLLoader xsltCacheLifetimeSeconds=60
[junit4] 2> 569290 INFO (coreLoadExecutor-1640-thread-1) [ x:collection1] o.a.s.h.l.XMLLoader xsltCacheLifetimeSeconds=60
[junit4] 2> 569292 INFO (coreLoadExecutor-1640-thread-1) [ x:collection1] o.a.s.c.PluginBag requestHandler : 'lazy' created with startup=lazy
[junit4] 2> 569292 INFO (coreLoadExecutor-1640-thread-1) [ x:collection1] o.a.s.c.RequestHandlers Registered paths: /admin/mbeans,standard,lazy,/update/json/docs,/admin/luke,/export,/get,/admin/properties,/update/json,/admin/threads,/update/csv,/sql,/graph,/admin/segments,/admin/system,/replication,defaults,/config,/stream,/schema,/admin/plugins,/admin/logging,/admin/ping,/update,/admin/file
[junit4] 2> 569292 INFO (coreLoadExecutor-1640-thread-1) [ x:collection1] o.a.s.c.SolrCore Using default statsCache cache: org.apache.solr.search.stats.LocalStatsCache
[junit4] 2> 569292 INFO (coreLoadExecutor-1640-thread-1) [ x:collection1] o.a.s.u.CommitTracker Hard AutoCommit: disabled
[junit4] 2> 569292 INFO (coreLoadExecutor-1640-thread-1) [ x:collection1] o.a.s.u.CommitTracker Soft AutoCommit: disabled
[junit4] 2> 569292 INFO (coreLoadExecutor-1640-thread-1) [ x:collection1] o.a.s.u.RandomMergePolicy RandomMergePolicy wrapping class org.apache.lucene.index.AlcoholicMergePolicy: [AlcoholicMergePolicy: minMergeSize=0, mergeFactor=10, maxMergeSize=1592229364, maxMergeSizeForForcedMerge=9223372036854775807, calibrateSizeByDeletes=true, maxMergeDocs=2147483647, maxCFSSegmentSizeMB=8.796093022207999E12, noCFSRatio=0.1]
[junit4] 2> 569292 INFO (coreLoadExecutor-1640-thread-1) [ x:collection1] o.a.s.c.SolrDeletionPolicy SolrDeletionPolicy.onInit: commits: num=1
[junit4] 2> commit{dir=MockDirectoryWrapper(RAMDirectory@6aaeac44 lockFactory=org.apache.lucene.store.SingleInstanceLockFactory@3f2888e3),segFN=segments_1,generation=1}
[junit4] 2> 569293 INFO (coreLoadExecutor-1640-thread-1) [ x:collection1] o.a.s.c.SolrDeletionPolicy newest commit generation = 1
[junit4] 2> 569293 INFO (coreLoadExecutor-1640-thread-1) [ x:collection1] o.a.s.s.SolrIndexSearcher Opening [Searcher@72bdb8d8[collection1] main]
[junit4] 2> 569293 INFO (coreLoadExecutor-1640-thread-1) [ x:collection1] o.a.s.r.ManagedResourceStorage File-based storage initialized to use dir: /export/home/jenkins/workspace/Lucene-Solr-master-Solaris/solr/build/solr-core/test/J0/temp/solr.handler.TestReplicationHandler_4910211677A01E90-001/solr-instance-001/collection1/conf
[junit4] 2> 569293 INFO (coreLoadExecutor-1640-thread-1) [ x:collection1] o.a.s.r.RestManager Initializing RestManager with initArgs: {storageDir=/export/home/jenkins/workspace/Lucene-Solr-master-Solaris/solr/build/solr-core/test/J0/temp/solr.handler.TestReplicationHandler_4910211677A01E90-001/solr-instance-001/collection1/conf}
[junit4] 2> 569293 INFO (coreLoadExecutor-1640-thread-1) [ x:collection1] o.a.s.r.ManagedResourceStorage Reading _rest_managed.json using file:dir=/export/home/jenkins/workspace/Lucene-Solr-master-Solaris/solr/build/solr-core/test/J0/temp/solr.handler.TestReplicationHandler_4910211677A01E90-001/solr-instance-001/collection1/conf
[junit4] 2> 569293 INFO (coreLoadExecutor-1640-thread-1) [ x:collection1] o.a.s.r.RestManager Initializing 0 registered ManagedResources
[junit4] 2> 569293 INFO (coreLoadExecutor-1640-thread-1) [ x:collection1] o.a.s.h.ReplicationHandler Replication enabled for following config files: schema.xml,xslt/dummy.xsl
[junit4] 2> 569294 INFO (coreLoadExecutor-1640-thread-1) [ x:collection1] o.a.s.h.ReplicationHandler Commits will be reserved for 10000
[junit4] 2> 569294 INFO (searcherExecutor-1641-thread-1-processing-x:collection1) [ x:collection1] o.a.s.c.SolrCore [collection1] Registered new searcher Searcher@72bdb8d8[collection1] main{ExitableDirectoryReader(UninvertingDirectoryReader())}
[junit4] 2> 569294 INFO (coreLoadExecutor-1640-thread-1) [ x:collection1] o.a.s.c.CoreContainer registering core: collection1
[junit4] 2> 569763 INFO (TEST-TestReplicationHandler.doTestReplicateAfterWrite2Slave-seed#[4910211677A01E90]) [ ] o.a.s.SolrTestCaseJ4 Writing core.properties file to /export/home/jenkins/workspace/Lucene-Solr-master-Solaris/solr/build/solr-core/test/J0/temp/solr.handler.TestReplicationHandler_4910211677A01E90-001/solr-instance-002/collection1
[junit4] 2> 569766 INFO (TEST-TestReplicationHandler.doTestReplicateAfterWrite2Slave-seed#[4910211677A01E90]) [ ] o.e.j.s.Server jetty-9.3.8.v20160314
[junit4] 2> 569768 INFO (TEST-TestReplicationHandler.doTestReplicateAfterWrite2Slave-seed#[4910211677A01E90]) [ ] o.e.j.s.h.ContextHandler Started o.e.j.s.ServletContextHandler@54cca1e9{/solr,null,AVAILABLE}
[junit4] 2> 569768 INFO (TEST-TestReplicationHandler.doTestReplicateAfterWrite2Slave-seed#[4910211677A01E90]) [ ] o.e.j.s.ServerConnector Started ServerConnector@589a4492{HTTP/1.1,[http/1.1]}{127.0.0.1:40262}
[junit4] 2> 569768 INFO (TEST-TestReplicationHandler.doTestReplicateAfterWrite2Slave-seed#[4910211677A01E90]) [ ] o.e.j.s.Server Started @575517ms
[junit4] 2> 569768 INFO (TEST-TestReplicationHandler.doTestReplicateAfterWrite2Slave-seed#[4910211677A01E90]) [ ] o.a.s.c.s.e.JettySolrRunner Jetty properties: {solr.data.dir=/export/home/jenkins/workspace/Lucene-Solr-master-Solaris/solr/build/solr-core/test/J0/temp/solr.handler.TestReplicationHandler_4910211677A01E90-001/solr-instance-002/collection1/data, hostContext=/solr, hostPort=40262}
[junit4] 2> 569770 INFO (TEST-TestReplicationHandler.doTestReplicateAfterWrite2Slave-seed#[4910211677A01E90]) [ ] o.a.s.s.SolrDispatchFilter SolrDispatchFilter.init(): sun.misc.Launcher$AppClassLoader@6d06d69c
[junit4] 2> 569770 INFO (TEST-TestReplicationHandler.doTestReplicateAfterWrite2Slave-seed#[4910211677A01E90]) [ ] o.a.s.c.SolrResourceLoader new SolrResourceLoader for directory: '/export/home/jenkins/workspace/Lucene-Solr-master-Solaris/solr/build/solr-core/test/J0/temp/solr.handler.TestReplicationHandler_4910211677A01E90-001/solr-instance-002'
[junit4] 2> 569770 INFO (TEST-TestReplicationHandler.doTestReplicateAfterWrite2Slave-seed#[4910211677A01E90]) [ ] o.a.s.c.SolrResourceLoader JNDI not configured for solr (NoInitialContextEx)
[junit4] 2> 569770 INFO (TEST-TestReplicationHandler.doTestReplicateAfterWrite2Slave-seed#[4910211677A01E90]) [ ] o.a.s.c.SolrResourceLoader solr home defaulted to 'solr/' (could not find system property or JNDI)
[junit4] 2> 569770 INFO (TEST-TestReplicationHandler.doTestReplicateAfterWrite2Slave-seed#[4910211677A01E90]) [ ] o.a.s.c.SolrXmlConfig Loading container configuration from /export/home/jenkins/workspace/Lucene-Solr-master-Solaris/solr/build/solr-core/test/J0/temp/solr.handler.TestReplicationHandler_4910211677A01E90-001/solr-instance-002/solr.xml
[junit4] 2> 569774 INFO (TEST-TestReplicationHandler.doTestReplicateAfterWrite2Slave-seed#[4910211677A01E90]) [ ] o.a.s.c.CorePropertiesLocator Config-defined core root directory: /export/home/jenkins/workspace/Lucene-Solr-master-Solaris/solr/build/solr-core/test/J0/temp/solr.handler.TestReplicationHandler_4910211677A01E90-001/solr-instance-002/.
[junit4] 2> 569774 INFO (TEST-TestReplicationHandler.doTestReplicateAfterWrite2Slave-seed#[4910211677A01E90]) [ ] o.a.s.c.CoreContainer New CoreContainer 1281272196
[junit4] 2> 569774 INFO (TEST-TestReplicationHandler.doTestReplicateAfterWrite2Slave-seed#[4910211677A01E90]) [ ] o.a.s.c.CoreContainer Loading cores into CoreContainer [instanceDir=/export/home/jenkins/workspace/Lucene-Solr-master-Solaris/solr/build/solr-core/test/J0/temp/solr.handler.TestReplicationHandler_4910211677A01E90-001/solr-instance-002]
[junit4] 2> 569774 WARN (TEST-TestReplicationHandler.doTestReplicateAfterWrite2Slave-seed#[4910211677A01E90]) [ ] o.a.s.c.CoreContainer Couldn't add files from /export/home/jenkins/workspace/Lucene-Solr-master-Solaris/solr/build/solr-core/test/J0/temp/solr.handler.TestReplicationHandler_4910211677A01E90-001/solr-instance-002/lib to classpath: /export/home/jenkins/workspace/Lucene-Solr-master-Solaris/solr/build/solr-core/test/J0/temp/solr.handler.TestReplicationHandler_4910211677A01E90-001/solr-instance-002/lib
[junit4] 2> 569775 INFO (TEST-TestReplicationHandler.doTestReplicateAfterWrite2Slave-seed#[4910211677A01E90]) [ ] o.a.s.h.c.HttpShardHandlerFactory created with socketTimeout : 90000,urlScheme : ,connTimeout : 15000,maxConnectionsPerHost : 20,maxConnections : 10000,corePoolSize : 0,maximumPoolSize : 2147483647,maxThreadIdleTime : 5,sizeOfQueue : -1,fairnessPolicy : false,
[junit4] 2> 569776 INFO (TEST-TestReplicationHandler.doTestReplicateAfterWrite2Slave-seed#[4910211677A01E90]) [ ] o.a.s.u.UpdateShardHandler Creating UpdateShardHandler HTTP client with params:
[junit4] 2> 569777 INFO (TEST-TestReplicationHandler.doTestReplicateAfterWrite2Slave-seed#[4910211677A01E90]) [ ] o.a.s.l.LogWatcher SLF4J impl is org.slf4j.impl.Log4jLoggerFactory
[junit4] 2> 569777 INFO (TEST-TestReplicationHandler.doTestReplicateAfterWrite2Slave-seed#[4910211677A01E90]) [ ] o.a.s.l.LogWatcher Registering Log Listener [Log4j (org.slf4j.impl.Log4jLoggerFactory)]
[junit4] 2> 569777 INFO (TEST-TestReplicationHandler.doTestReplicateAfterWrite2Slave-seed#[4910211677A01E90]) [ ] o.a.s.c.CoreContainer Security conf doesn't exist. Skipping setup for authorization module.
[junit4] 2> 569777 INFO (TEST-TestReplicationHandler.doTestReplicateAfterWrite2Slave-seed#[4910211677A01E90]) [ ] o.a.s.c.CoreContainer No authentication plugin used.
[junit4] 2> 569778 INFO (TEST-TestReplicationHandler.doTestReplicateAfterWrite2Slave-seed#[4910211677A01E90]) [ ] o.a.s.c.CorePropertiesLocator Looking for core definitions underneath /export/home/jenkins/workspace/Lucene-Solr-master-Solaris/solr/build/solr-core/test/J0/temp/solr.handler.TestReplicationHandler_4910211677A01E90-001/solr-instance-002/.
[junit4] 2> 569779 INFO (TEST-TestReplicationHandler.doTestReplicateAfterWrite2Slave-seed#[4910211677A01E90]) [ ] o.a.s.c.CoreDescriptor Created CoreDescriptor: {name=collection1, config=solrconfig.xml, loadOnStartup=true, schema=schema.xml, configSetProperties=configsetprops.json, transient=false, dataDir=data/}
[junit4] 2> 569779 INFO (TEST-TestReplicationHandler.doTestReplicateAfterWrite2Slave-seed#[4910211677A01E90]) [ ] o.a.s.c.CorePropertiesLocator Found core collection1 in /export/home/jenkins/workspace/Lucene-Solr-master-Solaris/solr/build/solr-core/test/J0/temp/solr.handler.TestReplicationHandler_4910211677A01E90-001/solr-instance-002/./collection1
[junit4] 2> 569779 INFO (TEST-TestReplicationHandler.doTestReplicateAfterWrite2Slave-seed#[4910211677A01E90]) [ ] o.a.s.c.CorePropertiesLocator Found 1 core definitions
[junit4] 2> 569779 INFO (coreLoadExecutor-1650-thread-1) [ ] o.a.s.c.SolrResourceLoader new SolrResourceLoader for directory: '/export/home/jenkins/workspace/Lucene-Solr-master-Solaris/solr/build/solr-core/test/J0/temp/solr.handler.TestReplicationHandler_4910211677A01E90-001/solr-instance-002/collection1'
[junit4] 2> 569781 INFO (TEST-TestReplicationHandler.doTestReplicateAfterWrite2Slave-seed#[4910211677A01E90]) [ ] o.a.s.s.SolrDispatchFilter user.dir=/export/home/jenkins/workspace/Lucene-Solr-master-Solaris/solr/build/solr-core/test/J0
[junit4] 2> 569781 INFO (TEST-TestReplicationHandler.doTestReplicateAfterWrite2Slave-seed#[4910211677A01E90]) [ ] o.a.s.s.SolrDispatchFilter SolrDispatchFilter.init() done
[junit4] 2> 569781 INFO (coreLoadExecutor-1650-thread-1) [ ] o.a.s.c.SolrResourceLoader JNDI not configured for solr (NoInitialContextEx)
[junit4] 2> 569781 INFO (coreLoadExecutor-1650-thread-1) [ ] o.a.s.c.SolrResourceLoader solr home defaulted to 'solr/' (could not find system property or JNDI)
[junit4] 2> 569787 INFO (coreLoadExecutor-1650-thread-1) [ ] o.a.s.c.SolrConfig current version of requestparams : -1
[junit4] 2> 569789 INFO (coreLoadExecutor-1650-thread-1) [ ] o.a.s.c.SolrConfig Using Lucene MatchVersion: 7.0.0
[junit4] 2> 569794 INFO (coreLoadExecutor-1650-thread-1) [ ] o.a.s.c.SolrConfig Loaded SolrConfig: solrconfig.xml
[junit4] 2> 569796 INFO (coreLoadExecutor-1650-thread-1) [ ] o.a.s.s.IndexSchema [collection1] Schema name=test
[junit4] 2> 569798 INFO (coreLoadExecutor-1650-thread-1) [ ] o.a.s.s.IndexSchema unique key field: id
[junit4] 2> 569799 INFO (coreLoadExecutor-1650-thread-1) [ ] o.a.s.c.ConfigSetProperties Did not find ConfigSet properties, assuming default properties: Can't find resource 'configsetprops.json' in classpath or '/export/home/jenkins/workspace/Lucene-Solr-master-Solaris/solr/build/solr-core/test/J0/temp/solr.handler.TestReplicationHandler_4910211677A01E90-001/solr-instance-002/collection1'
[junit4] 2> 569799 INFO (coreLoadExecutor-1650-thread-1) [ ] o.a.s.c.CoreContainer Creating SolrCore 'collection1' using configuration from instancedir /export/home/jenkins/workspace/Lucene-Solr-master-Solaris/solr/build/solr-core/test/J0/temp/solr.handler.TestReplicationHandler_4910211677A01E90-001/solr-instance-002/./collection1
[junit4] 2> 569799 INFO (coreLoadExecutor-1650-thread-1) [ x:collection1] o.a.s.c.SolrCore org.apache.solr.core.MockDirectoryFactory
[junit4] 2> 569799 INFO (coreLoadExecutor-1650-thread-1) [ x:collection1] o.a.s.c.SolrCore [[collection1] ] Opening new SolrCore at [/export/home/jenkins/workspace/Lucene-Solr-master-Solaris/solr/build/solr-core/test/J0/temp/solr.handler.TestReplicationHandler_4910211677A01E90-001/solr-instance-002/collection1], dataDir=[/export/home/jenkins/workspace/Lucene-Solr-master-Solaris/solr/build/solr-core/test/J0/temp/solr.handler.TestReplicationHandler_4910211677A01E90-001/solr-instance-002/./collection1/data/]
[junit4] 2> 569799 INFO (coreLoadExecutor-1650-thread-1) [ x:collection1] o.a.s.c.SolrCore JMX monitoring not detected for core: collection1
[junit4] 2> 569799 INFO (coreLoadExecutor-1650-thread-1) [ x:collection1] o.a.s.c.CachingDirectoryFactory return new directory for /export/home/jenkins/workspace/Lucene-Solr-master-Solaris/solr/build/solr-core/test/J0/temp/solr.handler.TestReplicationHandler_4910211677A01E90-001/solr-instance-002/./collection1/data
[junit4] 2> 569800 INFO (coreLoadExecutor-1650-thread-1) [ x:collection1] o.a.s.c.SolrCore New index directory detected: old=null new=/export/home/jenkins/workspace/Lucene-Solr-master-Solaris/solr/build/solr-core/test/J0/temp/solr.handler.TestReplicationHandler_4910211677A01E90-001/solr-instance-002/./collection1/data/index/
[junit4] 2> 569800 WARN (coreLoadExecutor-1650-thread-1) [ x:collection1] o.a.s.c.SolrCore [collection1] Solr index directory '/export/home/jenkins/workspace/Lucene-Solr-master-Solaris/solr/build/solr-core/test/J0/temp/solr.handler.TestReplicationHandler_4910211677A01E90-001/solr-instance-002/./collection1/data/index' doesn't exist. Creating new index...
[junit4] 2> 569800 INFO (coreLoadExecutor-1650-thread-1) [ x:collection1] o.a.s.c.CachingDirectoryFactory return new directory for /export/home/jenkins/workspace/Lucene-Solr-master-Solaris/solr/build/solr-core/test/J0/temp/solr.handler.TestReplicationHandler_4910211677A01E90-001/solr-instance-002/./collection1/data/index
[junit4] 2> 569801 INFO (coreLoadExecutor-1650-thread-1) [ x:collection1] o.a.s.u.RandomMergePolicy RandomMergePolicy wrapping class org.apache.lucene.index.AlcoholicMergePolicy: [AlcoholicMergePolicy: minMergeSize=0, mergeFactor=10, maxMergeSize=834398127, maxMergeSizeForForcedMerge=9223372036854775807, calibrateSizeByDeletes=true, maxMergeDocs=2147483647, maxCFSSegmentSizeMB=8.796093022207999E12, noCFSRatio=0.1]
[junit4] 2> 569801 INFO (coreLoadExecutor-1650-thread-1) [ x:collection1] o.a.s.c.SolrDeletionPolicy SolrDeletionPolicy.onCommit: commits: num=1
[junit4] 2> commit{dir=MockDirectoryWrapper(RAMDirectory@2e76582b lockFactory=org.apache.lucene.store.SingleInstanceLockFactory@57dee465),segFN=segments_1,generation=1}
[junit4] 2> 569801 INFO (coreLoadExecutor-1650-thread-1) [ x:collection1] o.a.s.c.SolrDeletionPolicy newest commit generation = 1
[junit4] 2> 569802 INFO (OldIndexDirectoryCleanupThreadForCore-collection1) [ x:collection1] o.a.s.c.SolrCore Looking for old index directories to cleanup for core collection1 in /export/home/jenkins/workspace/Lucene-Solr-master-Solaris/solr/build/solr-core/test/J0/temp/solr.handler.TestReplicationHandler_4910211677A01E90-001/solr-instance-002/./collection1/data/
[junit4] 2> 569803 INFO (coreLoadExecutor-1650-thread-1) [ x:collection1] o.a.s.c.SolrCore no updateRequestProcessorChain defined as default, creating implicit default
[junit4] 2> 569804 INFO (coreLoadExecutor-1650-thread-1) [ x:collection1] o.a.s.h.l.XMLLoader xsltCacheLifetimeSeconds=60
[junit4] 2> 569804 INFO (coreLoadExecutor-1650-thread-1) [ x:collection1] o.a.s.h.l.XMLLoader xsltCacheLifetimeSeconds=60
[junit4] 2> 569805 INFO (coreLoadExecutor-1650-thread-1) [ x:collection1] o.a.s.h.l.XMLLoader xsltCacheLifetimeSeconds=60
[junit4] 2> 569806 INFO (coreLoadExecutor-1650-thread-1) [ x:collection1] o.a.s.h.l.XMLLoader xsltCacheLifetimeSeconds=60
[junit4] 2> 569808 INFO (coreLoadExecutor-1650-thread-1) [ x:collection1] o.a.s.c.PluginBag requestHandler : 'lazy' created with startup=lazy
[junit4] 2> 569808 INFO (coreLoadExecutor-1650-thread-1) [ x:collection1] o.a.s.c.RequestHandlers Registered paths: /admin/mbeans,standard,lazy,/update/json/docs,/admin/luke,/export,/get,/admin/properties,/update/json,/admin/threads,/update/csv,/sql,/graph,/admin/segments,/admin/system,/replication,defaults,/config,/stream,/schema,/admin/plugins,/admin/logging,/admin/ping,/update,/admin/file
[junit4] 2> 569808 INFO (coreLoadExecutor-1650-thread-1) [ x:collection1] o.a.s.c.SolrCore Using default statsCache cache: org.apache.solr.search.stats.LocalStatsCache
[junit4] 2> 569808 INFO (coreLoadExecutor-1650-thread-1) [ x:collection1] o.a.s.u.CommitTracker Hard AutoCommit: disabled
[junit4] 2> 569808 INFO (coreLoadExecutor-1650-thread-1) [ x:collection1] o.a.s.u.CommitTracker Soft AutoCommit: disabled
[junit4] 2> 569808 INFO (coreLoadExecutor-1650-thread-1) [ x:collection1] o.a.s.u.RandomMergePolicy RandomMergePolicy wrapping class org.apache.lucene.index.AlcoholicMergePolicy: [AlcoholicMergePolicy: minMergeSize=0, mergeFactor=10, maxMergeSize=1592229364, maxMergeSizeForForcedMerge=9223372036854775807, calibrateSizeByDeletes=true, maxMergeDocs=2147483647, maxCFSSegmentSizeMB=8.796093022207999E12, noCFSRatio=0.1]
[junit4] 2> 569808 INFO (coreLoadExecutor-1650-thread-1) [ x:collection1] o.a.s.c.SolrDeletionPolicy SolrDeletionPolicy.onInit: commits: num=1
[junit4] 2> commit{dir=MockDirectoryWrapper(RAMDirectory@2e76582b lockFactory=org.apache.lucene.store.SingleInstanceLockFactory@57dee465),segFN=segments_1,generation=1}
[junit4] 2> 569808 INFO (coreLoadExecutor-1650-thread-1) [ x:collection1] o.a.s.c.SolrDeletionPolicy newest commit generation = 1
[junit4] 2> 569808 INFO (coreLoadExecutor-1650-thread-1) [ x:collection1] o.a.s.s.SolrIndexSearcher Opening [Searcher@3588ab04[collection1] main]
[junit4] 2> 569809 INFO (coreLoadExecutor-1650-thread-1) [ x:collection1] o.a.s.r.ManagedResourceStorage File-based storage initialized to use dir: /export/home/jenkins/workspace/Lucene-Solr-master-Solaris/solr/build/solr-core/test/J0/temp/solr.handler.TestReplicationHandler_4910211677A01E90-001/solr-instance-002/collection1/conf
[junit4] 2> 569809 INFO (coreLoadExecutor-1650-thread-1) [ x:collection1] o.a.s.r.RestManager Initializing RestManager with initArgs: {storageDir=/export/home/jenkins/workspace/Lucene-Solr-master-Solaris/solr/build/solr-core/test/J0/temp/solr.handler.TestReplicationHandler_4910211677A01E90-001/solr-instance-002/collection1/conf}
[junit4] 2> 569809 INFO (coreLoadExecutor-1650-thread-1) [ x:collection1] o.a.s.r.ManagedResourceStorage Reading _rest_managed.json using file:dir=/export/home/jenkins/workspace/Lucene-Solr-master-Solaris/solr/build/solr-core/test/J0/temp/solr.handler.TestReplicationHandler_4910211677A01E90-001/solr-instance-002/collection1/conf
[junit4] 2> 569809 INFO (coreLoadExecutor-1650-thread-1) [ x:collection1] o.a.s.r.RestManager Initializing 0 registered ManagedResources
[junit4] 2> 569810 INFO (coreLoadExecutor-1650-thread-1) [ x:collection1] o.a.s.h.ReplicationHandler Poll scheduled at an interval of 1000ms
[junit4] 2> 569811 INFO (coreLoadExecutor-1650-thread-1) [ x:collection1] o.a.s.c.CoreContainer registering core: collection1
[junit4] 2> 569811 INFO (searcherExecutor-1651-thread-1-processing-x:collection1) [ x:collection1] o.a.s.c.SolrCore [collection1] Registered new searcher Searcher@3588ab04[collection1] main{ExitableDirectoryReader(UninvertingDirectoryReader())}
[junit4] 2> 570288 INFO (qtp1698963984-3251) [ x:collection1] o.a.s.c.S.Request [collection1] webapp=/solr path=/select params={q=*:*&sort=id+desc&wt=javabin&version=2} hits=0 status=0 QTime=0
[junit4] 2> 570290 INFO (qtp1698963984-3252) [ x:collection1] o.a.s.u.p.LogUpdateProcessorFactory [collection1] webapp=/solr path=/update params={wt=javabin&version=2}{add=[0]} 0 1
[junit4] 2> 570290 INFO (qtp1698963984-3250) [ x:collection1] o.a.s.u.p.LogUpdateProcessorFactory [collection1] webapp=/solr path=/update params={wt=javabin&version=2}{add=[1]} 0 0
[junit4] 2> 570291 INFO (qtp1698963984-3254) [ x:collection1] o.a.s.u.p.LogUpdateProcessorFactory [collection1] webapp=/solr path=/update params={wt=javabin&version=2}{add=[2]} 0 0
[junit4] 2> 570291 INFO (qtp1698963984-3253) [ x:collection1] o.a.s.u.p.LogUpdateProcessorFactory [collection1] webapp=/solr path=/update params={wt=javabin&version=2}{add=[3]} 0 0
[junit4] 2> 570292 INFO (qtp1698963984-3255) [ x:collection1] o.a.s.u.p.LogUpdateProcessorFactory [collection1] webapp=/solr path=/update params={wt=javabin&version=2}{add=[4]} 0 0
[junit4] 2> 570292 INFO (qtp1698963984-3248) [ x:collection1] o.a.s.u.p.LogUpdateProcessorFactory [collection1] webapp=/solr path=/update params={wt=javabin&version=2}{add=[5]} 0 0
[junit4] 2> 570293 INFO (qtp1698963984-3251) [ x:collection1] o.a.s.u.p.LogUpdateProcessorFactory [collection1] webapp=/solr path=/update params={wt=javabin&version=2}{add=[6]} 0 0
[junit4] 2> 570293 INFO (qtp1698963984-3252) [ x:collection1] o.a.s.u.p.LogUpdateProcessorFactory [collection1] webapp=/solr path=/update params={wt=javabin&version=2}{add=[7]} 0 0
[junit4] 2> 570294 INFO (qtp1698963984-3250) [ x:collection1] o.a.s.u.p.LogUpdateProcessorFactory [collection1] webapp=/solr path=/update params={wt=javabin&version=2}{add=[8]} 0 0
[junit4] 2> 570294 INFO (qtp1698963984-3254) [ x:collection1] o.a.s.u.p.LogUpdateProcessorFactory [collection1] webapp=/solr path=/update params={wt=javabin&version=2}{add=[9]} 0 0
[junit4] 2> 570294 INFO (qtp1698963984-3253) [ x:collection1] o.a.s.u.p.LogUpdateProcessorFactory [collection1] webapp=/solr path=/update params={wt=javabin&version=2}{add=[10]} 0 0
[junit4] 2> 570295 INFO (qtp1698963984-3255) [ x:collection1] o.a.s.u.p.LogUpdateProcessorFactory [collection1] webapp=/solr path=/update params={wt=javabin&version=2}{add=[11]} 0 0
[junit4] 2> 570295 INFO (qtp1698963984-3248) [ x:collection1] o.a.s.u.p.LogUpdateProcessorFactory [collection1] webapp=/solr path=/update params={wt=javabin&version=2}{add=[12]} 0 0
[junit4] 2> 570296 INFO (qtp1698963984-3251) [ x:collection1] o.a.s.u.p.LogUpdateProcessorFactory [collection1] webapp=/solr path=/update params={wt=javabin&version=2}{add=[13]} 0 0
[junit4] 2> 570296 INFO (qtp1698963984-3252) [ x:collection1] o.a.s.u.p.LogUpdateProcessorFactory [collection1] webapp=/solr path=/update params={wt=javabin&version=2}{add=[14]} 0 0
[junit4] 2> 570297 INFO (qtp1698963984-3250) [ x:collection1] o.a.s.u.p.LogUpdateProcessorFactory [collection1] webapp=/solr path=/update params={wt=javabin&version=2}{add=[15]} 0 0
[junit4] 2> 570298 INFO (qtp1698963984-3254) [ x:collection1] o.a.s.u.p.LogUpdateProcessorFactory [collection1] webapp=/solr path=/update params={wt=javabin&version=2}{add=[16]} 0 0
[junit4] 2> 570298 INFO (qtp1698963984-3253) [ x:collection1] o.a.s.u.p.LogUpdateProcessorFactory [collection1] webapp=/solr path=/update params={wt=javabin&version=2}{add=[17]} 0 0
[junit4] 2> 570299 INFO (qtp1698963984-3255) [ x:collection1] o.a.s.u.p.LogUpdateProcessorFactory [collection1] webapp=/solr path=/update params={wt=javabin&version=2}{add=[18]} 0 0
[junit4] 2> 570299 INFO (qtp1698963984-3248) [ x:collection1] o.a.s.u.p.LogUpdateProcessorFactory [collection1] webapp=/solr path=/update params={wt=javabin&version=2}{add=[19]} 0 0
[junit4] 2> 570300 INFO (qtp1698963984-3251) [ x:collection1] o.a.s.u.p.LogUpdateProcessorFactory [collection1] webapp=/solr path=/update params={wt=javabin&version=2}{add=[20]} 0 0
[junit4] 2> 570300 INFO (qtp1698963984-3252) [ x:collection1] o.a.s.u.p.LogUpdateProcessorFactory [collection1] webapp=/solr path=/update params={wt=javabin&version=2}{add=[21]} 0 0
[junit4] 2> 570301 INFO (qtp1698963984-3250) [ x:collection1] o.a.s.u.p.LogUpdateProcessorFactory [collection1] webapp=/solr path=/update params={wt=javabin&version=2}{add=[22]} 0 0
[junit4] 2> 570302 INFO (qtp1698963984-3254) [ x:collection1] o.a.s.u.p.LogUpdateProcessorFactory [collection1] webapp=/solr path=/update params={wt=javabin&version=2}{add=[23]} 0 0
[junit4] 2> 570303 INFO (qtp1698963984-3253) [ x:collection1] o.a.s.u.p.LogUpdateProcessorFactory [collection1] webapp=/solr path=/update params={wt=javabin&version=2}{add=[24]} 0 0
[junit4] 2> 570303 INFO (qtp1698963984-3253) [ x:collection1] o.a.s.u.p.LogUpdateProcessorFactory [collection1] webapp=/solr path=/update params={wt=javabin&version=2}{add=[25]} 0 0
[junit4] 2> 570303 INFO (qtp1698963984-3253) [ x:collection1] o.a.s.u.p.LogUpdateProcessorFactory [collection1] webapp=/solr path=/update params={wt=javabin&version=2}{add=[26]} 0 0
[junit4] 2> 570304 INFO (qtp1698963984-3253) [ x:collection1] o.a.s.u.p.LogUpdateProcessorFactory [collection1] webapp=/solr path=/update params={wt=javabin&version=2}{add=[27]} 0 0
[junit4] 2> 570304 INFO (qtp1698963984-3253) [ x:collection1] o.a.s.u.p.LogUpdateProcessorFactory [collection1] webapp=/solr path=/update params={wt=javabin&version=2}{add=[28]} 0 0
[junit4] 2> 570304 INFO (qtp1698963984-3253) [ x:collection1] o.a.s.u.p.LogUpdateProcessorFactory [collection1] webapp=/solr path=/update params={wt=javabin&version=2}{add=[29]} 0 0
[junit4] 2> 570305 INFO (qtp1698963984-3253) [ x:collection1] o.a.s.u.p.LogUpdateProcessorFactory [collection1] webapp=/solr path=/update params={wt=javabin&version=2}{add=[30]} 0 0
[junit4] 2> 570305 INFO (qtp1698963984-3255) [ x:collection1] o.a.s.u.p.LogUpdateProcessorFactory [collection1] webapp=/solr path=/update params={wt=javabin&version=2}{add=[31]} 0 0
[junit4] 2> 570306 INFO (qtp1698963984-3248) [ x:collection1] o.a.s.u.p.LogUpdateProcessorFactory [collection1] webapp=/solr path=/update params={wt=javabin&version=2}{add=[32]} 0 0
[junit4] 2> 570306 INFO (qtp1698963984-3251) [ x:collection1] o.a.s.u.p.LogUpdateProcessorFactory [collection1] webapp=/solr path=/update params={wt=javabin&version=2}{add=[33]} 0 0
[junit4] 2> 570307 INFO (qtp1698963984-3252) [ x:collection1] o.a.s.u.p.LogUpdateProcessorFactory [collection1] webapp=/solr path=/update params={wt=javabin&version=2}{add=[34]} 0 0
[junit4] 2> 570307 INFO (qtp1698963984-3250) [ x:collection1] o.a.s.u.p.LogUpdateProcessorFactory [collection1] webapp=/solr path=/update params={wt=javabin&version=2}{add=[35]} 0 0
[junit4] 2> 570308 INFO (qtp1698963984-3254) [ x:collection1] o.a.s.u.p.LogUpdateProcessorFactory [collection1] webapp=/solr path=/update params={wt=javabin&version=2}{add=[36]} 0 0
[junit4] 2> 570308 INFO (qtp1698963984-3253) [ x:collection1] o.a.s.u.p.LogUpdateProcessorFactory [collection1] webapp=/solr path=/update params={wt=javabin&version=2}{add=[37]} 0 0
[junit4] 2> 570309 INFO (qtp1698963984-3255) [ x:collection1] o.a.s.u.p.LogUpdateProcessorFactory [collection1] webapp=/solr path=/update params={wt=javabin&version=2}{add=[38]} 0 0
[junit4] 2> 570309 INFO (qtp1698963984-3248) [ x:collection1] o.a.s.u.p.LogUpdateProcessorFactory [collection1] webapp=/solr path=/update params={wt=javabin&version=2}{add=[39]} 0 0
[junit4] 2> 570310 INFO (qtp1698963984-3251) [ x:collection1] o.a.s.u.p.LogUpdateProcessorFactory [collection1] webapp=/solr path=/update params={wt=javabin&version=2}{add=[40]} 0 0
[junit4] 2> 570311 INFO (qtp1698963984-3252) [ x:collection1] o.a.s.u.p.LogUpdateProcessorFactory [collection1] webapp=/solr path=/update params={wt=javabin&version=2}{add=[41]} 0 0
[junit4] 2> 570311 INFO (qtp1698963984-3250) [ x:collection1] o.a.s.u.p.LogUpdateProcessorFactory [collection1] webapp=/solr path=/update params={wt=javabin&version=2}{add=[42]} 0 0
[junit4] 2> 570312 INFO (qtp1698963984-3254) [ x:collection1] o.a.s.u.p.LogUpdateProcessorFactory [collection1] webapp=/solr path=/update params={wt=javabin&version=2}{add=[43]} 0 0
[junit4] 2> 570312 INFO (qtp1698963984-3253) [ x:collection1] o.a.s.u.p.LogUpdateProcessorFactory [collection1] webapp=/solr path=/update params={wt=javabin&version=2}{add=[44]} 0 0
[junit4] 2> 570313 INFO (qtp1698963984-3255) [ x:collection1] o.a.s.u.p.LogUpdateProcessorFactory [collection1] webapp=/solr path=/update params={wt=javabin&version=2}{add=[45]} 0 0
[junit4] 2> 570314 INFO (qtp1698963984-3248) [ x:collection1] o.a.s.u.p.LogUpdateProcessorFactory [collection1] webapp=/solr path=/update params={wt=javabin&version=2}{add=[46]} 0 0
[junit4] 2> 570314 INFO (qtp1698963984-3251) [ x:collection1] o.a.s.u.p.LogUpdateProcessorFactory [collection1] webapp=/solr path=/update params={wt=javabin&version=2}{add=[47]} 0 0
[junit4] 2> 570315 INFO (qtp1698963984-3252) [ x:collection1] o.a.s.u.p.LogUpdateProcessorFactory [collection1] webapp=/solr path=/update params={wt=javabin&version=2}{add=[48]} 0 0
[junit4] 2> 570316 INFO (qtp1698963984-3250) [ x:collection1] o.a.s.u.p.LogUpdateProcessorFactory [collection1] webapp=/solr path=/update params={wt=javabin&version=2}{add=[49]} 0 0
[junit4] 2> 570316 INFO (qtp1698963984-3254) [ x:collection1] o.a.s.u.p.LogUpdateProcessorFactory [collection1] webapp=/solr path=/update params={wt=javabin&version=2}{add=[50]} 0 0
[junit4] 2> 570317 INFO (qtp1698963984-3253) [ x:collection1] o.a.s.u.p.LogUpdateProcessorFactory [collection1] webapp=/solr path=/update params={wt=javabin&version=2}{add=[51]} 0 0
[junit4] 2> 570318 INFO (qtp1698963984-3255) [ x:collection1] o.a.s.u.p.LogUpdateProcessorFactory [collection1] webapp=/solr path=/update params={wt=javabin&version=2}{add=[52]} 0 0
[junit4] 2> 570318 INFO (qtp1698963984-3248) [ x:collection1] o.a.s.u.p.LogUpdateProcessorFactory [collection1] webapp=/solr path=/update params={wt=javabin&version=2}{add=[53]} 0 0
[junit4] 2> 570319 INFO (qtp1698963984-3251) [ x:collection1] o.a.s.u.p.LogUpdateProcessorFactory [collection1] webapp=/solr path=/update params={wt=javabin&version=2}{add=[54]} 0 0
[junit4] 2> 570320 INFO (qtp1698963984-3252) [ x:collection1] o.a.s.u.p.LogUpdateProcessorFactory [collection1] webapp=/solr path=/update params={wt=javabin&version=2}{add=[55]} 0 0
[junit4] 2> 570320 INFO (qtp1698963984-3252) [ x:collection1] o.a.s.u.p.LogUpdateProcessorFactory [collection1] webapp=/solr path=/update params={wt=javabin&version=2}{add=[56]} 0 0
[junit4] 2> 570320 INFO (qtp1698963984-3252) [ x:collection1] o.a.s.u.p.LogUpdateProcessorFactory [collection1] webapp=/solr path=/update params={wt=javabin&version=2}{add=[57]} 0 0
[junit4] 2> 570321 INFO (qtp1698963984-3252) [ x:collection1] o.a.s.u.p.LogUpdateProcessorFactory [collection1] webapp=/solr path=/update params={wt=javabin&version=2}{add=[58]} 0 0
[junit4] 2> 570321 INFO (qtp1698963984-3252) [ x:collection1] o.a.s.u.p.LogUpdateProcessorFactory [collection1] webapp=/solr path=/update params={wt=javabin&version=2}{add=[59]} 0 0
[junit4] 2> 570322 INFO (qtp1698963984-3252) [ x:collection1] o.a.s.u.p.LogUpdateProcessorFactory [collection1] webapp=/solr path=/update params={wt=javabin&version=2}{add=[60]} 0 0
[junit4] 2> 570322 INFO (qtp1698963984-3252) [ x:collection1] o.a.s.u.p.LogUpdateProcessorFactory [collection1] webapp=/solr path=/update params={wt=javabin&version=2}{add=[61]} 0 0
[junit4] 2> 570323 INFO (qtp1698963984-3252) [ x:collection1] o.a.s.u.p.LogUpdateProcessorFactory [collection1] webapp=/solr path=/update params={wt=javabin&version=2}{add=[62]} 0 0
[junit4] 2> 570323 INFO (qtp1698963984-3254) [ x:collection1] o.a.s.u.p.LogUpdateProcessorFactory [collection1] webapp=/solr path=/update params={wt=javabin&version=2}{add=[63]} 0 0
[junit4] 2> 570324 INFO (qtp1698963984-3254) [ x:collection1] o.a.s.u.p.LogUpdateProcessorFactory [collection1] webapp=/solr path=/update params={wt=javabin&version=2}{add=[64]} 0 0
[junit4] 2> 570325 INFO (qtp1698963984-3253) [ x:collection1] o.a.s.u.p.LogUpdateProcessorFactory [collection1] webapp=/solr path=/update params={wt=javabin&version=2}{add=[65]} 0 0
[junit4] 2> 570327 INFO (qtp1698963984-3255) [ x:collection1] o.a.s.u.p.LogUpdateProcessorFactory [collection1] webapp=/solr path=/update params={wt=javabin&version=2}{add=[66]} 0 0
[junit4] 2> 570328 INFO (qtp1698963984-3248) [ x:collection1] o.a.s.u.p.LogUpdateProcessorFactory [collection1] webapp=/solr path=/update params={wt=javabin&version=2}{add=[67]} 0 0
[junit4] 2> 570328 INFO (qtp1698963984-3251) [ x:collection1] o.a.s.u.p.LogUpdateProcessorFactory [collection1] webapp=/solr path=/update params={wt=javabin&version=2}{add=[68]} 0 0
[junit4] 2> 570329 INFO (qtp1698963984-3250) [ x:collection1] o.a.s.u.p.LogUpdateProcessorFactory [collection1] webapp=/solr path=/update params={wt=javabin&version=2}{add=[69]} 0 0
[junit4] 2> 570330 INFO (qtp1698963984-3252) [ x:collection1] o.a.s.u.p.LogUpdateProcessorFactory [collection1] webapp=/solr path=/update params={wt=javabin&version=2}{add=[70]} 0 0
[junit4] 2> 570331 INFO (qtp1698963984-3252) [ x:collection1] o.a.s.u.p.LogUpdateProcessorFactory [collection1] webapp=/solr path=/update params={wt=javabin&version=2}{add=[71]} 0 0
[junit4] 2> 570331 INFO (qtp1698963984-3252) [ x:collection1] o.a.s.u.p.LogUpdateProcessorFactory [collection1] webapp=/solr path=/update params={wt=javabin&version=2}{add=[72]} 0 0
[junit4] 2> 570332 INFO (qtp1698963984-3255) [ x:collection1] o.a.s.u.p.LogUpdateProcessorFactory [collection1] webapp=/solr path=/update params={wt=javabin&version=2}{add=[73]} 0 0
[junit4] 2> 570333 INFO (qtp1698963984-3248) [ x:collection1] o.a.s.u.p.LogUpdateProcessorFactory [collection1] webapp=/solr path=/update params={wt=javabin&version=2}{add=[74]} 0 0
[junit4] 2> 570333 INFO (qtp1698963984-3251) [ x:collection1] o.a.s.u.p.LogUpdateProcessorFactory [collection1] webapp=/solr path=/update params={wt=javabin&version=2}{add=[75]} 0 0
[junit4] 2> 570334 INFO (qtp1698963984-3250) [ x:collection1] o.a.s.u.p.LogUpdateProcessorFactory [collection1] webapp=/solr path=/update params={wt=javabin&version=2}{add=[76]} 0 0
[junit4] 2> 570335 INFO (qtp1698963984-3250) [ x:collection1] o.a.s.u.p.LogUpdateProcessorFactory [collection1] webapp=/solr path=/update params={wt=javabin&version=2}{add=[77]} 0 0
[junit4] 2> 570335 INFO (qtp1698963984-3253) [ x:collection1] o.a.s.u.p.LogUpdateProcessorFactory [collection1] webapp=/solr path=/update params={wt=javabin&version=2}{add=[78]} 0 0
[junit4] 2> 570336 INFO (qtp1698963984-3252) [ x:collection1] o.a.s.u.p.LogUpdateProcessorFactory [collection1] webapp=/solr path=/update params={wt=javabin&version=2}{add=[79]} 0 0
[junit4] 2> 570336 INFO (qtp1698963984-3255) [ x:collection1] o.a.s.u.p.LogUpdateProcessorFactory [collection1] webapp=/solr path=/update params={wt=javabin&version=2}{add=[80]} 0 0
[junit4] 2> 570337 INFO (qtp1698963984-3248) [ x:collection1] o.a.s.u.p.LogUpdateProcessorFactory [collection1] webapp=/solr path=/update params={wt=javabin&version=2}{add=[81]} 0 0
[junit4] 2> 570339 INFO (qtp1698963984-3251) [ x:collection1] o.a.s.u.p.LogUpdateProcessorFactory [collection1] webapp=/solr path=/update params={wt=javabin&version=2}{add=[82]} 0 1
[junit4] 2> 570339 INFO (qtp1698963984-3254) [ x:collection1] o.a.s.u.p.LogUpdateProcessorFactory [collection1] webapp=/solr path=/update params={wt=javabin&version=2}{add=[83]} 0 0
[junit4] 2> 570340 INFO (qtp1698963984-3250) [ x:collection1] o.a.s.u.p.LogUpdateProcessorFactory [collection1] webapp=/solr path=/update params={wt=javabin&version=2}{add=[84]} 0 0
[junit4] 2> 570340 INFO (qtp1698963984-3253) [ x:collection1] o.a.s.u.p.LogUpdateProcessorFactory [collection1] webapp=/solr path=/update params={wt=javabin&version=2}{add=[85]} 0 0
[junit4] 2> 570341 INFO (qtp1698963984-3252) [ x:collection1] o.a.s.u.p.LogUpdateProcessorFactory [collection1] webapp=/solr path=/update params={wt=javabin&version=2}{add=[86]} 0 0
[junit4] 2> 570341 INFO (qtp1698963984-3255) [ x:collection1] o.a.s.u.p.LogUpdateProcessorFactory [collection1] webapp=/solr path=/update params={wt=javabin&version=2}{add=[87]} 0 0
[junit4] 2> 570342 INFO (qtp1698963984-3248) [ x:collection1] o.a.s.u.p.LogUpdateProcessorFactory [collection1] webapp=/solr path=/update params={wt=javabin&version=2}{add=[88]} 0 0
[junit4] 2> 570343 INFO (qtp1698963984-3251) [ x:collection1] o.a.s.u.p.LogUpdateProcessorFactory [collection1] webapp=/solr path=/update params={wt=javabin&version=2}{add=[89]} 0 0
[junit4] 2> 570343 INFO (qtp1698963984-3254) [ x:collection1] o.a.s.u.p.LogUpdateProcessorFactory [collection1] webapp=/solr path=/update params={wt=javabin&version=2}{add=[90]} 0 0
[junit4] 2> 570344 INFO (qtp1698963984-3250) [ x:collection1] o.a.s.u.p.LogUpdateProcessorFactory [collection1] webapp=/solr path=/update params={wt=javabin&version=2}{add=[91]} 0 0
[junit4] 2> 570344 INFO (qtp1698963984-3253) [ x:collection1] o.a.s.u.p.LogUpdateProcessorFactory [collection1] webapp=/solr path=/update params={wt=javabin&version=2}{add=[92]} 0 0
[junit4] 2> 570345 INFO (qtp1698963984-3252) [ x:collection1] o.a.s.u.p.LogUpdateProcessorFactory [collection1] webapp=/solr path=/update params={wt=javabin&version=2}{add=[93]} 0 0
[junit4] 2> 570346 INFO (qtp1698963984-3255) [ x:collection1] o.a.s.u.p.LogUpdateProcessorFactory [collection1] webapp=/solr path=/update params={wt=javabin&version=2}{add=[94]} 0 0
[junit4] 2> 570346 INFO (qtp1698963984-3248) [ x:collection1] o.a.s.u.p.LogUpdateProcessorFactory [collection1] webapp=/solr path=/update params={wt=javabin&version=2}{add=[95]} 0 0
[junit4] 2> 570347 INFO (qtp1698963984-3251) [ x:collection1] o.a.s.u.p.LogUpdateProcessorFactory [collection1] webapp=/solr path=/update params={wt=javabin&version=2}{add=[96]} 0 0
[junit4] 2> 570347 INFO (qtp1698963984-3254) [ x:collection1] o.a.s.u.p.LogUpdateProcessorFactory [collection1] webapp=/solr path=/update params={wt=javabin&version=2}{add=[97]} 0 0
[junit4] 2> 570348 INFO (qtp1698963984-3250) [ x:collection1] o.a.s.u.p.LogUpdateProcessorFactory [collection1] webapp=/solr path=/update params={wt=javabin&version=2}{add=[98]} 0 0
[junit4] 2> 570348 INFO (qtp1698963984-3253) [ x:collection1] o.a.s.u.p.LogUpdateProcessorFactory [collection1] webapp=/solr path=/update params={wt=javabin&version=2}{add=[99]} 0 0
[junit4] 2> 570349 INFO (qtp1698963984-3252) [ x:collection1] o.a.s.u.p.LogUpdateProcessorFactory [collection1] webapp=/solr path=/update params={wt=javabin&version=2}{add=[100]} 0 0
[junit4] 2> 570349 INFO (qtp1698963984-3255) [ x:collection1] o.a.s.u.p.LogUpdateProcessorFactory [collection1] webapp=/solr path=/update params={wt=javabin&version=2}{add=[101]} 0 0
[junit4] 2> 570351 INFO (qtp1698963984-3248) [ x:collection1] o.a.s.u.p.LogUpdateProcessorFactory [collection1] webapp=/solr path=/update params={wt=javabin&version=2}{add=[102]} 0 0
[junit4] 2> 570351 INFO (qtp1698963984-3251) [ x:collection1] o.a.s.u.p.LogUpdateProcessorFactory [collection1] webapp=/solr path=/update params={wt=javabin&version=2}{add=[103]} 0 0
[junit4] 2> 570352 INFO (qtp1698963984-3254) [ x:collection1] o.a.s.u.p.LogUpdateProcessorFactory [collection1] webapp=/solr path=/update params={wt=javabin&version=2}{add=[104]} 0 0
[junit4] 2> 570352 INFO (qtp1698963984-3250) [ x:collection1] o.a.s.u.p.LogUpdateProcessorFactory [collection1] webapp=/solr path=/update params={wt=javabin&version=2}{add=[105]} 0 0
[junit4] 2> 570353 INFO (qtp1698963984-3253) [ x:collection1] o.a.s.u.p.LogUpdateProcessorFactory [collection1] webapp=/solr path=/update params={wt=javabin&version=2}{add=[106]} 0 0
[junit4] 2> 570353 INFO (qtp1698963984-3252) [ x:collection1] o.a.s.u.p.LogUpdateProcessorFactory [collection1] webapp=/solr path=/update params={wt=javabin&version=2}{add=[107]} 0 0
[junit4] 2> 570354 INFO (qtp1698963984-3255) [ x:collection1] o.a.s.u.p.LogUpdateProcessorFactory [collection1] webapp=/solr path=/update params={wt=javabin&version=2}{add=[108]} 0 0
[junit4] 2> 570355 INFO (qtp1698963984-3248) [ x:collection1] o.a.s.u.p.LogUpdateProcessorFactory [collection1] webapp=/solr path=/update params={wt=javabin&version=2}{add=[109]} 0 0
[junit4] 2> 570355 INFO (qtp1698963984-3251) [ x:collection1] o.a.s.u.p.LogUpdateProcessorFactory [collection1] webapp=/solr path=/update params={wt=javabin&version=2}{add=[110]} 0 0
[junit4] 2> 570356 INFO (qtp1698963984-3254) [ x:collection1] o.a.s.u.p.LogUpdateProcessorFactory [collection1] webapp=/solr path=/update params={wt=javabin&version=2}{add=[111]} 0 0
[junit4] 2> 570356 INFO (qtp1698963984-3250) [ x:collection1] o.a.s.u.p.LogUpdateProcessorFactory [collection1] webapp=/solr path=/update params={wt=javabin&version=2}{add=[112]} 0 0
[junit4] 2> 570357 INFO (qtp1698963984-3253) [ x:collection1] o.a.s.u.p.LogUpdateProcessorFactory [collection1] webapp=/solr path=/update params={wt=javabin&version=2}{add=[113]} 0 0
[junit4] 2> 570358 INFO (qtp1698963984-3252) [ x:collection1] o.a.s.u.p.LogUpdateProcessorFactory [collection1] webapp=/solr path=/update params={wt=javabin&version=2}{add=[114]} 0 0
[junit4] 2> 570358 INFO (qtp1698963984-3255) [ x:collection1] o.a.s.u.p.LogUpdateProcessorFactory [collection1] webapp=/solr path=/update params={wt=javabin&version=2}{add=[115]} 0 0
[junit4] 2> 570359 INFO (qtp1698963984-3248) [ x:collection1] o.a.s.u.p.LogUpdateProcessorFactory [collection1] webapp=/solr path=/update params={wt=javabin&version=2}{add=[116]} 0 0
[junit4] 2> 570359 INFO (qtp1698963984-3251) [ x:collection1] o.a.s.u.p.LogUpdateProcessorFactory [collection1] webapp=/solr path=/update params={wt=javabin&version=2}{add=[117]} 0 0
[junit4] 2> 570360 INFO (qtp1698963984-3254) [ x:collection1] o.a.s.u.p.LogUpdateProcessorFactory [collection1] webapp=/solr path=/update params={wt=javabin&version=2}{add=[118]} 0 0
[junit4] 2> 570360 INFO (qtp1698963984-3250) [ x:collection1] o.a.s.u.p.LogUpdateProcessorFactory [collection1] webapp=/solr path=/update params={wt=javabin&version=2}{add=[119]} 0 0
[junit4] 2> 570361 INFO (qtp1698963984-3253) [ x:collection1] o.a.s.u.p.LogUpdateProcessorFactory [collection1] webapp=/solr path=/update params={wt=javabin&version=2}{add=[120]} 0 0
[junit4] 2> 570362 INFO (qtp1698963984-3252) [ x:collection1] o.a.s.u.p.LogUpdateProcessorFactory [collection1] webapp=/solr path=/update params={wt=javabin&version=2}{add=[121]} 0 0
[junit4] 2> 570363 INFO (qtp1698963984-3255) [ x:collection1] o.a.s.u.p.LogUpdateProcessorFactory [collection1] webapp=/solr path=/update params={wt=javabin&version=2}{add=[122]} 0 0
[junit4] 2> 570364 INFO (qtp1698963984-3248) [ x:collection1] o.a.s.u.p.LogUpdateProcessorFactory [collection1] webapp=/solr path=/update params={wt=javabin&version=2}{add=[123]} 0 0
[junit4] 2> 570364 INFO (qtp1698963984-3251) [ x:collection1] o.a.s.u.p.LogUpdateProcessorFactory [collection1] webapp=/solr path=/update params={wt=javabin&version=2}{add=[124]} 0 0
[junit4] 2> 570365 INFO (qtp1698963984-3254) [ x:collection1] o.a.s.u.p.LogUpdateProcessorFactory [collection1] webapp=/solr path=/update params={wt=javabin&version=2}{add=[125]} 0 0
[junit4] 2> 570365 INFO (qtp1698963984-3250) [ x:collection1] o.a.s.u.p.LogUpdateProcessorFactory [collection1] webapp=/solr path=/update params={wt=javabin&version=2}{add=[126]} 0 0
[junit4] 2> 570366 INFO (qtp1698963984-3253) [ x:collection1] o.a.s.u.p.LogUpdateProcessorFactory [collection1] webapp=/solr path=/update params={wt=javabin&version=2}{add=[127]} 0 0
[junit4] 2> 570367 INFO (qtp1698963984-3252) [ x:collection1] o.a.s.u.p.LogUpdateProcessorFactory [collection1] webapp=/solr path=/update params={wt=javabin&version=2}{add=[128]} 0 0
[junit4] 2> 570367 INFO (qtp1698963984-3252) [ x:collection1] o.a.s.u.p.LogUpdateProcessorFactory [collection1] webapp=/solr path=/update params={wt=javabin&version=2}{add=[129]} 0 0
[junit4] 2> 570367 INFO (qtp1698963984-3248) [ x:collection1] o.a.s.u.p.LogUpdateProcessorFactory [collection1] webapp=/solr path=/update params={wt=javabin&version=2}{add=[130]} 0 0
[junit4] 2> 570369 INFO (qtp1698963984-3251) [ x:collection1] o.a.s.u.p.LogUpdateProcessorFactory [collection1] webapp=/solr path=/update params={wt=javabin&version=2}{add=[131]} 0 0
[junit4] 2> 570369 INFO (qtp1698963984-3254) [ x:collection1] o.a.s.u.p.LogUpdateProcessorFactory [collection1] webapp=/solr path=/update params={wt=javabin&version=2}{add=[132]} 0 0
[junit4] 2> 570370 INFO (qtp1698963984-3250) [ x:collection1] o.a.s.u.p.LogUpdateProcessorFactory [collection1] webapp=/solr path=/update params={wt=javabin&version=2}{add=[133]} 0 0
[junit4] 2> 570370 INFO (qtp1698963984-3253) [ x:collection1] o.a.s.u.p.LogUpdateProcessorFactory [collection1] webapp=/solr path=/update params={wt=javabin&version=2}{add=[134]} 0 0
[junit4] 2> 570371 INFO (qtp1698963984-3255) [ x:collection1] o.a.s.u.p.LogUpdateProcessorFactory [collection1] webapp=/solr path=/update params={wt=javabin&version=2}{add=[135]} 0 0
[junit4] 2> 570372 INFO (qtp1698963984-3252) [ x:collection1] o.a.s.u.p.LogUpdateProcessorFactory [collection1] webapp=/solr path=/update params={wt=javabin&version=2}{add=[136]} 0 0
[junit4] 2> 570372 INFO (qtp1698963984-3248) [ x:collection1] o.a.s.u.p.LogUpdateProcessorFactory [collection1] webapp=/solr path=/update params={wt=javabin&version=2}{add=[137]} 0 0
[junit4] 2> 570373 INFO (qtp1698963984-3251) [ x:collection1] o.a.s.u.p.LogUpdateProcessorFactory [collection1] webapp=/solr path=/update params={wt=javabin&version=2}{add=[138]} 0 0
[junit4] 2> 570373 INFO (qtp1698963984-3254) [ x:collection1] o.a.s.u.p.LogUpdateProcessorFactory [collection1] webapp=/solr path=/update params={wt=javabin&version=2}{add=[139]} 0 0
[junit4] 2> 570374 INFO (qtp1698963984-3250) [ x:collection1] o.a.s.u.p.LogUpdateProcessorFactory [collection1] webapp=/solr path=/update params={wt=javabin&version=2}{add=[140]} 0 0
[junit4] 2> 570375 INFO (qtp1698963984-3253) [ x:collection1] o.a.s.u.p.LogUpdateProcessorFactory [collection1] webapp=/solr path=/update params={wt=javabin&version=2}{add=[141]} 0 0
[junit4] 2> 570375 INFO (qtp1698963984-3255) [ x:collection1] o.a.s.u.p.LogUpdateProcessorFactory [collection1] webapp=/solr path=/update params={wt=javabin&version=2}{add=[142]} 0 0
[junit4] 2> 570376 INFO (qtp1698963984-3255) [ x:collection1] o.a.s.u.p.LogUpdateProcessorFactory [collection1] webapp=/solr path=/update params={wt=javabin&version=2}{add=[143]} 0 0
[junit4] 2> 570376 INFO (qtp1698963984-3255) [ x:collection1] o.a.s.u.p.LogUpdateProcessorFactory [collection1] webapp=/solr path=/update params={wt=javabin&version=2}{add=[144]} 0 0
[junit4] 2> 570377 INFO (qtp1698963984-3252) [ x:collection1] o.a.s.u.p.LogUpdateProcessorFactory [collection1] webapp=/solr path=/update params={wt=javabin&version=2}{add=[145]} 0 0
[junit4] 2> 570377 INFO (qtp1698963984-3248) [ x:collection1] o.a.s.u.p.LogUpdateProcessorFactory [collection1] webapp=/solr path=/update params={wt=javabin&version=2}{add=[146]} 0 0
[junit4] 2> 570379 INFO (qtp1698963984-3251) [ x:collection1] o.a.s.u.p.LogUpdateProcessorFactory [collection1] webapp=/solr path=/update params={wt=javabin&version=2}{add=[147]} 0 0
[junit4] 2> 570379 INFO (qtp1698963984-3254) [ x:collection1] o.a.s.u.p.LogUpdateProcessorFactory [collection1] webapp=/solr path=/update params={wt=javabin&version=2}{add=[148]} 0 0
[junit4] 2> 570380 INFO (qtp1698963984-3250) [ x:collection1] o.a.s.u.p.LogUpdateProcessorFactory [collection1] webapp=/solr path=/update params={wt=javabin&version=2}{add=[149]} 0 0
[junit4] 2> 570380 INFO (qtp1698963984-3253) [ x:collection1] o.a.s.u.p.LogUpdateProcessorFactory [collection1] webapp=/solr path=/update params={wt=javabin&version=2}{add=[150]} 0 0
[junit4] 2> 570381 INFO (qtp1698963984-3255) [ x:collection1] o.a.s.u.p.LogUpdateProcessorFactory [collection1] webapp=/solr path=/update params={wt=javabin&version=2}{add=[151]} 0 0
[junit4] 2> 570381 INFO (qtp1698963984-3252) [ x:collection1] o.a.s.u.p.LogUpdateProcessorFactory [collection1] webapp=/solr path=/update params={wt=javabin&version=2}{add=[152]} 0 0
[junit4] 2> 570382 INFO (qtp1698963984-3248) [ x:collection1] o.a.s.u.p.LogUpdateProcessorFactory [collection1] webapp=/solr path=/update params={wt=javabin&version=2}{add=[153]} 0 0
[junit4] 2> 570383 INFO (qtp1698963984-3251) [ x:collection1] o.a.s.u.p.LogUpdateProcessorFactory [collection1] webapp=/solr path=/update params={wt=javabin&version=2}{add=[154]} 0 0
[junit4] 2> 570383 INFO (qtp1698963984-3254) [ x:collection1] o.a.s.u.p.LogUpdateProcessorFactory [collection1] webapp=/solr path=/update params={wt=javabin&version=2}{add=[155]} 0 0
[junit4] 2> 570383 INFO (qtp1698963984-3250) [ x:collection1] o.a.s.u.p.LogUpdateProcessorFactory [collection1] webapp=/solr path=/update params={wt=javabin&version=2}{add=[156]} 0 0
[junit4] 2> 570384 INFO (qtp1698963984-3253) [ x:collection1] o.a.s.u.p.LogUpdateProcessorFactory [collection1] webapp=/solr path=/update params={wt=javabin&version=2}{add=[157]} 0 0
[junit4] 2> 570385 INFO (qtp1698963984-3255) [ x:collection1] o.a.s.u.p.LogUpdateProcessorFactory [collection1] webapp=/solr path=/update params={wt=javabin&version=2}{add=[158]} 0 0
[junit4] 2> 570385 INFO (qtp1698963984-3252) [ x:collection1] o.a.s.u.p.LogUpdateProcessorFactory [collection1] webapp=/solr path=/update params={wt=javabin&version=2}{add=[159]} 0 0
[junit4] 2> 570386 INFO (qtp1698963984-3248) [ x:collection1] o.a.s.u.p.LogUpdateProcessorFactory [collection1] webapp=/solr path=/update params={wt=javabin&version=2}{add=[160]} 0 0
[junit4] 2> 570387 INFO (qtp1698963984-3251) [ x:collection1] o.a.s.u.p.LogUpdateProcessorFactory [collection1] webapp=/solr path=/update params={wt=javabin&version=2}{add=[161]} 0 0
[junit4] 2> 570388 INFO (qtp1698963984-3254) [ x:collection1] o.a.s.u.p.LogUpdateProcessorFactory [collection1] webapp=/solr path=/update params={wt=javabin&version=2}{add=[162]} 0 0
[junit4] 2> 570388 INFO (qtp1698963984-3250) [ x:collection1] o.a.s.u.p.LogUpdateProcessorFactory [collection1] webapp=/solr path=/update params={wt=javabin&version=2}{add=[163]} 0 0
[junit4] 2> 570389 INFO (qtp1698963984-3253) [ x:collection1] o.a.s.u.p.LogUpdateProcessorFactory [collection1] webapp=/solr path=/update params={wt=javabin&version=2}{add=[164]} 0 0
[junit4] 2> 570389 INFO (qtp1698963984-3255) [ x:collection1] o.a.s.u.p.LogUpdateProcessorFactory [collection1] webapp=/solr path=/update params={wt=javabin&version=2}{add=[165]} 0 0
[junit4] 2> 570390 INFO (qtp1698963984-3252) [ x:collection1] o.a.s.u.p.LogUpdateProcessorFactory [collection1] webapp=/solr path=/update params={wt=javabin&version=2}{add=[166]} 0 0
[junit4] 2> 570391 INFO (qtp1698963984-3248) [ x:collection1] o.a.s.u.p.LogUpdateProcessorFactory [collection1] webapp=/solr path=/update params={wt=javabin&version=2}{add=[167]} 0 0
[junit4] 2> 570391 INFO (qtp1698963984-3251) [ x:collection1] o.a.s.u.p.LogUpdateProcessorFactory [collection1] webapp=/solr path=/update params={wt=javabin&version=2}{add=[168]} 0 0
[junit4] 2> 570392 INFO (qtp1698963984-3254) [ x:collection1] o.a.s.u.p.LogUpdateProcessorFactory [collection1] webapp=/solr path=/update params={wt=javabin&version=2}{add=[169]} 0 0
[junit4] 2> 570392 INFO (qtp1698963984-3250) [ x:collection1] o.a.s.u.p.LogUpdateProcessorFactory [collection1] webapp=/solr path=/update params={wt=javabin&version=2}{add=[170]} 0 0
[junit4] 2> 570393 INFO (qtp1698963984-3253) [ x:collection1] o.a.s.u.p.LogUpdateProcessorFactory [collection1] webapp=/solr path=/update params={wt=javabin&version=2}{add=[171]} 0 0
[junit4] 2> 570393 INFO (qtp1698963984-3255) [ x:collection1] o.a.s.u.p.LogUpdateProcessorFactory [collection1] webapp=/solr path=/update params={wt=javabin&version=2}{add=[172]} 0 0
[junit4] 2> 570394 INFO (qtp1698963984-3252) [ x:collection1] o.a.s.u.p.LogUpdateProcessorFactory [collection1] webapp=/solr path=/update params={wt=javabin&version=2}{add=[173]} 0 0
[junit4] 2> 570395 INFO (qtp1698963984-3248) [ x:collection1] o.a.s.u.p.LogUpdateProcessorFactory [collection1] webapp=/solr path=/update params={wt=javabin&version=2}{add=[174]} 0 0
[junit4] 2> 570395 INFO (qtp1698963984-3251) [ x:collection1] o.a.s.u.p.LogUpdateProcessorFactory [collection1] webapp=/solr path=/update params={wt=javabin&version=2}{add=[175]} 0 0
[junit4] 2> 570396 INFO (qtp1698963984-3254) [ x:collection1] o.a.s.u.p.LogUpdateProcessorFactory [collection1] webapp=/solr path=/update params={wt=javabin&version=2}{add=[176]} 0 0
[junit4] 2> 570396 INFO (qtp1698963984-3250) [ x:collection1] o.a.s.u.p.LogUpdateProcessorFactory [collection1] webapp=/solr path=/update params={wt=javabin&version=2}{add=[177]} 0 0
[junit4] 2> 570397 INFO (qtp1698963984-3253) [ x:collection1] o.a.s.u.p.LogUpdateProcessorFactory [collection1] webapp=/solr path=/update params={wt=javabin&version=2}{add=[178]} 0 0
[junit4] 2> 570397 INFO (qtp1698963984-3255) [ x:collection1] o.a.s.u.p.LogUpdateProcessorFactory [collection1] webapp=/solr path=/update params={wt=javabin&version=2}{add=[179]} 0 0
[junit4] 2> 570399 INFO (qtp1698963984-3252) [ x:collection1] o.a.s.u.p.LogUpdateProcessorFactory [collection1] webapp=/solr path=/update params={wt=javabin&version=2}{add=[180]} 0 0
[junit4] 2> 570401 INFO (qtp1698963984-3248) [ x:collection1] o.a.s.u.p.LogUpdateProcessorFactory [collection1] webapp=/solr path=/update params={wt=javabin&version=2}{add=[181]} 0 0
[junit4] 2> 570402 INFO (qtp1698963984-3251) [ x:collection1] o.a.s.u.p.LogUpdateProcessorFactory [collection1] webapp=/solr path=/update params={wt=javabin&version=2}{add=[182]} 0 0
[junit4] 2> 570402 INFO (qtp1698963984-3254) [ x:collection1] o.a.s.u.p.LogUpdateProcessorFactory [collection1] webapp=/solr path=/update params={wt=javabin&version=2}{add=[183]} 0 0
[junit4] 2> 570403 INFO (qtp1698963984-3250) [ x:collection1] o.a.s.u.p.LogUpdateProcessorFactory [collection1] webapp=/solr path=/update params={wt=javabin&version=2}{add=[184]} 0 0
[junit4] 2> 570404 INFO (qtp1698963984-3253) [ x:collection1] o.a.s.u.p.LogUpdateProcessorFactory [collection1] webapp=/solr path=/update params={wt=javabin&version=2}{add=[185]} 0 0
[junit4] 2> 570404 INFO (qtp1698963984-3255) [ x:collection1] o.a.s.u.p.LogUpdateProcessorFactory [collection1] webapp=/solr path=/update params={wt=javabin&version=2}{add=[186]} 0 0
[junit4] 2> 570405 INFO (qtp1698963984-3252) [ x:collection1] o.a.s.u.p.LogUpdateProcessorFactory [collection1] webapp=/solr path=/update params={wt=javabin&version=2}{add=[187]} 0 0
[junit4] 2> 570405 INFO (qtp1698963984-3248) [ x:collection1] o.a.s.u.p.LogUpdateProcessorFactory [collection1] webapp=/solr path=/update params={wt=javabin&version=2}{add=[188]} 0 0
[junit4] 2> 570406 INFO (qtp1698963984-3251) [ x:collection1] o.a.s.u.p.LogUpdateProcessorFactory [collection1] webapp=/solr path=/update params={wt=javabin&version=2}{add=[189]} 0 0
[junit4] 2> 570406 INFO (qtp1698963984-3254) [ x:collection1] o.a.s.u.p.LogUpdateProcessorFactory [collection1] webapp=/solr path=/update params={wt=javabin&version=2}{add=[190]} 0 0
[junit4] 2> 570407 INFO (qtp1698963984-3250) [ x:collection1] o.a.s.u.p.LogUpdateProcessorFactory [collection1] webapp=/solr path=/update params={wt=javabin&version=2}{add=[191]} 0 0
[junit4] 2> 570407 INFO (qtp1698963984-3253) [ x:collection1] o.a.s.u.p.LogUpdateProcessorFactory [collection1] webapp=/solr path=/update params={wt=javabin&version=2}{add=[192]} 0 0
[junit4] 2> 570408 INFO (qtp1698963984-3255) [ x:collection1] o.a.s.u.p.LogUpdateProcessorFactory [collection1] webapp=/solr path=/update params={wt=javabin&version=2}{add=[193]} 0 0
[junit4] 2> 570408 INFO (qtp1698963984-3252) [ x:collection1] o.a.s.u.p.LogUpdateProcessorFactory [collection1] webapp=/solr path=/update params={wt=javabin&version=2}{add=[194]} 0 0
[junit4] 2> 570409 INFO (qtp1698963984-3248) [ x:collection1] o.a.s.u.p.LogUpdateProcessorFactory [collection1] webapp=/solr path=/update params={wt=javabin&version=2}{add=[195]} 0 0
[junit4] 2> 570409 INFO (qtp1698963984-3251) [ x:collection1] o.a.s.u.p.LogUpdateProcessorFactory [collection1] webapp=/solr path=/update params={wt=javabin&version=2}{add=[196]} 0 0
[junit4] 2> 570410 INFO (qtp1698963984-3254) [ x:collection1] o.a.s.u.p.LogUpdateProcessorFactory [collection1] webapp=/solr path=/update params={wt=javabin&version=2}{add=[197]} 0 0
[junit4] 2> 570411 INFO (qtp1698963984-3250) [ x:collection1] o.a.s.u.p.LogUpdateProcessorFactory [collection1] webapp=/solr path=/update params={wt=javabin&version=2}{add=[198]} 0 0
[junit4] 2> 570411 INFO (qtp1698963984-3253) [ x:collection1] o.a.s.u.p.LogUpdateProcessorFactory [collection1] webapp=/solr path=/update params={wt=javabin&version=2}{add=[199]} 0 0
[junit4] 2> 570412 INFO (qtp1698963984-3255) [ x:collection1] o.a.s.u.p.LogUpdateProcessorFactory [collection1] webapp=/solr path=/update params={wt=javabin&version=2}{add=[200]} 0 0
[junit4] 2> 570413 INFO (qtp1698963984-3252) [ x:collection1] o.a.s.u.p.LogUpdateProcessorFactory [collection1] webapp=/solr path=/update params={wt=javabin&version=2}{add=[201]} 0 0
[junit4] 2> 570413 INFO (qtp1698963984-3248) [ x:collection1] o.a.s.u.p.LogUpdateProcessorFactory [collection1] webapp=/solr path=/update params={wt=javabin&version=2}{add=[202]} 0 0
[junit4] 2> 570414 INFO (qtp1698963984-3251) [ x:collection1] o.a.s.u.p.LogUpdateProcessorFactory [collection1] webapp=/solr path=/update params={wt=javabin&version=2}{add=[203]} 0 0
[junit4] 2> 570415 INFO (qtp1698963984-3254) [ x:collection1] o.a.s.u.p.LogUpdateProcessorFactory [collection1] webapp=/solr path=/update params={wt=javabin&version=2}{add=[204]} 0 0
[junit4] 2> 570416 INFO (qtp1698963984-3250) [ x:collection1] o.a.s.u.p.LogUpdateProcessorFactory [collection1] webapp=/solr path=/update params={wt=javabin&version=2}{add=[205]} 0 0
[junit4] 2> 570416 INFO (qtp1698963984-3253) [ x:collection1] o.a.s.u.p.LogUpdateProcessorFactory [collection1] webapp=/solr path=/update params={wt=javabin&version=2}{add=[206]} 0 0
[junit4] 2> 570417 INFO (qtp1698963984-3255) [ x:collection1] o.a.s.u.p.LogUpdateProcessorFactory [collection1] webapp=/solr path=/update params={wt=javabin&version=2}{add=[207]} 0 0
[junit4] 2> 570418 INFO (qtp1698963984-3252) [ x:collection1] o.a.s.u.p.LogUpdateProcessorFactory [collection1] webapp=/solr path=/update params={wt=javabin&version=2}{add=[208]} 0 0
[junit4] 2> 570418 INFO (qtp1698963984-3248) [ x:collection1] o.a.s.u.p.LogUpdateProcessorFactory [collection1] webapp=/solr path=/update params={wt=javabin&version=2}{add=[209]} 0 0
[junit4] 2> 570419 INFO (qtp1698963984-3251) [ x:collection1] o.a.s.u.p.LogUpdateProcessorFactory [collection1] webapp=/solr path=/update params={wt=javabin&version=2}{add=[210]} 0 0
[junit4] 2> 570419 INFO (qtp1698963984-3254) [ x:collection1] o.a.s.u.p.LogUpdateProcessorFactory [collection1] webapp=/solr path=/update params={wt=javabin&version=2}{add=[211]} 0 0
[junit4] 2> 570420 INFO (qtp1698963984-3254) [ x:collection1] o.a.s.u.p.LogUpdateProcessorFactory [collection1] webapp=/solr path=/update params={wt=javabin&version=2}{add=[212]} 0 0
[junit4] 2> 570420 INFO (qtp1698963984-3253) [ x:collection1] o.a.s.u.p.LogUpdateProcessorFactory [collection1] webapp=/solr path=/update params={wt=javabin&version=2}{add=[213]} 0 0
[junit4] 2> 570421 INFO (qtp1698963984-3255) [ x:collection1] o.a.s.u.p.LogUpdateProcessorFactory [collection1] webapp=/solr path=/update params={wt=javabin&version=2}{add=[214]} 0 0
[junit4] 2> 570421 INFO (qtp1698963984-3252) [ x:collection1] o.a.s.u.p.LogUpdateProcessorFactory [collection1] webapp=/solr path=/update params={wt=javabin&version=2}{add=[215]} 0 0
[junit4] 2> 570422 INFO (qtp1698963984-3248) [ x:collection1] o.a.s.u.p.LogUpdateProcessorFactory [collection1] webapp=/solr path=/update params={wt=javabin&version=2}{add=[216]} 0 0
[junit4] 2> 570423 INFO (qtp1698963984-3251) [ x:collection1] o.a.s.u.p.LogUpdateProcessorFactory [collection1] webapp=/solr path=/update params={wt=javabin&version=2}{add=[217]} 0 0
[junit4] 2> 570423 INFO (qtp1698963984-3250) [ x:collection1] o.a.s.u.p.LogUpdateProcessorFactory [collection1] webapp=/solr path=/update params={wt=javabin&version=2}{add=[218]} 0 0
[junit4] 2> 570424 INFO (qtp1698963984-3254) [ x:collection1] o.a.s.u.p.LogUpdateProcessorFactory [collection1] webapp=/solr path=/update params={wt=javabin&version=2}{add=[219]} 0 0
[junit4] 2> 570425 INFO (qtp1698963984-3253) [ x:collection1] o.a.s.u.p.LogUpdateProcessorFactory [collection1] webapp=/solr path=/update params={wt=javabin&version=2}{add=[220]} 0 0
[junit4] 2> 570425 INFO (qtp1698963984-3255) [ x:collection1] o.a.s.u.p.LogUpdateProcessorFactory [collection1] webapp=/solr path=/update params={wt=javabin&version=2}{add=[221]} 0 0
[junit4] 2> 570426 INFO (qtp1698963984-3252) [ x:collection1] o.a.s.u.p.LogUpdateProcessorFactory [collection1] webapp=/solr path=/update params={wt=javabin&version=2}{add=[222]} 0 0
[junit4] 2> 570427 INFO (qtp1698963984-3248) [ x:collection1] o.a.s.u.p.LogUpdateProcessorFactory [collection1] webapp=/solr path=/update params={wt=javabin&version=2}{add=[223]} 0 0
[junit4] 2> 570427 INFO (qtp1698963984-3251) [ x:collection1] o.a.s.u.p.LogUpdateProcessorFactory [collection1] webapp=/solr path=/update params={wt=javabin&version=2}{add=[224]} 0 0
[junit4] 2> 570428 INFO (qtp1698963984-3250) [ x:collection1] o.a.s.u.p.LogUpdateProcessorFactory [collection1] webapp=/solr path=/update params={wt=javabin&version=2}{add=[225]} 0 0
[junit4] 2> 570428 INFO (qtp1698963984-3254) [ x:collection1] o.a.s.u.p.LogUpdateProcessorFactory [collection1] webapp=/solr path=/update params={wt=javabin&version=2}{add=[226]} 0 0
[junit4] 2> 570429 INFO (qtp1698963984-3253) [ x:collection1] o.a.s.u.p.LogUpdateProcessorFactory [collection1] webapp=/solr path=/update params={wt=javabin&version=2}{add=[227]} 0 0
[junit4] 2> 570429 INFO (qtp1698963984-3255) [ x:collection1] o.a.s.u.p.LogUpdateProcessorFactory [collection1] webapp=/solr path=/update params={wt=javabin&version=2}{add=[228]} 0 0
[junit4] 2> 570430 INFO (qtp1698963984-3252) [ x:collection1] o.a.s.u.p.LogUpdateProcessorFactory [collection1] webapp=/solr path=/update params={wt=javabin&version=2}{add=[229]} 0 0
[junit4] 2> 570431 INFO (qtp1698963984-3248) [ x:collection1] o.a.s.u.p.LogUpdateProcessorFactory [collection1] webapp=/solr path=/update params={wt=javabin&version=2}{add=[230]} 0 0
[junit4] 2> 570432 INFO (qtp1698963984-3251) [ x:collection1] o.a.s.u.p.LogUpdateProcessorFactory [collection1] webapp=/solr path=/update params={wt=javabin&version=2}{add=[231]} 0 0
[junit4] 2> 570432 INFO (qtp1698963984-3250) [ x:collection1] o.a.s.u.p.LogUpdateProcessorFactory [collection1] webapp=/solr path=/update params={wt=javabin&version=2}{add=[232]} 0 0
[junit4] 2> 570433 INFO (qtp1698963984-3254) [ x:collection1] o.a.s.u.p.LogUpdateProcessorFactory [collection1] webapp=/solr path=/update params={wt=javabin&version=2}{add=[233]} 0 0
[junit4] 2> 570434 INFO (qtp1698963984-3253) [ x:collection1] o.a.s.u.p.LogUpdateProcessorFactory [collection1] webapp=/solr path=/update params={wt=javabin&version=2}{add=[234]} 0 0
[junit4] 2> 570434 INFO (qtp1698963984-3255) [ x:collection1] o.a.s.u.p.LogUpdateProcessorFactory [collection1] webapp=/solr path=/update params={wt=javabin&version=2}{add=[235]} 0 0
[junit4] 2> 570435 INFO (qtp1698963984-3252) [ x:collection1] o.a.s.u.p.LogUpdateProcessorFactory [collection1] webapp=/solr path=/update params={wt=javabin&version=2}{add=[236]} 0 0
[junit4] 2> 570436 INFO (qtp1698963984-3248) [ x:collection1] o.a.s.u.p.LogUpdateProcessorFactory [collection1] webapp=/solr path=/update params={wt=javabin&version=2}{add=[237]} 0 0
[junit4] 2> 570436 INFO (qtp1698963984-3251) [ x:collection1] o.a.s.u.p.LogUpdateProcessorFactory [collection1] webapp=/solr path=/update params={wt=javabin&version=2}{add=[238]} 0 0
[junit4] 2> 570437 INFO (qtp1698963984-3250) [ x:collection1] o.a.s.u.p.LogUpdateProcessorFactory [collection1] webapp=/solr path=/update params={wt=javabin&version=2}{add=[239]} 0 0
[junit4] 2> 570437 INFO (qtp1698963984-3254) [ x:collection1] o.a.s.u.p.LogUpdateProcessorFactory [collection1] webapp=/solr path=/update params={wt=javabin&version=2}{add=[240]} 0 0
[junit4] 2> 570439 INFO (qtp1698963984-3253) [ x:collection1] o.a.s.u.p.LogUpdateProcessorFactory [collection1] webapp=/solr path=/update params={wt=javabin&version=2}{add=[241]} 0 0
[junit4] 2> 570440 INFO (qtp1698963984-3255) [ x:collection1] o.a.s.u.p.LogUpdateProcessorFactory [collection1] webapp=/solr path=/update params={wt=javabin&version=2}{add=[242]} 0 0
[junit4] 2> 570440 INFO (qtp1698963984-3252) [ x:collection1] o.a.s.u.p.LogUpdateProcessorFactory [collection1] webapp=/solr path=/update params={wt=javabin&version=2}{add=[243]} 0 0
[junit4] 2> 570441 INFO (qtp1698963984-3248) [ x:collection1] o.a.s.u.p.LogUpdateProcessorFactory [collection1] webapp=/solr path=/update params={wt=javabin&version=2}{add=[244]} 0 0
[junit4] 2> 570441 INFO (qtp1698963984-3251) [ x:collection1] o.a.s.u.p.LogUpdateProcessorFactory [collection1] webapp=/solr path=/update params={wt=javabin&version=2}{add=[245]} 0 0
[junit4] 2> 570442 INFO (qtp1698963984-3250) [ x:collection1] o.a.s.u.p.LogUpdateProcessorFactory [collection1] webapp=/solr path=/update params={wt=javabin&version=2}{add=[246]} 0 0
[junit4] 2> 570443 INFO (qtp1698963984-3254) [ x:collection1] o.a.s.u.p.LogUpdateProcessorFactory [collection1] webapp=/solr path=/update params={wt=javabin&version=2}{add=[247]} 0 0
[junit4] 2> 570443 INFO (qtp1698963984-3253) [ x:collection1] o.a.s.u.p.LogUpdateProcessorFactory [collection1] webapp=/solr path=/update params={wt=javabin&version=2}{add=[248]} 0 0
[junit4] 2> 570444 INFO (qtp1698963984-3255) [ x:collection1] o.a.s.u.p.LogUpdateProcessorFactory [collection1] webapp=/solr path=/update params={wt=javabin&version=2}{add=[249]} 0 0
[junit4] 2> 570444 INFO (qtp1698963984-3252) [ x:collection1] o.a.s.u.p.LogUpdateProcessorFactory [collection1] webapp=/solr path=/update params={wt=javabin&version=2}{add=[250]} 0 0
[junit4] 2> 570445 INFO (qtp1698963984-3248) [ x:collection1] o.a.s.u.p.LogUpdateProcessorFactory [collection1] webapp=/solr path=/update params={wt=javabin&version=2}{add=[251]} 0 0
[junit4] 2> 570447 INFO (qtp1698963984-3251) [ x:collection1] o.a.s.u.p.LogUpdateProcessorFactory [collection1] webapp=/solr path=/update params={wt=javabin&version=2}{add=[252]} 0 1
[junit4] 2> 570447 INFO (qtp1698963984-3250) [ x:collection1] o.a.s.u.p.LogUpdateProcessorFactory [collection1] webapp=/solr path=/update params={wt=javabin&version=2}{add=[253]} 0 0
[junit4] 2> 570448 INFO (qtp1698963984-3254) [ x:collection1] o.a.s.u.p.LogUpdateProcessorFactory [collection1] webapp=/solr path=/update params={wt=javabin&version=2}{add=[254]} 0 0
[junit4] 2> 570449 INFO (qtp1698963984-3253) [ x:collection1] o.a.s.u.p.LogUpdateProcessorFactory [collection1] webapp=/solr path=/update params={wt=javabin&version=2}{add=[255]} 0 0
[junit4] 2> 570450 INFO (qtp1698963984-3255) [ x:collection1] o.a.s.u.p.LogUpdateProcessorFactory [collection1] webapp=/solr path=/update params={wt=javabin&version=2}{add=[256]} 0 0
[junit4] 2> 570450 INFO (qtp1698963984-3252) [ x:collection1] o.a.s.u.p.LogUpdateProcessorFactory [collection1] webapp=/solr path=/update params={wt=javabin&version=2}{add=[257]} 0 0
[junit4] 2> 570451 INFO (qtp1698963984-3248) [ x:collection1] o.a.s.u.p.LogUpdateProcessorFactory [collection1] webapp=/solr path=/update params={wt=javabin&version=2}{add=[258]} 0 0
[junit4] 2> 570452 INFO (qtp1698963984-3251) [ x:collection1] o.a.s.u.p.LogUpdateProcessorFactory [collection1] webapp=/solr path=/update params={wt=javabin&version=2}{add=[259]} 0 0
[junit4] 2> 570452 INFO (qtp1698963984-3250) [ x:collection1] o.a.s.u.p.LogUpdateProcessorFactory [collection
[...truncated too long message...]
645837 INFO (coreCloseExecutor-2290-thread-1) [ x:collection1] o.a.s.c.CachingDirectoryFactory Closing MockDirectoryFactory - 2 directories currently being tracked
[junit4] 2> 645837 INFO (coreCloseExecutor-2290-thread-1) [ x:collection1] o.a.s.c.CachingDirectoryFactory looking to close /export/home/jenkins/workspace/Lucene-Solr-master-Solaris/solr/build/solr-core/test/J0/temp/solr.handler.TestReplicationHandler_4910211677A01E90-001/solr-instance-029/./collection1/data/index [CachedDir<<refCount=0;path=/export/home/jenkins/workspace/Lucene-Solr-master-Solaris/solr/build/solr-core/test/J0/temp/solr.handler.TestReplicationHandler_4910211677A01E90-001/solr-instance-029/./collection1/data/index;done=false>>]
[junit4] 2> 645837 INFO (coreCloseExecutor-2290-thread-1) [ x:collection1] o.a.s.c.CachingDirectoryFactory Closing directory, CoreContainer#isShutdown=true
[junit4] 2> 645837 INFO (coreCloseExecutor-2290-thread-1) [ x:collection1] o.a.s.c.CachingDirectoryFactory Closing directory: /export/home/jenkins/workspace/Lucene-Solr-master-Solaris/solr/build/solr-core/test/J0/temp/solr.handler.TestReplicationHandler_4910211677A01E90-001/solr-instance-029/./collection1/data/index
[junit4] 2> 645837 INFO (coreCloseExecutor-2290-thread-1) [ x:collection1] o.a.s.c.CachingDirectoryFactory looking to close /export/home/jenkins/workspace/Lucene-Solr-master-Solaris/solr/build/solr-core/test/J0/temp/solr.handler.TestReplicationHandler_4910211677A01E90-001/solr-instance-029/./collection1/data [CachedDir<<refCount=0;path=/export/home/jenkins/workspace/Lucene-Solr-master-Solaris/solr/build/solr-core/test/J0/temp/solr.handler.TestReplicationHandler_4910211677A01E90-001/solr-instance-029/./collection1/data;done=false>>]
[junit4] 2> 645837 INFO (coreCloseExecutor-2290-thread-1) [ x:collection1] o.a.s.c.CachingDirectoryFactory Closing directory, CoreContainer#isShutdown=true
[junit4] 2> 645837 INFO (coreCloseExecutor-2290-thread-1) [ x:collection1] o.a.s.c.CachingDirectoryFactory Closing directory: /export/home/jenkins/workspace/Lucene-Solr-master-Solaris/solr/build/solr-core/test/J0/temp/solr.handler.TestReplicationHandler_4910211677A01E90-001/solr-instance-029/./collection1/data
[junit4] 2> 645838 INFO (TEST-TestReplicationHandler.doTestIndexAndConfigReplication-seed#[4910211677A01E90]) [ ] o.e.j.s.h.ContextHandler Stopped o.e.j.s.ServletContextHandler@5be11b17{/solr,null,UNAVAILABLE}
[junit4] 2> 645840 INFO (TEST-TestReplicationHandler.doTestIndexAndConfigReplication-seed#[4910211677A01E90]) [ ] o.e.j.s.ServerConnector Stopped ServerConnector@4caa6613{HTTP/1.1,[http/1.1]}{127.0.0.1:0}
[junit4] 2> 645840 INFO (TEST-TestReplicationHandler.doTestIndexAndConfigReplication-seed#[4910211677A01E90]) [ ] o.a.s.c.CoreContainer Shutting down CoreContainer instance=1327309780
[junit4] 2> 645841 INFO (coreCloseExecutor-2292-thread-1) [ x:collection1] o.a.s.c.SolrCore [collection1] CLOSING SolrCore org.apache.solr.core.SolrCore@3c83d9d7
[junit4] 2> 645842 INFO (coreCloseExecutor-2292-thread-1) [ x:collection1] o.a.s.u.DirectUpdateHandler2 closing DirectUpdateHandler2{commits=0,autocommits=0,soft autocommits=0,optimizes=0,rollbacks=0,expungeDeletes=0,docsPending=0,adds=0,deletesById=0,deletesByQuery=0,errors=0,cumulative_adds=0,cumulative_deletesById=0,cumulative_deletesByQuery=0,cumulative_errors=0}
[junit4] 2> 645842 INFO (coreCloseExecutor-2292-thread-1) [ x:collection1] o.a.s.u.SolrCoreState Closing SolrCoreState
[junit4] 2> 645842 INFO (coreCloseExecutor-2292-thread-1) [ x:collection1] o.a.s.u.DefaultSolrCoreState SolrCoreState ref count has reached 0 - closing IndexWriter
[junit4] 2> 645842 INFO (coreCloseExecutor-2292-thread-1) [ x:collection1] o.a.s.u.DefaultSolrCoreState closing IndexWriter with IndexWriterCloser
[junit4] 2> 645843 INFO (coreCloseExecutor-2292-thread-1) [ x:collection1] o.a.s.c.SolrCore [collection1] Closing main searcher on request.
[junit4] 2> 645844 INFO (coreCloseExecutor-2292-thread-1) [ x:collection1] o.a.s.c.CachingDirectoryFactory Closing MockDirectoryFactory - 2 directories currently being tracked
[junit4] 2> 645844 INFO (coreCloseExecutor-2292-thread-1) [ x:collection1] o.a.s.c.CachingDirectoryFactory looking to close /export/home/jenkins/workspace/Lucene-Solr-master-Solaris/solr/build/solr-core/test/J0/temp/solr.handler.TestReplicationHandler_4910211677A01E90-001/solr-instance-030/./collection1/data/index [CachedDir<<refCount=0;path=/export/home/jenkins/workspace/Lucene-Solr-master-Solaris/solr/build/solr-core/test/J0/temp/solr.handler.TestReplicationHandler_4910211677A01E90-001/solr-instance-030/./collection1/data/index;done=false>>]
[junit4] 2> 645844 INFO (coreCloseExecutor-2292-thread-1) [ x:collection1] o.a.s.c.CachingDirectoryFactory Closing directory, CoreContainer#isShutdown=true
[junit4] 2> 645844 INFO (coreCloseExecutor-2292-thread-1) [ x:collection1] o.a.s.c.CachingDirectoryFactory Closing directory: /export/home/jenkins/workspace/Lucene-Solr-master-Solaris/solr/build/solr-core/test/J0/temp/solr.handler.TestReplicationHandler_4910211677A01E90-001/solr-instance-030/./collection1/data/index
[junit4] 2> 645844 INFO (coreCloseExecutor-2292-thread-1) [ x:collection1] o.a.s.c.CachingDirectoryFactory looking to close /export/home/jenkins/workspace/Lucene-Solr-master-Solaris/solr/build/solr-core/test/J0/temp/solr.handler.TestReplicationHandler_4910211677A01E90-001/solr-instance-030/./collection1/data [CachedDir<<refCount=0;path=/export/home/jenkins/workspace/Lucene-Solr-master-Solaris/solr/build/solr-core/test/J0/temp/solr.handler.TestReplicationHandler_4910211677A01E90-001/solr-instance-030/./collection1/data;done=false>>]
[junit4] 2> 645844 INFO (coreCloseExecutor-2292-thread-1) [ x:collection1] o.a.s.c.CachingDirectoryFactory Closing directory, CoreContainer#isShutdown=true
[junit4] 2> 645844 INFO (coreCloseExecutor-2292-thread-1) [ x:collection1] o.a.s.c.CachingDirectoryFactory Closing directory: /export/home/jenkins/workspace/Lucene-Solr-master-Solaris/solr/build/solr-core/test/J0/temp/solr.handler.TestReplicationHandler_4910211677A01E90-001/solr-instance-030/./collection1/data
[junit4] 2> 645844 INFO (TEST-TestReplicationHandler.doTestIndexAndConfigReplication-seed#[4910211677A01E90]) [ ] o.e.j.s.h.ContextHandler Stopped o.e.j.s.ServletContextHandler@522a1399{/solr,null,UNAVAILABLE}
[junit4] 2> 645848 INFO (SUITE-TestReplicationHandler-seed#[4910211677A01E90]-worker) [ ] o.a.s.SolrTestCaseJ4 ###deleteCore
[junit4] 2> NOTE: leaving temporary files on disk at: /export/home/jenkins/workspace/Lucene-Solr-master-Solaris/solr/build/solr-core/test/J0/temp/solr.handler.TestReplicationHandler_4910211677A01E90-001
[junit4] 2> NOTE: test params are: codec=Asserting(Lucene60): {name=PostingsFormat(name=MockRandom), id=PostingsFormat(name=MockRandom), newname=PostingsFormat(name=MockRandom)}, docValues:{}, maxPointsInLeafNode=1878, maxMBSortInHeap=6.300682673881546, sim=ClassicSimilarity, locale=es-ES, timezone=Australia/Melbourne
[junit4] 2> NOTE: SunOS 5.11 amd64/Oracle Corporation 1.8.0_92 (64-bit)/cpus=3,threads=1,free=269713504,total=536870912
[junit4] 2> NOTE: All tests run in this JVM: [BigEndianAscendingWordDeserializerTest, TestRequestForwarding, AnalysisAfterCoreReloadTest, ConcurrentDeleteAndCreateCollectionTest, ReplicationFactorTest, SystemInfoHandlerTest, TestManagedSchema, ScriptEngineTest, TestCodecSupport, HttpPartitionTest, DocumentAnalysisRequestHandlerTest, SortSpecParsingTest, SimpleCollectionCreateDeleteTest, DistributedFacetPivotSmallTest, CollectionsAPIAsyncDistributedZkTest, CircularListTest, TestSchemaResource, AddBlockUpdateTest, PrimUtilsTest, TestLFUCache, ChangedSchemaMergeTest, TestStressReorder, AsyncMigrateRouteKeyTest, TestRuleBasedAuthorizationPlugin, HighlighterTest, TestMergePolicyConfig, RequiredFieldsTest, TestMissingGroups, TestDocSet, SolrIndexConfigTest, DistributedFacetPivotLongTailTest, ClassificationUpdateProcessorFactoryTest, TestRemoteStreaming, TestExactStatsCache, TestElisionMultitermQuery, TestComponentsName, PathHierarchyTokenizerFactoryTest, TestSolrQueryParserDefaultOperatorResource, TestSchemaManager, ExternalFileFieldSortTest, StandardRequestHandlerTest, RecoveryZkTest, DistribCursorPagingTest, TestMacros, IndexBasedSpellCheckerTest, TestIBSimilarityFactory, TestStandardQParsers, TestReqParamsAPI, TestReplicationHandler]
[junit4] Completed [94/597 (1!)] on J0 in 76.64s, 15 tests, 1 failure, 1 skipped <<< FAILURES!
[...truncated 1640 lines...]
BUILD FAILED
/export/home/jenkins/workspace/Lucene-Solr-master-Solaris/build.xml:740: The following error occurred while executing this line:
/export/home/jenkins/workspace/Lucene-Solr-master-Solaris/build.xml:684: The following error occurred while executing this line:
/export/home/jenkins/workspace/Lucene-Solr-master-Solaris/build.xml:59: The following error occurred while executing this line:
/export/home/jenkins/workspace/Lucene-Solr-master-Solaris/solr/build.xml:233: The following error occurred while executing this line:
/export/home/jenkins/workspace/Lucene-Solr-master-Solaris/solr/common-build.xml:529: The following error occurred while executing this line:
/export/home/jenkins/workspace/Lucene-Solr-master-Solaris/lucene/common-build.xml:1457: The following error occurred while executing this line:
/export/home/jenkins/workspace/Lucene-Solr-master-Solaris/lucene/common-build.xml:1014: There were test failures: 597 suites (10 ignored), 2412 tests, 1 failure, 87 ignored (72 assumptions) [seed: 4910211677A01E90]
Total time: 96 minutes 42 seconds
Build step 'Invoke Ant' marked build as failure
Archiving artifacts
[WARNINGS] Skipping publisher since build result is FAILURE
Recording test results
Email was triggered for: Failure - Any
Sending email for trigger: Failure - Any
[JENKINS] Lucene-Solr-master-Solaris (64bit/jdk1.8.0) - Build # 576
- Still Failing!
Posted by Policeman Jenkins Server <je...@thetaphi.de>.
Build: http://jenkins.thetaphi.de/job/Lucene-Solr-master-Solaris/576/
Java: 64bit/jdk1.8.0 -XX:-UseCompressedOops -XX:+UseParallelGC
All tests passed
Build Log:
[...truncated 52299 lines...]
[javadoc] Generating Javadoc
[javadoc] Javadoc execution
[javadoc] javadoc: warning - No source files for package org.apache.lucene.codecs
[javadoc] Loading source files for package org.apache.lucene.codecs...
[javadoc] Loading source files for package org.apache.lucene.codecs.lucene50...
[javadoc] Loading source files for package org.apache.lucene.codecs.lucene53...
[javadoc] Loading source files for package org.apache.lucene.codecs.lucene54...
[javadoc] Constructing Javadoc information...
[javadoc] Standard Doclet version 1.8.0_92
[javadoc] Building tree for all the packages and classes...
[javadoc] Building index for all the packages and classes...
[javadoc] Building index for all classes...
[javadoc] Generating /export/home/jenkins/workspace/Lucene-Solr-master-Solaris/lucene/build/docs/backward-codecs/help-doc.html...
[javadoc] Note: Custom tags that were not seen: @lucene.internal
[javadoc] 1 warning
BUILD FAILED
/export/home/jenkins/workspace/Lucene-Solr-master-Solaris/build.xml:740: The following error occurred while executing this line:
/export/home/jenkins/workspace/Lucene-Solr-master-Solaris/build.xml:101: The following error occurred while executing this line:
/export/home/jenkins/workspace/Lucene-Solr-master-Solaris/lucene/build.xml:138: The following error occurred while executing this line:
/export/home/jenkins/workspace/Lucene-Solr-master-Solaris/lucene/build.xml:246: The following error occurred while executing this line:
/export/home/jenkins/workspace/Lucene-Solr-master-Solaris/lucene/common-build.xml:2187: The following error occurred while executing this line:
/export/home/jenkins/workspace/Lucene-Solr-master-Solaris/lucene/module-build.xml:65: The following error occurred while executing this line:
/export/home/jenkins/workspace/Lucene-Solr-master-Solaris/lucene/module-build.xml:78: The following error occurred while executing this line:
/export/home/jenkins/workspace/Lucene-Solr-master-Solaris/lucene/common-build.xml:2163: Javadocs warnings were found!
Total time: 95 minutes 17 seconds
Build step 'Invoke Ant' marked build as failure
Archiving artifacts
[WARNINGS] Skipping publisher since build result is FAILURE
Recording test results
Email was triggered for: Failure - Any
Sending email for trigger: Failure - Any
[JENKINS] Lucene-Solr-master-Solaris (64bit/jdk1.8.0) - Build # 575
- Still Failing!
Posted by Policeman Jenkins Server <je...@thetaphi.de>.
Build: http://jenkins.thetaphi.de/job/Lucene-Solr-master-Solaris/575/
Java: 64bit/jdk1.8.0 -XX:-UseCompressedOops -XX:+UseParallelGC
1 tests failed.
FAILED: org.apache.solr.cloud.RecoveryAfterSoftCommitTest.test
Error Message:
Didn't see all replicas for shard shard1 in collection1 come up within 30000 ms! ClusterState: { "control_collection":{ "replicationFactor":"1", "shards":{"shard1":{ "range":"80000000-7fffffff", "state":"active", "replicas":{"core_node1":{ "core":"collection1", "base_url":"http://127.0.0.1:62545/a_to/g", "node_name":"127.0.0.1:62545_a_to%2Fg", "state":"active", "leader":"true"}}}}, "router":{"name":"compositeId"}, "maxShardsPerNode":"1", "autoAddReplicas":"false", "autoCreated":"true"}, "collection1":{ "replicationFactor":"1", "shards":{"shard1":{ "range":"80000000-7fffffff", "state":"active", "replicas":{ "core_node1":{ "core":"collection1", "base_url":"http://127.0.0.1:56797/a_to/g", "node_name":"127.0.0.1:56797_a_to%2Fg", "state":"active", "leader":"true"}, "core_node2":{ "core":"collection1", "base_url":"http://127.0.0.1:38547/a_to/g", "node_name":"127.0.0.1:38547_a_to%2Fg", "state":"recovering"}}}}, "router":{"name":"compositeId"}, "maxShardsPerNode":"1", "autoAddReplicas":"false", "autoCreated":"true"}}
Stack Trace:
java.lang.AssertionError: Didn't see all replicas for shard shard1 in collection1 come up within 30000 ms! ClusterState: {
"control_collection":{
"replicationFactor":"1",
"shards":{"shard1":{
"range":"80000000-7fffffff",
"state":"active",
"replicas":{"core_node1":{
"core":"collection1",
"base_url":"http://127.0.0.1:62545/a_to/g",
"node_name":"127.0.0.1:62545_a_to%2Fg",
"state":"active",
"leader":"true"}}}},
"router":{"name":"compositeId"},
"maxShardsPerNode":"1",
"autoAddReplicas":"false",
"autoCreated":"true"},
"collection1":{
"replicationFactor":"1",
"shards":{"shard1":{
"range":"80000000-7fffffff",
"state":"active",
"replicas":{
"core_node1":{
"core":"collection1",
"base_url":"http://127.0.0.1:56797/a_to/g",
"node_name":"127.0.0.1:56797_a_to%2Fg",
"state":"active",
"leader":"true"},
"core_node2":{
"core":"collection1",
"base_url":"http://127.0.0.1:38547/a_to/g",
"node_name":"127.0.0.1:38547_a_to%2Fg",
"state":"recovering"}}}},
"router":{"name":"compositeId"},
"maxShardsPerNode":"1",
"autoAddReplicas":"false",
"autoCreated":"true"}}
at __randomizedtesting.SeedInfo.seed([C324A3CA36D74810:4B709C10982B25E8]:0)
at org.junit.Assert.fail(Assert.java:93)
at org.apache.solr.cloud.AbstractFullDistribZkTestBase.ensureAllReplicasAreActive(AbstractFullDistribZkTestBase.java:1895)
at org.apache.solr.cloud.RecoveryAfterSoftCommitTest.test(RecoveryAfterSoftCommitTest.java:115)
at sun.reflect.NativeMethodAccessorImpl.invoke0(Native Method)
at sun.reflect.NativeMethodAccessorImpl.invoke(NativeMethodAccessorImpl.java:62)
at sun.reflect.DelegatingMethodAccessorImpl.invoke(DelegatingMethodAccessorImpl.java:43)
at java.lang.reflect.Method.invoke(Method.java:498)
at com.carrotsearch.randomizedtesting.RandomizedRunner.invoke(RandomizedRunner.java:1764)
at com.carrotsearch.randomizedtesting.RandomizedRunner$8.evaluate(RandomizedRunner.java:871)
at com.carrotsearch.randomizedtesting.RandomizedRunner$9.evaluate(RandomizedRunner.java:907)
at com.carrotsearch.randomizedtesting.RandomizedRunner$10.evaluate(RandomizedRunner.java:921)
at org.apache.solr.BaseDistributedSearchTestCase$ShardsRepeatRule$ShardsFixedStatement.callStatement(BaseDistributedSearchTestCase.java:985)
at org.apache.solr.BaseDistributedSearchTestCase$ShardsRepeatRule$ShardsStatement.evaluate(BaseDistributedSearchTestCase.java:960)
at com.carrotsearch.randomizedtesting.rules.SystemPropertiesRestoreRule$1.evaluate(SystemPropertiesRestoreRule.java:57)
at org.apache.lucene.util.TestRuleSetupTeardownChained$1.evaluate(TestRuleSetupTeardownChained.java:49)
at org.apache.lucene.util.AbstractBeforeAfterRule$1.evaluate(AbstractBeforeAfterRule.java:45)
at org.apache.lucene.util.TestRuleThreadAndTestName$1.evaluate(TestRuleThreadAndTestName.java:48)
at org.apache.lucene.util.TestRuleIgnoreAfterMaxFailures$1.evaluate(TestRuleIgnoreAfterMaxFailures.java:64)
at org.apache.lucene.util.TestRuleMarkFailure$1.evaluate(TestRuleMarkFailure.java:47)
at com.carrotsearch.randomizedtesting.rules.StatementAdapter.evaluate(StatementAdapter.java:36)
at com.carrotsearch.randomizedtesting.ThreadLeakControl$StatementRunner.run(ThreadLeakControl.java:367)
at com.carrotsearch.randomizedtesting.ThreadLeakControl.forkTimeoutingTask(ThreadLeakControl.java:809)
at com.carrotsearch.randomizedtesting.ThreadLeakControl$3.evaluate(ThreadLeakControl.java:460)
at com.carrotsearch.randomizedtesting.RandomizedRunner.runSingleTest(RandomizedRunner.java:880)
at com.carrotsearch.randomizedtesting.RandomizedRunner$5.evaluate(RandomizedRunner.java:781)
at com.carrotsearch.randomizedtesting.RandomizedRunner$6.evaluate(RandomizedRunner.java:816)
at com.carrotsearch.randomizedtesting.RandomizedRunner$7.evaluate(RandomizedRunner.java:827)
at com.carrotsearch.randomizedtesting.rules.StatementAdapter.evaluate(StatementAdapter.java:36)
at com.carrotsearch.randomizedtesting.rules.SystemPropertiesRestoreRule$1.evaluate(SystemPropertiesRestoreRule.java:57)
at org.apache.lucene.util.AbstractBeforeAfterRule$1.evaluate(AbstractBeforeAfterRule.java:45)
at com.carrotsearch.randomizedtesting.rules.StatementAdapter.evaluate(StatementAdapter.java:36)
at org.apache.lucene.util.TestRuleStoreClassName$1.evaluate(TestRuleStoreClassName.java:41)
at com.carrotsearch.randomizedtesting.rules.NoShadowingOrOverridesOnMethodsRule$1.evaluate(NoShadowingOrOverridesOnMethodsRule.java:40)
at com.carrotsearch.randomizedtesting.rules.NoShadowingOrOverridesOnMethodsRule$1.evaluate(NoShadowingOrOverridesOnMethodsRule.java:40)
at com.carrotsearch.randomizedtesting.rules.StatementAdapter.evaluate(StatementAdapter.java:36)
at com.carrotsearch.randomizedtesting.rules.StatementAdapter.evaluate(StatementAdapter.java:36)
at com.carrotsearch.randomizedtesting.rules.StatementAdapter.evaluate(StatementAdapter.java:36)
at org.apache.lucene.util.TestRuleAssertionsRequired$1.evaluate(TestRuleAssertionsRequired.java:53)
at org.apache.lucene.util.TestRuleMarkFailure$1.evaluate(TestRuleMarkFailure.java:47)
at org.apache.lucene.util.TestRuleIgnoreAfterMaxFailures$1.evaluate(TestRuleIgnoreAfterMaxFailures.java:64)
at org.apache.lucene.util.TestRuleIgnoreTestSuites$1.evaluate(TestRuleIgnoreTestSuites.java:54)
at com.carrotsearch.randomizedtesting.rules.StatementAdapter.evaluate(StatementAdapter.java:36)
at com.carrotsearch.randomizedtesting.ThreadLeakControl$StatementRunner.run(ThreadLeakControl.java:367)
at java.lang.Thread.run(Thread.java:745)
Build Log:
[...truncated 11323 lines...]
[junit4] Suite: org.apache.solr.cloud.RecoveryAfterSoftCommitTest
[junit4] 2> Creating dataDir: /export/home/jenkins/workspace/Lucene-Solr-master-Solaris/solr/build/solr-core/test/J0/temp/solr.cloud.RecoveryAfterSoftCommitTest_C324A3CA36D74810-001/init-core-data-001
[junit4] 2> 1671045 INFO (SUITE-RecoveryAfterSoftCommitTest-seed#[C324A3CA36D74810]-worker) [ ] o.a.s.BaseDistributedSearchTestCase Setting hostContext system property: /a_to/g
[junit4] 2> 1671048 INFO (TEST-RecoveryAfterSoftCommitTest.test-seed#[C324A3CA36D74810]) [ ] o.a.s.c.ZkTestServer STARTING ZK TEST SERVER
[junit4] 2> 1671049 INFO (Thread-6683) [ ] o.a.s.c.ZkTestServer client port:0.0.0.0/0.0.0.0:0
[junit4] 2> 1671049 INFO (Thread-6683) [ ] o.a.s.c.ZkTestServer Starting server
[junit4] 2> 1671149 INFO (TEST-RecoveryAfterSoftCommitTest.test-seed#[C324A3CA36D74810]) [ ] o.a.s.c.ZkTestServer start zk server on port:54292
[junit4] 2> 1671149 INFO (TEST-RecoveryAfterSoftCommitTest.test-seed#[C324A3CA36D74810]) [ ] o.a.s.c.c.SolrZkClient Using default ZkCredentialsProvider
[junit4] 2> 1671149 INFO (TEST-RecoveryAfterSoftCommitTest.test-seed#[C324A3CA36D74810]) [ ] o.a.s.c.c.ConnectionManager Waiting for client to connect to ZooKeeper
[junit4] 2> 1671153 INFO (zkCallback-1769-thread-1) [ ] o.a.s.c.c.ConnectionManager Watcher org.apache.solr.common.cloud.ConnectionManager@495b3ec1 name:ZooKeeperConnection Watcher:127.0.0.1:54292 got event WatchedEvent state:SyncConnected type:None path:null path:null type:None
[junit4] 2> 1671154 INFO (TEST-RecoveryAfterSoftCommitTest.test-seed#[C324A3CA36D74810]) [ ] o.a.s.c.c.ConnectionManager Client is connected to ZooKeeper
[junit4] 2> 1671154 INFO (TEST-RecoveryAfterSoftCommitTest.test-seed#[C324A3CA36D74810]) [ ] o.a.s.c.c.SolrZkClient Using default ZkACLProvider
[junit4] 2> 1671154 INFO (TEST-RecoveryAfterSoftCommitTest.test-seed#[C324A3CA36D74810]) [ ] o.a.s.c.c.SolrZkClient makePath: /solr
[junit4] 2> 1671159 INFO (TEST-RecoveryAfterSoftCommitTest.test-seed#[C324A3CA36D74810]) [ ] o.a.s.c.c.SolrZkClient Using default ZkCredentialsProvider
[junit4] 2> 1671159 INFO (TEST-RecoveryAfterSoftCommitTest.test-seed#[C324A3CA36D74810]) [ ] o.a.s.c.c.ConnectionManager Waiting for client to connect to ZooKeeper
[junit4] 2> 1671161 INFO (zkCallback-1770-thread-1) [ ] o.a.s.c.c.ConnectionManager Watcher org.apache.solr.common.cloud.ConnectionManager@38490933 name:ZooKeeperConnection Watcher:127.0.0.1:54292/solr got event WatchedEvent state:SyncConnected type:None path:null path:null type:None
[junit4] 2> 1671161 INFO (TEST-RecoveryAfterSoftCommitTest.test-seed#[C324A3CA36D74810]) [ ] o.a.s.c.c.ConnectionManager Client is connected to ZooKeeper
[junit4] 2> 1671162 INFO (TEST-RecoveryAfterSoftCommitTest.test-seed#[C324A3CA36D74810]) [ ] o.a.s.c.c.SolrZkClient Using default ZkACLProvider
[junit4] 2> 1671162 INFO (TEST-RecoveryAfterSoftCommitTest.test-seed#[C324A3CA36D74810]) [ ] o.a.s.c.c.SolrZkClient makePath: /collections/collection1
[junit4] 2> 1671166 INFO (TEST-RecoveryAfterSoftCommitTest.test-seed#[C324A3CA36D74810]) [ ] o.a.s.c.c.SolrZkClient makePath: /collections/collection1/shards
[junit4] 2> 1671169 INFO (TEST-RecoveryAfterSoftCommitTest.test-seed#[C324A3CA36D74810]) [ ] o.a.s.c.c.SolrZkClient makePath: /collections/control_collection
[junit4] 2> 1671171 INFO (TEST-RecoveryAfterSoftCommitTest.test-seed#[C324A3CA36D74810]) [ ] o.a.s.c.c.SolrZkClient makePath: /collections/control_collection/shards
[junit4] 2> 1671174 INFO (TEST-RecoveryAfterSoftCommitTest.test-seed#[C324A3CA36D74810]) [ ] o.a.s.c.AbstractZkTestCase put /export/home/jenkins/workspace/Lucene-Solr-master-Solaris/solr/core/src/test-files/solr/collection1/conf/solrconfig-tlog.xml to /configs/conf1/solrconfig.xml
[junit4] 2> 1671174 INFO (TEST-RecoveryAfterSoftCommitTest.test-seed#[C324A3CA36D74810]) [ ] o.a.s.c.c.SolrZkClient makePath: /configs/conf1/solrconfig.xml
[junit4] 2> 1671178 INFO (TEST-RecoveryAfterSoftCommitTest.test-seed#[C324A3CA36D74810]) [ ] o.a.s.c.AbstractZkTestCase put /export/home/jenkins/workspace/Lucene-Solr-master-Solaris/solr/core/src/test-files/solr/collection1/conf/schema.xml to /configs/conf1/schema.xml
[junit4] 2> 1671178 INFO (TEST-RecoveryAfterSoftCommitTest.test-seed#[C324A3CA36D74810]) [ ] o.a.s.c.c.SolrZkClient makePath: /configs/conf1/schema.xml
[junit4] 2> 1671182 INFO (TEST-RecoveryAfterSoftCommitTest.test-seed#[C324A3CA36D74810]) [ ] o.a.s.c.AbstractZkTestCase put /export/home/jenkins/workspace/Lucene-Solr-master-Solaris/solr/core/src/test-files/solr/collection1/conf/solrconfig.snippet.randomindexconfig.xml to /configs/conf1/solrconfig.snippet.randomindexconfig.xml
[junit4] 2> 1671182 INFO (TEST-RecoveryAfterSoftCommitTest.test-seed#[C324A3CA36D74810]) [ ] o.a.s.c.c.SolrZkClient makePath: /configs/conf1/solrconfig.snippet.randomindexconfig.xml
[junit4] 2> 1671185 INFO (TEST-RecoveryAfterSoftCommitTest.test-seed#[C324A3CA36D74810]) [ ] o.a.s.c.AbstractZkTestCase put /export/home/jenkins/workspace/Lucene-Solr-master-Solaris/solr/core/src/test-files/solr/collection1/conf/stopwords.txt to /configs/conf1/stopwords.txt
[junit4] 2> 1671185 INFO (TEST-RecoveryAfterSoftCommitTest.test-seed#[C324A3CA36D74810]) [ ] o.a.s.c.c.SolrZkClient makePath: /configs/conf1/stopwords.txt
[junit4] 2> 1671188 INFO (TEST-RecoveryAfterSoftCommitTest.test-seed#[C324A3CA36D74810]) [ ] o.a.s.c.AbstractZkTestCase put /export/home/jenkins/workspace/Lucene-Solr-master-Solaris/solr/core/src/test-files/solr/collection1/conf/protwords.txt to /configs/conf1/protwords.txt
[junit4] 2> 1671188 INFO (TEST-RecoveryAfterSoftCommitTest.test-seed#[C324A3CA36D74810]) [ ] o.a.s.c.c.SolrZkClient makePath: /configs/conf1/protwords.txt
[junit4] 2> 1671191 INFO (TEST-RecoveryAfterSoftCommitTest.test-seed#[C324A3CA36D74810]) [ ] o.a.s.c.AbstractZkTestCase put /export/home/jenkins/workspace/Lucene-Solr-master-Solaris/solr/core/src/test-files/solr/collection1/conf/currency.xml to /configs/conf1/currency.xml
[junit4] 2> 1671191 INFO (TEST-RecoveryAfterSoftCommitTest.test-seed#[C324A3CA36D74810]) [ ] o.a.s.c.c.SolrZkClient makePath: /configs/conf1/currency.xml
[junit4] 2> 1671194 INFO (TEST-RecoveryAfterSoftCommitTest.test-seed#[C324A3CA36D74810]) [ ] o.a.s.c.AbstractZkTestCase put /export/home/jenkins/workspace/Lucene-Solr-master-Solaris/solr/core/src/test-files/solr/collection1/conf/enumsConfig.xml to /configs/conf1/enumsConfig.xml
[junit4] 2> 1671194 INFO (TEST-RecoveryAfterSoftCommitTest.test-seed#[C324A3CA36D74810]) [ ] o.a.s.c.c.SolrZkClient makePath: /configs/conf1/enumsConfig.xml
[junit4] 2> 1671196 INFO (TEST-RecoveryAfterSoftCommitTest.test-seed#[C324A3CA36D74810]) [ ] o.a.s.c.AbstractZkTestCase put /export/home/jenkins/workspace/Lucene-Solr-master-Solaris/solr/core/src/test-files/solr/collection1/conf/open-exchange-rates.json to /configs/conf1/open-exchange-rates.json
[junit4] 2> 1671197 INFO (TEST-RecoveryAfterSoftCommitTest.test-seed#[C324A3CA36D74810]) [ ] o.a.s.c.c.SolrZkClient makePath: /configs/conf1/open-exchange-rates.json
[junit4] 2> 1671199 INFO (TEST-RecoveryAfterSoftCommitTest.test-seed#[C324A3CA36D74810]) [ ] o.a.s.c.AbstractZkTestCase put /export/home/jenkins/workspace/Lucene-Solr-master-Solaris/solr/core/src/test-files/solr/collection1/conf/mapping-ISOLatin1Accent.txt to /configs/conf1/mapping-ISOLatin1Accent.txt
[junit4] 2> 1671199 INFO (TEST-RecoveryAfterSoftCommitTest.test-seed#[C324A3CA36D74810]) [ ] o.a.s.c.c.SolrZkClient makePath: /configs/conf1/mapping-ISOLatin1Accent.txt
[junit4] 2> 1671203 INFO (TEST-RecoveryAfterSoftCommitTest.test-seed#[C324A3CA36D74810]) [ ] o.a.s.c.AbstractZkTestCase put /export/home/jenkins/workspace/Lucene-Solr-master-Solaris/solr/core/src/test-files/solr/collection1/conf/old_synonyms.txt to /configs/conf1/old_synonyms.txt
[junit4] 2> 1671203 INFO (TEST-RecoveryAfterSoftCommitTest.test-seed#[C324A3CA36D74810]) [ ] o.a.s.c.c.SolrZkClient makePath: /configs/conf1/old_synonyms.txt
[junit4] 2> 1671205 INFO (TEST-RecoveryAfterSoftCommitTest.test-seed#[C324A3CA36D74810]) [ ] o.a.s.c.AbstractZkTestCase put /export/home/jenkins/workspace/Lucene-Solr-master-Solaris/solr/core/src/test-files/solr/collection1/conf/synonyms.txt to /configs/conf1/synonyms.txt
[junit4] 2> 1671206 INFO (TEST-RecoveryAfterSoftCommitTest.test-seed#[C324A3CA36D74810]) [ ] o.a.s.c.c.SolrZkClient makePath: /configs/conf1/synonyms.txt
[junit4] 2> 1671374 INFO (TEST-RecoveryAfterSoftCommitTest.test-seed#[C324A3CA36D74810]) [ ] o.a.s.SolrTestCaseJ4 Writing core.properties file to /export/home/jenkins/workspace/Lucene-Solr-master-Solaris/solr/build/solr-core/test/J0/temp/solr.cloud.RecoveryAfterSoftCommitTest_C324A3CA36D74810-001/control-001/cores/collection1
[junit4] 2> 1671376 INFO (TEST-RecoveryAfterSoftCommitTest.test-seed#[C324A3CA36D74810]) [ ] o.e.j.s.Server jetty-9.3.8.v20160314
[junit4] 2> 1671378 INFO (TEST-RecoveryAfterSoftCommitTest.test-seed#[C324A3CA36D74810]) [ ] o.e.j.s.h.ContextHandler Started o.e.j.s.ServletContextHandler@570ddede{/a_to/g,null,AVAILABLE}
[junit4] 2> 1671378 INFO (TEST-RecoveryAfterSoftCommitTest.test-seed#[C324A3CA36D74810]) [ ] o.e.j.s.ServerConnector Started ServerConnector@28fd6279{HTTP/1.1,[http/1.1]}{127.0.0.1:54560}
[junit4] 2> 1671378 INFO (TEST-RecoveryAfterSoftCommitTest.test-seed#[C324A3CA36D74810]) [ ] o.e.j.s.Server Started @1675719ms
[junit4] 2> 1671378 INFO (TEST-RecoveryAfterSoftCommitTest.test-seed#[C324A3CA36D74810]) [ ] o.a.s.c.s.e.JettySolrRunner Jetty properties: {solr.data.dir=/export/home/jenkins/workspace/Lucene-Solr-master-Solaris/solr/build/solr-core/test/J0/temp/solr.cloud.RecoveryAfterSoftCommitTest_C324A3CA36D74810-001/tempDir-001/control/data, hostContext=/a_to/g, hostPort=62545, coreRootDirectory=/export/home/jenkins/workspace/Lucene-Solr-master-Solaris/solr/build/solr-core/test/J0/temp/solr.cloud.RecoveryAfterSoftCommitTest_C324A3CA36D74810-001/control-001/cores}
[junit4] 2> 1671379 INFO (TEST-RecoveryAfterSoftCommitTest.test-seed#[C324A3CA36D74810]) [ ] o.a.s.s.SolrDispatchFilter SolrDispatchFilter.init(): sun.misc.Launcher$AppClassLoader@6d06d69c
[junit4] 2> 1671379 INFO (TEST-RecoveryAfterSoftCommitTest.test-seed#[C324A3CA36D74810]) [ ] o.a.s.c.SolrResourceLoader new SolrResourceLoader for directory: '/export/home/jenkins/workspace/Lucene-Solr-master-Solaris/solr/build/solr-core/test/J0/temp/solr.cloud.RecoveryAfterSoftCommitTest_C324A3CA36D74810-001/control-001'
[junit4] 2> 1671379 INFO (TEST-RecoveryAfterSoftCommitTest.test-seed#[C324A3CA36D74810]) [ ] o.a.s.c.SolrResourceLoader JNDI not configured for solr (NoInitialContextEx)
[junit4] 2> 1671379 INFO (TEST-RecoveryAfterSoftCommitTest.test-seed#[C324A3CA36D74810]) [ ] o.a.s.c.SolrResourceLoader solr home defaulted to 'solr/' (could not find system property or JNDI)
[junit4] 2> 1671379 INFO (TEST-RecoveryAfterSoftCommitTest.test-seed#[C324A3CA36D74810]) [ ] o.a.s.c.c.SolrZkClient Using default ZkCredentialsProvider
[junit4] 2> 1671380 INFO (TEST-RecoveryAfterSoftCommitTest.test-seed#[C324A3CA36D74810]) [ ] o.a.s.c.c.ConnectionManager Waiting for client to connect to ZooKeeper
[junit4] 2> 1671382 INFO (zkCallback-1771-thread-1) [ ] o.a.s.c.c.ConnectionManager Watcher org.apache.solr.common.cloud.ConnectionManager@5113aca9 name:ZooKeeperConnection Watcher:127.0.0.1:54292/solr got event WatchedEvent state:SyncConnected type:None path:null path:null type:None
[junit4] 2> 1671382 INFO (TEST-RecoveryAfterSoftCommitTest.test-seed#[C324A3CA36D74810]) [ ] o.a.s.c.c.ConnectionManager Client is connected to ZooKeeper
[junit4] 2> 1671383 INFO (TEST-RecoveryAfterSoftCommitTest.test-seed#[C324A3CA36D74810]) [ ] o.a.s.c.c.SolrZkClient Using default ZkACLProvider
[junit4] 2> 1671385 INFO (TEST-RecoveryAfterSoftCommitTest.test-seed#[C324A3CA36D74810]) [ ] o.a.s.s.SolrDispatchFilter Loading solr.xml from SolrHome (not found in ZooKeeper)
[junit4] 2> 1671385 INFO (TEST-RecoveryAfterSoftCommitTest.test-seed#[C324A3CA36D74810]) [ ] o.a.s.c.SolrXmlConfig Loading container configuration from /export/home/jenkins/workspace/Lucene-Solr-master-Solaris/solr/build/solr-core/test/J0/temp/solr.cloud.RecoveryAfterSoftCommitTest_C324A3CA36D74810-001/control-001/solr.xml
[junit4] 2> 1671391 INFO (TEST-RecoveryAfterSoftCommitTest.test-seed#[C324A3CA36D74810]) [ ] o.a.s.c.CorePropertiesLocator Config-defined core root directory: /export/home/jenkins/workspace/Lucene-Solr-master-Solaris/solr/build/solr-core/test/J0/temp/solr.cloud.RecoveryAfterSoftCommitTest_C324A3CA36D74810-001/control-001/cores
[junit4] 2> 1671392 INFO (TEST-RecoveryAfterSoftCommitTest.test-seed#[C324A3CA36D74810]) [ ] o.a.s.c.CoreContainer New CoreContainer 475842131
[junit4] 2> 1671392 INFO (TEST-RecoveryAfterSoftCommitTest.test-seed#[C324A3CA36D74810]) [ ] o.a.s.c.CoreContainer Loading cores into CoreContainer [instanceDir=/export/home/jenkins/workspace/Lucene-Solr-master-Solaris/solr/build/solr-core/test/J0/temp/solr.cloud.RecoveryAfterSoftCommitTest_C324A3CA36D74810-001/control-001]
[junit4] 2> 1671392 WARN (TEST-RecoveryAfterSoftCommitTest.test-seed#[C324A3CA36D74810]) [ ] o.a.s.c.CoreContainer Couldn't add files from /export/home/jenkins/workspace/Lucene-Solr-master-Solaris/solr/build/solr-core/test/J0/temp/solr.cloud.RecoveryAfterSoftCommitTest_C324A3CA36D74810-001/control-001/lib to classpath: /export/home/jenkins/workspace/Lucene-Solr-master-Solaris/solr/build/solr-core/test/J0/temp/solr.cloud.RecoveryAfterSoftCommitTest_C324A3CA36D74810-001/control-001/lib
[junit4] 2> 1671393 INFO (TEST-RecoveryAfterSoftCommitTest.test-seed#[C324A3CA36D74810]) [ ] o.a.s.h.c.HttpShardHandlerFactory created with socketTimeout : 90000,urlScheme : ,connTimeout : 15000,maxConnectionsPerHost : 20,maxConnections : 10000,corePoolSize : 0,maximumPoolSize : 2147483647,maxThreadIdleTime : 5,sizeOfQueue : -1,fairnessPolicy : false,
[junit4] 2> 1671394 INFO (TEST-RecoveryAfterSoftCommitTest.test-seed#[C324A3CA36D74810]) [ ] o.a.s.u.UpdateShardHandler Creating UpdateShardHandler HTTP client with params:
[junit4] 2> 1671395 INFO (TEST-RecoveryAfterSoftCommitTest.test-seed#[C324A3CA36D74810]) [ ] o.a.s.l.LogWatcher SLF4J impl is org.slf4j.impl.Log4jLoggerFactory
[junit4] 2> 1671395 INFO (TEST-RecoveryAfterSoftCommitTest.test-seed#[C324A3CA36D74810]) [ ] o.a.s.l.LogWatcher Registering Log Listener [Log4j (org.slf4j.impl.Log4jLoggerFactory)]
[junit4] 2> 1671395 INFO (TEST-RecoveryAfterSoftCommitTest.test-seed#[C324A3CA36D74810]) [ ] o.a.s.c.ZkContainer Zookeeper client=127.0.0.1:54292/solr
[junit4] 2> 1671396 INFO (TEST-RecoveryAfterSoftCommitTest.test-seed#[C324A3CA36D74810]) [ ] o.a.s.c.ZkController zkHost includes chroot
[junit4] 2> 1671396 INFO (TEST-RecoveryAfterSoftCommitTest.test-seed#[C324A3CA36D74810]) [ ] o.a.s.c.c.SolrZkClient Using default ZkCredentialsProvider
[junit4] 2> 1671396 INFO (TEST-RecoveryAfterSoftCommitTest.test-seed#[C324A3CA36D74810]) [ ] o.a.s.c.c.ConnectionManager Waiting for client to connect to ZooKeeper
[junit4] 2> 1671398 INFO (zkCallback-1774-thread-1) [ ] o.a.s.c.c.ConnectionManager Watcher org.apache.solr.common.cloud.ConnectionManager@1bcdec98 name:ZooKeeperConnection Watcher:127.0.0.1:54292 got event WatchedEvent state:SyncConnected type:None path:null path:null type:None
[junit4] 2> 1671398 INFO (TEST-RecoveryAfterSoftCommitTest.test-seed#[C324A3CA36D74810]) [ ] o.a.s.c.c.ConnectionManager Client is connected to ZooKeeper
[junit4] 2> 1671399 INFO (TEST-RecoveryAfterSoftCommitTest.test-seed#[C324A3CA36D74810]) [ ] o.a.s.c.c.SolrZkClient Using default ZkACLProvider
[junit4] 2> 1671400 INFO (TEST-RecoveryAfterSoftCommitTest.test-seed#[C324A3CA36D74810]) [n:127.0.0.1:62545_a_to%2Fg ] o.a.s.c.ZkController Added new OnReconnect listener org.apache.solr.cloud.ZkController$$Lambda$77/1517282429@3f871186
[junit4] 2> 1671401 INFO (TEST-RecoveryAfterSoftCommitTest.test-seed#[C324A3CA36D74810]) [n:127.0.0.1:62545_a_to%2Fg ] o.a.s.c.c.ConnectionManager Waiting for client to connect to ZooKeeper
[junit4] 2> 1671403 INFO (zkCallback-1775-thread-1-processing-n:127.0.0.1:62545_a_to%2Fg) [n:127.0.0.1:62545_a_to%2Fg ] o.a.s.c.c.ConnectionManager Watcher org.apache.solr.common.cloud.ConnectionManager@569264be name:ZooKeeperConnection Watcher:127.0.0.1:54292/solr got event WatchedEvent state:SyncConnected type:None path:null path:null type:None
[junit4] 2> 1671403 INFO (TEST-RecoveryAfterSoftCommitTest.test-seed#[C324A3CA36D74810]) [n:127.0.0.1:62545_a_to%2Fg ] o.a.s.c.c.ConnectionManager Client is connected to ZooKeeper
[junit4] 2> 1671405 INFO (TEST-RecoveryAfterSoftCommitTest.test-seed#[C324A3CA36D74810]) [n:127.0.0.1:62545_a_to%2Fg ] o.a.s.c.c.SolrZkClient makePath: /overseer/queue
[junit4] 2> 1671408 INFO (TEST-RecoveryAfterSoftCommitTest.test-seed#[C324A3CA36D74810]) [n:127.0.0.1:62545_a_to%2Fg ] o.a.s.c.c.SolrZkClient makePath: /overseer/collection-queue-work
[junit4] 2> 1671413 INFO (TEST-RecoveryAfterSoftCommitTest.test-seed#[C324A3CA36D74810]) [n:127.0.0.1:62545_a_to%2Fg ] o.a.s.c.c.SolrZkClient makePath: /overseer/collection-map-running
[junit4] 2> 1671417 INFO (TEST-RecoveryAfterSoftCommitTest.test-seed#[C324A3CA36D74810]) [n:127.0.0.1:62545_a_to%2Fg ] o.a.s.c.c.SolrZkClient makePath: /overseer/collection-map-completed
[junit4] 2> 1671421 INFO (TEST-RecoveryAfterSoftCommitTest.test-seed#[C324A3CA36D74810]) [n:127.0.0.1:62545_a_to%2Fg ] o.a.s.c.c.SolrZkClient makePath: /overseer/collection-map-failure
[junit4] 2> 1671424 INFO (TEST-RecoveryAfterSoftCommitTest.test-seed#[C324A3CA36D74810]) [n:127.0.0.1:62545_a_to%2Fg ] o.a.s.c.c.SolrZkClient makePath: /live_nodes
[junit4] 2> 1671427 INFO (TEST-RecoveryAfterSoftCommitTest.test-seed#[C324A3CA36D74810]) [n:127.0.0.1:62545_a_to%2Fg ] o.a.s.c.c.SolrZkClient makePath: /aliases.json
[junit4] 2> 1671429 INFO (TEST-RecoveryAfterSoftCommitTest.test-seed#[C324A3CA36D74810]) [n:127.0.0.1:62545_a_to%2Fg ] o.a.s.c.c.SolrZkClient makePath: /clusterstate.json
[junit4] 2> 1671431 INFO (TEST-RecoveryAfterSoftCommitTest.test-seed#[C324A3CA36D74810]) [n:127.0.0.1:62545_a_to%2Fg ] o.a.s.c.c.SolrZkClient makePath: /security.json
[junit4] 2> 1671433 INFO (TEST-RecoveryAfterSoftCommitTest.test-seed#[C324A3CA36D74810]) [n:127.0.0.1:62545_a_to%2Fg ] o.a.s.c.c.ZkStateReader Updating cluster state from ZooKeeper...
[junit4] 2> 1671436 INFO (TEST-RecoveryAfterSoftCommitTest.test-seed#[C324A3CA36D74810]) [n:127.0.0.1:62545_a_to%2Fg ] o.a.s.c.c.ZkStateReader Updated live nodes from ZooKeeper... (0) -> (0)
[junit4] 2> 1671439 INFO (TEST-RecoveryAfterSoftCommitTest.test-seed#[C324A3CA36D74810]) [n:127.0.0.1:62545_a_to%2Fg ] o.a.s.c.c.SolrZkClient makePath: /overseer_elect
[junit4] 2> 1671442 INFO (TEST-RecoveryAfterSoftCommitTest.test-seed#[C324A3CA36D74810]) [n:127.0.0.1:62545_a_to%2Fg ] o.a.s.c.c.SolrZkClient makePath: /overseer_elect/election
[junit4] 2> 1671445 INFO (TEST-RecoveryAfterSoftCommitTest.test-seed#[C324A3CA36D74810]) [n:127.0.0.1:62545_a_to%2Fg ] o.a.s.c.Overseer Overseer (id=null) closing
[junit4] 2> 1671446 INFO (TEST-RecoveryAfterSoftCommitTest.test-seed#[C324A3CA36D74810]) [n:127.0.0.1:62545_a_to%2Fg ] o.a.s.c.LeaderElector Joined leadership election with path: /overseer_elect/election/95884680286568452-127.0.0.1:62545_a_to%2Fg-n_0000000000
[junit4] 2> 1671446 INFO (TEST-RecoveryAfterSoftCommitTest.test-seed#[C324A3CA36D74810]) [n:127.0.0.1:62545_a_to%2Fg ] o.a.s.c.OverseerElectionContext I am going to be the leader 127.0.0.1:62545_a_to%2Fg
[junit4] 2> 1671447 INFO (TEST-RecoveryAfterSoftCommitTest.test-seed#[C324A3CA36D74810]) [n:127.0.0.1:62545_a_to%2Fg ] o.a.s.c.c.SolrZkClient makePath: /overseer_elect/leader
[junit4] 2> 1671450 INFO (TEST-RecoveryAfterSoftCommitTest.test-seed#[C324A3CA36D74810]) [n:127.0.0.1:62545_a_to%2Fg ] o.a.s.c.Overseer Overseer (id=95884680286568452-127.0.0.1:62545_a_to%2Fg-n_0000000000) starting
[junit4] 2> 1671454 INFO (TEST-RecoveryAfterSoftCommitTest.test-seed#[C324A3CA36D74810]) [n:127.0.0.1:62545_a_to%2Fg ] o.a.s.c.c.SolrZkClient makePath: /overseer/queue-work
[junit4] 2> 1671465 INFO (TEST-RecoveryAfterSoftCommitTest.test-seed#[C324A3CA36D74810]) [n:127.0.0.1:62545_a_to%2Fg ] o.a.s.c.OverseerAutoReplicaFailoverThread Starting OverseerAutoReplicaFailoverThread autoReplicaFailoverWorkLoopDelay=10000 autoReplicaFailoverWaitAfterExpiration=30000 autoReplicaFailoverBadNodeExpiration=60000
[junit4] 2> 1671466 INFO (OverseerCollectionConfigSetProcessor-95884680286568452-127.0.0.1:62545_a_to%2Fg-n_0000000000) [n:127.0.0.1:62545_a_to%2Fg ] o.a.s.c.OverseerTaskProcessor Process current queue of overseer operations
[junit4] 2> 1671467 INFO (OverseerStateUpdate-95884680286568452-127.0.0.1:62545_a_to%2Fg-n_0000000000) [n:127.0.0.1:62545_a_to%2Fg ] o.a.s.c.Overseer Starting to work on the main queue
[junit4] 2> 1671467 INFO (TEST-RecoveryAfterSoftCommitTest.test-seed#[C324A3CA36D74810]) [n:127.0.0.1:62545_a_to%2Fg ] o.a.s.c.ZkController Register node as live in ZooKeeper:/live_nodes/127.0.0.1:62545_a_to%2Fg
[junit4] 2> 1671468 INFO (TEST-RecoveryAfterSoftCommitTest.test-seed#[C324A3CA36D74810]) [n:127.0.0.1:62545_a_to%2Fg ] o.a.s.c.c.SolrZkClient makePath: /live_nodes/127.0.0.1:62545_a_to%2Fg
[junit4] 2> 1671473 INFO (OverseerStateUpdate-95884680286568452-127.0.0.1:62545_a_to%2Fg-n_0000000000) [n:127.0.0.1:62545_a_to%2Fg ] o.a.s.c.c.ZkStateReader Updated live nodes from ZooKeeper... (0) -> (1)
[junit4] 2> 1671473 INFO (zkCallback-1775-thread-1-processing-n:127.0.0.1:62545_a_to%2Fg) [n:127.0.0.1:62545_a_to%2Fg ] o.a.s.c.c.ZkStateReader A live node change: [WatchedEvent state:SyncConnected type:NodeChildrenChanged path:/live_nodes], has occurred - updating... (live nodes size: [1])
[junit4] 2> 1671478 INFO (zkCallback-1775-thread-1-processing-n:127.0.0.1:62545_a_to%2Fg) [n:127.0.0.1:62545_a_to%2Fg ] o.a.s.c.c.ZkStateReader Updated live nodes from ZooKeeper... (1) -> (1)
[junit4] 2> 1671511 INFO (TEST-RecoveryAfterSoftCommitTest.test-seed#[C324A3CA36D74810]) [n:127.0.0.1:62545_a_to%2Fg ] o.a.s.c.CoreContainer Security conf doesn't exist. Skipping setup for authorization module.
[junit4] 2> 1671511 INFO (TEST-RecoveryAfterSoftCommitTest.test-seed#[C324A3CA36D74810]) [n:127.0.0.1:62545_a_to%2Fg ] o.a.s.c.CoreContainer No authentication plugin used.
[junit4] 2> 1671512 INFO (TEST-RecoveryAfterSoftCommitTest.test-seed#[C324A3CA36D74810]) [n:127.0.0.1:62545_a_to%2Fg ] o.a.s.c.CorePropertiesLocator Looking for core definitions underneath /export/home/jenkins/workspace/Lucene-Solr-master-Solaris/solr/build/solr-core/test/J0/temp/solr.cloud.RecoveryAfterSoftCommitTest_C324A3CA36D74810-001/control-001/cores
[junit4] 2> 1671514 INFO (TEST-RecoveryAfterSoftCommitTest.test-seed#[C324A3CA36D74810]) [n:127.0.0.1:62545_a_to%2Fg ] o.a.s.c.CoreDescriptor Created CoreDescriptor: {name=collection1, config=solrconfig.xml, transient=false, schema=schema.xml, loadOnStartup=true, configSetProperties=configsetprops.json, collection=control_collection, coreNodeName=, dataDir=data/, shard=}
[junit4] 2> 1671514 INFO (TEST-RecoveryAfterSoftCommitTest.test-seed#[C324A3CA36D74810]) [n:127.0.0.1:62545_a_to%2Fg ] o.a.s.c.CorePropertiesLocator Found core collection1 in /export/home/jenkins/workspace/Lucene-Solr-master-Solaris/solr/build/solr-core/test/J0/temp/solr.cloud.RecoveryAfterSoftCommitTest_C324A3CA36D74810-001/control-001/cores/collection1
[junit4] 2> 1671514 INFO (TEST-RecoveryAfterSoftCommitTest.test-seed#[C324A3CA36D74810]) [n:127.0.0.1:62545_a_to%2Fg ] o.a.s.c.CorePropertiesLocator Found 1 core definitions
[junit4] 2> 1671516 INFO (TEST-RecoveryAfterSoftCommitTest.test-seed#[C324A3CA36D74810]) [n:127.0.0.1:62545_a_to%2Fg ] o.a.s.s.SolrDispatchFilter user.dir=/export/home/jenkins/workspace/Lucene-Solr-master-Solaris/solr/build/solr-core/test/J0
[junit4] 2> 1671516 INFO (TEST-RecoveryAfterSoftCommitTest.test-seed#[C324A3CA36D74810]) [n:127.0.0.1:62545_a_to%2Fg ] o.a.s.s.SolrDispatchFilter SolrDispatchFilter.init() done
[junit4] 2> 1671516 INFO (coreLoadExecutor-5949-thread-1-processing-n:127.0.0.1:62545_a_to%2Fg) [n:127.0.0.1:62545_a_to%2Fg c:control_collection x:collection1] o.a.s.c.ZkController publishing state=down
[junit4] 2> 1671516 INFO (coreLoadExecutor-5949-thread-1-processing-n:127.0.0.1:62545_a_to%2Fg) [n:127.0.0.1:62545_a_to%2Fg c:control_collection x:collection1] o.a.s.c.ZkController numShards not found on descriptor - reading it from system property
[junit4] 2> 1671518 INFO (coreLoadExecutor-5949-thread-1-processing-n:127.0.0.1:62545_a_to%2Fg) [n:127.0.0.1:62545_a_to%2Fg c:control_collection x:collection1] o.a.s.c.ZkController Collection control_collection not visible yet, but flagging it so a watch is registered when it becomes visible
[junit4] 2> 1671518 INFO (coreLoadExecutor-5949-thread-1-processing-n:127.0.0.1:62545_a_to%2Fg) [n:127.0.0.1:62545_a_to%2Fg c:control_collection x:collection1] o.a.s.c.c.ZkStateReader addZkWatch [control_collection]
[junit4] 2> 1671519 INFO (OverseerStateUpdate-95884680286568452-127.0.0.1:62545_a_to%2Fg-n_0000000000) [n:127.0.0.1:62545_a_to%2Fg ] o.a.s.c.Overseer processMessage: queueSize: 1, message = {
[junit4] 2> "core":"collection1",
[junit4] 2> "roles":null,
[junit4] 2> "base_url":"http://127.0.0.1:62545/a_to/g",
[junit4] 2> "node_name":"127.0.0.1:62545_a_to%2Fg",
[junit4] 2> "numShards":"1",
[junit4] 2> "state":"down",
[junit4] 2> "shard":null,
[junit4] 2> "collection":"control_collection",
[junit4] 2> "operation":"state"} current state version: 0
[junit4] 2> 1671520 INFO (coreLoadExecutor-5949-thread-1-processing-n:127.0.0.1:62545_a_to%2Fg) [n:127.0.0.1:62545_a_to%2Fg c:control_collection x:collection1] o.a.s.c.c.ZkStateReader Deleting data for [control_collection]
[junit4] 2> 1671520 INFO (OverseerStateUpdate-95884680286568452-127.0.0.1:62545_a_to%2Fg-n_0000000000) [n:127.0.0.1:62545_a_to%2Fg ] o.a.s.c.o.ReplicaMutator Update state numShards=1 message={
[junit4] 2> "core":"collection1",
[junit4] 2> "roles":null,
[junit4] 2> "base_url":"http://127.0.0.1:62545/a_to/g",
[junit4] 2> "node_name":"127.0.0.1:62545_a_to%2Fg",
[junit4] 2> "numShards":"1",
[junit4] 2> "state":"down",
[junit4] 2> "shard":null,
[junit4] 2> "collection":"control_collection",
[junit4] 2> "operation":"state"}
[junit4] 2> 1671521 INFO (OverseerStateUpdate-95884680286568452-127.0.0.1:62545_a_to%2Fg-n_0000000000) [n:127.0.0.1:62545_a_to%2Fg ] o.a.s.c.o.ClusterStateMutator building a new cName: control_collection
[junit4] 2> 1671522 INFO (coreLoadExecutor-5949-thread-1-processing-n:127.0.0.1:62545_a_to%2Fg) [n:127.0.0.1:62545_a_to%2Fg c:control_collection x:collection1] o.a.s.c.ZkController look for our core node name
[junit4] 2> 1671522 INFO (OverseerStateUpdate-95884680286568452-127.0.0.1:62545_a_to%2Fg-n_0000000000) [n:127.0.0.1:62545_a_to%2Fg ] o.a.s.c.o.ReplicaMutator Assigning new node to shard shard=shard1
[junit4] 2> 1671526 INFO (zkCallback-1775-thread-1-processing-n:127.0.0.1:62545_a_to%2Fg) [n:127.0.0.1:62545_a_to%2Fg ] o.a.s.c.c.ZkStateReader A cluster state change: [WatchedEvent state:SyncConnected type:NodeDataChanged path:/clusterstate.json], has occurred - updating... (live nodes size: [1])
[junit4] 2> 1672523 INFO (coreLoadExecutor-5949-thread-1-processing-n:127.0.0.1:62545_a_to%2Fg) [n:127.0.0.1:62545_a_to%2Fg c:control_collection x:collection1] o.a.s.c.ZkController waiting to find shard id in clusterstate for collection1
[junit4] 2> 1672523 INFO (coreLoadExecutor-5949-thread-1-processing-n:127.0.0.1:62545_a_to%2Fg) [n:127.0.0.1:62545_a_to%2Fg c:control_collection x:collection1] o.a.s.c.ZkController Check for collection zkNode:control_collection
[junit4] 2> 1672524 INFO (coreLoadExecutor-5949-thread-1-processing-n:127.0.0.1:62545_a_to%2Fg) [n:127.0.0.1:62545_a_to%2Fg c:control_collection x:collection1] o.a.s.c.ZkController Collection zkNode exists
[junit4] 2> 1672524 INFO (coreLoadExecutor-5949-thread-1-processing-n:127.0.0.1:62545_a_to%2Fg) [n:127.0.0.1:62545_a_to%2Fg c:control_collection x:collection1] o.a.s.c.c.ZkStateReader Load collection config from: [/collections/control_collection]
[junit4] 2> 1672525 INFO (coreLoadExecutor-5949-thread-1-processing-n:127.0.0.1:62545_a_to%2Fg) [n:127.0.0.1:62545_a_to%2Fg c:control_collection x:collection1] o.a.s.c.c.ZkStateReader path=[/collections/control_collection] [configName]=[conf1] specified config exists in ZooKeeper
[junit4] 2> 1672525 INFO (coreLoadExecutor-5949-thread-1-processing-n:127.0.0.1:62545_a_to%2Fg) [n:127.0.0.1:62545_a_to%2Fg c:control_collection x:collection1] o.a.s.c.SolrResourceLoader new SolrResourceLoader for directory: '/export/home/jenkins/workspace/Lucene-Solr-master-Solaris/solr/build/solr-core/test/J0/temp/solr.cloud.RecoveryAfterSoftCommitTest_C324A3CA36D74810-001/control-001/cores/collection1'
[junit4] 2> 1672526 INFO (coreLoadExecutor-5949-thread-1-processing-n:127.0.0.1:62545_a_to%2Fg) [n:127.0.0.1:62545_a_to%2Fg c:control_collection x:collection1] o.a.s.c.SolrResourceLoader JNDI not configured for solr (NoInitialContextEx)
[junit4] 2> 1672526 INFO (coreLoadExecutor-5949-thread-1-processing-n:127.0.0.1:62545_a_to%2Fg) [n:127.0.0.1:62545_a_to%2Fg c:control_collection x:collection1] o.a.s.c.SolrResourceLoader solr home defaulted to 'solr/' (could not find system property or JNDI)
[junit4] 2> 1672527 INFO (coreLoadExecutor-5949-thread-1-processing-n:127.0.0.1:62545_a_to%2Fg) [n:127.0.0.1:62545_a_to%2Fg c:control_collection x:collection1] o.a.s.c.Config loaded config solrconfig.xml with version 0
[junit4] 2> 1672534 INFO (coreLoadExecutor-5949-thread-1-processing-n:127.0.0.1:62545_a_to%2Fg) [n:127.0.0.1:62545_a_to%2Fg c:control_collection x:collection1] o.a.s.c.SolrConfig current version of requestparams : -1
[junit4] 2> 1672537 INFO (coreLoadExecutor-5949-thread-1-processing-n:127.0.0.1:62545_a_to%2Fg) [n:127.0.0.1:62545_a_to%2Fg c:control_collection x:collection1] o.a.s.c.SolrConfig Using Lucene MatchVersion: 7.0.0
[junit4] 2> 1672544 INFO (coreLoadExecutor-5949-thread-1-processing-n:127.0.0.1:62545_a_to%2Fg) [n:127.0.0.1:62545_a_to%2Fg c:control_collection x:collection1] o.a.s.c.SolrConfig Loaded SolrConfig: solrconfig.xml
[junit4] 2> 1672549 INFO (coreLoadExecutor-5949-thread-1-processing-n:127.0.0.1:62545_a_to%2Fg) [n:127.0.0.1:62545_a_to%2Fg c:control_collection x:collection1] o.a.s.s.IndexSchema [collection1] Schema name=test
[junit4] 2> 1672648 INFO (coreLoadExecutor-5949-thread-1-processing-n:127.0.0.1:62545_a_to%2Fg) [n:127.0.0.1:62545_a_to%2Fg c:control_collection x:collection1] o.a.s.s.OpenExchangeRatesOrgProvider Initialized with rates=open-exchange-rates.json, refreshInterval=1440.
[junit4] 2> 1672654 INFO (coreLoadExecutor-5949-thread-1-processing-n:127.0.0.1:62545_a_to%2Fg) [n:127.0.0.1:62545_a_to%2Fg c:control_collection x:collection1] o.a.s.s.IndexSchema default search field in schema is text
[junit4] 2> 1672655 INFO (coreLoadExecutor-5949-thread-1-processing-n:127.0.0.1:62545_a_to%2Fg) [n:127.0.0.1:62545_a_to%2Fg c:control_collection x:collection1] o.a.s.s.IndexSchema unique key field: id
[junit4] 2> 1672672 INFO (coreLoadExecutor-5949-thread-1-processing-n:127.0.0.1:62545_a_to%2Fg) [n:127.0.0.1:62545_a_to%2Fg c:control_collection x:collection1] o.a.s.s.FileExchangeRateProvider Reloading exchange rates from file currency.xml
[junit4] 2> 1672675 INFO (coreLoadExecutor-5949-thread-1-processing-n:127.0.0.1:62545_a_to%2Fg) [n:127.0.0.1:62545_a_to%2Fg c:control_collection x:collection1] o.a.s.s.FileExchangeRateProvider Reloading exchange rates from file currency.xml
[junit4] 2> 1672677 INFO (coreLoadExecutor-5949-thread-1-processing-n:127.0.0.1:62545_a_to%2Fg) [n:127.0.0.1:62545_a_to%2Fg c:control_collection x:collection1] o.a.s.s.OpenExchangeRatesOrgProvider Reloading exchange rates from open-exchange-rates.json
[junit4] 2> 1672679 INFO (coreLoadExecutor-5949-thread-1-processing-n:127.0.0.1:62545_a_to%2Fg) [n:127.0.0.1:62545_a_to%2Fg c:control_collection x:collection1] o.a.s.s.OpenExchangeRatesOrgProvider Reloading exchange rates from open-exchange-rates.json
[junit4] 2> 1672681 INFO (coreLoadExecutor-5949-thread-1-processing-n:127.0.0.1:62545_a_to%2Fg) [n:127.0.0.1:62545_a_to%2Fg c:control_collection x:collection1] o.a.s.c.ConfigSetProperties Did not find ConfigSet properties, assuming default properties: Can't find resource 'configsetprops.json' in classpath or '/configs/conf1', cwd=/export/home/jenkins/workspace/Lucene-Solr-master-Solaris/solr/build/solr-core/test/J0
[junit4] 2> 1672681 INFO (coreLoadExecutor-5949-thread-1-processing-n:127.0.0.1:62545_a_to%2Fg) [n:127.0.0.1:62545_a_to%2Fg c:control_collection x:collection1] o.a.s.c.CoreContainer Creating SolrCore 'collection1' using configuration from collection control_collection
[junit4] 2> 1672681 INFO (coreLoadExecutor-5949-thread-1-processing-n:127.0.0.1:62545_a_to%2Fg) [n:127.0.0.1:62545_a_to%2Fg c:control_collection s:shard1 r:core_node1 x:collection1] o.a.s.c.SolrCore org.apache.solr.core.MockDirectoryFactory
[junit4] 2> 1672682 INFO (coreLoadExecutor-5949-thread-1-processing-n:127.0.0.1:62545_a_to%2Fg) [n:127.0.0.1:62545_a_to%2Fg c:control_collection s:shard1 r:core_node1 x:collection1] o.a.s.c.SolrCore [[collection1] ] Opening new SolrCore at [/export/home/jenkins/workspace/Lucene-Solr-master-Solaris/solr/build/solr-core/test/J0/temp/solr.cloud.RecoveryAfterSoftCommitTest_C324A3CA36D74810-001/control-001/cores/collection1], dataDir=[/export/home/jenkins/workspace/Lucene-Solr-master-Solaris/solr/build/solr-core/test/J0/temp/solr.cloud.RecoveryAfterSoftCommitTest_C324A3CA36D74810-001/control-001/cores/collection1/data/]
[junit4] 2> 1672682 INFO (coreLoadExecutor-5949-thread-1-processing-n:127.0.0.1:62545_a_to%2Fg) [n:127.0.0.1:62545_a_to%2Fg c:control_collection s:shard1 r:core_node1 x:collection1] o.a.s.c.JmxMonitoredMap JMX monitoring is enabled. Adding Solr mbeans to JMX Server: com.sun.jmx.mbeanserver.JmxMBeanServer@50a6406b
[junit4] 2> 1672682 INFO (coreLoadExecutor-5949-thread-1-processing-n:127.0.0.1:62545_a_to%2Fg) [n:127.0.0.1:62545_a_to%2Fg c:control_collection s:shard1 r:core_node1 x:collection1] o.a.s.c.CachingDirectoryFactory return new directory for /export/home/jenkins/workspace/Lucene-Solr-master-Solaris/solr/build/solr-core/test/J0/temp/solr.cloud.RecoveryAfterSoftCommitTest_C324A3CA36D74810-001/control-001/cores/collection1/data
[junit4] 2> 1672682 INFO (coreLoadExecutor-5949-thread-1-processing-n:127.0.0.1:62545_a_to%2Fg) [n:127.0.0.1:62545_a_to%2Fg c:control_collection s:shard1 r:core_node1 x:collection1] o.a.s.c.SolrCore New index directory detected: old=null new=/export/home/jenkins/workspace/Lucene-Solr-master-Solaris/solr/build/solr-core/test/J0/temp/solr.cloud.RecoveryAfterSoftCommitTest_C324A3CA36D74810-001/control-001/cores/collection1/data/index/
[junit4] 2> 1672682 WARN (coreLoadExecutor-5949-thread-1-processing-n:127.0.0.1:62545_a_to%2Fg) [n:127.0.0.1:62545_a_to%2Fg c:control_collection s:shard1 r:core_node1 x:collection1] o.a.s.c.SolrCore [collection1] Solr index directory '/export/home/jenkins/workspace/Lucene-Solr-master-Solaris/solr/build/solr-core/test/J0/temp/solr.cloud.RecoveryAfterSoftCommitTest_C324A3CA36D74810-001/control-001/cores/collection1/data/index' doesn't exist. Creating new index...
[junit4] 2> 1672683 INFO (coreLoadExecutor-5949-thread-1-processing-n:127.0.0.1:62545_a_to%2Fg) [n:127.0.0.1:62545_a_to%2Fg c:control_collection s:shard1 r:core_node1 x:collection1] o.a.s.c.CachingDirectoryFactory return new directory for /export/home/jenkins/workspace/Lucene-Solr-master-Solaris/solr/build/solr-core/test/J0/temp/solr.cloud.RecoveryAfterSoftCommitTest_C324A3CA36D74810-001/control-001/cores/collection1/data/index
[junit4] 2> 1672683 INFO (coreLoadExecutor-5949-thread-1-processing-n:127.0.0.1:62545_a_to%2Fg) [n:127.0.0.1:62545_a_to%2Fg c:control_collection s:shard1 r:core_node1 x:collection1] o.a.s.u.RandomMergePolicy RandomMergePolicy wrapping class org.apache.lucene.index.TieredMergePolicy: [TieredMergePolicy: maxMergeAtOnce=49, maxMergeAtOnceExplicit=45, maxMergedSegmentMB=22.8310546875, floorSegmentMB=0.224609375, forceMergeDeletesPctAllowed=17.724904894725814, segmentsPerTier=28.0, maxCFSSegmentSizeMB=8.796093022207999E12, noCFSRatio=0.0
[junit4] 2> 1672686 INFO (coreLoadExecutor-5949-thread-1-processing-n:127.0.0.1:62545_a_to%2Fg) [n:127.0.0.1:62545_a_to%2Fg c:control_collection s:shard1 r:core_node1 x:collection1] o.a.s.c.SolrDeletionPolicy SolrDeletionPolicy.onCommit: commits: num=1
[junit4] 2> commit{dir=MockDirectoryWrapper(NIOFSDirectory@/export/home/jenkins/workspace/Lucene-Solr-master-Solaris/solr/build/solr-core/test/J0/temp/solr.cloud.RecoveryAfterSoftCommitTest_C324A3CA36D74810-001/index-NIOFSDirectory-001 lockFactory=org.apache.lucene.store.NativeFSLockFactory@1bc4ad1c),segFN=segments_1,generation=1}
[junit4] 2> 1672686 INFO (coreLoadExecutor-5949-thread-1-processing-n:127.0.0.1:62545_a_to%2Fg) [n:127.0.0.1:62545_a_to%2Fg c:control_collection s:shard1 r:core_node1 x:collection1] o.a.s.c.SolrDeletionPolicy newest commit generation = 1
[junit4] 2> 1672687 INFO (OldIndexDirectoryCleanupThreadForCore-collection1) [n:127.0.0.1:62545_a_to%2Fg c:control_collection s:shard1 r:core_node1 x:collection1] o.a.s.c.SolrCore Looking for old index directories to cleanup for core collection1 in /export/home/jenkins/workspace/Lucene-Solr-master-Solaris/solr/build/solr-core/test/J0/temp/solr.cloud.RecoveryAfterSoftCommitTest_C324A3CA36D74810-001/control-001/cores/collection1/data/
[junit4] 2> 1672687 WARN (OldIndexDirectoryCleanupThreadForCore-collection1) [n:127.0.0.1:62545_a_to%2Fg c:control_collection s:shard1 r:core_node1 x:collection1] o.a.s.c.DirectoryFactory /export/home/jenkins/workspace/Lucene-Solr-master-Solaris/solr/build/solr-core/test/J0/temp/solr.cloud.RecoveryAfterSoftCommitTest_C324A3CA36D74810-001/control-001/cores/collection1/data/ does not point to a valid data directory; skipping clean-up of old index directories.
[junit4] 2> 1672690 INFO (coreLoadExecutor-5949-thread-1-processing-n:127.0.0.1:62545_a_to%2Fg) [n:127.0.0.1:62545_a_to%2Fg c:control_collection s:shard1 r:core_node1 x:collection1] o.a.s.u.p.UpdateRequestProcessorChain creating updateRequestProcessorChain "nodistrib"
[junit4] 2> 1672690 INFO (coreLoadExecutor-5949-thread-1-processing-n:127.0.0.1:62545_a_to%2Fg) [n:127.0.0.1:62545_a_to%2Fg c:control_collection s:shard1 r:core_node1 x:collection1] o.a.s.u.p.UpdateRequestProcessorChain creating updateRequestProcessorChain "dedupe"
[junit4] 2> 1672690 INFO (coreLoadExecutor-5949-thread-1-processing-n:127.0.0.1:62545_a_to%2Fg) [n:127.0.0.1:62545_a_to%2Fg c:control_collection s:shard1 r:core_node1 x:collection1] o.a.s.u.p.UpdateRequestProcessorChain inserting DistributedUpdateProcessorFactory into updateRequestProcessorChain "dedupe"
[junit4] 2> 1672690 INFO (coreLoadExecutor-5949-thread-1-processing-n:127.0.0.1:62545_a_to%2Fg) [n:127.0.0.1:62545_a_to%2Fg c:control_collection s:shard1 r:core_node1 x:collection1] o.a.s.u.p.UpdateRequestProcessorChain creating updateRequestProcessorChain "stored_sig"
[junit4] 2> 1672690 INFO (coreLoadExecutor-5949-thread-1-processing-n:127.0.0.1:62545_a_to%2Fg) [n:127.0.0.1:62545_a_to%2Fg c:control_collection s:shard1 r:core_node1 x:collection1] o.a.s.u.p.UpdateRequestProcessorChain inserting DistributedUpdateProcessorFactory into updateRequestProcessorChain "stored_sig"
[junit4] 2> 1672690 INFO (coreLoadExecutor-5949-thread-1-processing-n:127.0.0.1:62545_a_to%2Fg) [n:127.0.0.1:62545_a_to%2Fg c:control_collection s:shard1 r:core_node1 x:collection1] o.a.s.u.p.UpdateRequestProcessorChain creating updateRequestProcessorChain "distrib-dup-test-chain-explicit"
[junit4] 2> 1672690 INFO (coreLoadExecutor-5949-thread-1-processing-n:127.0.0.1:62545_a_to%2Fg) [n:127.0.0.1:62545_a_to%2Fg c:control_collection s:shard1 r:core_node1 x:collection1] o.a.s.u.p.UpdateRequestProcessorChain creating updateRequestProcessorChain "distrib-dup-test-chain-implicit"
[junit4] 2> 1672690 INFO (coreLoadExecutor-5949-thread-1-processing-n:127.0.0.1:62545_a_to%2Fg) [n:127.0.0.1:62545_a_to%2Fg c:control_collection s:shard1 r:core_node1 x:collection1] o.a.s.u.p.UpdateRequestProcessorChain inserting DistributedUpdateProcessorFactory into updateRequestProcessorChain "distrib-dup-test-chain-implicit"
[junit4] 2> 1672690 INFO (coreLoadExecutor-5949-thread-1-processing-n:127.0.0.1:62545_a_to%2Fg) [n:127.0.0.1:62545_a_to%2Fg c:control_collection s:shard1 r:core_node1 x:collection1] o.a.s.c.SolrCore no updateRequestProcessorChain defined as default, creating implicit default
[junit4] 2> 1672690 WARN (coreLoadExecutor-5949-thread-1-processing-n:127.0.0.1:62545_a_to%2Fg) [n:127.0.0.1:62545_a_to%2Fg c:control_collection s:shard1 r:core_node1 x:collection1] o.a.s.c.RequestHandlers INVALID paramSet a in requestHandler {type = requestHandler,name = /dump,class = DumpRequestHandler,args = {defaults={a=A,b=B}}}
[junit4] 2> 1672692 INFO (coreLoadExecutor-5949-thread-1-processing-n:127.0.0.1:62545_a_to%2Fg) [n:127.0.0.1:62545_a_to%2Fg c:control_collection s:shard1 r:core_node1 x:collection1] o.a.s.h.l.XMLLoader xsltCacheLifetimeSeconds=60
[junit4] 2> 1672693 INFO (coreLoadExecutor-5949-thread-1-processing-n:127.0.0.1:62545_a_to%2Fg) [n:127.0.0.1:62545_a_to%2Fg c:control_collection s:shard1 r:core_node1 x:collection1] o.a.s.h.l.XMLLoader xsltCacheLifetimeSeconds=60
[junit4] 2> 1672694 INFO (coreLoadExecutor-5949-thread-1-processing-n:127.0.0.1:62545_a_to%2Fg) [n:127.0.0.1:62545_a_to%2Fg c:control_collection s:shard1 r:core_node1 x:collection1] o.a.s.h.l.XMLLoader xsltCacheLifetimeSeconds=60
[junit4] 2> 1672695 INFO (coreLoadExecutor-5949-thread-1-processing-n:127.0.0.1:62545_a_to%2Fg) [n:127.0.0.1:62545_a_to%2Fg c:control_collection s:shard1 r:core_node1 x:collection1] o.a.s.h.l.XMLLoader xsltCacheLifetimeSeconds=60
[junit4] 2> 1672700 INFO (coreLoadExecutor-5949-thread-1-processing-n:127.0.0.1:62545_a_to%2Fg) [n:127.0.0.1:62545_a_to%2Fg c:control_collection s:shard1 r:core_node1 x:collection1] o.a.s.c.RequestHandlers Registered paths: /admin/mbeans,standard,/update/json/docs,/admin/luke,/export,/get,/admin/properties,/update/json,/admin/threads,/dump,/update/csv,/sql,/graph,/admin/segments,/admin/system,/replication,/config,/stream,/schema,/admin/plugins,/admin/logging,/admin/ping,/update,/admin/file
[junit4] 2> 1672700 INFO (coreLoadExecutor-5949-thread-1-processing-n:127.0.0.1:62545_a_to%2Fg) [n:127.0.0.1:62545_a_to%2Fg c:control_collection s:shard1 r:core_node1 x:collection1] o.a.s.c.SolrCore Using default statsCache cache: org.apache.solr.search.stats.LocalStatsCache
[junit4] 2> 1672701 INFO (coreLoadExecutor-5949-thread-1-processing-n:127.0.0.1:62545_a_to%2Fg) [n:127.0.0.1:62545_a_to%2Fg c:control_collection s:shard1 r:core_node1 x:collection1] o.a.s.u.UpdateHandler Using UpdateLog implementation: org.apache.solr.update.UpdateLog
[junit4] 2> 1672701 INFO (coreLoadExecutor-5949-thread-1-processing-n:127.0.0.1:62545_a_to%2Fg) [n:127.0.0.1:62545_a_to%2Fg c:control_collection s:shard1 r:core_node1 x:collection1] o.a.s.u.UpdateLog Initializing UpdateLog: dataDir= defaultSyncLevel=FLUSH numRecordsToKeep=2 maxNumLogsToKeep=10 numVersionBuckets=65536
[junit4] 2> 1672702 INFO (coreLoadExecutor-5949-thread-1-processing-n:127.0.0.1:62545_a_to%2Fg) [n:127.0.0.1:62545_a_to%2Fg c:control_collection s:shard1 r:core_node1 x:collection1] o.a.s.u.CommitTracker Hard AutoCommit: disabled
[junit4] 2> 1672702 INFO (coreLoadExecutor-5949-thread-1-processing-n:127.0.0.1:62545_a_to%2Fg) [n:127.0.0.1:62545_a_to%2Fg c:control_collection s:shard1 r:core_node1 x:collection1] o.a.s.u.CommitTracker Soft AutoCommit: disabled
[junit4] 2> 1672703 INFO (coreLoadExecutor-5949-thread-1-processing-n:127.0.0.1:62545_a_to%2Fg) [n:127.0.0.1:62545_a_to%2Fg c:control_collection s:shard1 r:core_node1 x:collection1] o.a.s.u.RandomMergePolicy RandomMergePolicy wrapping class org.apache.lucene.index.LogDocMergePolicy: [LogDocMergePolicy: minMergeSize=1000, mergeFactor=42, maxMergeSize=9223372036854775807, maxMergeSizeForForcedMerge=9223372036854775807, calibrateSizeByDeletes=true, maxMergeDocs=2147483647, maxCFSSegmentSizeMB=8.796093022207999E12, noCFSRatio=0.5131612796601686]
[junit4] 2> 1672704 INFO (coreLoadExecutor-5949-thread-1-processing-n:127.0.0.1:62545_a_to%2Fg) [n:127.0.0.1:62545_a_to%2Fg c:control_collection s:shard1 r:core_node1 x:collection1] o.a.s.c.SolrDeletionPolicy SolrDeletionPolicy.onInit: commits: num=1
[junit4] 2> commit{dir=MockDirectoryWrapper(NIOFSDirectory@/export/home/jenkins/workspace/Lucene-Solr-master-Solaris/solr/build/solr-core/test/J0/temp/solr.cloud.RecoveryAfterSoftCommitTest_C324A3CA36D74810-001/index-NIOFSDirectory-001 lockFactory=org.apache.lucene.store.NativeFSLockFactory@1bc4ad1c),segFN=segments_1,generation=1}
[junit4] 2> 1672704 INFO (coreLoadExecutor-5949-thread-1-processing-n:127.0.0.1:62545_a_to%2Fg) [n:127.0.0.1:62545_a_to%2Fg c:control_collection s:shard1 r:core_node1 x:collection1] o.a.s.c.SolrDeletionPolicy newest commit generation = 1
[junit4] 2> 1672705 INFO (coreLoadExecutor-5949-thread-1-processing-n:127.0.0.1:62545_a_to%2Fg) [n:127.0.0.1:62545_a_to%2Fg c:control_collection s:shard1 r:core_node1 x:collection1] o.a.s.s.SolrIndexSearcher Opening [Searcher@5194cd3b[collection1] main]
[junit4] 2> 1672705 INFO (coreLoadExecutor-5949-thread-1-processing-n:127.0.0.1:62545_a_to%2Fg) [n:127.0.0.1:62545_a_to%2Fg c:control_collection s:shard1 r:core_node1 x:collection1] o.a.s.c.c.ZkStateReader Load collection config from: [/collections/control_collection]
[junit4] 2> 1672706 INFO (coreLoadExecutor-5949-thread-1-processing-n:127.0.0.1:62545_a_to%2Fg) [n:127.0.0.1:62545_a_to%2Fg c:control_collection s:shard1 r:core_node1 x:collection1] o.a.s.c.c.ZkStateReader path=[/collections/control_collection] [configName]=[conf1] specified config exists in ZooKeeper
[junit4] 2> 1672706 INFO (coreLoadExecutor-5949-thread-1-processing-n:127.0.0.1:62545_a_to%2Fg) [n:127.0.0.1:62545_a_to%2Fg c:control_collection s:shard1 r:core_node1 x:collection1] o.a.s.r.ManagedResourceStorage Setting up ZooKeeper-based storage for the RestManager with znodeBase: /configs/conf1
[junit4] 2> 1672707 INFO (coreLoadExecutor-5949-thread-1-processing-n:127.0.0.1:62545_a_to%2Fg) [n:127.0.0.1:62545_a_to%2Fg c:control_collection s:shard1 r:core_node1 x:collection1] o.a.s.r.ManagedResourceStorage Configured ZooKeeperStorageIO with znodeBase: /configs/conf1
[junit4] 2> 1672707 INFO (coreLoadExecutor-5949-thread-1-processing-n:127.0.0.1:62545_a_to%2Fg) [n:127.0.0.1:62545_a_to%2Fg c:control_collection s:shard1 r:core_node1 x:collection1] o.a.s.r.RestManager Initializing RestManager with initArgs: {}
[junit4] 2> 1672708 INFO (coreLoadExecutor-5949-thread-1-processing-n:127.0.0.1:62545_a_to%2Fg) [n:127.0.0.1:62545_a_to%2Fg c:control_collection s:shard1 r:core_node1 x:collection1] o.a.s.r.ManagedResourceStorage Reading _rest_managed.json using ZooKeeperStorageIO:path=/configs/conf1
[junit4] 2> 1672710 INFO (coreLoadExecutor-5949-thread-1-processing-n:127.0.0.1:62545_a_to%2Fg) [n:127.0.0.1:62545_a_to%2Fg c:control_collection s:shard1 r:core_node1 x:collection1] o.a.s.r.ManagedResourceStorage No data found for znode /configs/conf1/_rest_managed.json
[junit4] 2> 1672710 INFO (coreLoadExecutor-5949-thread-1-processing-n:127.0.0.1:62545_a_to%2Fg) [n:127.0.0.1:62545_a_to%2Fg c:control_collection s:shard1 r:core_node1 x:collection1] o.a.s.r.ManagedResourceStorage Loaded null at path _rest_managed.json using ZooKeeperStorageIO:path=/configs/conf1
[junit4] 2> 1672710 INFO (coreLoadExecutor-5949-thread-1-processing-n:127.0.0.1:62545_a_to%2Fg) [n:127.0.0.1:62545_a_to%2Fg c:control_collection s:shard1 r:core_node1 x:collection1] o.a.s.r.RestManager Initializing 0 registered ManagedResources
[junit4] 2> 1672710 INFO (coreLoadExecutor-5949-thread-1-processing-n:127.0.0.1:62545_a_to%2Fg) [n:127.0.0.1:62545_a_to%2Fg c:control_collection s:shard1 r:core_node1 x:collection1] o.a.s.h.ReplicationHandler Commits will be reserved for 10000
[junit4] 2> 1672711 INFO (coreLoadExecutor-5949-thread-1-processing-n:127.0.0.1:62545_a_to%2Fg) [n:127.0.0.1:62545_a_to%2Fg c:control_collection s:shard1 r:core_node1 x:collection1] o.a.s.u.UpdateLog Looking up max value of version field to seed version buckets
[junit4] 2> 1672711 INFO (coreLoadExecutor-5949-thread-1-processing-n:127.0.0.1:62545_a_to%2Fg) [n:127.0.0.1:62545_a_to%2Fg c:control_collection s:shard1 r:core_node1 x:collection1] o.a.s.u.VersionInfo Refreshing highest value of _version_ for 65536 version buckets from index
[junit4] 2> 1672711 INFO (coreLoadExecutor-5949-thread-1-processing-n:127.0.0.1:62545_a_to%2Fg) [n:127.0.0.1:62545_a_to%2Fg c:control_collection s:shard1 r:core_node1 x:collection1] o.a.s.u.VersionInfo No terms found for _version_, cannot seed version bucket highest value from index
[junit4] 2> 1672711 INFO (coreLoadExecutor-5949-thread-1-processing-n:127.0.0.1:62545_a_to%2Fg) [n:127.0.0.1:62545_a_to%2Fg c:control_collection s:shard1 r:core_node1 x:collection1] o.a.s.u.UpdateLog Could not find max version in index or recent updates, using new clock 1534154886325731328
[junit4] 2> 1672711 INFO (searcherExecutor-5950-thread-1-processing-n:127.0.0.1:62545_a_to%2Fg x:collection1 s:shard1 c:control_collection r:core_node1) [n:127.0.0.1:62545_a_to%2Fg c:control_collection s:shard1 r:core_node1 x:collection1] o.a.s.c.SolrCore [collection1] Registered new searcher Searcher@5194cd3b[collection1] main{ExitableDirectoryReader(UninvertingDirectoryReader())}
[junit4] 2> 1672714 INFO (coreLoadExecutor-5949-thread-1-processing-n:127.0.0.1:62545_a_to%2Fg) [n:127.0.0.1:62545_a_to%2Fg c:control_collection s:shard1 r:core_node1 x:collection1] o.a.s.u.UpdateLog Took 3.0ms to seed version buckets with highest version 1534154886325731328
[junit4] 2> 1672714 INFO (coreLoadExecutor-5949-thread-1-processing-n:127.0.0.1:62545_a_to%2Fg) [n:127.0.0.1:62545_a_to%2Fg c:control_collection s:shard1 r:core_node1 x:collection1] o.a.s.c.ZkController watch zkdir /configs/conf1
[junit4] 2> 1672715 INFO (coreLoadExecutor-5949-thread-1-processing-n:127.0.0.1:62545_a_to%2Fg) [n:127.0.0.1:62545_a_to%2Fg c:control_collection s:shard1 r:core_node1 x:collection1] o.a.s.c.CoreContainer registering core: collection1
[junit4] 2> 1672717 INFO (coreZkRegister-5943-thread-1-processing-n:127.0.0.1:62545_a_to%2Fg x:collection1 s:shard1 c:control_collection r:core_node1) [n:127.0.0.1:62545_a_to%2Fg c:control_collection s:shard1 r:core_node1 x:collection1] o.a.s.c.ZkController Register replica - core:collection1 address:http://127.0.0.1:62545/a_to/g collection:control_collection shard:shard1
[junit4] 2> 1672718 INFO (coreZkRegister-5943-thread-1-processing-n:127.0.0.1:62545_a_to%2Fg x:collection1 s:shard1 c:control_collection r:core_node1) [n:127.0.0.1:62545_a_to%2Fg c:control_collection s:shard1 r:core_node1 x:collection1] o.a.s.c.c.SolrZkClient makePath: /collections/control_collection/leader_elect/shard1/election
[junit4] 2> 1672725 INFO (coreZkRegister-5943-thread-1-processing-n:127.0.0.1:62545_a_to%2Fg x:collection1 s:shard1 c:control_collection r:core_node1) [n:127.0.0.1:62545_a_to%2Fg c:control_collection s:shard1 r:core_node1 x:collection1] o.a.s.c.LeaderElector Joined leadership election with path: /collections/control_collection/leader_elect/shard1/election/95884680286568452-core_node1-n_0000000000
[junit4] 2> 1672725 INFO (coreZkRegister-5943-thread-1-processing-n:127.0.0.1:62545_a_to%2Fg x:collection1 s:shard1 c:control_collection r:core_node1) [n:127.0.0.1:62545_a_to%2Fg c:control_collection s:shard1 r:core_node1 x:collection1] o.a.s.c.ShardLeaderElectionContext Running the leader process for shard=shard1 and weAreReplacement=false and leaderVoteWait=10000
[junit4] 2> 1672728 INFO (coreZkRegister-5943-thread-1-processing-n:127.0.0.1:62545_a_to%2Fg x:collection1 s:shard1 c:control_collection r:core_node1) [n:127.0.0.1:62545_a_to%2Fg c:control_collection s:shard1 r:core_node1 x:collection1] o.a.s.c.ShardLeaderElectionContext Enough replicas found to continue.
[junit4] 2> 1672728 INFO (coreZkRegister-5943-thread-1-processing-n:127.0.0.1:62545_a_to%2Fg x:collection1 s:shard1 c:control_collection r:core_node1) [n:127.0.0.1:62545_a_to%2Fg c:control_collection s:shard1 r:core_node1 x:collection1] o.a.s.c.ShardLeaderElectionContext I may be the new leader - try and sync
[junit4] 2> 1672728 INFO (coreZkRegister-5943-thread-1-processing-n:127.0.0.1:62545_a_to%2Fg x:collection1 s:shard1 c:control_collection r:core_node1) [n:127.0.0.1:62545_a_to%2Fg c:control_collection s:shard1 r:core_node1 x:collection1] o.a.s.c.SyncStrategy Sync replicas to http://127.0.0.1:62545/a_to/g/collection1/
[junit4] 2> 1672728 INFO (coreZkRegister-5943-thread-1-processing-n:127.0.0.1:62545_a_to%2Fg x:collection1 s:shard1 c:control_collection r:core_node1) [n:127.0.0.1:62545_a_to%2Fg c:control_collection s:shard1 r:core_node1 x:collection1] o.a.s.c.SyncStrategy Sync Success - now sync replicas to me
[junit4] 2> 1672728 INFO (coreZkRegister-5943-thread-1-processing-n:127.0.0.1:62545_a_to%2Fg x:collection1 s:shard1 c:control_collection r:core_node1) [n:127.0.0.1:62545_a_to%2Fg c:control_collection s:shard1 r:core_node1 x:collection1] o.a.s.c.SyncStrategy http://127.0.0.1:62545/a_to/g/collection1/ has no replicas
[junit4] 2> 1672728 INFO (OverseerStateUpdate-95884680286568452-127.0.0.1:62545_a_to%2Fg-n_0000000000) [n:127.0.0.1:62545_a_to%2Fg ] o.a.s.c.Overseer processMessage: queueSize: 1, message = {
[junit4] 2> "operation":"leader",
[junit4] 2> "shard":"shard1",
[junit4] 2> "collection":"control_collection"} current state version: 1
[junit4] 2> 1672730 INFO (coreZkRegister-5943-thread-1-processing-n:127.0.0.1:62545_a_to%2Fg x:collection1 s:shard1 c:control_collection r:core_node1) [n:127.0.0.1:62545_a_to%2Fg c:control_collection s:shard1 r:core_node1 x:collection1] o.a.s.c.c.SolrZkClient makePath: /collections/control_collection/leaders/shard1
[junit4] 2> 1672734 INFO (coreZkRegister-5943-thread-1-processing-n:127.0.0.1:62545_a_to%2Fg x:collection1 s:shard1 c:control_collection r:core_node1) [n:127.0.0.1:62545_a_to%2Fg c:control_collection s:shard1 r:core_node1 x:collection1] o.a.s.c.ShardLeaderElectionContextBase Creating leader registration node /collections/control_collection/leaders/shard1/leader after winning as /collections/control_collection/leader_elect/shard1/election/95884680286568452-core_node1-n_0000000000
[junit4] 2> 1672739 INFO (coreZkRegister-5943-thread-1-processing-n:127.0.0.1:62545_a_to%2Fg x:collection1 s:shard1 c:control_collection r:core_node1) [n:127.0.0.1:62545_a_to%2Fg c:control_collection s:shard1 r:core_node1 x:collection1] o.a.s.c.ShardLeaderElectionContext I am the new leader: http://127.0.0.1:62545/a_to/g/collection1/ shard1
[junit4] 2> 1672741 INFO (OverseerStateUpdate-95884680286568452-127.0.0.1:62545_a_to%2Fg-n_0000000000) [n:127.0.0.1:62545_a_to%2Fg ] o.a.s.c.Overseer processMessage: queueSize: 1, message = {
[junit4] 2> "operation":"leader",
[junit4] 2> "shard":"shard1",
[junit4] 2> "collection":"control_collection",
[junit4] 2> "base_url":"http://127.0.0.1:62545/a_to/g",
[junit4] 2> "core":"collection1",
[junit4] 2> "state":"active"} current state version: 1
[junit4] 2> 1672846 INFO (zkCallback-1775-thread-1-processing-n:127.0.0.1:62545_a_to%2Fg) [n:127.0.0.1:62545_a_to%2Fg ] o.a.s.c.c.ZkStateReader A cluster state change: [WatchedEvent state:SyncConnected type:NodeDataChanged path:/clusterstate.json], has occurred - updating... (live nodes size: [1])
[junit4] 2> 1672892 INFO (coreZkRegister-5943-thread-1-processing-n:127.0.0.1:62545_a_to%2Fg x:collection1 s:shard1 c:control_collection r:core_node1) [n:127.0.0.1:62545_a_to%2Fg c:control_collection s:shard1 r:core_node1 x:collection1] o.a.s.c.ZkController We are http://127.0.0.1:62545/a_to/g/collection1/ and leader is http://127.0.0.1:62545/a_to/g/collection1/
[junit4] 2> 1672892 INFO (coreZkRegister-5943-thread-1-processing-n:127.0.0.1:62545_a_to%2Fg x:collection1 s:shard1 c:control_collection r:core_node1) [n:127.0.0.1:62545_a_to%2Fg c:control_collection s:shard1 r:core_node1 x:collection1] o.a.s.c.ZkController No LogReplay needed for core=collection1 baseURL=http://127.0.0.1:62545/a_to/g
[junit4] 2> 1672892 INFO (coreZkRegister-5943-thread-1-processing-n:127.0.0.1:62545_a_to%2Fg x:collection1 s:shard1 c:control_collection r:core_node1) [n:127.0.0.1:62545_a_to%2Fg c:control_collection s:shard1 r:core_node1 x:collection1] o.a.s.c.ZkController I am the leader, no recovery necessary
[junit4] 2> 1672892 INFO (coreZkRegister-5943-thread-1-processing-n:127.0.0.1:62545_a_to%2Fg x:collection1 s:shard1 c:control_collection r:core_node1) [n:127.0.0.1:62545_a_to%2Fg c:control_collection s:shard1 r:core_node1 x:collection1] o.a.s.c.ZkController publishing state=active
[junit4] 2> 1672892 INFO (coreZkRegister-5943-thread-1-processing-n:127.0.0.1:62545_a_to%2Fg x:collection1 s:shard1 c:control_collection r:core_node1) [n:127.0.0.1:62545_a_to%2Fg c:control_collection s:shard1 r:core_node1 x:collection1] o.a.s.c.ZkController numShards not found on descriptor - reading it from system property
[junit4] 2> 1672896 INFO (OverseerStateUpdate-95884680286568452-127.0.0.1:62545_a_to%2Fg-n_0000000000) [n:127.0.0.1:62545_a_to%2Fg ] o.a.s.c.Overseer processMessage: queueSize: 1, message = {
[junit4] 2> "core":"collection1",
[junit4] 2> "core_node_name":"core_node1",
[junit4] 2> "roles":null,
[junit4] 2> "base_url":"http://127.0.0.1:62545/a_to/g",
[junit4] 2> "node_name":"127.0.0.1:62545_a_to%2Fg",
[junit4] 2> "numShards":"1",
[junit4] 2> "state":"active",
[junit4] 2> "shard":"shard1",
[junit4] 2> "collection":"control_collection",
[junit4] 2> "operation":"state"} current state version: 2
[junit4] 2> 1672897 INFO (OverseerStateUpdate-95884680286568452-127.0.0.1:62545_a_to%2Fg-n_0000000000) [n:127.0.0.1:62545_a_to%2Fg ] o.a.s.c.o.ReplicaMutator Update state numShards=1 message={
[junit4] 2> "core":"collection1",
[junit4] 2> "core_node_name":"core_node1",
[junit4] 2> "roles":null,
[junit4] 2> "base_url":"http://127.0.0.1:62545/a_to/g",
[junit4] 2> "node_name":"127.0.0.1:62545_a_to%2Fg",
[junit4] 2> "numShards":"1",
[junit4] 2> "state":"active",
[junit4] 2> "shard":"shard1",
[junit4] 2> "collection":"control_collection",
[junit4] 2> "operation":"state"}
[junit4] 2> 1673000 INFO (zkCallback-1775-thread-1-processing-n:127.0.0.1:62545_a_to%2Fg) [n:127.0.0.1:62545_a_to%2Fg ] o.a.s.c.c.ZkStateReader A cluster state change: [WatchedEvent state:SyncConnected type:NodeDataChanged path:/clusterstate.json], has occurred - updating... (live nodes size: [1])
[junit4] 2> 1673045 INFO (TEST-RecoveryAfterSoftCommitTest.test-seed#[C324A3CA36D74810]) [ ] o.a.s.c.s.i.CloudSolrClient Final constructed zkHost string: 127.0.0.1:54292/solr
[junit4] 2> 1673046 INFO (TEST-RecoveryAfterSoftCommitTest.test-seed#[C324A3CA36D74810]) [ ] o.a.s.c.c.SolrZkClient Using default ZkCredentialsProvider
[junit4] 2> 1673046 INFO (TEST-RecoveryAfterSoftCommitTest.test-seed#[C324A3CA36D74810]) [ ] o.a.s.c.c.ConnectionManager Waiting for client to connect to ZooKeeper
[junit4] 2> 1673048 INFO (zkCallback-1777-thread-1) [ ] o.a.s.c.c.ConnectionManager Watcher org.apache.solr.common.cloud.ConnectionManager@2ebd68c9 name:ZooKeeperConnection Watcher:127.0.0.1:54292/solr got event WatchedEvent state:SyncConnected type:None path:null path:null type:None
[junit4] 2> 1673049 INFO (TEST-RecoveryAfterSoftCommitTest.test-seed#[C324A3CA36D74810]) [ ] o.a.s.c.c.ConnectionManager Client is connected to ZooKeeper
[junit4] 2> 1673049 INFO (TEST-RecoveryAfterSoftCommitTest.test-seed#[C324A3CA36D74810]) [ ] o.a.s.c.c.SolrZkClient Using default ZkACLProvider
[junit4] 2> 1673049 INFO (TEST-RecoveryAfterSoftCommitTest.test-seed#[C324A3CA36D74810]) [ ] o.a.s.c.c.ZkStateReader Updating cluster state from ZooKeeper...
[junit4] 2> 1673051 INFO (TEST-RecoveryAfterSoftCommitTest.test-seed#[C324A3CA36D74810]) [ ] o.a.s.c.c.ZkStateReader Updated live nodes from ZooKeeper... (0) -> (1)
[junit4] 2> 1673053 INFO (TEST-RecoveryAfterSoftCommitTest.test-seed#[C324A3CA36D74810]) [ ] o.a.s.c.ChaosMonkey monkey: init - expire sessions:false cause connection loss:false
[junit4] 2> 1673053 INFO (TEST-RecoveryAfterSoftCommitTest.test-seed#[C324A3CA36D74810]) [ ] o.a.s.c.AbstractFullDistribZkTestBase Creating collection1 with stateFormat=2
[junit4] 2> 1673053 INFO (TEST-RecoveryAfterSoftCommitTest.test-seed#[C324A3CA36D74810]) [ ] o.a.s.c.c.SolrZkClient Using default ZkCredentialsProvider
[junit4] 2> 1673054 INFO (TEST-RecoveryAfterSoftCommitTest.test-seed#[C324A3CA36D74810]) [ ] o.a.s.c.c.ConnectionManager Waiting for client to connect to ZooKeeper
[junit4] 2> 1673055 INFO (zkCallback-1778-thread-1) [ ] o.a.s.c.c.ConnectionManager Watcher org.apache.solr.common.cloud.ConnectionManager@490dec0a name:ZooKeeperConnection Watcher:127.0.0.1:54292/solr got event WatchedEvent state:SyncConnected type:None path:null path:null type:None
[junit4] 2> 1673056 INFO (TEST-RecoveryAfterSoftCommitTest.test-seed#[C324A3CA36D74810]) [ ] o.a.s.c.c.ConnectionManager Client is connected to ZooKeeper
[junit4] 2> 1673056 INFO (TEST-RecoveryAfterSoftCommitTest.test-seed#[C324A3CA36D74810]) [ ] o.a.s.c.c.SolrZkClient Using default ZkACLProvider
[junit4] 2> 1673059 WARN (NIOServerCxn.Factory:0.0.0.0/0.0.0.0:0) [ ] o.a.z.s.NIOServerCnxn caught end of stream exception
[junit4] 2> EndOfStreamException: Unable to read additional data from client sessionid 0x154a69bd3e20006, likely client has closed socket
[junit4] 2> at org.apache.zookeeper.server.NIOServerCnxn.doIO(NIOServerCnxn.java:228)
[junit4] 2> at org.apache.zookeeper.server.NIOServerCnxnFactory.run(NIOServerCnxnFactory.java:208)
[junit4] 2> at java.lang.Thread.run(Thread.java:745)
[junit4] 2> 1673059 INFO (OverseerStateUpdate-95884680286568452-127.0.0.1:62545_a_to%2Fg-n_0000000000) [n:127.0.0.1:62545_a_to%2Fg ] o.a.s.c.Overseer processMessage: queueSize: 1, message = {
[junit4] 2> "operation":"create",
[junit4] 2> "name":"collection1",
[junit4] 2> "numShards":"1",
[junit4] 2> "stateFormat":"2"} current state version: 3
[junit4] 2> 1673060 INFO (OverseerStateUpdate-95884680286568452-127.0.0.1:62545_a_to%2Fg-n_0000000000) [n:127.0.0.1:62545_a_to%2Fg ] o.a.s.c.o.ClusterStateMutator building a new cName: collection1
[junit4] 2> 1673165 INFO (OverseerStateUpdate-95884680286568452-127.0.0.1:62545_a_to%2Fg-n_0000000000) [n:127.0.0.1:62545_a_to%2Fg ] o.a.s.c.o.ZkStateWriter going to create_collection /collections/collection1/state.json
[junit4] 2> 1673236 INFO (TEST-RecoveryAfterSoftCommitTest.test-seed#[C324A3CA36D74810]) [ ] o.a.s.SolrTestCaseJ4 Writing core.properties file to /export/home/jenkins/workspace/Lucene-Solr-master-Solaris/solr/build/solr-core/test/J0/temp/solr.cloud.RecoveryAfterSoftCommitTest_C324A3CA36D74810-001/shard-1-001/cores/collection1
[junit4] 2> 1673237 INFO (TEST-RecoveryAfterSoftCommitTest.test-seed#[C324A3CA36D74810]) [ ] o.a.s.c.AbstractFullDistribZkTestBase create jetty 1 in directory /export/home/jenkins/workspace/Lucene-Solr-master-Solaris/solr/build/solr-core/test/J0/temp/solr.cloud.RecoveryAfterSoftCommitTest_C324A3CA36D74810-001/shard-1-001
[junit4] 2> 1673238 INFO (TEST-RecoveryAfterSoftCommitTest.test-seed#[C324A3CA36D74810]) [ ] o.e.j.s.Server jetty-9.3.8.v20160314
[junit4] 2> 1673251 INFO (TEST-RecoveryAfterSoftCommitTest.test-seed#[C324A3CA36D74810]) [ ] o.e.j.s.h.ContextHandler Started o.e.j.s.ServletContextHandler@54e6a6dc{/a_to/g,null,AVAILABLE}
[junit4] 2> 1673251 INFO (TEST-RecoveryAfterSoftCommitTest.test-seed#[C324A3CA36D74810]) [ ] o.e.j.s.ServerConnector Started ServerConnector@1bab2b21{HTTP/1.1,[http/1.1]}{127.0.0.1:60579}
[junit4] 2> 1673251 INFO (TEST-RecoveryAfterSoftCommitTest.test-seed#[C324A3CA36D74810]) [ ] o.e.j.s.Server Started @1677593ms
[junit4] 2> 1673251 INFO (TEST-RecoveryAfterSoftCommitTest.test-seed#[C324A3CA36D74810]) [ ] o.a.s.c.s.e.JettySolrRunner Jetty properties: {solr.data.dir=/export/home/jenkins/workspace/Lucene-Solr-master-Solaris/solr/build/solr-core/test/J0/temp/solr.cloud.RecoveryAfterSoftCommitTest_C324A3CA36D74810-001/tempDir-001/jetty1, solrconfig=solrconfig.xml, hostContext=/a_to/g, hostPort=56797, coreRootDirectory=/export/home/jenkins/workspace/Lucene-Solr-master-Solaris/solr/build/solr-core/test/J0/temp/solr.cloud.RecoveryAfterSoftCommitTest_C324A3CA36D74810-001/shard-1-001/cores}
[junit4] 2> 1673252 INFO (TEST-RecoveryAfterSoftCommitTest.test-seed#[C324A3CA36D74810]) [ ] o.a.s.s.SolrDispatchFilter SolrDispatchFilter.init(): sun.misc.Launcher$AppClassLoader@6d06d69c
[junit4] 2> 1673252 INFO (TEST-RecoveryAfterSoftCommitTest.test-seed#[C324A3CA36D74810]) [ ] o.a.s.c.SolrResourceLoader new SolrResourceLoader for directory: '/export/home/jenkins/workspace/Lucene-Solr-master-Solaris/solr/build/solr-core/test/J0/temp/solr.cloud.RecoveryAfterSoftCommitTest_C324A3CA36D74810-001/shard-1-001'
[junit4] 2> 1673252 INFO (TEST-RecoveryAfterSoftCommitTest.test-seed#[C324A3CA36D74810]) [ ] o.a.s.c.SolrResourceLoader JNDI not configured for solr (NoInitialContextEx)
[junit4] 2> 1673252 INFO (TEST-RecoveryAfterSoftCommitTest.test-seed#[C324A3CA36D74810]) [ ] o.a.s.c.SolrResourceLoader solr home defaulted to 'solr/' (could not find system property or JNDI)
[junit4] 2> 1673253 INFO (TEST-RecoveryAfterSoftCommitTest.test-seed#[C324A3CA36D74810]) [ ] o.a.s.c.c.SolrZkClient Using default ZkCredentialsProvider
[junit4] 2> 1673254 INFO (TEST-RecoveryAfterSoftCommitTest.test-seed#[C324A3CA36D74810]) [ ] o.a.s.c.c.ConnectionManager Waiting for client to connect to ZooKeeper
[junit4] 2> 1673255 INFO (zkCallback-1779-thread-1) [ ] o.a.s.c.c.ConnectionManager Watcher org.apache.solr.common.cloud.ConnectionManager@2f6d9d9a name:ZooKeeperConnection Watcher:127.0.0.1:54292/solr got event WatchedEvent state:SyncConnected type:None path:null path:null type:None
[junit4] 2> 1673256 INFO (TEST-RecoveryAfterSoftCommitTest.test-seed#[C324A3CA36D74810]) [ ] o.a.s.c.c.ConnectionManager Client is connected to ZooKeeper
[junit4] 2> 1673256 INFO (TEST-RecoveryAfterSoftCommitTest.test-seed#[C324A3CA36D74810]) [ ] o.a.s.c.c.SolrZkClient Using default ZkACLProvider
[junit4] 2> 1673258 INFO (TEST-RecoveryAfterSoftCommitTest.test-seed#[C324A3CA36D74810]) [ ] o.a.s.s.SolrDispatchFilter Loading solr.xml from SolrHome (not found in ZooKeeper)
[junit4] 2> 1673258 INFO (TEST-RecoveryAfterSoftCommitTest.test-seed#[C324A3CA36D74810]) [ ] o.a.s.c.SolrXmlConfig Loading container configuration from /export/home/jenkins/workspace/Lucene-Solr-master-Solaris/solr/build/solr-core/test/J0/temp/solr.cloud.RecoveryAfterSoftCommitTest_C324A3CA36D74810-001/shard-1-001/solr.xml
[junit4] 2> 1673267 INFO (TEST-RecoveryAfterSoftCommitTest.test-seed#[C324A3CA36D74810]) [ ] o.a.s.c.CorePropertiesLocator Config-defined core root directory: /export/home/jenkins/workspace/Lucene-Solr-master-Solaris/solr/build/solr-core/test/J0/temp/solr.cloud.RecoveryAfterSoftCommitTest_C324A3CA36D74810-001/shard-1-001/cores
[junit4] 2> 1673267 INFO (TEST-RecoveryAfterSoftCommitTest.test-seed#[C324A3CA36D74810]) [ ] o.a.s.c.CoreContainer New CoreContainer 1817920775
[junit4] 2> 1673267 INFO (TEST-RecoveryAfterSoftCommitTest.test-seed#[C324A3CA36D74810]) [ ] o.a.s.c.CoreContainer Loading cores into CoreContainer [instanceDir=/export/home/jenkins/workspace/Lucene-Solr-master-Solaris/solr/build/solr-core/test/J0/temp/solr.cloud.RecoveryAfterSoftCommitTest_C324A3CA36D74810-001/shard-1-001]
[junit4] 2> 1673268 WARN (TEST-RecoveryAfterSoftCommitTest.test-seed#[C324A3CA36D74810]) [ ] o.a.s.c.CoreContainer Couldn't add files from /export/home/jenkins/workspace/Lucene-Solr-master-Solaris/solr/build/solr-core/test/J0/temp/solr.cloud.RecoveryAfterSoftCommitTest_C324A3CA36D74810-001/shard-1-001/lib to classpath: /export/home/jenkins/workspace/Lucene-Solr-master-Solaris/solr/build/solr-core/test/J0/temp/solr.cloud.RecoveryAfterSoftCommitTest_C324A3CA36D74810-001/shard-1-001/lib
[junit4] 2> 1673268 INFO (TEST-RecoveryAfterSoftCommitTest.test-seed#[C324A3CA36D74810]) [ ] o.a.s.h.c.HttpShardHandlerFactory created with socketTimeout : 90000,urlScheme : ,connTimeout : 15000,maxConnectionsPerHost : 20,maxConnections : 10000,corePoolSize : 0,maximumPoolSize : 2147483647,maxThreadIdleTime : 5,sizeOfQueue : -1,fairnessPolicy : false,
[junit4] 2> 1673271 INFO (TEST-RecoveryAfterSoftCommitTest.test-seed#[C324A3CA36D74810]) [ ] o.a.s.u.UpdateShardHandler Creating UpdateShardHandler HTTP client with params:
[junit4] 2> 1673272 INFO (TEST-RecoveryAfterSoftCommitTest.test-seed#[C324A3CA36D74810]) [ ] o.a.s.l.LogWatcher SLF4J impl is org.slf4j.impl.Log4jLoggerFactory
[junit4] 2> 1673272 INFO (TEST-RecoveryAfterSoftCommitTest.test-seed#[C324A3CA36D74810]) [ ] o.a.s.l.LogWatcher Registering Log Listener [Log4j (org.slf4j.impl.Log4jLoggerFactory)]
[junit4] 2> 1673272 INFO (TEST-RecoveryAfterSoftCommitTest.test-seed#[C324A3CA36D74810]) [ ] o.a.s.c.ZkContainer Zookeeper client=127.0.0.1:54292/solr
[junit4] 2> 1673272 INFO (TEST-RecoveryAfterSoftCommitTest.test-seed#[C324A3CA36D74810]) [ ] o.a.s.c.ZkController zkHost includes chroot
[junit4] 2> 1673272 INFO (TEST-RecoveryAfterSoftCommitTest.test-seed#[C324A3CA36D74810]) [ ] o.a.s.c.c.SolrZkClient Using default ZkCredentialsProvider
[junit4] 2> 1673273 INFO (TEST-RecoveryAfterSoftCommitTest.test-seed#[C324A3CA36D74810]) [ ] o.a.s.c.c.ConnectionManager Waiting for client to connect to ZooKeeper
[junit4] 2> 1673275 INFO (zkCallback-1782-thread-1) [ ] o.a.s.c.c.ConnectionManager Watcher org.apache.solr.common.cloud.ConnectionManager@182ce353 name:ZooKeeperConnection Watcher:127.0.0.1:54292 got event WatchedEvent state:SyncConnected type:None path:null path:null type:None
[junit4] 2> 1673275 INFO (TEST-RecoveryAfterSoftCommitTest.test-seed#[C324A3CA36D74810]) [ ] o.a.s.c.c.ConnectionManager Client is connected to ZooKeeper
[junit4] 2> 1673275 INFO (TEST-RecoveryAfterSoftCommitTest.test-seed#[C324A3CA36D74810]) [ ] o.a.s.c.c.SolrZkClient Using default ZkACLProvider
[junit4] 2> 1673277 INFO (TEST-RecoveryAfterSoftCommitTest.test-seed#[C324A3CA36D74810]) [n:127.0.0.1:56797_a_to%2Fg ] o.a.s.c.ZkController Added new OnReconnect listener org.apache.solr.cloud.ZkController$$Lambda$77/1517282429@2bda9874
[junit4] 2> 1673278 INFO (TEST-RecoveryAfterSoftCommitTest.test-seed#[C324A3CA36D74810]) [n:127.0.0.1:56797_a_to%2Fg ] o.a.s.c.c.ConnectionManager Waiting for client to connect to ZooKeeper
[junit4] 2> 1673279 INFO (zkCallback-1783-thread-1-processing-n:127.0.0.1:56797_a_to%2Fg) [n:127.0.0.1:56797_a_to%2Fg ] o.a.s.c.c.ConnectionManager Watcher org.apache.solr.common.cloud.ConnectionManager@60081959 name:ZooKeeperConnection Watcher:127.0.0.1:54292/solr got event WatchedEvent state:SyncConnected type:None path:null path:null type:None
[junit4] 2> 1673280 INFO (TEST-RecoveryAfterSoftCommitTest.test-seed#[C324A3CA36D74810]) [n:127.0.0.1:56797_a_to%2Fg ] o.a.s.c.c.ConnectionManager Client is connected to ZooKeeper
[junit4] 2> 1673292 INFO (TEST-RecoveryAfterSoftCommitTest.test-seed#[C324A3CA36D74810]) [n:127.0.0.1:56797_a_to%2Fg ] o.a.s.c.c.ZkStateReader Updating cluster state from ZooKeeper...
[junit4] 2> 1673294 INFO (TEST-RecoveryAfterSoftCommitTest.test-seed#[C324A3CA36D74810]) [n:127.0.0.1:56797_a_to%2Fg ] o.a.s.c.c.ZkStateReader Updated live nodes from ZooKeeper... (0) -> (1)
[junit4] 2> 1673299 INFO (TEST-RecoveryAfterSoftCommitTest.test-seed#[C324A3CA36D74810]) [n:127.0.0.1:56797_a_to%2Fg ] o.a.s.c.Overseer Overseer (id=null) closing
[junit4] 2> 1673300 INFO (TEST-RecoveryAfterSoftCommitTest.test-seed#[C324A3CA36D74810]) [n:127.0.0.1:56797_a_to%2Fg ] o.a.s.c.LeaderElector Joined leadership election with path: /overseer_elect/election/95884680286568457-127.0.0.1:56797_a_to%2Fg-n_0000000001
[junit4] 2> 1673302 INFO (TEST-RecoveryAfterSoftCommitTest.test-seed#[C324A3CA36D74810]) [n:127.0.0.1:56797_a_to%2Fg ] o.a.s.c.LeaderElector Watching path /overseer_elect/election/95884680286568452-127.0.0.1:62545_a_to%2Fg-n_0000000000 to know if I could be the leader
[junit4] 2> 1673302 INFO (TEST-RecoveryAfterSoftCommitTest.test-seed#[C324A3CA36D74810]) [n:127.0.0.1:56797_a_to%2Fg ] o.a.s.c.ZkController Publish node=127.0.0.1:56797_a_to%2Fg as DOWN
[junit4] 2> 1673305 INFO (OverseerStateUpdate-95884680286568452-127.0.0.1:62545_a_to%2Fg-n_0000000000) [n:127.0.0.1:62545_a_to%2Fg ] o.a.s.c.Overseer processMessage: queueSize: 1, message = {
[junit4] 2> "operation":"downnode",
[junit4] 2> "node_name":"127.0.0.1:56797_a_to%2Fg"} current state version: 3
[junit4] 2> 1673306 INFO (OverseerStateUpdate-95884680286568452-127.0.0.1:62545_a_to%2Fg-n_0000000000) [n:127.0.0.1:62545_a_to%2Fg ] o.a.s.c.o.NodeMutator DownNode state invoked for node: 127.0.0.1:56797_a_to%2Fg
[junit4] 2> 1673307 INFO (zkCallback-1777-thread-1) [ ] o.a.s.c.c.ZkStateReader A cluster state change: [WatchedEvent state:SyncConnected type:NodeDataChanged path:/clusterstate.json], has occurred - updating... (live nodes size: [1])
[junit4] 2> 1673308 INFO (zkCallback-1775-thread-1-processing-n:127.0.0.1:62545_a_to%2Fg) [n:127.0.0.1:62545_a_to%2Fg ] o.a.s.c.c.ZkStateReader A cluster state change: [WatchedEvent state:SyncConnected type:NodeDataChanged path:/clusterstate.json], has occurred - updating... (live nodes size: [1])
[junit4] 2> 1673308 INFO (zkCallback-1783-thread-1-processing-n:127.0.0.1:56797_a_to%2Fg) [n:127.0.0.1:56797_a_to%2Fg ] o.a.s.c.c.ZkStateReader A cluster state change: [WatchedEvent state:SyncConnected type:NodeDataChanged path:/clusterstate.json], has occurred - updating... (live nodes size: [1])
[junit4] 2> 1673415 INFO (OverseerStateUpdate-95884680286568452-127.0.0.1:62545_a_to%2Fg-n_0000000000) [n:127.0.0.1:62545_a_to%2Fg ] o.a.s.c.o.ZkStateWriter going to update_collection /collections/collection1/state.json version: 0
[junit4] 2> 1674306 INFO (TEST-RecoveryAfterSoftCommitTest.test-seed#[C324A3CA36D74810]) [n:127.0.0.1:56797_a_to%2Fg ] o.a.s.c.ZkController Register node as live in ZooKeeper:/live_nodes/127.0.0.1:56797_a_to%2Fg
[junit4] 2> 1674307 INFO (TEST-RecoveryAfterSoftCommitTest.test-seed#[C324A3CA36D74810]) [n:127.0.0.1:56797_a_to%2Fg ] o.a.s.c.c.SolrZkClient makePath: /live_nodes/127.0.0.1:56797_a_to%2Fg
[junit4] 2> 1674310 INFO (zkCallback-1775-thread-1-processing-n:127.0.0.1:62545_a_to%2Fg) [n:127.0.0.1:62545_a_to%2Fg ] o.a.s.c.c.ZkStateReader A live node change: [WatchedEvent state:SyncConnected type:NodeChildrenChanged path:/live_nodes], has occurred - updating... (live nodes size: [1])
[junit4] 2> 1674311 INFO (zkCallback-1777-thread-1) [ ] o.a.s.c.c.ZkStateReader A live node change: [WatchedEvent state:SyncConnected type:NodeChildrenChanged path:/live_nodes], has occurred - updating... (live nodes size: [1])
[junit4] 2> 1674311 INFO (zkCallback-1783-thread-1-processing-n:127.0.0.1:56797_a_to%2Fg) [n:127.0.0.1:56797_a_to%2Fg ] o.a.s.c.c.ZkStateReader A live node change: [WatchedEvent state:SyncConnected type:NodeChildrenChanged path:/live_nodes], has occurred - updating... (live nodes size: [1])
[junit4] 2> 1674312 INFO (zkCallback-1783-thread-1-processing-n:127.0.0.1:56797_a_to%2Fg) [n:127.0.0.1:56797_a_to%2Fg ] o.a.s.c.c.ZkStateReader Updated live nodes from ZooKeeper... (1) -> (2)
[junit4] 2> 1674313 INFO (zkCallback-1777-thread-1) [ ] o.a.s.c.c.ZkStateReader Updated live nodes from ZooKeeper... (1) -> (2)
[junit4] 2> 1674313 INFO (zkCallback-1775-thread-1-processing-n:127.0.0.1:62545_a_to%2Fg) [n:127.0.0.1:62545_a_to%2Fg ] o.a.s.c.c.ZkStateReader Updated live nodes from ZooKeeper... (1) -> (2)
[junit4] 2> 1674343 INFO (TEST-RecoveryAfterSoftCommitTest.test-seed#[C324A3CA36D74810]) [n:127.0.0.1:56797_a_to%2Fg ] o.a.s.c.CoreContainer Security conf doesn't exist. Skipping setup for authorization module.
[junit4] 2> 1674343 INFO (TEST-RecoveryAfterSoftCommitTest.test-seed#[C324A3CA36D74810]) [n:127.0.0.1:56797_a_to%2Fg ] o.a.s.c.CoreContainer No authentication plugin used.
[junit4] 2> 1674344 INFO (TEST-RecoveryAfterSoftCommitTest.test-seed#[C324A3CA36D74810]) [n:127.0.0.1:56797_a_to%2Fg ] o.a.s.c.CorePropertiesLocator Looking for core definitions underneath /export/home/jenkins/workspace/Lucene-Solr-master-Solaris/solr/build/solr-core/test/J0/temp/solr.cloud.RecoveryAfterSoftCommitTest_C324A3CA36D74810-001/shard-1-001/cores
[junit4] 2> 1674346 INFO (TEST-RecoveryAfterSoftCommitTest.test-seed#[C324A3CA36D74810]) [n:127.0.0.1:56797_a_to%2Fg ] o.a.s.c.CoreDescriptor Created CoreDescriptor: {name=collection1, config=solrconfig.xml, transient=false, schema=schema.xml, loadOnStartup=true, configSetProperties=configsetprops.json, collection=collection1, coreNodeName=, dataDir=data/, shard=}
[junit4] 2> 1674346 INFO (TEST-RecoveryAfterSoftCommitTest.test-seed#[C324A3CA36D74810]) [n:127.0.0.1:56797_a_to%2Fg ] o.a.s.c.CorePropertiesLocator Found core collection1 in /export/home/jenkins/workspace/Lucene-Solr-master-Solaris/solr/build/solr-core/test/J0/temp/solr.cloud.RecoveryAfterSoftCommitTest_C324A3CA36D74810-001/shard-1-001/cores/collection1
[junit4] 2> 1674346 INFO (TEST-RecoveryAfterSoftCommitTest.test-seed#[C324A3CA36D74810]) [n:127.0.0.1:56797_a_to%2Fg ] o.a.s.c.CorePropertiesLocator Found 1 core definitions
[junit4] 2> 1674348 INFO (TEST-RecoveryAfterSoftCommitTest.test-seed#[C324A3CA36D74810]) [n:127.0.0.1:56797_a_to%2Fg ] o.a.s.s.SolrDispatchFilter user.dir=/export/home/jenkins/workspace/Lucene-Solr-master-Solaris/solr/build/solr-core/test/J0
[junit4] 2> 1674348 INFO (TEST-RecoveryAfterSoftCommitTest.test-seed#[C324A3CA36D74810]) [n:127.0.0.1:56797_a_to%2Fg ] o.a.s.s.SolrDispatchFilter SolrDispatchFilter.init() done
[junit4] 2> 1674349 INFO (coreLoadExecutor-5960-thread-1-processing-n:127.0.0.1:56797_a_to%2Fg) [n:127.0.0.1:56797_a_to%2Fg c:collection1 x:collection1] o.a.s.c.ZkController publishing state=down
[junit4] 2> 1674349 INFO (coreLoadExecutor-5960-thread-1-processing-n:127.0.0.1:56797_a_to%2Fg) [n:127.0.0.1:56797_a_to%2Fg c:collection1 x:collection1] o.a.s.c.ZkController numShards not found on descriptor - reading it from system property
[junit4] 2> 1674351 INFO (coreLoadExecutor-5960-thread-1-processing-n:127.0.0.1:56797_a_to%2Fg) [n:127.0.0.1:56797_a_to%2Fg c:collection1 x:collection1] o.a.s.c.ZkController Registering watch for collection collection1
[junit4] 2> 1674351 INFO (coreLoadExecutor-5960-thread-1-processing-n:127.0.0.1:56797_a_to%2Fg) [n:127.0.0.1:56797_a_to%2Fg c:collection1 x:collection1] o.a.s.c.c.ZkStateReader addZkWatch [collection1]
[junit4] 2> 1674352 INFO (OverseerStateUpdate-95884680286568452-127.0.0.1:62545_a_to%2Fg-n_0000000000) [n:127.0.0.1:62545_a_to%2Fg ] o.a.s.c.Overseer processMessage: queueSize: 1, message = {
[junit4] 2> "core":"collection1",
[junit4] 2> "roles":null,
[junit4] 2> "base_url":"http://127.0.0.1:56797/a_to/g",
[junit4] 2> "node_name":"127.0.0.1:56797_a_to%2Fg",
[junit4] 2> "numShards":"1",
[junit4] 2> "state":"down",
[junit4] 2> "shard":null,
[junit4] 2> "collection":"collection1",
[junit4] 2> "operation":"state"} current state version: 4
[junit4] 2> 1674353 INFO (coreLoadExecutor-5960-thread-1-processing-n:127.0.0.1:56797_a_to%2Fg) [n:127.0.0.1:56797_a_to%2Fg c:collection1 x:collection1] o.a.s.c.c.ZkStateReader Add data for [collection1] ver [1]
[junit4] 2> 1674353 INFO (coreLoadExecutor-5960-thread-1-processing-n:127.0.0.1:56797_a_to%2Fg) [n:127.0.0.1:56797_a_to%2Fg c:collection1 x:collection1] o.a.s.c.ZkController look for our core node name
[junit4] 2> 1674353 INFO (OverseerStateUpdate-95884680286568452-127.0.0.1:62545_a_to%2Fg-n_0000000000) [n:127.0.0.1:62545_a_to%2Fg ] o.a.s.c.o.ReplicaMutator Update state numShards=1 message={
[junit4] 2> "core":"collection1",
[junit4] 2> "roles":null,
[junit4] 2> "base_url":"http://127.0.0.1:56797/a_to/g",
[junit4] 2> "node_name":"127.0.0.1:56797_a_to%2Fg",
[junit4] 2> "numShards":"1",
[junit4] 2> "state":"down",
[junit4] 2> "shard":null,
[juni
[...truncated too long message...]
AfterSoftCommitTest.test-seed#[C324A3CA36D74810]) [ ] o.a.s.c.ZkTestServer connecting to 127.0.0.1:54292 54292
[junit4] 2> 1725483 INFO (Thread-6683) [ ] o.a.s.c.ZkTestServer connecting to 127.0.0.1:54292 54292
[junit4] 2> 1725483 WARN (Thread-6683) [ ] o.a.s.c.ZkTestServer Watch limit violations:
[junit4] 2> Maximum concurrent create/delete watches above limit:
[junit4] 2>
[junit4] 2> 4 /solr/aliases.json
[junit4] 2> 3 /solr/security.json
[junit4] 2> 3 /solr/configs/conf1
[junit4] 2>
[junit4] 2> Maximum concurrent data watches above limit:
[junit4] 2>
[junit4] 2> 4 /solr/clusterstate.json
[junit4] 2> 2 /solr/collections/collection1/state.json
[junit4] 2>
[junit4] 2> Maximum concurrent children watches above limit:
[junit4] 2>
[junit4] 2> 4 /solr/live_nodes
[junit4] 2> 4 /solr/collections
[junit4] 2> 3 /solr/overseer/queue
[junit4] 2> 3 /solr/overseer/collection-queue-work
[junit4] 2> 2 /solr/overseer/queue-work
[junit4] 2>
[junit4] 2> 1725484 WARN (TEST-RecoveryAfterSoftCommitTest.test-seed#[C324A3CA36D74810]) [ ] o.a.s.c.SocketProxy Closing 0 connections to: http://127.0.0.1:62545/a_to/g, target: http://127.0.0.1:54560/a_to/g
[junit4] 2> 1725484 WARN (TEST-RecoveryAfterSoftCommitTest.test-seed#[C324A3CA36D74810]) [ ] o.a.s.c.SocketProxy Closing 7 connections to: http://127.0.0.1:56797/a_to/g, target: http://127.0.0.1:60579/a_to/g
[junit4] 2> 1725484 WARN (TEST-RecoveryAfterSoftCommitTest.test-seed#[C324A3CA36D74810]) [ ] o.a.s.c.SocketProxy Closing 1 connections to: http://127.0.0.1:38547/a_to/g, target: http://127.0.0.1:42676/a_to/g
[junit4] 2> NOTE: reproduce with: ant test -Dtestcase=RecoveryAfterSoftCommitTest -Dtests.method=test -Dtests.seed=C324A3CA36D74810 -Dtests.slow=true -Dtests.locale=vi -Dtests.timezone=Asia/Phnom_Penh -Dtests.asserts=true -Dtests.file.encoding=UTF-8
[junit4] FAILURE 54.4s J0 | RecoveryAfterSoftCommitTest.test <<<
[junit4] > Throwable #1: java.lang.AssertionError: Didn't see all replicas for shard shard1 in collection1 come up within 30000 ms! ClusterState: {
[junit4] > "control_collection":{
[junit4] > "replicationFactor":"1",
[junit4] > "shards":{"shard1":{
[junit4] > "range":"80000000-7fffffff",
[junit4] > "state":"active",
[junit4] > "replicas":{"core_node1":{
[junit4] > "core":"collection1",
[junit4] > "base_url":"http://127.0.0.1:62545/a_to/g",
[junit4] > "node_name":"127.0.0.1:62545_a_to%2Fg",
[junit4] > "state":"active",
[junit4] > "leader":"true"}}}},
[junit4] > "router":{"name":"compositeId"},
[junit4] > "maxShardsPerNode":"1",
[junit4] > "autoAddReplicas":"false",
[junit4] > "autoCreated":"true"},
[junit4] > "collection1":{
[junit4] > "replicationFactor":"1",
[junit4] > "shards":{"shard1":{
[junit4] > "range":"80000000-7fffffff",
[junit4] > "state":"active",
[junit4] > "replicas":{
[junit4] > "core_node1":{
[junit4] > "core":"collection1",
[junit4] > "base_url":"http://127.0.0.1:56797/a_to/g",
[junit4] > "node_name":"127.0.0.1:56797_a_to%2Fg",
[junit4] > "state":"active",
[junit4] > "leader":"true"},
[junit4] > "core_node2":{
[junit4] > "core":"collection1",
[junit4] > "base_url":"http://127.0.0.1:38547/a_to/g",
[junit4] > "node_name":"127.0.0.1:38547_a_to%2Fg",
[junit4] > "state":"recovering"}}}},
[junit4] > "router":{"name":"compositeId"},
[junit4] > "maxShardsPerNode":"1",
[junit4] > "autoAddReplicas":"false",
[junit4] > "autoCreated":"true"}}
[junit4] > at __randomizedtesting.SeedInfo.seed([C324A3CA36D74810:4B709C10982B25E8]:0)
[junit4] > at org.apache.solr.cloud.AbstractFullDistribZkTestBase.ensureAllReplicasAreActive(AbstractFullDistribZkTestBase.java:1895)
[junit4] > at org.apache.solr.cloud.RecoveryAfterSoftCommitTest.test(RecoveryAfterSoftCommitTest.java:115)
[junit4] > at org.apache.solr.BaseDistributedSearchTestCase$ShardsRepeatRule$ShardsFixedStatement.callStatement(BaseDistributedSearchTestCase.java:985)
[junit4] > at org.apache.solr.BaseDistributedSearchTestCase$ShardsRepeatRule$ShardsStatement.evaluate(BaseDistributedSearchTestCase.java:960)
[junit4] > at java.lang.Thread.run(Thread.java:745)
[junit4] 2> 1725493 INFO (SUITE-RecoveryAfterSoftCommitTest-seed#[C324A3CA36D74810]-worker) [ ] o.a.s.SolrTestCaseJ4 ###deleteCore
[junit4] 2> NOTE: leaving temporary files on disk at: /export/home/jenkins/workspace/Lucene-Solr-master-Solaris/solr/build/solr-core/test/J0/temp/solr.cloud.RecoveryAfterSoftCommitTest_C324A3CA36D74810-001
[junit4] 2> May 12, 2016 8:16:05 PM com.carrotsearch.randomizedtesting.ThreadLeakControl checkThreadLeaks
[junit4] 2> WARNING: Will linger awaiting termination of 1 leaked thread(s).
[junit4] 2> NOTE: test params are: codec=Lucene60, sim=ClassicSimilarity, locale=vi, timezone=Asia/Phnom_Penh
[junit4] 2> NOTE: SunOS 5.11 amd64/Oracle Corporation 1.8.0_92 (64-bit)/cpus=3,threads=1,free=183802552,total=432013312
[junit4] 2> NOTE: All tests run in this JVM: [SampleTest, TestUpdate, PolyFieldTest, AddBlockUpdateTest, SpatialRPTFieldTypeTest, TestFieldTypeResource, TestAnalyzeInfixSuggestions, HdfsThreadLeakTest, CdcrReplicationDistributedZkTest, QueryElevationComponentTest, BasicAuthIntegrationTest, CollectionStateFormat2Test, BigEndianAscendingWordDeserializerTest, SegmentsInfoRequestHandlerTest, TestNamedUpdateProcessors, TestShardHandlerFactory, TestMiniSolrCloudCluster, SolrIndexConfigTest, TestManagedSynonymFilterFactory, TestComplexPhraseQParserPlugin, TestLFUCache, TestAuthorizationFramework, JsonLoaderTest, CollectionsAPIAsyncDistributedZkTest, CursorPagingTest, SmileWriterTest, TestRandomCollapseQParserPlugin, TestSimpleQParserPlugin, TestRuleBasedAuthorizationPlugin, TestConfig, PathHierarchyTokenizerFactoryTest, RollingRestartTest, TestCloudInspectUtil, TestMergePolicyConfig, RecoveryZkTest, TestLMDirichletSimilarityFactory, TestRestManager, CoreAdminRequestStatusTest, TriLevelCompositeIdRoutingTest, TermsComponentTest, TestLeaderElectionZkExpiry, TestRebalanceLeaders, MBeansHandlerTest, TestDistribIDF, CheckHdfsIndexTest, CurrencyFieldXmlFileTest, TestTrieFacet, BJQParserTest, StressHdfsTest, TestComponentsName, TestOrdValues, TestGeoJSONResponseWriter, ShardRoutingTest, TestRequestForwarding, TestArbitraryIndexDir, TestRawResponseWriter, ChangedSchemaMergeTest, DocumentAnalysisRequestHandlerTest, TestWordDelimiterFilterFactory, SolrRequestParserTest, TestTolerantSearch, HdfsCollectionsAPIDistributedZkTest, TestSearchPerf, TestPostingsSolrHighlighter, CloudMLTQParserTest, TestElisionMultitermQuery, TestDefaultSearchFieldResource, SaslZkACLProviderTest, TestMissingGroups, SolrCoreTest, ReturnFieldsTest, TestConfigReload, TestFunctionQuery, TestSolrDynamicMBean, TestSurroundQueryParser, BlockDirectoryTest, URLClassifyProcessorTest, TestSchemaResource, PrimUtilsTest, ChaosMonkeyNothingIsSafeTest, TestDynamicFieldResource, TestJsonFacets, DistribJoinFromCollectionTest, TestSweetSpotSimilarityFactory, TestSolr4Spatial2, CustomCollectionTest, TestLuceneMatchVersion, TestNonDefinedSimilarityFactory, TestOnReconnectListenerSupport, BadComponentTest, TestUniqueKeyFieldResource, AsyncMigrateRouteKeyTest, GraphQueryTest, TestObjectReleaseTracker, AlternateDirectoryTest, TestCoreContainer, TestTrackingShardHandlerFactory, TestSchemaVersionResource, SyncSliceTest, TestXIncludeConfig, DeleteShardTest, TestHighFrequencyDictionaryFactory, TestExpandComponent, FastVectorHighlighterTest, TestClassicSimilarityFactory, TestConfigOverlay, HighlighterMaxOffsetTest, AnalysisAfterCoreReloadTest, CdcrRequestHandlerTest, TestCursorMarkWithoutUniqueKey, HardAutoCommitTest, DistributedQueryElevationComponentTest, UpdateParamsTest, RequestLoggingTest, AddSchemaFieldsUpdateProcessorFactoryTest, TestReplicationHandler, ClusterStateUpdateTest, UnloadDistributedZkTest, SliceStateTest, DistributedSpellCheckComponentTest, SpatialHeatmapFacetsTest, TestDocBasedVersionConstraints, TestStandardQParsers, RecoveryAfterSoftCommitTest]
[junit4] Completed [267/597 (1!)] on J0 in 55.25s, 1 test, 1 failure <<< FAILURES!
[...truncated 1072 lines...]
BUILD FAILED
/export/home/jenkins/workspace/Lucene-Solr-master-Solaris/build.xml:740: The following error occurred while executing this line:
/export/home/jenkins/workspace/Lucene-Solr-master-Solaris/build.xml:684: The following error occurred while executing this line:
/export/home/jenkins/workspace/Lucene-Solr-master-Solaris/build.xml:59: The following error occurred while executing this line:
/export/home/jenkins/workspace/Lucene-Solr-master-Solaris/solr/build.xml:233: The following error occurred while executing this line:
/export/home/jenkins/workspace/Lucene-Solr-master-Solaris/solr/common-build.xml:529: The following error occurred while executing this line:
/export/home/jenkins/workspace/Lucene-Solr-master-Solaris/lucene/common-build.xml:1457: The following error occurred while executing this line:
/export/home/jenkins/workspace/Lucene-Solr-master-Solaris/lucene/common-build.xml:1014: There were test failures: 597 suites (10 ignored), 2412 tests, 1 failure, 86 ignored (71 assumptions) [seed: C324A3CA36D74810]
Total time: 83 minutes 4 seconds
Build step 'Invoke Ant' marked build as failure
Archiving artifacts
[WARNINGS] Skipping publisher since build result is FAILURE
Recording test results
Email was triggered for: Failure - Any
Sending email for trigger: Failure - Any