You are viewing a plain text version of this content. The canonical link for it is here.
Posted to dev@oozie.apache.org by Apache Jenkins Server <je...@builds.apache.org> on 2014/09/03 05:32:42 UTC
Build failed in Jenkins: oozie-trunk-precommit-build #1871
See <https://builds.apache.org/job/oozie-trunk-precommit-build/1871/>
------------------------------------------
[...truncated 1223 lines...]
[WARNING] 'build.plugins.plugin.version' for com.atlassian.maven.plugins:maven-clover2-plugin is missing. @ org.apache.oozie:oozie-main:4.2.0-SNAPSHOT, <https://builds.apache.org/job/oozie-trunk-precommit-build/ws/pom.xml,> line 911, column 21
[WARNING] 'build.plugins.plugin.version' for org.codehaus.mojo:findbugs-maven-plugin is missing. @ org.apache.oozie:oozie-main:4.2.0-SNAPSHOT, <https://builds.apache.org/job/oozie-trunk-precommit-build/ws/pom.xml,> line 924, column 21
[WARNING]
[WARNING] Some problems were encountered while building the effective model for org.apache.oozie:oozie-distro:jar:4.2.0-SNAPSHOT
[WARNING] 'build.plugins.plugin.version' for com.atlassian.maven.plugins:maven-clover2-plugin is missing. @ org.apache.oozie:oozie-main:4.2.0-SNAPSHOT, <https://builds.apache.org/job/oozie-trunk-precommit-build/ws/pom.xml,> line 911, column 21
[WARNING] 'build.plugins.plugin.version' for org.codehaus.mojo:findbugs-maven-plugin is missing. @ org.apache.oozie:oozie-main:4.2.0-SNAPSHOT, <https://builds.apache.org/job/oozie-trunk-precommit-build/ws/pom.xml,> line 924, column 21
[WARNING]
[WARNING] Some problems were encountered while building the effective model for org.apache.oozie:oozie-workflowgenerator:war:4.2.0-SNAPSHOT
[WARNING] 'build.plugins.plugin.version' for com.atlassian.maven.plugins:maven-clover2-plugin is missing. @ org.apache.oozie:oozie-main:4.2.0-SNAPSHOT, <https://builds.apache.org/job/oozie-trunk-precommit-build/ws/pom.xml,> line 911, column 21
[WARNING] 'build.plugins.plugin.version' for org.codehaus.mojo:findbugs-maven-plugin is missing. @ org.apache.oozie:oozie-main:4.2.0-SNAPSHOT, <https://builds.apache.org/job/oozie-trunk-precommit-build/ws/pom.xml,> line 924, column 21
[WARNING]
[WARNING] Some problems were encountered while building the effective model for org.apache.oozie:oozie-main:pom:4.2.0-SNAPSHOT
[WARNING] 'build.plugins.plugin.version' for com.atlassian.maven.plugins:maven-clover2-plugin is missing. @ line 911, column 21
[WARNING] 'build.plugins.plugin.version' for org.codehaus.mojo:findbugs-maven-plugin is missing. @ line 924, column 21
[WARNING]
[WARNING] It is highly recommended to fix these problems because they threaten the stability of your build.
[WARNING]
[WARNING] For this reason, future Maven versions might no longer support building such malformed projects.
[WARNING]
[INFO] ------------------------------------------------------------------------
[INFO] Reactor Build Order:
[INFO]
[INFO] Apache Oozie Main
[INFO] Apache Oozie Hadoop 1.2.1.oozie-4.2.0-SNAPSHOT Test
[INFO] Apache Oozie Client
[INFO] Apache Oozie Hadoop 1.2.1.oozie-4.2.0-SNAPSHOT
[INFO] Apache Oozie Hadoop Distcp 1.2.1.oozie-4.2.0-SNAPSHOT
[INFO] Apache Oozie Hadoop 1.2.1.oozie-4.2.0-SNAPSHOT Test
[INFO] Apache Oozie Hadoop Utils 1.2.1.oozie-4.2.0-SNAPSHOT
[INFO] Apache Oozie Hadoop 2.3.0.oozie-4.2.0-SNAPSHOT
[INFO] Apache Oozie Hadoop 2.3.0.oozie-4.2.0-SNAPSHOT Test
[INFO] Apache Oozie Hadoop Distcp 2.3.0.oozie-4.2.0-SNAPSHOT
[INFO] Apache Oozie Hadoop Utils 2.3.0.oozie-4.2.0-SNAPSHOT
[INFO] Apache Oozie Hadoop 2.3.0.oozie-4.2.0-SNAPSHOT Test
[INFO] Apache Oozie Hadoop 0.23.5.oozie-4.2.0-SNAPSHOT
[INFO] Apache Oozie Hadoop 0.23.5.oozie-4.2.0-SNAPSHOT Test
[INFO] Apache Oozie Hadoop Distcp 0.23.5.oozie-4.2.0-SNAPSHOT
[INFO] Apache Oozie Hadoop Utils 0.23.5.oozie-4.2.0-SNAPSHOT
[INFO] Apache Oozie Hadoop 0.23.5.oozie-4.2.0-SNAPSHOT Test
[INFO] Apache Oozie Hadoop Libs
[INFO] Apache Oozie Hbase 0.94.2.oozie-4.2.0-SNAPSHOT
[INFO] Apache Oozie Hbase Libs
[INFO] Apache Oozie HCatalog 0.13.1.oozie-4.2.0-SNAPSHOT
[INFO] Apache Oozie HCatalog Libs
[INFO] Apache Oozie Share Lib Oozie
[INFO] Apache Oozie Share Lib HCatalog
[INFO] Apache Oozie Core
[INFO] Apache Oozie Docs
[INFO] Apache Oozie Share Lib Pig
[INFO] Apache Oozie Share Lib Hive
[INFO] Apache Oozie Share Lib Sqoop
[INFO] Apache Oozie Share Lib Streaming
[INFO] Apache Oozie Share Lib Distcp
[INFO] Apache Oozie WebApp
[INFO] Apache Oozie Examples
[INFO] Apache Oozie Share Lib
[INFO] Apache Oozie Tools
[INFO] Apache Oozie MiniOozie
[INFO] Apache Oozie WorkflowGenerator
[INFO] Apache Oozie Distro
[INFO]
[INFO] Using the builder org.apache.maven.lifecycle.internal.builder.singlethreaded.SingleThreadedBuilder with a thread count of 1
[INFO]
[INFO] ------------------------------------------------------------------------
[INFO] Building Apache Oozie Main 4.2.0-SNAPSHOT
[INFO] ------------------------------------------------------------------------
[INFO]
[INFO] --- maven-enforcer-plugin:1.0:enforce (clean) @ oozie-main ---
[INFO]
[INFO] --- maven-clean-plugin:2.5:clean (default-clean) @ oozie-main ---
[INFO] Deleting <https://builds.apache.org/job/oozie-trunk-precommit-build/ws/target>
[INFO]
[INFO] --- maven-enforcer-plugin:1.0:enforce (default) @ oozie-main ---
[INFO]
[INFO] ------------------------------------------------------------------------
[INFO] Building Apache Oozie Hadoop 1.2.1.oozie-4.2.0-SNAPSHOT Test 1.2.1.oozie-4.2.0-SNAPSHOT
[INFO] ------------------------------------------------------------------------
[INFO]
[INFO] --- maven-clean-plugin:2.5:clean (default-clean) @ oozie-hadoop-auth ---
[INFO] Deleting <https://builds.apache.org/job/oozie-trunk-precommit-build/ws/hadooplibs/hadoop-auth-1/target>
[INFO]
[INFO] --- maven-resources-plugin:2.5:resources (default-resources) @ oozie-hadoop-auth ---
[debug] execute contextualize
[INFO] Using 'UTF-8' encoding to copy filtered resources.
[INFO] skip non existing resourceDirectory <https://builds.apache.org/job/oozie-trunk-precommit-build/ws/hadooplibs/hadoop-auth-1/src/main/resources>
[INFO]
[INFO] --- maven-compiler-plugin:2.3.2:compile (default-compile) @ oozie-hadoop-auth ---
[INFO] No sources to compile
[INFO]
[INFO] --- maven-resources-plugin:2.5:testResources (default-testResources) @ oozie-hadoop-auth ---
[debug] execute contextualize
[INFO] Using 'UTF-8' encoding to copy filtered resources.
[INFO] skip non existing resourceDirectory <https://builds.apache.org/job/oozie-trunk-precommit-build/ws/hadooplibs/hadoop-auth-1/src/test/resources>
[INFO]
[INFO] --- maven-compiler-plugin:2.3.2:testCompile (default-testCompile) @ oozie-hadoop-auth ---
[INFO] No sources to compile
[INFO]
[INFO] --- maven-surefire-plugin:2.12.2:test (default-test) @ oozie-hadoop-auth ---
[INFO] Tests are skipped.
[INFO]
[INFO] ------------------------------------------------------------------------
[INFO] Building Apache Oozie Client 4.2.0-SNAPSHOT
[INFO] ------------------------------------------------------------------------
[INFO]
[INFO] --- maven-clean-plugin:2.5:clean (default-clean) @ oozie-client ---
[INFO] Deleting <https://builds.apache.org/job/oozie-trunk-precommit-build/ws/client/target>
[INFO]
[INFO] --- maven-resources-plugin:2.5:resources (default-resources) @ oozie-client ---
[debug] execute contextualize
[INFO] Using 'UTF-8' encoding to copy filtered resources.
[INFO] Copying 33 resources
[INFO]
[INFO] --- maven-compiler-plugin:2.3.2:compile (default-compile) @ oozie-client ---
[INFO] Compiling 35 source files to <https://builds.apache.org/job/oozie-trunk-precommit-build/ws/client/target/classes>
[INFO] -------------------------------------------------------------
[WARNING] COMPILATION WARNING :
[INFO] -------------------------------------------------------------
[WARNING] <https://builds.apache.org/job/oozie-trunk-precommit-build/ws/client/src/main/java/org/apache/oozie/cli/OozieCLI.java>:[1339,62] [deprecation] getGroup() in org.apache.oozie.client.WorkflowJob has been deprecated
[WARNING] <https://builds.apache.org/job/oozie-trunk-precommit-build/ws/client/src/main/java/org/apache/oozie/cli/OozieCLI.java>:[1448,64] [deprecation] getGroup() in org.apache.oozie.client.CoordinatorJob has been deprecated
[WARNING] <https://builds.apache.org/job/oozie-trunk-precommit-build/ws/client/src/main/java/org/apache/oozie/cli/OozieCLI.java>:[1534,92] [deprecation] getGroup() in org.apache.oozie.client.Job has been deprecated
[WARNING] <https://builds.apache.org/job/oozie-trunk-precommit-build/ws/client/src/main/java/org/apache/oozie/cli/OozieCLI.java>:[1554,42] [deprecation] getGroup() in org.apache.oozie.client.Job has been deprecated
[WARNING] <https://builds.apache.org/job/oozie-trunk-precommit-build/ws/client/src/main/java/org/apache/oozie/cli/OozieCLI.java>:[1672,64] [deprecation] getGroup() in org.apache.oozie.client.WorkflowJob has been deprecated
[WARNING] <https://builds.apache.org/job/oozie-trunk-precommit-build/ws/client/src/main/java/org/apache/oozie/cli/OozieCLI.java>:[1690,42] [deprecation] getGroup() in org.apache.oozie.client.WorkflowJob has been deprecated
[WARNING] <https://builds.apache.org/job/oozie-trunk-precommit-build/ws/client/src/main/java/org/apache/oozie/cli/OozieCLI.java>:[1837,50] [unchecked] unchecked conversion
found : java.util.List
required: java.util.List<java.lang.String>
[WARNING] <https://builds.apache.org/job/oozie-trunk-precommit-build/ws/client/src/main/java/org/apache/oozie/cli/OozieCLI.java>:[1874,50] [unchecked] unchecked conversion
found : java.util.List
required: java.util.List<java.lang.String>
[WARNING] <https://builds.apache.org/job/oozie-trunk-precommit-build/ws/client/src/main/java/org/apache/oozie/client/rest/JsonToBean.java>:[110,52] [deprecation] WORKFLOW_GROUP in org.apache.oozie.client.rest.JsonTags has been deprecated
[WARNING] <https://builds.apache.org/job/oozie-trunk-precommit-build/ws/client/src/main/java/org/apache/oozie/client/rest/JsonToBean.java>:[159,55] [deprecation] COORDINATOR_JOB_GROUP in org.apache.oozie.client.rest.JsonTags has been deprecated
[WARNING] <https://builds.apache.org/job/oozie-trunk-precommit-build/ws/client/src/main/java/org/apache/oozie/client/rest/JsonToBean.java>:[181,55] [deprecation] BUNDLE_JOB_GROUP in org.apache.oozie.client.rest.JsonTags has been deprecated
[INFO] 11 warnings
[INFO] -------------------------------------------------------------
[INFO] -------------------------------------------------------------
[ERROR] COMPILATION ERROR :
[INFO] -------------------------------------------------------------
[ERROR] <https://builds.apache.org/job/oozie-trunk-precommit-build/ws/client/src/main/java/org/apache/oozie/client/event/jms/JMSMessagingUtils.java>:[76,43] type parameters of <T>T cannot be determined; no unique maximal instance exists for type variable T with upper bounds T,org.apache.oozie.client.event.message.EventMessage
[INFO] 1 error
[INFO] -------------------------------------------------------------
[INFO] ------------------------------------------------------------------------
[INFO] Reactor Summary:
[INFO]
[INFO] Apache Oozie Main ................................. SUCCESS [ 0.298 s]
[INFO] Apache Oozie Hadoop 1.2.1.oozie-4.2.0-SNAPSHOT Test SUCCESS [ 0.322 s]
[INFO] Apache Oozie Client ............................... FAILURE [ 1.105 s]
[INFO] Apache Oozie Hadoop 1.2.1.oozie-4.2.0-SNAPSHOT .... SKIPPED
[INFO] Apache Oozie Hadoop Distcp 1.2.1.oozie-4.2.0-SNAPSHOT SKIPPED
[INFO] Apache Oozie Hadoop 1.2.1.oozie-4.2.0-SNAPSHOT Test SKIPPED
[INFO] Apache Oozie Hadoop Utils 1.2.1.oozie-4.2.0-SNAPSHOT SKIPPED
[INFO] Apache Oozie Hadoop 2.3.0.oozie-4.2.0-SNAPSHOT .... SKIPPED
[INFO] Apache Oozie Hadoop 2.3.0.oozie-4.2.0-SNAPSHOT Test SKIPPED
[INFO] Apache Oozie Hadoop Distcp 2.3.0.oozie-4.2.0-SNAPSHOT SKIPPED
[INFO] Apache Oozie Hadoop Utils 2.3.0.oozie-4.2.0-SNAPSHOT SKIPPED
[INFO] Apache Oozie Hadoop 2.3.0.oozie-4.2.0-SNAPSHOT Test SKIPPED
[INFO] Apache Oozie Hadoop 0.23.5.oozie-4.2.0-SNAPSHOT ... SKIPPED
[INFO] Apache Oozie Hadoop 0.23.5.oozie-4.2.0-SNAPSHOT Test SKIPPED
[INFO] Apache Oozie Hadoop Distcp 0.23.5.oozie-4.2.0-SNAPSHOT SKIPPED
[INFO] Apache Oozie Hadoop Utils 0.23.5.oozie-4.2.0-SNAPSHOT SKIPPED
[INFO] Apache Oozie Hadoop 0.23.5.oozie-4.2.0-SNAPSHOT Test SKIPPED
[INFO] Apache Oozie Hadoop Libs .......................... SKIPPED
[INFO] Apache Oozie Hbase 0.94.2.oozie-4.2.0-SNAPSHOT .... SKIPPED
[INFO] Apache Oozie Hbase Libs ........................... SKIPPED
[INFO] Apache Oozie HCatalog 0.13.1.oozie-4.2.0-SNAPSHOT . SKIPPED
[INFO] Apache Oozie HCatalog Libs ........................ SKIPPED
[INFO] Apache Oozie Share Lib Oozie ...................... SKIPPED
[INFO] Apache Oozie Share Lib HCatalog ................... SKIPPED
[INFO] Apache Oozie Core ................................. SKIPPED
[INFO] Apache Oozie Docs ................................. SKIPPED
[INFO] Apache Oozie Share Lib Pig ........................ SKIPPED
[INFO] Apache Oozie Share Lib Hive ....................... SKIPPED
[INFO] Apache Oozie Share Lib Sqoop ...................... SKIPPED
[INFO] Apache Oozie Share Lib Streaming .................. SKIPPED
[INFO] Apache Oozie Share Lib Distcp ..................... SKIPPED
[INFO] Apache Oozie WebApp ............................... SKIPPED
[INFO] Apache Oozie Examples ............................. SKIPPED
[INFO] Apache Oozie Share Lib ............................ SKIPPED
[INFO] Apache Oozie Tools ................................ SKIPPED
[INFO] Apache Oozie MiniOozie ............................ SKIPPED
[INFO] Apache Oozie WorkflowGenerator .................... SKIPPED
[INFO] Apache Oozie Distro ............................... SKIPPED
[INFO] ------------------------------------------------------------------------
[INFO] BUILD FAILURE
[INFO] ------------------------------------------------------------------------
[INFO] Total time: 2.938 s
[INFO] Finished at: 2014-09-03T03:32:34+00:00
[INFO] Final Memory: 16M/113M
[INFO] ------------------------------------------------------------------------
[WARNING] The requested profile "testPatchCompile" could not be activated because it does not exist.
[ERROR] Failed to execute goal org.apache.maven.plugins:maven-compiler-plugin:2.3.2:compile (default-compile) on project oozie-client: Compilation failure
[ERROR] <https://builds.apache.org/job/oozie-trunk-precommit-build/ws/client/src/main/java/org/apache/oozie/client/event/jms/JMSMessagingUtils.java>:[76,43] type parameters of <T>T cannot be determined; no unique maximal instance exists for type variable T with upper bounds T,org.apache.oozie.client.event.message.EventMessage
[ERROR] -> [Help 1]
[ERROR]
[ERROR] To see the full stack trace of the errors, re-run Maven with the -e switch.
[ERROR] Re-run Maven using the -X switch to enable full debug logging.
[ERROR]
[ERROR] For more information about the errors and possible solutions, please read the following articles:
[ERROR] [Help 1] http://cwiki.apache.org/confluence/display/MAVEN/MojoFailureException
[ERROR]
[ERROR] After correcting the problems, you can resume the build with the command
[ERROR] mvn <goals> -rf :oozie-client
Running test-patch task BACKWARDS_COMPATIBILITY
Running test-patch task TESTS
Running test-patch task DISTRO
Applying patch
checking file webapp/src/main/webapp/oozie-console.js
Hunk #1 succeeded at 123 with fuzz 1 (offset 93 lines).
Hunk #2 succeeded at 326 (offset 169 lines).
Hunk #3 FAILED at 170.
Hunk #4 FAILED at 245.
Hunk #5 FAILED at 338.
Hunk #6 succeeded at 574 with fuzz 2 (offset 176 lines).
Hunk #7 FAILED at 703.
Hunk #8 FAILED at 796.
Hunk #9 FAILED at 856.
Hunk #10 succeeded at 1437 (offset 372 lines).
Hunk #11 FAILED at 1134.
Hunk #12 FAILED at 1145.
Hunk #13 FAILED at 1221.
9 out of 13 hunks FAILED
can't find file to patch at input line 251
Perhaps you used the wrong -p or --strip option?
The text leading up to this was:
--------------------------
|Index: webapp/src/main/webapp/index.html
|===================================================================
|--- webapp/src/main/webapp/index.html (revision 1405876)
|+++ webapp/src/main/webapp/index.html (working copy)
--------------------------
No file to patch. Skipping patch.
1 out of 1 hunk ignored
Patch failed to apply to head of branch
Adding comment to JIRA
Comment added.
test-patch exit code: 1
Build step 'Execute shell' marked build as failure
Archiving artifacts
Sending artifact delta relative to oozie-trunk-precommit-build #1819
Archived 5 artifacts
Archive block size is 32768
Received 0 blocks and 166848 bytes
Compression is 0.0%
Took 2.2 sec
Recording test results
Build failed in Jenkins: oozie-trunk-precommit-build #1873
Posted by Apache Jenkins Server <je...@builds.apache.org>.
See <https://builds.apache.org/job/oozie-trunk-precommit-build/1873/>
------------------------------------------
[...truncated 10216 lines...]
[INFO] share already added, skipping
[INFO] share/lib already added, skipping
[INFO] already added, skipping
[INFO] share already added, skipping
[INFO] share/lib already added, skipping
[INFO] already added, skipping
[INFO] share already added, skipping
[INFO] share/lib already added, skipping
[INFO] already added, skipping
[INFO] share already added, skipping
[INFO] share/lib already added, skipping
[INFO]
[INFO] ------------------------------------------------------------------------
[INFO] Building Apache Oozie Tools 4.2.0-SNAPSHOT
[INFO] ------------------------------------------------------------------------
[INFO]
[INFO] --- maven-resources-plugin:2.5:resources (default-resources) @ oozie-tools ---
[debug] execute contextualize
[INFO] Using 'UTF-8' encoding to copy filtered resources.
[INFO] skip non existing resourceDirectory <https://builds.apache.org/job/oozie-trunk-precommit-build/ws/tools/src/main/resources>
[INFO]
[INFO] --- maven-compiler-plugin:2.3.2:compile (default-compile) @ oozie-tools ---
[INFO] Nothing to compile - all classes are up to date
[INFO]
[INFO] --- maven-resources-plugin:2.5:testResources (default-testResources) @ oozie-tools ---
[debug] execute contextualize
[INFO] Using 'UTF-8' encoding to copy filtered resources.
[INFO] Copying 2 resources
[INFO]
[INFO] --- maven-compiler-plugin:2.3.2:testCompile (default-testCompile) @ oozie-tools ---
[INFO] Nothing to compile - all classes are up to date
[INFO]
[INFO] --- maven-surefire-plugin:2.12.2:test (default-test) @ oozie-tools ---
[INFO] Tests are skipped.
[INFO]
[INFO] --- maven-jar-plugin:2.3.1:jar (default-jar) @ oozie-tools ---
[INFO] Building jar: <https://builds.apache.org/job/oozie-trunk-precommit-build/ws/tools/target/oozie-tools-4.2.0-SNAPSHOT.jar>
[INFO]
[INFO] --- maven-assembly-plugin:2.2.1:single (default-cli) @ oozie-tools ---
[INFO] Reading assembly descriptor: ../src/main/assemblies/tools.xml
[WARNING] The following patterns were never triggered in this artifact exclusion filter:
o '*:*:pom:*'
[INFO] Copying files to <https://builds.apache.org/job/oozie-trunk-precommit-build/ws/tools/target/oozie-tools-4.2.0-SNAPSHOT-tools>
[WARNING] Assembly file: <https://builds.apache.org/job/oozie-trunk-precommit-build/ws/tools/target/oozie-tools-4.2.0-SNAPSHOT-tools> is not a regular file (it may be a directory). It cannot be attached to the project build for installation or deployment.
[INFO]
[INFO] ------------------------------------------------------------------------
[INFO] Building Apache Oozie MiniOozie 4.2.0-SNAPSHOT
[INFO] ------------------------------------------------------------------------
[INFO]
[INFO] --- maven-resources-plugin:2.5:resources (default-resources) @ oozie-mini ---
[debug] execute contextualize
[INFO] Using 'UTF-8' encoding to copy filtered resources.
[INFO] skip non existing resourceDirectory <https://builds.apache.org/job/oozie-trunk-precommit-build/ws/minitest/src/main/resources>
[INFO]
[INFO] --- maven-compiler-plugin:2.3.2:compile (default-compile) @ oozie-mini ---
[INFO] No sources to compile
[INFO]
[INFO] --- maven-resources-plugin:2.5:testResources (default-testResources) @ oozie-mini ---
[debug] execute contextualize
[INFO] Using 'UTF-8' encoding to copy filtered resources.
[INFO] Copying 3 resources
[INFO]
[INFO] --- maven-compiler-plugin:2.3.2:testCompile (default-testCompile) @ oozie-mini ---
[INFO] Nothing to compile - all classes are up to date
[INFO]
[INFO] --- maven-surefire-plugin:2.12.2:test (default-test) @ oozie-mini ---
[INFO] Tests are skipped.
[INFO]
[INFO] --- maven-jar-plugin:2.3.1:jar (default-jar) @ oozie-mini ---
[WARNING] JAR will be empty - no content was marked for inclusion!
[INFO] Building jar: <https://builds.apache.org/job/oozie-trunk-precommit-build/ws/minitest/target/oozie-mini-4.2.0-SNAPSHOT.jar>
[INFO]
[INFO] --- maven-assembly-plugin:2.2.1:single (default-cli) @ oozie-mini ---
[INFO] Reading assembly descriptor: src/main/assemblies/empty.xml
[INFO]
[INFO] ------------------------------------------------------------------------
[INFO] Building Apache Oozie Distro 4.2.0-SNAPSHOT
[INFO] ------------------------------------------------------------------------
[INFO]
[INFO] --- maven-resources-plugin:2.5:resources (default-resources) @ oozie-distro ---
[debug] execute contextualize
[INFO] Using 'UTF-8' encoding to copy filtered resources.
[INFO] skip non existing resourceDirectory <https://builds.apache.org/job/oozie-trunk-precommit-build/ws/distro/src/main/resources>
[INFO]
[INFO] --- maven-compiler-plugin:2.3.2:compile (default-compile) @ oozie-distro ---
[INFO] No sources to compile
[INFO]
[INFO] --- maven-resources-plugin:2.5:testResources (default-testResources) @ oozie-distro ---
[debug] execute contextualize
[INFO] Using 'UTF-8' encoding to copy filtered resources.
[INFO] skip non existing resourceDirectory <https://builds.apache.org/job/oozie-trunk-precommit-build/ws/distro/src/test/resources>
[INFO]
[INFO] --- maven-compiler-plugin:2.3.2:testCompile (default-testCompile) @ oozie-distro ---
[INFO] No sources to compile
[INFO]
[INFO] --- maven-surefire-plugin:2.12.2:test (default-test) @ oozie-distro ---
[INFO] Tests are skipped.
[INFO]
[INFO] --- maven-jar-plugin:2.3.1:jar (default-jar) @ oozie-distro ---
[WARNING] JAR will be empty - no content was marked for inclusion!
[INFO] Building jar: <https://builds.apache.org/job/oozie-trunk-precommit-build/ws/distro/target/oozie-distro-4.2.0-SNAPSHOT.jar>
[INFO]
[INFO] --- maven-antrun-plugin:1.6:run (default) @ oozie-distro ---
[INFO] Executing tasks
main:
[get] Getting: http://archive.apache.org/dist/tomcat/tomcat-6/v6.0.41/bin/apache-tomcat-6.0.41.tar.gz
[get] To: <https://builds.apache.org/job/oozie-trunk-precommit-build/ws/distro/downloads/tomcat-6.0.41.tar.gz>
...........................................................................................................................................................................................................................................................................................................................................................................................................................
[mkdir] Created dir: <https://builds.apache.org/job/oozie-trunk-precommit-build/ws/distro/target/tomcat>
[gunzip] Expanding <https://builds.apache.org/job/oozie-trunk-precommit-build/ws/distro/downloads/tomcat-6.0.41.tar.gz> to <https://builds.apache.org/job/oozie-trunk-precommit-build/ws/distro/target/tomcat/tomcat-6.0.41.tar>
[untar] Expanding: <https://builds.apache.org/job/oozie-trunk-precommit-build/ws/distro/target/tomcat/tomcat-6.0.41.tar> into <https://builds.apache.org/job/oozie-trunk-precommit-build/ws/distro/target/tomcat>
[delete] Deleting directory <https://builds.apache.org/job/oozie-trunk-precommit-build/ws/distro/target/tomcat/oozie-server/webapps>
[mkdir] Created dir: <https://builds.apache.org/job/oozie-trunk-precommit-build/ws/distro/target/tomcat/oozie-server/webapps>
[delete] Deleting: <https://builds.apache.org/job/oozie-trunk-precommit-build/ws/distro/target/tomcat/oozie-server/conf/server.xml>
[copy] Copying 1 file to <https://builds.apache.org/job/oozie-trunk-precommit-build/ws/distro/target/tomcat/oozie-server/conf>
[copy] Copying 1 file to <https://builds.apache.org/job/oozie-trunk-precommit-build/ws/distro/target/tomcat/oozie-server/conf>
[mkdir] Created dir: <https://builds.apache.org/job/oozie-trunk-precommit-build/ws/distro/target/tomcat/oozie-server/conf/ssl>
[copy] Copying 1 file to <https://builds.apache.org/job/oozie-trunk-precommit-build/ws/distro/target/tomcat/oozie-server/conf/ssl>
[copy] Copying 1 file to <https://builds.apache.org/job/oozie-trunk-precommit-build/ws/distro/target/tomcat/oozie-server/conf/ssl>
[copy] Copying 1 file to <https://builds.apache.org/job/oozie-trunk-precommit-build/ws/distro/target/tomcat/oozie-server/conf/ssl>
[copy] Copying 3 files to <https://builds.apache.org/job/oozie-trunk-precommit-build/ws/distro/target/tomcat/oozie-server/webapps/ROOT>
[INFO] Executed tasks
[INFO]
[INFO] --- maven-assembly-plugin:2.2.1:single (default-cli) @ oozie-distro ---
[INFO] Reading assembly descriptor: ../src/main/assemblies/distro.xml
[INFO] Copying files to <https://builds.apache.org/job/oozie-trunk-precommit-build/ws/distro/target/oozie-4.2.0-SNAPSHOT-distro>
[WARNING] Assembly file: <https://builds.apache.org/job/oozie-trunk-precommit-build/ws/distro/target/oozie-4.2.0-SNAPSHOT-distro> is not a regular file (it may be a directory). It cannot be attached to the project build for installation or deployment.
[INFO] Building tar : <https://builds.apache.org/job/oozie-trunk-precommit-build/ws/distro/target/oozie-4.2.0-SNAPSHOT-distro.tar.gz>
[INFO] ------------------------------------------------------------------------
[INFO] Reactor Summary:
[INFO]
[INFO] Apache Oozie Main ................................. SUCCESS [ 0.866 s]
[INFO] Apache Oozie Hadoop 1.2.1.oozie-4.2.0-SNAPSHOT Test SUCCESS [ 0.561 s]
[INFO] Apache Oozie Client ............................... SUCCESS [ 19.804 s]
[INFO] Apache Oozie Hadoop 1.2.1.oozie-4.2.0-SNAPSHOT .... SUCCESS [ 0.807 s]
[INFO] Apache Oozie Hadoop Distcp 1.2.1.oozie-4.2.0-SNAPSHOT SUCCESS [ 0.052 s]
[INFO] Apache Oozie Hadoop 1.2.1.oozie-4.2.0-SNAPSHOT Test SUCCESS [ 0.107 s]
[INFO] Apache Oozie Hadoop Utils 1.2.1.oozie-4.2.0-SNAPSHOT SUCCESS [ 0.078 s]
[INFO] Apache Oozie Hadoop 2.3.0.oozie-4.2.0-SNAPSHOT .... SUCCESS [ 1.892 s]
[INFO] Apache Oozie Hadoop 2.3.0.oozie-4.2.0-SNAPSHOT Test SUCCESS [ 0.150 s]
[INFO] Apache Oozie Hadoop Distcp 2.3.0.oozie-4.2.0-SNAPSHOT SUCCESS [ 0.043 s]
[INFO] Apache Oozie Hadoop Utils 2.3.0.oozie-4.2.0-SNAPSHOT SUCCESS [ 0.093 s]
[INFO] Apache Oozie Hadoop 2.3.0.oozie-4.2.0-SNAPSHOT Test SUCCESS [ 0.045 s]
[INFO] Apache Oozie Hadoop 0.23.5.oozie-4.2.0-SNAPSHOT ... SUCCESS [ 1.435 s]
[INFO] Apache Oozie Hadoop 0.23.5.oozie-4.2.0-SNAPSHOT Test SUCCESS [ 0.122 s]
[INFO] Apache Oozie Hadoop Distcp 0.23.5.oozie-4.2.0-SNAPSHOT SUCCESS [ 0.045 s]
[INFO] Apache Oozie Hadoop Utils 0.23.5.oozie-4.2.0-SNAPSHOT SUCCESS [ 0.103 s]
[INFO] Apache Oozie Hadoop 0.23.5.oozie-4.2.0-SNAPSHOT Test SUCCESS [ 0.058 s]
[INFO] Apache Oozie Hadoop Libs .......................... SUCCESS [ 2.972 s]
[INFO] Apache Oozie Hbase 0.94.2.oozie-4.2.0-SNAPSHOT .... SUCCESS [ 0.235 s]
[INFO] Apache Oozie Hbase Libs ........................... SUCCESS [ 0.591 s]
[INFO] Apache Oozie HCatalog 0.13.1.oozie-4.2.0-SNAPSHOT . SUCCESS [ 0.437 s]
[INFO] Apache Oozie HCatalog Libs ........................ SUCCESS [ 1.512 s]
[INFO] Apache Oozie Share Lib Oozie ...................... SUCCESS [ 0.988 s]
[INFO] Apache Oozie Share Lib HCatalog ................... SUCCESS [ 1.488 s]
[INFO] Apache Oozie Core ................................. SUCCESS [ 17.705 s]
[INFO] Apache Oozie Docs ................................. SUCCESS [ 11.181 s]
[INFO] Apache Oozie Share Lib Pig ........................ SUCCESS [ 2.857 s]
[INFO] Apache Oozie Share Lib Hive ....................... SUCCESS [ 2.087 s]
[INFO] Apache Oozie Share Lib Sqoop ...................... SUCCESS [ 0.554 s]
[INFO] Apache Oozie Share Lib Streaming .................. SUCCESS [ 0.273 s]
[INFO] Apache Oozie Share Lib Distcp ..................... SUCCESS [ 0.238 s]
[INFO] Apache Oozie WebApp ............................... SUCCESS [ 26.679 s]
[INFO] Apache Oozie Examples ............................. SUCCESS [ 1.185 s]
[INFO] Apache Oozie Share Lib ............................ SUCCESS [ 8.810 s]
[INFO] Apache Oozie Tools ................................ SUCCESS [ 2.305 s]
[INFO] Apache Oozie MiniOozie ............................ SUCCESS [ 0.089 s]
[INFO] Apache Oozie Distro ............................... SUCCESS [ 29.588 s]
[INFO] ------------------------------------------------------------------------
[INFO] BUILD SUCCESS
[INFO] ------------------------------------------------------------------------
[INFO] Total time: 02:19 min
[INFO] Finished at: 2014-09-03T05:02:54+00:00
[INFO] Final Memory: 76M/951M
[INFO] ------------------------------------------------------------------------
Reports
Running test-patch task CLEAN
Running test-patch task RAW_PATCH_ANALYSIS
Running test-patch task RAT
Running test-patch task JAVADOC
Running test-patch task COMPILE
Running test-patch task BACKWARDS_COMPATIBILITY
Running test-patch task TESTS
Running test-patch task DISTRO
Testing JIRA OOZIE-1860
Cleaning local git workspace
----------------------------
+1 PATCH_APPLIES
+1 CLEAN
+1 RAW_PATCH_ANALYSIS
+1 the patch does not introduce any @author tags
+1 the patch does not introduce any tabs
+1 the patch does not introduce any trailing spaces
+1 the patch does not introduce any line longer than 132
+1 the patch does adds/modifies 1 testcase(s)
+1 RAT
+1 the patch does not seem to introduce new RAT warnings
+1 JAVADOC
+1 the patch does not seem to introduce new Javadoc warnings
+1 COMPILE
+1 HEAD compiles
+1 patch compiles
+1 the patch does not seem to introduce new javac warnings
+1 BACKWARDS_COMPATIBILITY
+1 the patch does not change any JPA Entity/Colum/Basic/Lob/Transient annotations
+1 the patch does not modify JPA files
-1 TESTS
Tests run: 1515
Tests failed: 1
Tests errors: 1
The patch failed the following testcases:
testPauseBundleAndCoordinator(org.apache.oozie.service.TestPauseTransitService)
+1 DISTRO
+1 distro tarball builds with the patch
----------------------------
-1 Overall result, please check the reported -1(s)
The full output of the test-patch run is available at
https://builds.apache.org/job/oozie-trunk-precommit-build/1873/
Adding comment to JIRA
Comment added.
test-patch exit code: 1
Build step 'Execute shell' marked build as failure
Archiving artifacts
Sending artifact delta relative to oozie-trunk-precommit-build #1819
Archived 10 artifacts
Archive block size is 32768
Received 8 blocks and 642240 bytes
Compression is 29.0%
Took 0.26 sec
Recording test results
Publish JUnit test result report is waiting for a checkpoint on oozie-trunk-precommit-build #1862
Build failed in Jenkins: oozie-trunk-precommit-build #1872
Posted by Apache Jenkins Server <je...@builds.apache.org>.
See <https://builds.apache.org/job/oozie-trunk-precommit-build/1872/>
------------------------------------------
[...truncated 2940 lines...]
[INFO] Using 'UTF-8' encoding to copy filtered resources.
[INFO] skip non existing resourceDirectory <https://builds.apache.org/job/oozie-trunk-precommit-build/ws/webapp/src/test/resources>
[INFO]
[INFO] --- maven-compiler-plugin:2.3.2:testCompile (default-testCompile) @ oozie-webapp ---
[INFO] No sources to compile
[INFO]
[INFO] --- maven-surefire-plugin:2.12.2:test (default-test) @ oozie-webapp ---
[INFO] Tests are skipped.
[INFO]
[INFO] ------------------------------------------------------------------------
[INFO] Building Apache Oozie Examples 4.2.0-SNAPSHOT
[INFO] ------------------------------------------------------------------------
[INFO]
[INFO] --- maven-clean-plugin:2.5:clean (default-clean) @ oozie-examples ---
[INFO] Deleting <https://builds.apache.org/job/oozie-trunk-precommit-build/ws/examples/target>
[INFO]
[INFO] --- maven-resources-plugin:2.5:resources (default-resources) @ oozie-examples ---
[debug] execute contextualize
[INFO] Using 'UTF-8' encoding to copy filtered resources.
[INFO] skip non existing resourceDirectory <https://builds.apache.org/job/oozie-trunk-precommit-build/ws/examples/src/main/resources>
[INFO]
[INFO] --- maven-compiler-plugin:2.3.2:compile (default-compile) @ oozie-examples ---
[INFO] Compiling 11 source files to <https://builds.apache.org/job/oozie-trunk-precommit-build/ws/examples/target/classes>
[INFO]
[INFO] --- maven-resources-plugin:2.5:testResources (default-testResources) @ oozie-examples ---
[debug] execute contextualize
[INFO] Using 'UTF-8' encoding to copy filtered resources.
[INFO] Copying 7 resources
[INFO]
[INFO] --- maven-compiler-plugin:2.3.2:testCompile (default-testCompile) @ oozie-examples ---
[INFO] Compiling 1 source file to <https://builds.apache.org/job/oozie-trunk-precommit-build/ws/examples/target/test-classes>
[INFO]
[INFO] --- maven-surefire-plugin:2.12.2:test (default-test) @ oozie-examples ---
[INFO] Tests are skipped.
[INFO]
[INFO] ------------------------------------------------------------------------
[INFO] Building Apache Oozie Share Lib 4.2.0-SNAPSHOT
[INFO] ------------------------------------------------------------------------
[INFO]
[INFO] --- maven-clean-plugin:2.5:clean (default-clean) @ oozie-sharelib ---
[INFO] Deleting <https://builds.apache.org/job/oozie-trunk-precommit-build/ws/sharelib/target>
[INFO]
[INFO] ------------------------------------------------------------------------
[INFO] Building Apache Oozie Tools 4.2.0-SNAPSHOT
[INFO] ------------------------------------------------------------------------
[INFO]
[INFO] --- maven-clean-plugin:2.5:clean (default-clean) @ oozie-tools ---
[INFO] Deleting <https://builds.apache.org/job/oozie-trunk-precommit-build/ws/tools/target>
[INFO]
[INFO] --- maven-resources-plugin:2.5:resources (default-resources) @ oozie-tools ---
[debug] execute contextualize
[INFO] Using 'UTF-8' encoding to copy filtered resources.
[INFO] skip non existing resourceDirectory <https://builds.apache.org/job/oozie-trunk-precommit-build/ws/tools/src/main/resources>
[INFO]
[INFO] --- maven-compiler-plugin:2.3.2:compile (default-compile) @ oozie-tools ---
[INFO] Compiling 2 source files to <https://builds.apache.org/job/oozie-trunk-precommit-build/ws/tools/target/classes>
[INFO]
[INFO] --- maven-resources-plugin:2.5:testResources (default-testResources) @ oozie-tools ---
[debug] execute contextualize
[INFO] Using 'UTF-8' encoding to copy filtered resources.
[INFO] Copying 2 resources
[INFO]
[INFO] --- maven-compiler-plugin:2.3.2:testCompile (default-testCompile) @ oozie-tools ---
[INFO] Compiling 6 source files to <https://builds.apache.org/job/oozie-trunk-precommit-build/ws/tools/target/test-classes>
[INFO]
[INFO] --- maven-surefire-plugin:2.12.2:test (default-test) @ oozie-tools ---
[INFO] Tests are skipped.
[INFO]
[INFO] ------------------------------------------------------------------------
[INFO] Building Apache Oozie MiniOozie 4.2.0-SNAPSHOT
[INFO] ------------------------------------------------------------------------
[INFO]
[INFO] --- maven-clean-plugin:2.5:clean (default-clean) @ oozie-mini ---
[INFO] Deleting <https://builds.apache.org/job/oozie-trunk-precommit-build/ws/minitest/target>
[INFO]
[INFO] --- maven-resources-plugin:2.5:resources (default-resources) @ oozie-mini ---
[debug] execute contextualize
[INFO] Using 'UTF-8' encoding to copy filtered resources.
[INFO] skip non existing resourceDirectory <https://builds.apache.org/job/oozie-trunk-precommit-build/ws/minitest/src/main/resources>
[INFO]
[INFO] --- maven-compiler-plugin:2.3.2:compile (default-compile) @ oozie-mini ---
[INFO] No sources to compile
[INFO]
[INFO] --- maven-resources-plugin:2.5:testResources (default-testResources) @ oozie-mini ---
[debug] execute contextualize
[INFO] Using 'UTF-8' encoding to copy filtered resources.
[INFO] Copying 3 resources
[INFO]
[INFO] --- maven-compiler-plugin:2.3.2:testCompile (default-testCompile) @ oozie-mini ---
[INFO] Compiling 1 source file to <https://builds.apache.org/job/oozie-trunk-precommit-build/ws/minitest/target/test-classes>
[INFO]
[INFO] --- maven-surefire-plugin:2.12.2:test (default-test) @ oozie-mini ---
[INFO] Tests are skipped.
[INFO]
[INFO] ------------------------------------------------------------------------
[INFO] Building Apache Oozie WorkflowGenerator 4.2.0-SNAPSHOT
[INFO] ------------------------------------------------------------------------
[INFO]
[INFO] --- maven-clean-plugin:2.5:clean (default-clean) @ oozie-workflowgenerator ---
[INFO] Deleting <https://builds.apache.org/job/oozie-trunk-precommit-build/ws/workflowgenerator/target>
[INFO]
[INFO] --- maven-resources-plugin:2.5:resources (default-resources) @ oozie-workflowgenerator ---
[debug] execute contextualize
[INFO] Using 'UTF-8' encoding to copy filtered resources.
[INFO] Copying 24 resources to ../../img
[INFO]
[INFO] --- maven-compiler-plugin:2.3.2:compile (default-compile) @ oozie-workflowgenerator ---
[INFO] Compiling 39 source files to <https://builds.apache.org/job/oozie-trunk-precommit-build/ws/workflowgenerator/target/oozie-wfgen/WEB-INF/classes>
[WARNING] <https://builds.apache.org/job/oozie-trunk-precommit-build/ws/workflowgenerator/src/main/java/org/apache/oozie/tools/workflowgenerator/client/OozieWorkflowGenerator.java>:[243,30] [deprecation] TreeItem(java.lang.String) in com.google.gwt.user.client.ui.TreeItem has been deprecated
[WARNING] <https://builds.apache.org/job/oozie-trunk-precommit-build/ws/workflowgenerator/src/main/java/org/apache/oozie/tools/workflowgenerator/client/OozieWorkflowGenerator.java>:[270,30] [deprecation] TreeItem(java.lang.String) in com.google.gwt.user.client.ui.TreeItem has been deprecated
[WARNING] <https://builds.apache.org/job/oozie-trunk-precommit-build/ws/workflowgenerator/src/main/java/org/apache/oozie/tools/workflowgenerator/client/OozieWorkflowGenerator.java>:[271,26] [deprecation] TreeItem(java.lang.String) in com.google.gwt.user.client.ui.TreeItem has been deprecated
[WARNING] <https://builds.apache.org/job/oozie-trunk-precommit-build/ws/workflowgenerator/src/main/java/org/apache/oozie/tools/workflowgenerator/client/OozieWorkflowGenerator.java>:[272,14] [deprecation] addItem(java.lang.String) in com.google.gwt.user.client.ui.TreeItem has been deprecated
[WARNING] <https://builds.apache.org/job/oozie-trunk-precommit-build/ws/workflowgenerator/src/main/java/org/apache/oozie/tools/workflowgenerator/client/OozieWorkflowGenerator.java>:[273,14] [deprecation] addItem(java.lang.String) in com.google.gwt.user.client.ui.TreeItem has been deprecated
[WARNING] <https://builds.apache.org/job/oozie-trunk-precommit-build/ws/workflowgenerator/src/main/java/org/apache/oozie/tools/workflowgenerator/client/OozieWorkflowGenerator.java>:[275,18] [deprecation] addItem(java.lang.String) in com.google.gwt.user.client.ui.TreeItem has been deprecated
[WARNING] <https://builds.apache.org/job/oozie-trunk-precommit-build/ws/workflowgenerator/src/main/java/org/apache/oozie/tools/workflowgenerator/client/OozieWorkflowGenerator.java>:[276,18] [deprecation] addItem(java.lang.String) in com.google.gwt.user.client.ui.TreeItem has been deprecated
[WARNING] <https://builds.apache.org/job/oozie-trunk-precommit-build/ws/workflowgenerator/src/main/java/org/apache/oozie/tools/workflowgenerator/client/OozieWorkflowGenerator.java>:[277,18] [deprecation] addItem(java.lang.String) in com.google.gwt.user.client.ui.TreeItem has been deprecated
[WARNING] <https://builds.apache.org/job/oozie-trunk-precommit-build/ws/workflowgenerator/src/main/java/org/apache/oozie/tools/workflowgenerator/client/OozieWorkflowGenerator.java>:[278,18] [deprecation] addItem(java.lang.String) in com.google.gwt.user.client.ui.TreeItem has been deprecated
[WARNING] <https://builds.apache.org/job/oozie-trunk-precommit-build/ws/workflowgenerator/src/main/java/org/apache/oozie/tools/workflowgenerator/client/OozieWorkflowGenerator.java>:[279,18] [deprecation] addItem(java.lang.String) in com.google.gwt.user.client.ui.TreeItem has been deprecated
[WARNING] <https://builds.apache.org/job/oozie-trunk-precommit-build/ws/workflowgenerator/src/main/java/org/apache/oozie/tools/workflowgenerator/client/OozieWorkflowGenerator.java>:[280,18] [deprecation] addItem(java.lang.String) in com.google.gwt.user.client.ui.TreeItem has been deprecated
[WARNING] <https://builds.apache.org/job/oozie-trunk-precommit-build/ws/workflowgenerator/src/main/java/org/apache/oozie/tools/workflowgenerator/client/OozieWorkflowGenerator.java>:[281,18] [deprecation] addItem(java.lang.String) in com.google.gwt.user.client.ui.TreeItem has been deprecated
[WARNING] <https://builds.apache.org/job/oozie-trunk-precommit-build/ws/workflowgenerator/src/main/java/org/apache/oozie/tools/workflowgenerator/client/OozieWorkflowGenerator.java>:[284,31] [deprecation] TreeItem(java.lang.String) in com.google.gwt.user.client.ui.TreeItem has been deprecated
[WARNING] <https://builds.apache.org/job/oozie-trunk-precommit-build/ws/workflowgenerator/src/main/java/org/apache/oozie/tools/workflowgenerator/client/OozieWorkflowGenerator.java>:[285,19] [deprecation] addItem(java.lang.String) in com.google.gwt.user.client.ui.TreeItem has been deprecated
[WARNING] <https://builds.apache.org/job/oozie-trunk-precommit-build/ws/workflowgenerator/src/main/java/org/apache/oozie/tools/workflowgenerator/client/OozieWorkflowGenerator.java>:[286,19] [deprecation] addItem(java.lang.String) in com.google.gwt.user.client.ui.TreeItem has been deprecated
[WARNING] <https://builds.apache.org/job/oozie-trunk-precommit-build/ws/workflowgenerator/src/main/java/org/apache/oozie/tools/workflowgenerator/client/OozieWorkflowGenerator.java>:[287,19] [deprecation] addItem(java.lang.String) in com.google.gwt.user.client.ui.TreeItem has been deprecated
[WARNING] <https://builds.apache.org/job/oozie-trunk-precommit-build/ws/workflowgenerator/src/main/java/org/apache/oozie/tools/workflowgenerator/client/OozieWorkflowGenerator.java>:[288,19] [deprecation] addItem(java.lang.String) in com.google.gwt.user.client.ui.TreeItem has been deprecated
[WARNING] <https://builds.apache.org/job/oozie-trunk-precommit-build/ws/workflowgenerator/src/main/java/org/apache/oozie/tools/workflowgenerator/client/OozieWorkflowGenerator.java>:[289,19] [deprecation] addItem(java.lang.String) in com.google.gwt.user.client.ui.TreeItem has been deprecated
[WARNING] <https://builds.apache.org/job/oozie-trunk-precommit-build/ws/workflowgenerator/src/main/java/org/apache/oozie/tools/workflowgenerator/client/property/action/SubWFPropertyTable.java>:[129,11] [deprecation] setChecked(boolean) in com.google.gwt.user.client.ui.CheckBox has been deprecated
[WARNING] <https://builds.apache.org/job/oozie-trunk-precommit-build/ws/workflowgenerator/src/main/java/org/apache/oozie/tools/workflowgenerator/client/property/action/SSHPropertyTable.java>:[150,11] [deprecation] setChecked(boolean) in com.google.gwt.user.client.ui.CheckBox has been deprecated
[WARNING] <https://builds.apache.org/job/oozie-trunk-precommit-build/ws/workflowgenerator/src/main/java/org/apache/oozie/tools/workflowgenerator/client/property/action/JavaPropertyTable.java>:[126,11] [deprecation] setChecked(boolean) in com.google.gwt.user.client.ui.CheckBox has been deprecated
[WARNING] <https://builds.apache.org/job/oozie-trunk-precommit-build/ws/workflowgenerator/src/main/java/org/apache/oozie/tools/workflowgenerator/client/property/action/ShellPropertyTable.java>:[184,11] [deprecation] setChecked(boolean) in com.google.gwt.user.client.ui.CheckBox has been deprecated
[INFO]
[INFO] --- maven-war-plugin:2.1.1:exploded (default) @ oozie-workflowgenerator ---
[INFO] Exploding webapp
[INFO] Assembling webapp [oozie-workflowgenerator] in [<https://builds.apache.org/job/oozie-trunk-precommit-build/ws/workflowgenerator/target/oozie-wfgen]>
[INFO] Processing war project
[INFO] Copying webapp resources [<https://builds.apache.org/job/oozie-trunk-precommit-build/ws/workflowgenerator/src/main/webapp]>
[INFO] Webapp assembled in [70 msecs]
[INFO]
[INFO] --- maven-resources-plugin:2.5:testResources (default-testResources) @ oozie-workflowgenerator ---
[debug] execute contextualize
[INFO] Using 'UTF-8' encoding to copy filtered resources.
[INFO] skip non existing resourceDirectory <https://builds.apache.org/job/oozie-trunk-precommit-build/ws/workflowgenerator/src/test/resources>
[INFO]
[INFO] --- maven-compiler-plugin:2.3.2:testCompile (default-testCompile) @ oozie-workflowgenerator ---
[INFO] Compiling 1 source file to <https://builds.apache.org/job/oozie-trunk-precommit-build/ws/workflowgenerator/target/test-classes>
[INFO]
[INFO] --- maven-surefire-plugin:2.12.2:test (default-test) @ oozie-workflowgenerator ---
[INFO] Tests are skipped.
[INFO]
[INFO] ------------------------------------------------------------------------
[INFO] Building Apache Oozie Distro 4.2.0-SNAPSHOT
[INFO] ------------------------------------------------------------------------
[INFO]
[INFO] --- maven-clean-plugin:2.5:clean (default-clean) @ oozie-distro ---
[INFO] Deleting <https://builds.apache.org/job/oozie-trunk-precommit-build/ws/distro/target>
[INFO]
[INFO] --- maven-resources-plugin:2.5:resources (default-resources) @ oozie-distro ---
[debug] execute contextualize
[INFO] Using 'UTF-8' encoding to copy filtered resources.
[INFO] skip non existing resourceDirectory <https://builds.apache.org/job/oozie-trunk-precommit-build/ws/distro/src/main/resources>
[INFO]
[INFO] --- maven-compiler-plugin:2.3.2:compile (default-compile) @ oozie-distro ---
[INFO] No sources to compile
[INFO]
[INFO] --- maven-resources-plugin:2.5:testResources (default-testResources) @ oozie-distro ---
[debug] execute contextualize
[INFO] Using 'UTF-8' encoding to copy filtered resources.
[INFO] skip non existing resourceDirectory <https://builds.apache.org/job/oozie-trunk-precommit-build/ws/distro/src/test/resources>
[INFO]
[INFO] --- maven-compiler-plugin:2.3.2:testCompile (default-testCompile) @ oozie-distro ---
[INFO] No sources to compile
[INFO]
[INFO] --- maven-surefire-plugin:2.12.2:test (default-test) @ oozie-distro ---
[INFO] Tests are skipped.
[INFO] ------------------------------------------------------------------------
[INFO] Reactor Summary:
[INFO]
[INFO] Apache Oozie Main ................................. SUCCESS [ 0.797 s]
[INFO] Apache Oozie Hadoop 1.2.1.oozie-4.2.0-SNAPSHOT Test SUCCESS [ 0.905 s]
[INFO] Apache Oozie Client ............................... SUCCESS [ 9.711 s]
[INFO] Apache Oozie Hadoop 1.2.1.oozie-4.2.0-SNAPSHOT .... SUCCESS [ 0.260 s]
[INFO] Apache Oozie Hadoop Distcp 1.2.1.oozie-4.2.0-SNAPSHOT SUCCESS [ 0.082 s]
[INFO] Apache Oozie Hadoop 1.2.1.oozie-4.2.0-SNAPSHOT Test SUCCESS [ 0.454 s]
[INFO] Apache Oozie Hadoop Utils 1.2.1.oozie-4.2.0-SNAPSHOT SUCCESS [ 2.146 s]
[INFO] Apache Oozie Hadoop 2.3.0.oozie-4.2.0-SNAPSHOT .... SUCCESS [ 0.420 s]
[INFO] Apache Oozie Hadoop 2.3.0.oozie-4.2.0-SNAPSHOT Test SUCCESS [ 0.253 s]
[INFO] Apache Oozie Hadoop Distcp 2.3.0.oozie-4.2.0-SNAPSHOT SUCCESS [ 0.061 s]
[INFO] Apache Oozie Hadoop Utils 2.3.0.oozie-4.2.0-SNAPSHOT SUCCESS [ 2.808 s]
[INFO] Apache Oozie Hadoop 2.3.0.oozie-4.2.0-SNAPSHOT Test SUCCESS [ 0.032 s]
[INFO] Apache Oozie Hadoop 0.23.5.oozie-4.2.0-SNAPSHOT ... SUCCESS [ 0.346 s]
[INFO] Apache Oozie Hadoop 0.23.5.oozie-4.2.0-SNAPSHOT Test SUCCESS [ 0.354 s]
[INFO] Apache Oozie Hadoop Distcp 0.23.5.oozie-4.2.0-SNAPSHOT SUCCESS [ 0.084 s]
[INFO] Apache Oozie Hadoop Utils 0.23.5.oozie-4.2.0-SNAPSHOT SUCCESS [ 2.908 s]
[INFO] Apache Oozie Hadoop 0.23.5.oozie-4.2.0-SNAPSHOT Test SUCCESS [ 0.100 s]
[INFO] Apache Oozie Hadoop Libs .......................... SUCCESS [ 0.005 s]
[INFO] Apache Oozie Hbase 0.94.2.oozie-4.2.0-SNAPSHOT .... SUCCESS [ 0.062 s]
[INFO] Apache Oozie Hbase Libs ........................... SUCCESS [ 0.011 s]
[INFO] Apache Oozie HCatalog 0.13.1.oozie-4.2.0-SNAPSHOT . SUCCESS [ 0.393 s]
[INFO] Apache Oozie HCatalog Libs ........................ SUCCESS [ 0.006 s]
[INFO] Apache Oozie Share Lib Oozie ...................... SUCCESS [ 4.941 s]
[INFO] Apache Oozie Share Lib HCatalog ................... SUCCESS [ 5.796 s]
[INFO] Apache Oozie Core ................................. SUCCESS [ 41.580 s]
[INFO] Apache Oozie Docs ................................. SUCCESS [ 2.952 s]
[INFO] Apache Oozie Share Lib Pig ........................ SUCCESS [ 8.501 s]
[INFO] Apache Oozie Share Lib Hive ....................... SUCCESS [ 7.632 s]
[INFO] Apache Oozie Share Lib Sqoop ...................... SUCCESS [ 7.721 s]
[INFO] Apache Oozie Share Lib Streaming .................. SUCCESS [ 8.608 s]
[INFO] Apache Oozie Share Lib Distcp ..................... SUCCESS [ 4.585 s]
[INFO] Apache Oozie WebApp ............................... SUCCESS [ 0.158 s]
[INFO] Apache Oozie Examples ............................. SUCCESS [ 7.845 s]
[INFO] Apache Oozie Share Lib ............................ SUCCESS [ 0.009 s]
[INFO] Apache Oozie Tools ................................ SUCCESS [ 9.143 s]
[INFO] Apache Oozie MiniOozie ............................ SUCCESS [ 3.775 s]
[INFO] Apache Oozie WorkflowGenerator .................... SUCCESS [ 7.797 s]
[INFO] Apache Oozie Distro ............................... SUCCESS [ 0.223 s]
[INFO] ------------------------------------------------------------------------
[INFO] BUILD SUCCESS
[INFO] ------------------------------------------------------------------------
[INFO] Total time: 02:26 min
[INFO] Finished at: 2014-09-03T03:32:48+00:00
[INFO] Final Memory: 40M/719M
[INFO] ------------------------------------------------------------------------
[WARNING] The requested profile "testPatchCompile" could not be activated because it does not exist.
Running test-patch task BACKWARDS_COMPATIBILITY
Running test-patch task TESTS
Running test-patch task DISTRO
Applying patch
(Stripping trailing CRs from patch; use --binary to disable.)
checking file tools/src/main/java/org/apache/oozie/tools/OozieDBCLI.java
Hunk #1 FAILED at 778.
1 out of 1 hunk FAILED
Patch failed to apply to head of branch
Adding comment to JIRA
Comment added.
test-patch exit code: 1
Build step 'Execute shell' marked build as failure
Archiving artifacts
Sending artifact delta relative to oozie-trunk-precommit-build #1819
Archived 5 artifacts
Archive block size is 32768
Received 3 blocks and 269452 bytes
Compression is 26.7%
Took 0.36 sec
Recording test results