You are viewing a plain text version of this content. The canonical link for it is here.
Posted to dev@lucene.apache.org by Policeman Jenkins Server <je...@thetaphi.de> on 2019/08/16 13:01:28 UTC
[JENKINS] Lucene-Solr-master-Linux (64bit/jdk-11.0.3) - Build #
24554 - Failure!
Build: https://jenkins.thetaphi.de/job/Lucene-Solr-master-Linux/24554/
Java: 64bit/jdk-11.0.3 -XX:+UseCompressedOops -XX:+UseConcMarkSweepGC
1 tests failed.
FAILED: org.apache.solr.search.facet.TestCloudJSONFacetSKG.testRandom
Error Message:
Error from server at https://127.0.0.1:34165/solr/org.apache.solr.search.facet.TestCloudJSONFacetSKG_collection: Expected mime type application/octet-stream but got text/html. <html> <head> <meta http-equiv="Content-Type" content="text/html;charset=utf-8"/> <title>Error 500 Server Error</title> </head> <body><h2>HTTP ERROR 500</h2> <p>Problem accessing /solr/org.apache.solr.search.facet.TestCloudJSONFacetSKG_collection/select. Reason: <pre> Server Error</pre></p><h3>Caused by:</h3><pre>java.lang.AssertionError at java.base/java.util.HashMap$TreeNode.moveRootToFront(HashMap.java:1896) at java.base/java.util.HashMap$TreeNode.putTreeVal(HashMap.java:2061) at java.base/java.util.HashMap.putVal(HashMap.java:633) at java.base/java.util.HashMap.put(HashMap.java:607) at org.apache.solr.search.LRUCache.put(LRUCache.java:196) at org.apache.solr.search.SolrCacheHolder.put(SolrCacheHolder.java:46) at org.apache.solr.search.SolrIndexSearcher.getDocListC(SolrIndexSearcher.java:1449) at org.apache.solr.search.SolrIndexSearcher.search(SolrIndexSearcher.java:568) at org.apache.solr.handler.component.QueryComponent.doProcessUngroupedSearch(QueryComponent.java:1484) at org.apache.solr.handler.component.QueryComponent.process(QueryComponent.java:398) at org.apache.solr.handler.component.SearchHandler.handleRequestBody(SearchHandler.java:305) at org.apache.solr.handler.RequestHandlerBase.handleRequest(RequestHandlerBase.java:198) at org.apache.solr.core.SolrCore.execute(SolrCore.java:2581) at org.apache.solr.servlet.HttpSolrCall.execute(HttpSolrCall.java:780) at org.apache.solr.servlet.HttpSolrCall.call(HttpSolrCall.java:566) at org.apache.solr.servlet.SolrDispatchFilter.doFilter(SolrDispatchFilter.java:423) at org.apache.solr.servlet.SolrDispatchFilter.doFilter(SolrDispatchFilter.java:350) at org.eclipse.jetty.servlet.ServletHandler$CachedChain.doFilter(ServletHandler.java:1610) at org.apache.solr.client.solrj.embedded.JettySolrRunner$DebugFilter.doFilter(JettySolrRunner.java:165) at org.eclipse.jetty.servlet.ServletHandler$CachedChain.doFilter(ServletHandler.java:1610) at org.eclipse.jetty.servlet.ServletHandler.doHandle(ServletHandler.java:540) at org.eclipse.jetty.server.handler.ScopedHandler.nextHandle(ScopedHandler.java:255) at org.eclipse.jetty.server.session.SessionHandler.doHandle(SessionHandler.java:1711) at org.eclipse.jetty.server.handler.ScopedHandler.nextHandle(ScopedHandler.java:255) at org.eclipse.jetty.server.handler.ContextHandler.doHandle(ContextHandler.java:1347) at org.eclipse.jetty.server.handler.ScopedHandler.nextScope(ScopedHandler.java:203) at org.eclipse.jetty.servlet.ServletHandler.doScope(ServletHandler.java:480) at org.eclipse.jetty.server.session.SessionHandler.doScope(SessionHandler.java:1678) at org.eclipse.jetty.server.handler.ScopedHandler.nextScope(ScopedHandler.java:201) at org.eclipse.jetty.server.handler.ContextHandler.doScope(ContextHandler.java:1249) at org.eclipse.jetty.server.handler.ScopedHandler.handle(ScopedHandler.java:144) at org.eclipse.jetty.server.handler.gzip.GzipHandler.handle(GzipHandler.java:753) at org.eclipse.jetty.server.handler.HandlerWrapper.handle(HandlerWrapper.java:132) at org.eclipse.jetty.server.Server.handle(Server.java:505) at org.eclipse.jetty.server.HttpChannel.handle(HttpChannel.java:370) at org.eclipse.jetty.server.HttpConnection.onFillable(HttpConnection.java:267) at org.eclipse.jetty.io.AbstractConnection$ReadCallback.succeeded(AbstractConnection.java:305) at org.eclipse.jetty.io.FillInterest.fillable(FillInterest.java:103) at org.eclipse.jetty.io.ssl.SslConnection$DecryptedEndPoint.onFillable(SslConnection.java:427) at org.eclipse.jetty.io.ssl.SslConnection.onFillable(SslConnection.java:321) at org.eclipse.jetty.io.ssl.SslConnection$2.succeeded(SslConnection.java:159) at org.eclipse.jetty.io.FillInterest.fillable(FillInterest.java:103) at org.eclipse.jetty.io.ChannelEndPoint$2.run(ChannelEndPoint.java:117) at org.eclipse.jetty.util.thread.QueuedThreadPool.runJob(QueuedThreadPool.java:781) at org.eclipse.jetty.util.thread.QueuedThreadPool$Runner.run(QueuedThreadPool.java:917) at java.base/java.lang.Thread.run(Thread.java:834) </pre> <hr><a href="http://eclipse.org/jetty">Powered by Jetty:// 9.4.19.v20190610</a><hr/> </body> </html>
Stack Trace:
org.apache.solr.client.solrj.impl.HttpSolrClient$RemoteSolrException: Error from server at https://127.0.0.1:34165/solr/org.apache.solr.search.facet.TestCloudJSONFacetSKG_collection: Expected mime type application/octet-stream but got text/html. <html>
<head>
<meta http-equiv="Content-Type" content="text/html;charset=utf-8"/>
<title>Error 500 Server Error</title>
</head>
<body><h2>HTTP ERROR 500</h2>
<p>Problem accessing /solr/org.apache.solr.search.facet.TestCloudJSONFacetSKG_collection/select. Reason:
<pre> Server Error</pre></p><h3>Caused by:</h3><pre>java.lang.AssertionError
at java.base/java.util.HashMap$TreeNode.moveRootToFront(HashMap.java:1896)
at java.base/java.util.HashMap$TreeNode.putTreeVal(HashMap.java:2061)
at java.base/java.util.HashMap.putVal(HashMap.java:633)
at java.base/java.util.HashMap.put(HashMap.java:607)
at org.apache.solr.search.LRUCache.put(LRUCache.java:196)
at org.apache.solr.search.SolrCacheHolder.put(SolrCacheHolder.java:46)
at org.apache.solr.search.SolrIndexSearcher.getDocListC(SolrIndexSearcher.java:1449)
at org.apache.solr.search.SolrIndexSearcher.search(SolrIndexSearcher.java:568)
at org.apache.solr.handler.component.QueryComponent.doProcessUngroupedSearch(QueryComponent.java:1484)
at org.apache.solr.handler.component.QueryComponent.process(QueryComponent.java:398)
at org.apache.solr.handler.component.SearchHandler.handleRequestBody(SearchHandler.java:305)
at org.apache.solr.handler.RequestHandlerBase.handleRequest(RequestHandlerBase.java:198)
at org.apache.solr.core.SolrCore.execute(SolrCore.java:2581)
at org.apache.solr.servlet.HttpSolrCall.execute(HttpSolrCall.java:780)
at org.apache.solr.servlet.HttpSolrCall.call(HttpSolrCall.java:566)
at org.apache.solr.servlet.SolrDispatchFilter.doFilter(SolrDispatchFilter.java:423)
at org.apache.solr.servlet.SolrDispatchFilter.doFilter(SolrDispatchFilter.java:350)
at org.eclipse.jetty.servlet.ServletHandler$CachedChain.doFilter(ServletHandler.java:1610)
at org.apache.solr.client.solrj.embedded.JettySolrRunner$DebugFilter.doFilter(JettySolrRunner.java:165)
at org.eclipse.jetty.servlet.ServletHandler$CachedChain.doFilter(ServletHandler.java:1610)
at org.eclipse.jetty.servlet.ServletHandler.doHandle(ServletHandler.java:540)
at org.eclipse.jetty.server.handler.ScopedHandler.nextHandle(ScopedHandler.java:255)
at org.eclipse.jetty.server.session.SessionHandler.doHandle(SessionHandler.java:1711)
at org.eclipse.jetty.server.handler.ScopedHandler.nextHandle(ScopedHandler.java:255)
at org.eclipse.jetty.server.handler.ContextHandler.doHandle(ContextHandler.java:1347)
at org.eclipse.jetty.server.handler.ScopedHandler.nextScope(ScopedHandler.java:203)
at org.eclipse.jetty.servlet.ServletHandler.doScope(ServletHandler.java:480)
at org.eclipse.jetty.server.session.SessionHandler.doScope(SessionHandler.java:1678)
at org.eclipse.jetty.server.handler.ScopedHandler.nextScope(ScopedHandler.java:201)
at org.eclipse.jetty.server.handler.ContextHandler.doScope(ContextHandler.java:1249)
at org.eclipse.jetty.server.handler.ScopedHandler.handle(ScopedHandler.java:144)
at org.eclipse.jetty.server.handler.gzip.GzipHandler.handle(GzipHandler.java:753)
at org.eclipse.jetty.server.handler.HandlerWrapper.handle(HandlerWrapper.java:132)
at org.eclipse.jetty.server.Server.handle(Server.java:505)
at org.eclipse.jetty.server.HttpChannel.handle(HttpChannel.java:370)
at org.eclipse.jetty.server.HttpConnection.onFillable(HttpConnection.java:267)
at org.eclipse.jetty.io.AbstractConnection$ReadCallback.succeeded(AbstractConnection.java:305)
at org.eclipse.jetty.io.FillInterest.fillable(FillInterest.java:103)
at org.eclipse.jetty.io.ssl.SslConnection$DecryptedEndPoint.onFillable(SslConnection.java:427)
at org.eclipse.jetty.io.ssl.SslConnection.onFillable(SslConnection.java:321)
at org.eclipse.jetty.io.ssl.SslConnection$2.succeeded(SslConnection.java:159)
at org.eclipse.jetty.io.FillInterest.fillable(FillInterest.java:103)
at org.eclipse.jetty.io.ChannelEndPoint$2.run(ChannelEndPoint.java:117)
at org.eclipse.jetty.util.thread.QueuedThreadPool.runJob(QueuedThreadPool.java:781)
at org.eclipse.jetty.util.thread.QueuedThreadPool$Runner.run(QueuedThreadPool.java:917)
at java.base/java.lang.Thread.run(Thread.java:834)
</pre>
<hr><a href="http://eclipse.org/jetty">Powered by Jetty:// 9.4.19.v20190610</a><hr/>
</body>
</html>
at __randomizedtesting.SeedInfo.seed([A39E0ADCB98259EB:D1D22FD308E2EF98]:0)
at org.apache.solr.client.solrj.impl.HttpSolrClient.executeMethod(HttpSolrClient.java:620)
at org.apache.solr.client.solrj.impl.HttpSolrClient.request(HttpSolrClient.java:262)
at org.apache.solr.client.solrj.impl.HttpSolrClient.request(HttpSolrClient.java:245)
at org.apache.solr.client.solrj.SolrRequest.process(SolrRequest.java:211)
at org.apache.solr.client.solrj.SolrClient.query(SolrClient.java:987)
at org.apache.solr.client.solrj.SolrClient.query(SolrClient.java:1002)
at org.apache.solr.search.facet.TestCloudJSONFacetSKG.getNumFound(TestCloudJSONFacetSKG.java:669)
at org.apache.solr.search.facet.TestCloudJSONFacetSKG.verifySKGResults(TestCloudJSONFacetSKG.java:446)
at org.apache.solr.search.facet.TestCloudJSONFacetSKG.assertFacetSKGsAreCorrect(TestCloudJSONFacetSKG.java:392)
at org.apache.solr.search.facet.TestCloudJSONFacetSKG.assertFacetSKGsAreCorrect(TestCloudJSONFacetSKG.java:402)
at org.apache.solr.search.facet.TestCloudJSONFacetSKG.assertFacetSKGsAreCorrect(TestCloudJSONFacetSKG.java:349)
at org.apache.solr.search.facet.TestCloudJSONFacetSKG.testRandom(TestCloudJSONFacetSKG.java:274)
at java.base/jdk.internal.reflect.NativeMethodAccessorImpl.invoke0(Native Method)
at java.base/jdk.internal.reflect.NativeMethodAccessorImpl.invoke(NativeMethodAccessorImpl.java:62)
at java.base/jdk.internal.reflect.DelegatingMethodAccessorImpl.invoke(DelegatingMethodAccessorImpl.java:43)
at java.base/java.lang.reflect.Method.invoke(Method.java:566)
at com.carrotsearch.randomizedtesting.RandomizedRunner.invoke(RandomizedRunner.java:1750)
at com.carrotsearch.randomizedtesting.RandomizedRunner$8.evaluate(RandomizedRunner.java:938)
at com.carrotsearch.randomizedtesting.RandomizedRunner$9.evaluate(RandomizedRunner.java:974)
at com.carrotsearch.randomizedtesting.RandomizedRunner$10.evaluate(RandomizedRunner.java:988)
at com.carrotsearch.randomizedtesting.rules.SystemPropertiesRestoreRule$1.evaluate(SystemPropertiesRestoreRule.java:57)
at org.apache.lucene.util.TestRuleSetupTeardownChained$1.evaluate(TestRuleSetupTeardownChained.java:49)
at org.apache.lucene.util.AbstractBeforeAfterRule$1.evaluate(AbstractBeforeAfterRule.java:45)
at org.apache.lucene.util.TestRuleThreadAndTestName$1.evaluate(TestRuleThreadAndTestName.java:48)
at org.apache.lucene.util.TestRuleIgnoreAfterMaxFailures$1.evaluate(TestRuleIgnoreAfterMaxFailures.java:64)
at org.apache.lucene.util.TestRuleMarkFailure$1.evaluate(TestRuleMarkFailure.java:47)
at com.carrotsearch.randomizedtesting.rules.StatementAdapter.evaluate(StatementAdapter.java:36)
at com.carrotsearch.randomizedtesting.ThreadLeakControl$StatementRunner.run(ThreadLeakControl.java:368)
at com.carrotsearch.randomizedtesting.ThreadLeakControl.forkTimeoutingTask(ThreadLeakControl.java:817)
at com.carrotsearch.randomizedtesting.ThreadLeakControl$3.evaluate(ThreadLeakControl.java:468)
at com.carrotsearch.randomizedtesting.RandomizedRunner.runSingleTest(RandomizedRunner.java:947)
at com.carrotsearch.randomizedtesting.RandomizedRunner$5.evaluate(RandomizedRunner.java:832)
at com.carrotsearch.randomizedtesting.RandomizedRunner$6.evaluate(RandomizedRunner.java:883)
at com.carrotsearch.randomizedtesting.RandomizedRunner$7.evaluate(RandomizedRunner.java:894)
at com.carrotsearch.randomizedtesting.rules.StatementAdapter.evaluate(StatementAdapter.java:36)
at com.carrotsearch.randomizedtesting.rules.SystemPropertiesRestoreRule$1.evaluate(SystemPropertiesRestoreRule.java:57)
at org.apache.lucene.util.AbstractBeforeAfterRule$1.evaluate(AbstractBeforeAfterRule.java:45)
at com.carrotsearch.randomizedtesting.rules.StatementAdapter.evaluate(StatementAdapter.java:36)
at org.apache.lucene.util.TestRuleStoreClassName$1.evaluate(TestRuleStoreClassName.java:41)
at com.carrotsearch.randomizedtesting.rules.NoShadowingOrOverridesOnMethodsRule$1.evaluate(NoShadowingOrOverridesOnMethodsRule.java:40)
at com.carrotsearch.randomizedtesting.rules.NoShadowingOrOverridesOnMethodsRule$1.evaluate(NoShadowingOrOverridesOnMethodsRule.java:40)
at com.carrotsearch.randomizedtesting.rules.StatementAdapter.evaluate(StatementAdapter.java:36)
at com.carrotsearch.randomizedtesting.rules.StatementAdapter.evaluate(StatementAdapter.java:36)
at org.apache.lucene.util.TestRuleAssertionsRequired$1.evaluate(TestRuleAssertionsRequired.java:53)
at org.apache.lucene.util.TestRuleMarkFailure$1.evaluate(TestRuleMarkFailure.java:47)
at org.apache.lucene.util.TestRuleIgnoreAfterMaxFailures$1.evaluate(TestRuleIgnoreAfterMaxFailures.java:64)
at org.apache.lucene.util.TestRuleIgnoreTestSuites$1.evaluate(TestRuleIgnoreTestSuites.java:54)
at com.carrotsearch.randomizedtesting.rules.StatementAdapter.evaluate(StatementAdapter.java:36)
at com.carrotsearch.randomizedtesting.ThreadLeakControl$StatementRunner.run(ThreadLeakControl.java:368)
at java.base/java.lang.Thread.run(Thread.java:834)
Build Log:
[...truncated 2035 lines...]
[junit4] JVM J2: stderr was not empty, see: /home/jenkins/workspace/Lucene-Solr-master-Linux/lucene/build/core/test/temp/junit4-J2-20190816_113125_3635124588792086349953.syserr
[junit4] >>> JVM J2 emitted unexpected output (verbatim) ----
[junit4] OpenJDK 64-Bit Server VM warning: Option UseConcMarkSweepGC was deprecated in version 9.0 and will likely be removed in a future release.
[junit4] <<< JVM J2: EOF ----
[...truncated 3 lines...]
[junit4] JVM J1: stderr was not empty, see: /home/jenkins/workspace/Lucene-Solr-master-Linux/lucene/build/core/test/temp/junit4-J1-20190816_113125_36314090603514593424812.syserr
[junit4] >>> JVM J1 emitted unexpected output (verbatim) ----
[junit4] OpenJDK 64-Bit Server VM warning: Option UseConcMarkSweepGC was deprecated in version 9.0 and will likely be removed in a future release.
[junit4] <<< JVM J1: EOF ----
[...truncated 3 lines...]
[junit4] JVM J0: stderr was not empty, see: /home/jenkins/workspace/Lucene-Solr-master-Linux/lucene/build/core/test/temp/junit4-J0-20190816_113125_36318121032193742696267.syserr
[junit4] >>> JVM J0 emitted unexpected output (verbatim) ----
[junit4] OpenJDK 64-Bit Server VM warning: Option UseConcMarkSweepGC was deprecated in version 9.0 and will likely be removed in a future release.
[junit4] <<< JVM J0: EOF ----
[...truncated 301 lines...]
[junit4] JVM J2: stderr was not empty, see: /home/jenkins/workspace/Lucene-Solr-master-Linux/lucene/build/test-framework/test/temp/junit4-J2-20190816_114335_2021082626785234046281.syserr
[junit4] >>> JVM J2 emitted unexpected output (verbatim) ----
[junit4] OpenJDK 64-Bit Server VM warning: Option UseConcMarkSweepGC was deprecated in version 9.0 and will likely be removed in a future release.
[junit4] <<< JVM J2: EOF ----
[...truncated 3 lines...]
[junit4] JVM J0: stderr was not empty, see: /home/jenkins/workspace/Lucene-Solr-master-Linux/lucene/build/test-framework/test/temp/junit4-J0-20190816_114335_2025907885724846411401.syserr
[junit4] >>> JVM J0 emitted unexpected output (verbatim) ----
[junit4] OpenJDK 64-Bit Server VM warning: Option UseConcMarkSweepGC was deprecated in version 9.0 and will likely be removed in a future release.
[junit4] <<< JVM J0: EOF ----
[...truncated 3 lines...]
[junit4] JVM J1: stderr was not empty, see: /home/jenkins/workspace/Lucene-Solr-master-Linux/lucene/build/test-framework/test/temp/junit4-J1-20190816_114335_20211435813718087428071.syserr
[junit4] >>> JVM J1 emitted unexpected output (verbatim) ----
[junit4] OpenJDK 64-Bit Server VM warning: Option UseConcMarkSweepGC was deprecated in version 9.0 and will likely be removed in a future release.
[junit4] <<< JVM J1: EOF ----
[...truncated 1088 lines...]
[junit4] JVM J1: stderr was not empty, see: /home/jenkins/workspace/Lucene-Solr-master-Linux/lucene/build/analysis/common/test/temp/junit4-J1-20190816_114535_2319093908146794740792.syserr
[junit4] >>> JVM J1 emitted unexpected output (verbatim) ----
[junit4] OpenJDK 64-Bit Server VM warning: Option UseConcMarkSweepGC was deprecated in version 9.0 and will likely be removed in a future release.
[junit4] <<< JVM J1: EOF ----
[...truncated 3 lines...]
[junit4] JVM J0: stderr was not empty, see: /home/jenkins/workspace/Lucene-Solr-master-Linux/lucene/build/analysis/common/test/temp/junit4-J0-20190816_114535_2312535960624976902255.syserr
[junit4] >>> JVM J0 emitted unexpected output (verbatim) ----
[junit4] OpenJDK 64-Bit Server VM warning: Option UseConcMarkSweepGC was deprecated in version 9.0 and will likely be removed in a future release.
[junit4] <<< JVM J0: EOF ----
[...truncated 3 lines...]
[junit4] JVM J2: stderr was not empty, see: /home/jenkins/workspace/Lucene-Solr-master-Linux/lucene/build/analysis/common/test/temp/junit4-J2-20190816_114535_2316369150274527929468.syserr
[junit4] >>> JVM J2 emitted unexpected output (verbatim) ----
[junit4] OpenJDK 64-Bit Server VM warning: Option UseConcMarkSweepGC was deprecated in version 9.0 and will likely be removed in a future release.
[junit4] <<< JVM J2: EOF ----
[...truncated 247 lines...]
[junit4] JVM J0: stderr was not empty, see: /home/jenkins/workspace/Lucene-Solr-master-Linux/lucene/build/analysis/icu/test/temp/junit4-J0-20190816_114813_3568034522717511246291.syserr
[junit4] >>> JVM J0 emitted unexpected output (verbatim) ----
[junit4] OpenJDK 64-Bit Server VM warning: Option UseConcMarkSweepGC was deprecated in version 9.0 and will likely be removed in a future release.
[junit4] <<< JVM J0: EOF ----
[junit4] JVM J2: stderr was not empty, see: /home/jenkins/workspace/Lucene-Solr-master-Linux/lucene/build/analysis/icu/test/temp/junit4-J2-20190816_114813_35617682647131463059989.syserr
[junit4] >>> JVM J2 emitted unexpected output (verbatim) ----
[junit4] OpenJDK 64-Bit Server VM warning: Option UseConcMarkSweepGC was deprecated in version 9.0 and will likely be removed in a future release.
[junit4] <<< JVM J2: EOF ----
[junit4] JVM J1: stderr was not empty, see: /home/jenkins/workspace/Lucene-Solr-master-Linux/lucene/build/analysis/icu/test/temp/junit4-J1-20190816_114813_35613696801974298224566.syserr
[junit4] >>> JVM J1 emitted unexpected output (verbatim) ----
[junit4] OpenJDK 64-Bit Server VM warning: Option UseConcMarkSweepGC was deprecated in version 9.0 and will likely be removed in a future release.
[junit4] <<< JVM J1: EOF ----
[...truncated 215 lines...]
[junit4] JVM J0: stderr was not empty, see: /home/jenkins/workspace/Lucene-Solr-master-Linux/lucene/build/analysis/kuromoji/test/temp/junit4-J0-20190816_114827_74112556157562842184254.syserr
[junit4] >>> JVM J0 emitted unexpected output (verbatim) ----
[junit4] OpenJDK 64-Bit Server VM warning: Option UseConcMarkSweepGC was deprecated in version 9.0 and will likely be removed in a future release.
[junit4] <<< JVM J0: EOF ----
[...truncated 3 lines...]
[junit4] JVM J2: stderr was not empty, see: /home/jenkins/workspace/Lucene-Solr-master-Linux/lucene/build/analysis/kuromoji/test/temp/junit4-J2-20190816_114827_7414270439259522700441.syserr
[junit4] >>> JVM J2 emitted unexpected output (verbatim) ----
[junit4] OpenJDK 64-Bit Server VM warning: Option UseConcMarkSweepGC was deprecated in version 9.0 and will likely be removed in a future release.
[junit4] <<< JVM J2: EOF ----
[...truncated 5 lines...]
[junit4] JVM J1: stderr was not empty, see: /home/jenkins/workspace/Lucene-Solr-master-Linux/lucene/build/analysis/kuromoji/test/temp/junit4-J1-20190816_114827_7412446234347041260981.syserr
[junit4] >>> JVM J1 emitted unexpected output (verbatim) ----
[junit4] OpenJDK 64-Bit Server VM warning: Option UseConcMarkSweepGC was deprecated in version 9.0 and will likely be removed in a future release.
[junit4] <<< JVM J1: EOF ----
[...truncated 154 lines...]
[junit4] JVM J1: stderr was not empty, see: /home/jenkins/workspace/Lucene-Solr-master-Linux/lucene/build/analysis/morfologik/test/temp/junit4-J1-20190816_114906_19016452624019434313055.syserr
[junit4] >>> JVM J1 emitted unexpected output (verbatim) ----
[junit4] OpenJDK 64-Bit Server VM warning: Option UseConcMarkSweepGC was deprecated in version 9.0 and will likely be removed in a future release.
[junit4] <<< JVM J1: EOF ----
[...truncated 3 lines...]
[junit4] JVM J0: stderr was not empty, see: /home/jenkins/workspace/Lucene-Solr-master-Linux/lucene/build/analysis/morfologik/test/temp/junit4-J0-20190816_114906_1882997687783885977395.syserr
[junit4] >>> JVM J0 emitted unexpected output (verbatim) ----
[junit4] OpenJDK 64-Bit Server VM warning: Option UseConcMarkSweepGC was deprecated in version 9.0 and will likely be removed in a future release.
[junit4] <<< JVM J0: EOF ----
[...truncated 3 lines...]
[junit4] JVM J2: stderr was not empty, see: /home/jenkins/workspace/Lucene-Solr-master-Linux/lucene/build/analysis/morfologik/test/temp/junit4-J2-20190816_114906_1901029827679678074225.syserr
[junit4] >>> JVM J2 emitted unexpected output (verbatim) ----
[junit4] OpenJDK 64-Bit Server VM warning: Option UseConcMarkSweepGC was deprecated in version 9.0 and will likely be removed in a future release.
[junit4] <<< JVM J2: EOF ----
[...truncated 177 lines...]
[junit4] JVM J0: stderr was not empty, see: /home/jenkins/workspace/Lucene-Solr-master-Linux/lucene/build/analysis/nori/test/temp/junit4-J0-20190816_114911_48913039537615895579752.syserr
[junit4] >>> JVM J0 emitted unexpected output (verbatim) ----
[junit4] OpenJDK 64-Bit Server VM warning: Option UseConcMarkSweepGC was deprecated in version 9.0 and will likely be removed in a future release.
[junit4] <<< JVM J0: EOF ----
[...truncated 6 lines...]
[junit4] JVM J1: stderr was not empty, see: /home/jenkins/workspace/Lucene-Solr-master-Linux/lucene/build/analysis/nori/test/temp/junit4-J1-20190816_114911_4909831066269240759077.syserr
[junit4] >>> JVM J1 emitted unexpected output (verbatim) ----
[junit4] OpenJDK 64-Bit Server VM warning: Option UseConcMarkSweepGC was deprecated in version 9.0 and will likely be removed in a future release.
[junit4] <<< JVM J1: EOF ----
[...truncated 3 lines...]
[junit4] JVM J2: stderr was not empty, see: /home/jenkins/workspace/Lucene-Solr-master-Linux/lucene/build/analysis/nori/test/temp/junit4-J2-20190816_114911_49117742206839107114110.syserr
[junit4] >>> JVM J2 emitted unexpected output (verbatim) ----
[junit4] OpenJDK 64-Bit Server VM warning: Option UseConcMarkSweepGC was deprecated in version 9.0 and will likely be removed in a future release.
[junit4] <<< JVM J2: EOF ----
[...truncated 160 lines...]
[junit4] JVM J2: stderr was not empty, see: /home/jenkins/workspace/Lucene-Solr-master-Linux/lucene/build/analysis/opennlp/test/temp/junit4-J2-20190816_114929_7417410489302289199119.syserr
[junit4] >>> JVM J2 emitted unexpected output (verbatim) ----
[junit4] OpenJDK 64-Bit Server VM warning: Option UseConcMarkSweepGC was deprecated in version 9.0 and will likely be removed in a future release.
[junit4] <<< JVM J2: EOF ----
[...truncated 6 lines...]
[junit4] JVM J1: stderr was not empty, see: /home/jenkins/workspace/Lucene-Solr-master-Linux/lucene/build/analysis/opennlp/test/temp/junit4-J1-20190816_114929_7419473660279860071157.syserr
[junit4] >>> JVM J1 emitted unexpected output (verbatim) ----
[junit4] OpenJDK 64-Bit Server VM warning: Option UseConcMarkSweepGC was deprecated in version 9.0 and will likely be removed in a future release.
[junit4] <<< JVM J1: EOF ----
[junit4] JVM J0: stderr was not empty, see: /home/jenkins/workspace/Lucene-Solr-master-Linux/lucene/build/analysis/opennlp/test/temp/junit4-J0-20190816_114929_7417885968165002183621.syserr
[junit4] >>> JVM J0 emitted unexpected output (verbatim) ----
[junit4] OpenJDK 64-Bit Server VM warning: Option UseConcMarkSweepGC was deprecated in version 9.0 and will likely be removed in a future release.
[junit4] <<< JVM J0: EOF ----
[...truncated 171 lines...]
[junit4] JVM J2: stderr was not empty, see: /home/jenkins/workspace/Lucene-Solr-master-Linux/lucene/build/analysis/phonetic/test/temp/junit4-J2-20190816_114933_39317566722698262613806.syserr
[junit4] >>> JVM J2 emitted unexpected output (verbatim) ----
[junit4] OpenJDK 64-Bit Server VM warning: Option UseConcMarkSweepGC was deprecated in version 9.0 and will likely be removed in a future release.
[junit4] <<< JVM J2: EOF ----
[junit4] JVM J1: stderr was not empty, see: /home/jenkins/workspace/Lucene-Solr-master-Linux/lucene/build/analysis/phonetic/test/temp/junit4-J1-20190816_114933_39310432187462387715890.syserr
[junit4] >>> JVM J1 emitted unexpected output (verbatim) ----
[junit4] OpenJDK 64-Bit Server VM warning: Option UseConcMarkSweepGC was deprecated in version 9.0 and will likely be removed in a future release.
[junit4] <<< JVM J1: EOF ----
[...truncated 3 lines...]
[junit4] JVM J0: stderr was not empty, see: /home/jenkins/workspace/Lucene-Solr-master-Linux/lucene/build/analysis/phonetic/test/temp/junit4-J0-20190816_114933_39313162529220841459204.syserr
[junit4] >>> JVM J0 emitted unexpected output (verbatim) ----
[junit4] OpenJDK 64-Bit Server VM warning: Option UseConcMarkSweepGC was deprecated in version 9.0 and will likely be removed in a future release.
[junit4] <<< JVM J0: EOF ----
[...truncated 153 lines...]
[junit4] JVM J0: stderr was not empty, see: /home/jenkins/workspace/Lucene-Solr-master-Linux/lucene/build/analysis/smartcn/test/temp/junit4-J0-20190816_114946_5343902926601433439622.syserr
[junit4] >>> JVM J0 emitted unexpected output (verbatim) ----
[junit4] OpenJDK 64-Bit Server VM warning: Option UseConcMarkSweepGC was deprecated in version 9.0 and will likely be removed in a future release.
[junit4] <<< JVM J0: EOF ----
[...truncated 3 lines...]
[junit4] JVM J1: stderr was not empty, see: /home/jenkins/workspace/Lucene-Solr-master-Linux/lucene/build/analysis/smartcn/test/temp/junit4-J1-20190816_114946_53416045972126673167616.syserr
[junit4] >>> JVM J1 emitted unexpected output (verbatim) ----
[junit4] OpenJDK 64-Bit Server VM warning: Option UseConcMarkSweepGC was deprecated in version 9.0 and will likely be removed in a future release.
[junit4] <<< JVM J1: EOF ----
[...truncated 157 lines...]
[junit4] JVM J2: stderr was not empty, see: /home/jenkins/workspace/Lucene-Solr-master-Linux/lucene/build/analysis/stempel/test/temp/junit4-J2-20190816_115003_23912884214746721671237.syserr
[junit4] >>> JVM J2 emitted unexpected output (verbatim) ----
[junit4] OpenJDK 64-Bit Server VM warning: Option UseConcMarkSweepGC was deprecated in version 9.0 and will likely be removed in a future release.
[junit4] <<< JVM J2: EOF ----
[junit4] JVM J1: stderr was not empty, see: /home/jenkins/workspace/Lucene-Solr-master-Linux/lucene/build/analysis/stempel/test/temp/junit4-J1-20190816_115003_23914935128040386064611.syserr
[junit4] >>> JVM J1 emitted unexpected output (verbatim) ----
[junit4] OpenJDK 64-Bit Server VM warning: Option UseConcMarkSweepGC was deprecated in version 9.0 and will likely be removed in a future release.
[junit4] <<< JVM J1: EOF ----
[...truncated 3 lines...]
[junit4] JVM J0: stderr was not empty, see: /home/jenkins/workspace/Lucene-Solr-master-Linux/lucene/build/analysis/stempel/test/temp/junit4-J0-20190816_115003_23915557704442746782294.syserr
[junit4] >>> JVM J0 emitted unexpected output (verbatim) ----
[junit4] OpenJDK 64-Bit Server VM warning: Option UseConcMarkSweepGC was deprecated in version 9.0 and will likely be removed in a future release.
[junit4] <<< JVM J0: EOF ----
[...truncated 178 lines...]
[junit4] JVM J0: stderr was not empty, see: /home/jenkins/workspace/Lucene-Solr-master-Linux/lucene/build/backward-codecs/test/temp/junit4-J0-20190816_115007_0022280693837514432331.syserr
[junit4] >>> JVM J0 emitted unexpected output (verbatim) ----
[junit4] OpenJDK 64-Bit Server VM warning: Option UseConcMarkSweepGC was deprecated in version 9.0 and will likely be removed in a future release.
[junit4] <<< JVM J0: EOF ----
[...truncated 9 lines...]
[junit4] JVM J2: stderr was not empty, see: /home/jenkins/workspace/Lucene-Solr-master-Linux/lucene/build/backward-codecs/test/temp/junit4-J2-20190816_115007_00215884036715604959596.syserr
[junit4] >>> JVM J2 emitted unexpected output (verbatim) ----
[junit4] OpenJDK 64-Bit Server VM warning: Option UseConcMarkSweepGC was deprecated in version 9.0 and will likely be removed in a future release.
[junit4] <<< JVM J2: EOF ----
[...truncated 9 lines...]
[junit4] JVM J1: stderr was not empty, see: /home/jenkins/workspace/Lucene-Solr-master-Linux/lucene/build/backward-codecs/test/temp/junit4-J1-20190816_115007_0021008019134628473677.syserr
[junit4] >>> JVM J1 emitted unexpected output (verbatim) ----
[junit4] OpenJDK 64-Bit Server VM warning: Option UseConcMarkSweepGC was deprecated in version 9.0 and will likely be removed in a future release.
[junit4] <<< JVM J1: EOF ----
[...truncated 1440 lines...]
[junit4] JVM J0: stderr was not empty, see: /home/jenkins/workspace/Lucene-Solr-master-Linux/lucene/build/benchmark/test/temp/junit4-J0-20190816_115257_7889917118193991882990.syserr
[junit4] >>> JVM J0 emitted unexpected output (verbatim) ----
[junit4] OpenJDK 64-Bit Server VM warning: Option UseConcMarkSweepGC was deprecated in version 9.0 and will likely be removed in a future release.
[junit4] <<< JVM J0: EOF ----
[...truncated 3 lines...]
[junit4] JVM J1: stderr was not empty, see: /home/jenkins/workspace/Lucene-Solr-master-Linux/lucene/build/benchmark/test/temp/junit4-J1-20190816_115257_78811975764514619653397.syserr
[junit4] >>> JVM J1 emitted unexpected output (verbatim) ----
[junit4] OpenJDK 64-Bit Server VM warning: Option UseConcMarkSweepGC was deprecated in version 9.0 and will likely be removed in a future release.
[junit4] <<< JVM J1: EOF ----
[...truncated 3 lines...]
[junit4] JVM J2: stderr was not empty, see: /home/jenkins/workspace/Lucene-Solr-master-Linux/lucene/build/benchmark/test/temp/junit4-J2-20190816_115257_78910433940619992056566.syserr
[junit4] >>> JVM J2 emitted unexpected output (verbatim) ----
[junit4] OpenJDK 64-Bit Server VM warning: Option UseConcMarkSweepGC was deprecated in version 9.0 and will likely be removed in a future release.
[junit4] <<< JVM J2: EOF ----
[...truncated 238 lines...]
[junit4] JVM J1: stderr was not empty, see: /home/jenkins/workspace/Lucene-Solr-master-Linux/lucene/build/classification/test/temp/junit4-J1-20190816_115307_91612501368298980090781.syserr
[junit4] >>> JVM J1 emitted unexpected output (verbatim) ----
[junit4] OpenJDK 64-Bit Server VM warning: Option UseConcMarkSweepGC was deprecated in version 9.0 and will likely be removed in a future release.
[junit4] <<< JVM J1: EOF ----
[junit4] JVM J0: stderr was not empty, see: /home/jenkins/workspace/Lucene-Solr-master-Linux/lucene/build/classification/test/temp/junit4-J0-20190816_115307_9161598259351786570086.syserr
[junit4] >>> JVM J0 emitted unexpected output (verbatim) ----
[junit4] OpenJDK 64-Bit Server VM warning: Option UseConcMarkSweepGC was deprecated in version 9.0 and will likely be removed in a future release.
[junit4] <<< JVM J0: EOF ----
[...truncated 3 lines...]
[junit4] JVM J2: stderr was not empty, see: /home/jenkins/workspace/Lucene-Solr-master-Linux/lucene/build/classification/test/temp/junit4-J2-20190816_115307_9167762786472862797016.syserr
[junit4] >>> JVM J2 emitted unexpected output (verbatim) ----
[junit4] OpenJDK 64-Bit Server VM warning: Option UseConcMarkSweepGC was deprecated in version 9.0 and will likely be removed in a future release.
[junit4] <<< JVM J2: EOF ----
[...truncated 250 lines...]
[junit4] JVM J2: stderr was not empty, see: /home/jenkins/workspace/Lucene-Solr-master-Linux/lucene/build/codecs/test/temp/junit4-J2-20190816_115321_4789798511194241257893.syserr
[junit4] >>> JVM J2 emitted unexpected output (verbatim) ----
[junit4] OpenJDK 64-Bit Server VM warning: Option UseConcMarkSweepGC was deprecated in version 9.0 and will likely be removed in a future release.
[junit4] <<< JVM J2: EOF ----
[...truncated 8 lines...]
[junit4] JVM J0: stderr was not empty, see: /home/jenkins/workspace/Lucene-Solr-master-Linux/lucene/build/codecs/test/temp/junit4-J0-20190816_115321_478102965855989280934.syserr
[junit4] >>> JVM J0 emitted unexpected output (verbatim) ----
[junit4] OpenJDK 64-Bit Server VM warning: Option UseConcMarkSweepGC was deprecated in version 9.0 and will likely be removed in a future release.
[junit4] <<< JVM J0: EOF ----
[...truncated 7 lines...]
[junit4] JVM J1: stderr was not empty, see: /home/jenkins/workspace/Lucene-Solr-master-Linux/lucene/build/codecs/test/temp/junit4-J1-20190816_115321_4789179159003099768163.syserr
[junit4] >>> JVM J1 emitted unexpected output (verbatim) ----
[junit4] OpenJDK 64-Bit Server VM warning: Option UseConcMarkSweepGC was deprecated in version 9.0 and will likely be removed in a future release.
[junit4] <<< JVM J1: EOF ----
[...truncated 206 lines...]
[junit4] JVM J0: stderr was not empty, see: /home/jenkins/workspace/Lucene-Solr-master-Linux/lucene/build/demo/test/temp/junit4-J0-20190816_115553_74889067549168180199.syserr
[junit4] >>> JVM J0 emitted unexpected output (verbatim) ----
[junit4] OpenJDK 64-Bit Server VM warning: Option UseConcMarkSweepGC was deprecated in version 9.0 and will likely be removed in a future release.
[junit4] <<< JVM J0: EOF ----
[...truncated 6 lines...]
[junit4] JVM J1: stderr was not empty, see: /home/jenkins/workspace/Lucene-Solr-master-Linux/lucene/build/demo/test/temp/junit4-J1-20190816_115553_7482803176144216302517.syserr
[junit4] >>> JVM J1 emitted unexpected output (verbatim) ----
[junit4] OpenJDK 64-Bit Server VM warning: Option UseConcMarkSweepGC was deprecated in version 9.0 and will likely be removed in a future release.
[junit4] <<< JVM J1: EOF ----
[junit4] JVM J2: stderr was not empty, see: /home/jenkins/workspace/Lucene-Solr-master-Linux/lucene/build/demo/test/temp/junit4-J2-20190816_115553_7492217287924379187602.syserr
[junit4] >>> JVM J2 emitted unexpected output (verbatim) ----
[junit4] OpenJDK 64-Bit Server VM warning: Option UseConcMarkSweepGC was deprecated in version 9.0 and will likely be removed in a future release.
[junit4] <<< JVM J2: EOF ----
[...truncated 170 lines...]
[junit4] JVM J0: stderr was not empty, see: /home/jenkins/workspace/Lucene-Solr-master-Linux/lucene/build/expressions/test/temp/junit4-J0-20190816_115557_9618810984224186860345.syserr
[junit4] >>> JVM J0 emitted unexpected output (verbatim) ----
[junit4] OpenJDK 64-Bit Server VM warning: Option UseConcMarkSweepGC was deprecated in version 9.0 and will likely be removed in a future release.
[junit4] <<< JVM J0: EOF ----
[...truncated 3 lines...]
[junit4] JVM J1: stderr was not empty, see: /home/jenkins/workspace/Lucene-Solr-master-Linux/lucene/build/expressions/test/temp/junit4-J1-20190816_115557_96114577181361038981985.syserr
[junit4] >>> JVM J1 emitted unexpected output (verbatim) ----
[junit4] OpenJDK 64-Bit Server VM warning: Option UseConcMarkSweepGC was deprecated in version 9.0 and will likely be removed in a future release.
[junit4] <<< JVM J1: EOF ----
[...truncated 3 lines...]
[junit4] JVM J2: stderr was not empty, see: /home/jenkins/workspace/Lucene-Solr-master-Linux/lucene/build/expressions/test/temp/junit4-J2-20190816_115557_96114882106726575024888.syserr
[junit4] >>> JVM J2 emitted unexpected output (verbatim) ----
[junit4] OpenJDK 64-Bit Server VM warning: Option UseConcMarkSweepGC was deprecated in version 9.0 and will likely be removed in a future release.
[junit4] <<< JVM J2: EOF ----
[...truncated 214 lines...]
[junit4] JVM J2: stderr was not empty, see: /home/jenkins/workspace/Lucene-Solr-master-Linux/lucene/build/facet/test/temp/junit4-J2-20190816_115606_90710629747365073880185.syserr
[junit4] >>> JVM J2 emitted unexpected output (verbatim) ----
[junit4] OpenJDK 64-Bit Server VM warning: Option UseConcMarkSweepGC was deprecated in version 9.0 and will likely be removed in a future release.
[junit4] <<< JVM J2: EOF ----
[...truncated 15 lines...]
[junit4] JVM J0: stderr was not empty, see: /home/jenkins/workspace/Lucene-Solr-master-Linux/lucene/build/facet/test/temp/junit4-J0-20190816_115606_90711932200579828668356.syserr
[junit4] >>> JVM J0 emitted unexpected output (verbatim) ----
[junit4] OpenJDK 64-Bit Server VM warning: Option UseConcMarkSweepGC was deprecated in version 9.0 and will likely be removed in a future release.
[junit4] <<< JVM J0: EOF ----
[...truncated 3 lines...]
[junit4] JVM J1: stderr was not empty, see: /home/jenkins/workspace/Lucene-Solr-master-Linux/lucene/build/facet/test/temp/junit4-J1-20190816_115606_9072589572671985737088.syserr
[junit4] >>> JVM J1 emitted unexpected output (verbatim) ----
[junit4] OpenJDK 64-Bit Server VM warning: Option UseConcMarkSweepGC was deprecated in version 9.0 and will likely be removed in a future release.
[junit4] <<< JVM J1: EOF ----
[...truncated 182 lines...]
[junit4] JVM J2: stderr was not empty, see: /home/jenkins/workspace/Lucene-Solr-master-Linux/lucene/build/grouping/test/temp/junit4-J2-20190816_115657_9695112598143978836024.syserr
[junit4] >>> JVM J2 emitted unexpected output (verbatim) ----
[junit4] OpenJDK 64-Bit Server VM warning: Option UseConcMarkSweepGC was deprecated in version 9.0 and will likely be removed in a future release.
[junit4] <<< JVM J2: EOF ----
[junit4] JVM J1: stderr was not empty, see: /home/jenkins/workspace/Lucene-Solr-master-Linux/lucene/build/grouping/test/temp/junit4-J1-20190816_115657_96914339576938804309602.syserr
[junit4] >>> JVM J1 emitted unexpected output (verbatim) ----
[junit4] OpenJDK 64-Bit Server VM warning: Option UseConcMarkSweepGC was deprecated in version 9.0 and will likely be removed in a future release.
[junit4] <<< JVM J1: EOF ----
[...truncated 3 lines...]
[junit4] JVM J0: stderr was not empty, see: /home/jenkins/workspace/Lucene-Solr-master-Linux/lucene/build/grouping/test/temp/junit4-J0-20190816_115657_96915427386346224467046.syserr
[junit4] >>> JVM J0 emitted unexpected output (verbatim) ----
[junit4] OpenJDK 64-Bit Server VM warning: Option UseConcMarkSweepGC was deprecated in version 9.0 and will likely be removed in a future release.
[junit4] <<< JVM J0: EOF ----
[...truncated 243 lines...]
[junit4] JVM J2: stderr was not empty, see: /home/jenkins/workspace/Lucene-Solr-master-Linux/lucene/build/highlighter/test/temp/junit4-J2-20190816_115720_01612043474295005222126.syserr
[junit4] >>> JVM J2 emitted unexpected output (verbatim) ----
[junit4] OpenJDK 64-Bit Server VM warning: Option UseConcMarkSweepGC was deprecated in version 9.0 and will likely be removed in a future release.
[junit4] <<< JVM J2: EOF ----
[...truncated 3 lines...]
[junit4] JVM J0: stderr was not empty, see: /home/jenkins/workspace/Lucene-Solr-master-Linux/lucene/build/highlighter/test/temp/junit4-J0-20190816_115720_014320797374362476033.syserr
[junit4] >>> JVM J0 emitted unexpected output (verbatim) ----
[junit4] OpenJDK 64-Bit Server VM warning: Option UseConcMarkSweepGC was deprecated in version 9.0 and will likely be removed in a future release.
[junit4] <<< JVM J0: EOF ----
[...truncated 3 lines...]
[junit4] JVM J1: stderr was not empty, see: /home/jenkins/workspace/Lucene-Solr-master-Linux/lucene/build/highlighter/test/temp/junit4-J1-20190816_115720_0151430212615611274043.syserr
[junit4] >>> JVM J1 emitted unexpected output (verbatim) ----
[junit4] OpenJDK 64-Bit Server VM warning: Option UseConcMarkSweepGC was deprecated in version 9.0 and will likely be removed in a future release.
[junit4] <<< JVM J1: EOF ----
[...truncated 163 lines...]
[junit4] JVM J1: stderr was not empty, see: /home/jenkins/workspace/Lucene-Solr-master-Linux/lucene/build/join/test/temp/junit4-J1-20190816_115758_6227519826275130181650.syserr
[junit4] >>> JVM J1 emitted unexpected output (verbatim) ----
[junit4] OpenJDK 64-Bit Server VM warning: Option UseConcMarkSweepGC was deprecated in version 9.0 and will likely be removed in a future release.
[junit4] <<< JVM J1: EOF ----
[...truncated 3 lines...]
[junit4] JVM J2: stderr was not empty, see: /home/jenkins/workspace/Lucene-Solr-master-Linux/lucene/build/join/test/temp/junit4-J2-20190816_115758_62215369852321653362891.syserr
[junit4] >>> JVM J2 emitted unexpected output (verbatim) ----
[junit4] OpenJDK 64-Bit Server VM warning: Option UseConcMarkSweepGC was deprecated in version 9.0 and will likely be removed in a future release.
[junit4] <<< JVM J2: EOF ----
[...truncated 6 lines...]
[junit4] JVM J0: stderr was not empty, see: /home/jenkins/workspace/Lucene-Solr-master-Linux/lucene/build/join/test/temp/junit4-J0-20190816_115758_622468752591558275547.syserr
[junit4] >>> JVM J0 emitted unexpected output (verbatim) ----
[junit4] OpenJDK 64-Bit Server VM warning: Option UseConcMarkSweepGC was deprecated in version 9.0 and will likely be removed in a future release.
[junit4] <<< JVM J0: EOF ----
[...truncated 268 lines...]
[junit4] JVM J1: stderr was not empty, see: /home/jenkins/workspace/Lucene-Solr-master-Linux/lucene/build/luke/test/temp/junit4-J1-20190816_115839_8456333617359900500135.syserr
[junit4] >>> JVM J1 emitted unexpected output (verbatim) ----
[junit4] OpenJDK 64-Bit Server VM warning: Option UseConcMarkSweepGC was deprecated in version 9.0 and will likely be removed in a future release.
[junit4] <<< JVM J1: EOF ----
[...truncated 6 lines...]
[junit4] JVM J0: stderr was not empty, see: /home/jenkins/workspace/Lucene-Solr-master-Linux/lucene/build/luke/test/temp/junit4-J0-20190816_115839_8458440417760313329768.syserr
[junit4] >>> JVM J0 emitted unexpected output (verbatim) ----
[junit4] OpenJDK 64-Bit Server VM warning: Option UseConcMarkSweepGC was deprecated in version 9.0 and will likely be removed in a future release.
[junit4] <<< JVM J0: EOF ----
[junit4] JVM J2: stderr was not empty, see: /home/jenkins/workspace/Lucene-Solr-master-Linux/lucene/build/luke/test/temp/junit4-J2-20190816_115839_84511963155858040918429.syserr
[junit4] >>> JVM J2 emitted unexpected output (verbatim) ----
[junit4] OpenJDK 64-Bit Server VM warning: Option UseConcMarkSweepGC was deprecated in version 9.0 and will likely be removed in a future release.
[junit4] <<< JVM J2: EOF ----
[...truncated 149 lines...]
[junit4] JVM J0: stderr was not empty, see: /home/jenkins/workspace/Lucene-Solr-master-Linux/lucene/build/memory/test/temp/junit4-J0-20190816_115846_5374830787449781198746.syserr
[junit4] >>> JVM J0 emitted unexpected output (verbatim) ----
[junit4] OpenJDK 64-Bit Server VM warning: Option UseConcMarkSweepGC was deprecated in version 9.0 and will likely be removed in a future release.
[junit4] <<< JVM J0: EOF ----
[...truncated 3 lines...]
[junit4] JVM J1: stderr was not empty, see: /home/jenkins/workspace/Lucene-Solr-master-Linux/lucene/build/memory/test/temp/junit4-J1-20190816_115846_5371448213359546886793.syserr
[junit4] >>> JVM J1 emitted unexpected output (verbatim) ----
[junit4] OpenJDK 64-Bit Server VM warning: Option UseConcMarkSweepGC was deprecated in version 9.0 and will likely be removed in a future release.
[junit4] <<< JVM J1: EOF ----
[...truncated 188 lines...]
[junit4] JVM J0: stderr was not empty, see: /home/jenkins/workspace/Lucene-Solr-master-Linux/lucene/build/misc/test/temp/junit4-J0-20190816_115857_87517765753613914715097.syserr
[junit4] >>> JVM J0 emitted unexpected output (verbatim) ----
[junit4] OpenJDK 64-Bit Server VM warning: Option UseConcMarkSweepGC was deprecated in version 9.0 and will likely be removed in a future release.
[junit4] <<< JVM J0: EOF ----
[...truncated 3 lines...]
[junit4] JVM J2: stderr was not empty, see: /home/jenkins/workspace/Lucene-Solr-master-Linux/lucene/build/misc/test/temp/junit4-J2-20190816_115857_87613453582398556547311.syserr
[junit4] >>> JVM J2 emitted unexpected output (verbatim) ----
[junit4] OpenJDK 64-Bit Server VM warning: Option UseConcMarkSweepGC was deprecated in version 9.0 and will likely be removed in a future release.
[junit4] <<< JVM J2: EOF ----
[...truncated 3 lines...]
[junit4] JVM J1: stderr was not empty, see: /home/jenkins/workspace/Lucene-Solr-master-Linux/lucene/build/misc/test/temp/junit4-J1-20190816_115857_87511002333193876454376.syserr
[junit4] >>> JVM J1 emitted unexpected output (verbatim) ----
[junit4] OpenJDK 64-Bit Server VM warning: Option UseConcMarkSweepGC was deprecated in version 9.0 and will likely be removed in a future release.
[junit4] <<< JVM J1: EOF ----
[...truncated 251 lines...]
[junit4] JVM J0: stderr was not empty, see: /home/jenkins/workspace/Lucene-Solr-master-Linux/lucene/build/monitor/test/temp/junit4-J0-20190816_115932_3091653112933385378381.syserr
[junit4] >>> JVM J0 emitted unexpected output (verbatim) ----
[junit4] OpenJDK 64-Bit Server VM warning: Option UseConcMarkSweepGC was deprecated in version 9.0 and will likely be removed in a future release.
[junit4] <<< JVM J0: EOF ----
[...truncated 6 lines...]
[junit4] JVM J1: stderr was not empty, see: /home/jenkins/workspace/Lucene-Solr-master-Linux/lucene/build/monitor/test/temp/junit4-J1-20190816_115932_3093412613970853714355.syserr
[junit4] >>> JVM J1 emitted unexpected output (verbatim) ----
[junit4] OpenJDK 64-Bit Server VM warning: Option UseConcMarkSweepGC was deprecated in version 9.0 and will likely be removed in a future release.
[junit4] <<< JVM J1: EOF ----
[junit4] JVM J2: stderr was not empty, see: /home/jenkins/workspace/Lucene-Solr-master-Linux/lucene/build/monitor/test/temp/junit4-J2-20190816_115932_3094961127325317628429.syserr
[junit4] >>> JVM J2 emitted unexpected output (verbatim) ----
[junit4] OpenJDK 64-Bit Server VM warning: Option UseConcMarkSweepGC was deprecated in version 9.0 and will likely be removed in a future release.
[junit4] <<< JVM J2: EOF ----
[...truncated 313 lines...]
[junit4] JVM J0: stderr was not empty, see: /home/jenkins/workspace/Lucene-Solr-master-Linux/lucene/build/queries/test/temp/junit4-J0-20190816_115942_4863613522681829692857.syserr
[junit4] >>> JVM J0 emitted unexpected output (verbatim) ----
[junit4] OpenJDK 64-Bit Server VM warning: Option UseConcMarkSweepGC was deprecated in version 9.0 and will likely be removed in a future release.
[junit4] <<< JVM J0: EOF ----
[...truncated 3 lines...]
[junit4] JVM J2: stderr was not empty, see: /home/jenkins/workspace/Lucene-Solr-master-Linux/lucene/build/queries/test/temp/junit4-J2-20190816_115942_48612500706149810059190.syserr
[junit4] >>> JVM J2 emitted unexpected output (verbatim) ----
[junit4] OpenJDK 64-Bit Server VM warning: Option UseConcMarkSweepGC was deprecated in version 9.0 and will likely be removed in a future release.
[junit4] <<< JVM J2: EOF ----
[...truncated 3 lines...]
[junit4] JVM J1: stderr was not empty, see: /home/jenkins/workspace/Lucene-Solr-master-Linux/lucene/build/queries/test/temp/junit4-J1-20190816_115942_48616640094792514303813.syserr
[junit4] >>> JVM J1 emitted unexpected output (verbatim) ----
[junit4] OpenJDK 64-Bit Server VM warning: Option UseConcMarkSweepGC was deprecated in version 9.0 and will likely be removed in a future release.
[junit4] <<< JVM J1: EOF ----
[...truncated 223 lines...]
[junit4] JVM J2: stderr was not empty, see: /home/jenkins/workspace/Lucene-Solr-master-Linux/lucene/build/queryparser/test/temp/junit4-J2-20190816_115953_5054898831684986255506.syserr
[junit4] >>> JVM J2 emitted unexpected output (verbatim) ----
[junit4] OpenJDK 64-Bit Server VM warning: Option UseConcMarkSweepGC was deprecated in version 9.0 and will likely be removed in a future release.
[junit4] <<< JVM J2: EOF ----
[...truncated 3 lines...]
[junit4] JVM J1: stderr was not empty, see: /home/jenkins/workspace/Lucene-Solr-master-Linux/lucene/build/queryparser/test/temp/junit4-J1-20190816_115953_50517033460395347177942.syserr
[junit4] >>> JVM J1 emitted unexpected output (verbatim) ----
[junit4] OpenJDK 64-Bit Server VM warning: Option UseConcMarkSweepGC was deprecated in version 9.0 and will likely be removed in a future release.
[junit4] <<< JVM J1: EOF ----
[...truncated 3 lines...]
[junit4] JVM J0: stderr was not empty, see: /home/jenkins/workspace/Lucene-Solr-master-Linux/lucene/build/queryparser/test/temp/junit4-J0-20190816_115953_505445471880750911725.syserr
[junit4] >>> JVM J0 emitted unexpected output (verbatim) ----
[junit4] OpenJDK 64-Bit Server VM warning: Option UseConcMarkSweepGC was deprecated in version 9.0 and will likely be removed in a future release.
[junit4] <<< JVM J0: EOF ----
[...truncated 215 lines...]
[junit4] JVM J2: stderr was not empty, see: /home/jenkins/workspace/Lucene-Solr-master-Linux/lucene/build/replicator/test/temp/junit4-J2-20190816_120004_2149771771944573024035.syserr
[junit4] >>> JVM J2 emitted unexpected output (verbatim) ----
[junit4] OpenJDK 64-Bit Server VM warning: Option UseConcMarkSweepGC was deprecated in version 9.0 and will likely be removed in a future release.
[junit4] <<< JVM J2: EOF ----
[junit4] JVM J0: stderr was not empty, see: /home/jenkins/workspace/Lucene-Solr-master-Linux/lucene/build/replicator/test/temp/junit4-J0-20190816_120004_21311117278733328440041.syserr
[junit4] >>> JVM J0 emitted unexpected output (verbatim) ----
[junit4] OpenJDK 64-Bit Server VM warning: Option UseConcMarkSweepGC was deprecated in version 9.0 and will likely be removed in a future release.
[junit4] <<< JVM J0: EOF ----
[junit4] JVM J1: stderr was not empty, see: /home/jenkins/workspace/Lucene-Solr-master-Linux/lucene/build/replicator/test/temp/junit4-J1-20190816_120004_2138799700008947025070.syserr
[junit4] >>> JVM J1 emitted unexpected output (verbatim) ----
[junit4] OpenJDK 64-Bit Server VM warning: Option UseConcMarkSweepGC was deprecated in version 9.0 and will likely be removed in a future release.
[junit4] <<< JVM J1: EOF ----
[...truncated 270 lines...]
[junit4] JVM J1: stderr was not empty, see: /home/jenkins/workspace/Lucene-Solr-master-Linux/lucene/build/sandbox/test/temp/junit4-J1-20190816_120016_9114351641093568587430.syserr
[junit4] >>> JVM J1 emitted unexpected output (verbatim) ----
[junit4] OpenJDK 64-Bit Server VM warning: Option UseConcMarkSweepGC was deprecated in version 9.0 and will likely be removed in a future release.
[junit4] <<< JVM J1: EOF ----
[...truncated 5 lines...]
[junit4] JVM J0: stderr was not empty, see: /home/jenkins/workspace/Lucene-Solr-master-Linux/lucene/build/sandbox/test/temp/junit4-J0-20190816_120016_9119409309242130175539.syserr
[junit4] >>> JVM J0 emitted unexpected output (verbatim) ----
[junit4] OpenJDK 64-Bit Server VM warning: Option UseConcMarkSweepGC was deprecated in version 9.0 and will likely be removed in a future release.
[junit4] <<< JVM J0: EOF ----
[...truncated 5 lines...]
[junit4] JVM J2: stderr was not empty, see: /home/jenkins/workspace/Lucene-Solr-master-Linux/lucene/build/sandbox/test/temp/junit4-J2-20190816_120016_91112616027242556786966.syserr
[junit4] >>> JVM J2 emitted unexpected output (verbatim) ----
[junit4] OpenJDK 64-Bit Server VM warning: Option UseConcMarkSweepGC was deprecated in version 9.0 and will likely be removed in a future release.
[junit4] <<< JVM J2: EOF ----
[...truncated 294 lines...]
[junit4] JVM J1: stderr was not empty, see: /home/jenkins/workspace/Lucene-Solr-master-Linux/lucene/build/spatial-extras/test/temp/junit4-J1-20190816_120231_1627547500554711926786.syserr
[junit4] >>> JVM J1 emitted unexpected output (verbatim) ----
[junit4] OpenJDK 64-Bit Server VM warning: Option UseConcMarkSweepGC was deprecated in version 9.0 and will likely be removed in a future release.
[junit4] <<< JVM J1: EOF ----
[...truncated 6 lines...]
[junit4] JVM J2: stderr was not empty, see: /home/jenkins/workspace/Lucene-Solr-master-Linux/lucene/build/spatial-extras/test/temp/junit4-J2-20190816_120231_1637557793895395129215.syserr
[junit4] >>> JVM J2 emitted unexpected output (verbatim) ----
[junit4] OpenJDK 64-Bit Server VM warning: Option UseConcMarkSweepGC was deprecated in version 9.0 and will likely be removed in a future release.
[junit4] <<< JVM J2: EOF ----
[...truncated 3 lines...]
[junit4] JVM J0: stderr was not empty, see: /home/jenkins/workspace/Lucene-Solr-master-Linux/lucene/build/spatial-extras/test/temp/junit4-J0-20190816_120231_16212700574447020387763.syserr
[junit4] >>> JVM J0 emitted unexpected output (verbatim) ----
[junit4] OpenJDK 64-Bit Server VM warning: Option UseConcMarkSweepGC was deprecated in version 9.0 and will likely be removed in a future release.
[junit4] <<< JVM J0: EOF ----
[...truncated 148 lines...]
[junit4] JVM J0: stderr was not empty, see: /home/jenkins/workspace/Lucene-Solr-master-Linux/lucene/build/spatial/test/temp/junit4-J0-20190816_120305_7434667114093620562207.syserr
[junit4] >>> JVM J0 emitted unexpected output (verbatim) ----
[junit4] OpenJDK 64-Bit Server VM warning: Option UseConcMarkSweepGC was deprecated in version 9.0 and will likely be removed in a future release.
[junit4] <<< JVM J0: EOF ----
[...truncated 184 lines...]
[junit4] JVM J0: stderr was not empty, see: /home/jenkins/workspace/Lucene-Solr-master-Linux/lucene/build/spatial3d/test/temp/junit4-J0-20190816_120307_6468590674120037744386.syserr
[junit4] >>> JVM J0 emitted unexpected output (verbatim) ----
[junit4] OpenJDK 64-Bit Server VM warning: Option UseConcMarkSweepGC was deprecated in version 9.0 and will likely be removed in a future release.
[junit4] <<< JVM J0: EOF ----
[junit4] JVM J1: stderr was not empty, see: /home/jenkins/workspace/Lucene-Solr-master-Linux/lucene/build/spatial3d/test/temp/junit4-J1-20190816_120307_64611973995159824300548.syserr
[junit4] >>> JVM J1 emitted unexpected output (verbatim) ----
[junit4] OpenJDK 64-Bit Server VM warning: Option UseConcMarkSweepGC was deprecated in version 9.0 and will likely be removed in a future release.
[junit4] <<< JVM J1: EOF ----
[...truncated 6 lines...]
[junit4] JVM J2: stderr was not empty, see: /home/jenkins/workspace/Lucene-Solr-master-Linux/lucene/build/spatial3d/test/temp/junit4-J2-20190816_120307_6468345182996245054259.syserr
[junit4] >>> JVM J2 emitted unexpected output (verbatim) ----
[junit4] OpenJDK 64-Bit Server VM warning: Option UseConcMarkSweepGC was deprecated in version 9.0 and will likely be removed in a future release.
[junit4] <<< JVM J2: EOF ----
[...truncated 242 lines...]
[junit4] JVM J2: stderr was not empty, see: /home/jenkins/workspace/Lucene-Solr-master-Linux/lucene/build/suggest/test/temp/junit4-J2-20190816_120450_0877385624540464136676.syserr
[junit4] >>> JVM J2 emitted unexpected output (verbatim) ----
[junit4] OpenJDK 64-Bit Server VM warning: Option UseConcMarkSweepGC was deprecated in version 9.0 and will likely be removed in a future release.
[junit4] <<< JVM J2: EOF ----
[...truncated 3 lines...]
[junit4] JVM J1: stderr was not empty, see: /home/jenkins/workspace/Lucene-Solr-master-Linux/lucene/build/suggest/test/temp/junit4-J1-20190816_120450_08717428473260394433081.syserr
[junit4] >>> JVM J1 emitted unexpected output (verbatim) ----
[junit4] OpenJDK 64-Bit Server VM warning: Option UseConcMarkSweepGC was deprecated in version 9.0 and will likely be removed in a future release.
[junit4] <<< JVM J1: EOF ----
[...truncated 12 lines...]
[junit4] JVM J0: stderr was not empty, see: /home/jenkins/workspace/Lucene-Solr-master-Linux/lucene/build/suggest/test/temp/junit4-J0-20190816_120450_0877850540996796096472.syserr
[junit4] >>> JVM J0 emitted unexpected output (verbatim) ----
[junit4] OpenJDK 64-Bit Server VM warning: Option UseConcMarkSweepGC was deprecated in version 9.0 and will likely be removed in a future release.
[junit4] <<< JVM J0: EOF ----
[...truncated 1885 lines...]
[junit4] Suite: org.apache.solr.search.facet.TestCloudJSONFacetSKG
[junit4] 2> 219905 INFO (SUITE-TestCloudJSONFacetSKG-seed#[A39E0ADCB98259EB]-worker) [ ] o.a.s.SolrTestCaseJ4 SecureRandom sanity checks: test.solr.allowed.securerandom=null & java.security.egd=file:/dev/./urandom
[junit4] 2> 219905 INFO (SUITE-TestCloudJSONFacetSKG-seed#[A39E0ADCB98259EB]-worker) [ ] o.a.s.SolrTestCaseJ4 Created dataDir: /home/jenkins/workspace/Lucene-Solr-master-Linux/solr/build/solr-core/test/J1/temp/solr.search.facet.TestCloudJSONFacetSKG_A39E0ADCB98259EB-001/data-dir-38-001
[junit4] 2> 219905 WARN (SUITE-TestCloudJSONFacetSKG-seed#[A39E0ADCB98259EB]-worker) [ ] o.a.s.SolrTestCaseJ4 startTrackingSearchers: numOpens=226 numCloses=226
[junit4] 2> 219905 INFO (SUITE-TestCloudJSONFacetSKG-seed#[A39E0ADCB98259EB]-worker) [ ] o.a.s.SolrTestCaseJ4 Using PointFields (NUMERIC_POINTS_SYSPROP=true) w/NUMERIC_DOCVALUES_SYSPROP=false
[junit4] 2> 219906 INFO (SUITE-TestCloudJSONFacetSKG-seed#[A39E0ADCB98259EB]-worker) [ ] o.a.s.SolrTestCaseJ4 Randomized ssl (true) and clientAuth (true) via: @org.apache.solr.util.RandomizeSSL(reason="", value=0.0/0.0, ssl=0.0/0.0, clientAuth=0.0/0.0)
[junit4] 2> 219907 INFO (SUITE-TestCloudJSONFacetSKG-seed#[A39E0ADCB98259EB]-worker) [ ] o.a.s.c.MiniSolrCloudCluster Starting cluster of 1 servers in /home/jenkins/workspace/Lucene-Solr-master-Linux/solr/build/solr-core/test/J1/temp/solr.search.facet.TestCloudJSONFacetSKG_A39E0ADCB98259EB-001/tempDir-001
[junit4] 2> 219907 INFO (SUITE-TestCloudJSONFacetSKG-seed#[A39E0ADCB98259EB]-worker) [ ] o.a.s.c.ZkTestServer STARTING ZK TEST SERVER
[junit4] 2> 219908 INFO (ZkTestServer Run Thread) [ ] o.a.s.c.ZkTestServer client port:0.0.0.0/0.0.0.0:0
[junit4] 2> 219908 INFO (ZkTestServer Run Thread) [ ] o.a.s.c.ZkTestServer Starting server
[junit4] 2> 220008 INFO (SUITE-TestCloudJSONFacetSKG-seed#[A39E0ADCB98259EB]-worker) [ ] o.a.s.c.ZkTestServer start zk server on port:41137
[junit4] 2> 220008 INFO (SUITE-TestCloudJSONFacetSKG-seed#[A39E0ADCB98259EB]-worker) [ ] o.a.s.c.ZkTestServer parse host and port list: 127.0.0.1:41137
[junit4] 2> 220008 INFO (SUITE-TestCloudJSONFacetSKG-seed#[A39E0ADCB98259EB]-worker) [ ] o.a.s.c.ZkTestServer connecting to 127.0.0.1 41137
[junit4] 2> 220010 INFO (SUITE-TestCloudJSONFacetSKG-seed#[A39E0ADCB98259EB]-worker) [ ] o.a.s.c.c.ConnectionManager Waiting for client to connect to ZooKeeper
[junit4] 2> 220011 INFO (zkConnectionManagerCallback-1474-thread-1) [ ] o.a.s.c.c.ConnectionManager zkClient has connected
[junit4] 2> 220011 INFO (SUITE-TestCloudJSONFacetSKG-seed#[A39E0ADCB98259EB]-worker) [ ] o.a.s.c.c.ConnectionManager Client is connected to ZooKeeper
[junit4] 2> 220029 INFO (SUITE-TestCloudJSONFacetSKG-seed#[A39E0ADCB98259EB]-worker) [ ] o.a.s.c.c.ConnectionManager Waiting for client to connect to ZooKeeper
[junit4] 2> 220037 INFO (zkConnectionManagerCallback-1476-thread-1) [ ] o.a.s.c.c.ConnectionManager zkClient has connected
[junit4] 2> 220037 INFO (SUITE-TestCloudJSONFacetSKG-seed#[A39E0ADCB98259EB]-worker) [ ] o.a.s.c.c.ConnectionManager Client is connected to ZooKeeper
[junit4] 2> 220038 INFO (SUITE-TestCloudJSONFacetSKG-seed#[A39E0ADCB98259EB]-worker) [ ] o.a.s.c.c.ConnectionManager Waiting for client to connect to ZooKeeper
[junit4] 2> 220043 INFO (zkConnectionManagerCallback-1478-thread-1) [ ] o.a.s.c.c.ConnectionManager zkClient has connected
[junit4] 2> 220043 INFO (SUITE-TestCloudJSONFacetSKG-seed#[A39E0ADCB98259EB]-worker) [ ] o.a.s.c.c.ConnectionManager Client is connected to ZooKeeper
[junit4] 2> 220152 WARN (jetty-launcher-1479-thread-1) [ ] o.e.j.s.AbstractConnector Ignoring deprecated socket close linger time
[junit4] 2> 220152 INFO (jetty-launcher-1479-thread-1) [ ] o.a.s.c.s.e.JettySolrRunner Start Jetty (original configured port=0)
[junit4] 2> 220152 INFO (jetty-launcher-1479-thread-1) [ ] o.a.s.c.s.e.JettySolrRunner Trying to start Jetty on port 0 try number 1 ...
[junit4] 2> 220152 INFO (jetty-launcher-1479-thread-1) [ ] o.e.j.s.Server jetty-9.4.19.v20190610; built: 2019-06-10T16:30:51.723Z; git: afcf563148970e98786327af5e07c261fda175d3; jvm 11.0.3+7
[junit4] 2> 220153 INFO (jetty-launcher-1479-thread-1) [ ] o.e.j.s.session DefaultSessionIdManager workerName=node0
[junit4] 2> 220153 INFO (jetty-launcher-1479-thread-1) [ ] o.e.j.s.session No SessionScavenger set, using defaults
[junit4] 2> 220153 INFO (jetty-launcher-1479-thread-1) [ ] o.e.j.s.session node0 Scavenging every 660000ms
[junit4] 2> 220153 INFO (jetty-launcher-1479-thread-1) [ ] o.e.j.s.h.ContextHandler Started o.e.j.s.ServletContextHandler@3ce37869{/solr,null,AVAILABLE}
[junit4] 2> 220154 INFO (jetty-launcher-1479-thread-1) [ ] o.e.j.s.AbstractConnector Started ServerConnector@1764b7{ssl,[ssl, alpn, http/1.1, h2]}{127.0.0.1:34165}
[junit4] 2> 220154 INFO (jetty-launcher-1479-thread-1) [ ] o.e.j.s.Server Started @220191ms
[junit4] 2> 220154 INFO (jetty-launcher-1479-thread-1) [ ] o.a.s.c.s.e.JettySolrRunner Jetty properties: {hostContext=/solr, hostPort=34165}
[junit4] 2> 220154 ERROR (jetty-launcher-1479-thread-1) [ ] o.a.s.u.StartupLoggingUtils Missing Java Option solr.log.dir. Logging may be missing or incomplete.
[junit4] 2> 220154 INFO (jetty-launcher-1479-thread-1) [ ] o.a.s.s.SolrDispatchFilter Using logger factory org.apache.logging.slf4j.Log4jLoggerFactory
[junit4] 2> 220154 INFO (jetty-launcher-1479-thread-1) [ ] o.a.s.s.SolrDispatchFilter ___ _ Welcome to Apache Solr™ version 9.0.0
[junit4] 2> 220154 INFO (jetty-launcher-1479-thread-1) [ ] o.a.s.s.SolrDispatchFilter / __| ___| |_ _ Starting in cloud mode on port null
[junit4] 2> 220154 INFO (jetty-launcher-1479-thread-1) [ ] o.a.s.s.SolrDispatchFilter \__ \/ _ \ | '_| Install dir: null
[junit4] 2> 220154 INFO (jetty-launcher-1479-thread-1) [ ] o.a.s.s.SolrDispatchFilter |___/\___/_|_| Start time: 2019-08-16T12:10:06.647743Z
[junit4] 2> 220155 INFO (jetty-launcher-1479-thread-1) [ ] o.a.s.c.c.ConnectionManager Waiting for client to connect to ZooKeeper
[junit4] 2> 220156 INFO (zkConnectionManagerCallback-1481-thread-1) [ ] o.a.s.c.c.ConnectionManager zkClient has connected
[junit4] 2> 220156 INFO (jetty-launcher-1479-thread-1) [ ] o.a.s.c.c.ConnectionManager Client is connected to ZooKeeper
[junit4] 2> 220156 INFO (jetty-launcher-1479-thread-1) [ ] o.a.s.s.SolrDispatchFilter solr.xml found in ZooKeeper. Loading...
[junit4] 2> 220298 INFO (jetty-launcher-1479-thread-1) [ ] o.a.s.h.c.HttpShardHandlerFactory Host whitelist initialized: WhitelistHostChecker [whitelistHosts=null, whitelistHostCheckingEnabled=true]
[junit4] 2> 220299 WARN (jetty-launcher-1479-thread-1) [ ] o.e.j.u.s.S.config Trusting all certificates configured for Client@768ab7a9[provider=null,keyStore=null,trustStore=null]
[junit4] 2> 220299 WARN (jetty-launcher-1479-thread-1) [ ] o.e.j.u.s.S.config No Client EndPointIdentificationAlgorithm configured for Client@768ab7a9[provider=null,keyStore=null,trustStore=null]
[junit4] 2> 220301 WARN (jetty-launcher-1479-thread-1) [ ] o.e.j.u.s.S.config Trusting all certificates configured for Client@23f79b68[provider=null,keyStore=null,trustStore=null]
[junit4] 2> 220301 WARN (jetty-launcher-1479-thread-1) [ ] o.e.j.u.s.S.config No Client EndPointIdentificationAlgorithm configured for Client@23f79b68[provider=null,keyStore=null,trustStore=null]
[junit4] 2> 220302 INFO (jetty-launcher-1479-thread-1) [ ] o.a.s.c.ZkContainer Zookeeper client=127.0.0.1:41137/solr
[junit4] 2> 220303 INFO (jetty-launcher-1479-thread-1) [ ] o.a.s.c.c.ConnectionManager Waiting for client to connect to ZooKeeper
[junit4] 2> 220304 INFO (zkConnectionManagerCallback-1488-thread-1) [ ] o.a.s.c.c.ConnectionManager zkClient has connected
[junit4] 2> 220304 INFO (jetty-launcher-1479-thread-1) [ ] o.a.s.c.c.ConnectionManager Client is connected to ZooKeeper
[junit4] 2> 220405 INFO (jetty-launcher-1479-thread-1) [n:127.0.0.1:34165_solr ] o.a.s.c.c.ConnectionManager Waiting for client to connect to ZooKeeper
[junit4] 2> 220406 INFO (zkConnectionManagerCallback-1490-thread-1) [ ] o.a.s.c.c.ConnectionManager zkClient has connected
[junit4] 2> 220406 INFO (jetty-launcher-1479-thread-1) [n:127.0.0.1:34165_solr ] o.a.s.c.c.ConnectionManager Client is connected to ZooKeeper
[junit4] 2> 220451 INFO (jetty-launcher-1479-thread-1) [n:127.0.0.1:34165_solr ] o.a.s.c.OverseerElectionContext I am going to be the leader 127.0.0.1:34165_solr
[junit4] 2> 220452 INFO (jetty-launcher-1479-thread-1) [n:127.0.0.1:34165_solr ] o.a.s.c.Overseer Overseer (id=72126496235388933-127.0.0.1:34165_solr-n_0000000000) starting
[junit4] 2> 220455 INFO (jetty-launcher-1479-thread-1) [n:127.0.0.1:34165_solr ] o.a.s.c.c.ConnectionManager Waiting for client to connect to ZooKeeper
[junit4] 2> 220459 INFO (zkConnectionManagerCallback-1497-thread-1) [ ] o.a.s.c.c.ConnectionManager zkClient has connected
[junit4] 2> 220459 INFO (jetty-launcher-1479-thread-1) [n:127.0.0.1:34165_solr ] o.a.s.c.c.ConnectionManager Client is connected to ZooKeeper
[junit4] 2> 220460 INFO (jetty-launcher-1479-thread-1) [n:127.0.0.1:34165_solr ] o.a.s.c.s.i.ZkClientClusterStateProvider Cluster at 127.0.0.1:41137/solr ready
[junit4] 2> 220465 INFO (OverseerStateUpdate-72126496235388933-127.0.0.1:34165_solr-n_0000000000) [n:127.0.0.1:34165_solr ] o.a.s.c.Overseer Starting to work on the main queue : 127.0.0.1:34165_solr
[junit4] 2> 220465 INFO (jetty-launcher-1479-thread-1) [n:127.0.0.1:34165_solr ] o.a.s.c.ZkController Register node as live in ZooKeeper:/live_nodes/127.0.0.1:34165_solr
[junit4] 2> 220466 INFO (zkCallback-1489-thread-1) [ ] o.a.s.c.c.ZkStateReader Updated live nodes from ZooKeeper... (0) -> (1)
[junit4] 2> 220467 INFO (jetty-launcher-1479-thread-1) [n:127.0.0.1:34165_solr ] o.a.s.c.LibListener clusterprops.json changed , version 0
[junit4] 2> 220487 INFO (zkCallback-1496-thread-1) [ ] o.a.s.c.c.ZkStateReader Updated live nodes from ZooKeeper... (0) -> (1)
[junit4] 2> 220493 INFO (jetty-launcher-1479-thread-1) [n:127.0.0.1:34165_solr ] o.a.s.h.a.MetricsHistoryHandler No .system collection, keeping metrics history in memory.
[junit4] 2> 220504 INFO (jetty-launcher-1479-thread-1) [n:127.0.0.1:34165_solr ] o.a.s.m.r.SolrJmxReporter JMX monitoring for 'solr_34165.solr.node' (registry 'solr.node') enabled at server: com.sun.jmx.mbeanserver.JmxMBeanServer@62aa2e96
[junit4] 2> 220508 INFO (jetty-launcher-1479-thread-1) [n:127.0.0.1:34165_solr ] o.a.s.m.r.SolrJmxReporter JMX monitoring for 'solr_34165.solr.jvm' (registry 'solr.jvm') enabled at server: com.sun.jmx.mbeanserver.JmxMBeanServer@62aa2e96
[junit4] 2> 220508 INFO (jetty-launcher-1479-thread-1) [n:127.0.0.1:34165_solr ] o.a.s.m.r.SolrJmxReporter JMX monitoring for 'solr_34165.solr.jetty' (registry 'solr.jetty') enabled at server: com.sun.jmx.mbeanserver.JmxMBeanServer@62aa2e96
[junit4] 2> 220509 INFO (jetty-launcher-1479-thread-1) [n:127.0.0.1:34165_solr ] o.a.s.c.CorePropertiesLocator Found 0 core definitions underneath /home/jenkins/workspace/Lucene-Solr-master-Linux/solr/build/solr-core/test/J1/temp/solr.search.facet.TestCloudJSONFacetSKG_A39E0ADCB98259EB-001/tempDir-001/node1/.
[junit4] 2> 220518 INFO (SUITE-TestCloudJSONFacetSKG-seed#[A39E0ADCB98259EB]-worker) [ ] o.a.s.c.c.ConnectionManager Waiting for client to connect to ZooKeeper
[junit4] 2> 220519 INFO (zkConnectionManagerCallback-1503-thread-1) [ ] o.a.s.c.c.ConnectionManager zkClient has connected
[junit4] 2> 220519 INFO (SUITE-TestCloudJSONFacetSKG-seed#[A39E0ADCB98259EB]-worker) [ ] o.a.s.c.c.ConnectionManager Client is connected to ZooKeeper
[junit4] 2> 220520 INFO (SUITE-TestCloudJSONFacetSKG-seed#[A39E0ADCB98259EB]-worker) [ ] o.a.s.c.c.ZkStateReader Updated live nodes from ZooKeeper... (0) -> (1)
[junit4] 2> 220521 INFO (SUITE-TestCloudJSONFacetSKG-seed#[A39E0ADCB98259EB]-worker) [ ] o.a.s.c.s.i.ZkClientClusterStateProvider Cluster at 127.0.0.1:41137/solr ready
[junit4] 2> 220705 INFO (qtp1340971265-4309) [n:127.0.0.1:34165_solr ] o.a.s.h.a.CollectionsHandler Invoked Collection Action :create with params property.schema=schema_latest.xml&property.config=solrconfig-tlog.xml&collection.configName=org.apache.solr.search.facet.TestCloudJSONFacetSKG_config-set&name=org.apache.solr.search.facet.TestCloudJSONFacetSKG_collection&nrtReplicas=1&action=CREATE&numShards=1&wt=javabin&version=2 and sendToOCPQueue=true
[junit4] 2> 220707 INFO (OverseerThreadFactory-1578-thread-1-processing-n:127.0.0.1:34165_solr) [n:127.0.0.1:34165_solr ] o.a.s.c.a.c.CreateCollectionCmd Create collection org.apache.solr.search.facet.TestCloudJSONFacetSKG_collection
[junit4] 2> 220811 INFO (OverseerStateUpdate-72126496235388933-127.0.0.1:34165_solr-n_0000000000) [n:127.0.0.1:34165_solr ] o.a.s.c.o.SliceMutator createReplica() {
[junit4] 2> "operation":"ADDREPLICA",
[junit4] 2> "collection":"org.apache.solr.search.facet.TestCloudJSONFacetSKG_collection",
[junit4] 2> "shard":"shard1",
[junit4] 2> "core":"org.apache.solr.search.facet.TestCloudJSONFacetSKG_collection_shard1_replica_n1",
[junit4] 2> "state":"down",
[junit4] 2> "base_url":"https://127.0.0.1:34165/solr",
[junit4] 2> "type":"NRT",
[junit4] 2> "waitForFinalState":"false"}
[junit4] 2> 221022 INFO (qtp1340971265-4308) [n:127.0.0.1:34165_solr x:org.apache.solr.search.facet.TestCloudJSONFacetSKG_collection_shard1_replica_n1 ] o.a.s.h.a.CoreAdminOperation core create command qt=/admin/cores&collection.configName=org.apache.solr.search.facet.TestCloudJSONFacetSKG_config-set&newCollection=true&collection=org.apache.solr.search.facet.TestCloudJSONFacetSKG_collection&version=2&replicaType=NRT&property.schema=schema_latest.xml&property.config=solrconfig-tlog.xml&coreNodeName=core_node2&name=org.apache.solr.search.facet.TestCloudJSONFacetSKG_collection_shard1_replica_n1&action=CREATE&numShards=1&shard=shard1&wt=javabin
[junit4] 2> 221022 INFO (qtp1340971265-4308) [n:127.0.0.1:34165_solr x:org.apache.solr.search.facet.TestCloudJSONFacetSKG_collection_shard1_replica_n1 ] o.a.s.c.TransientSolrCoreCacheDefault Allocating transient cache for 2147483647 transient cores
[junit4] 2> 222031 INFO (qtp1340971265-4308) [n:127.0.0.1:34165_solr c:org.apache.solr.search.facet.TestCloudJSONFacetSKG_collection s:shard1 r:core_node2 x:org.apache.solr.search.facet.TestCloudJSONFacetSKG_collection_shard1_replica_n1 ] o.a.s.c.SolrConfig Using Lucene MatchVersion: 9.0.0
[junit4] 2> 222039 INFO (qtp1340971265-4308) [n:127.0.0.1:34165_solr c:org.apache.solr.search.facet.TestCloudJSONFacetSKG_collection s:shard1 r:core_node2 x:org.apache.solr.search.facet.TestCloudJSONFacetSKG_collection_shard1_replica_n1 ] o.a.s.s.IndexSchema [org.apache.solr.search.facet.TestCloudJSONFacetSKG_collection_shard1_replica_n1] Schema name=example
[junit4] 2> 222072 INFO (qtp1340971265-4308) [n:127.0.0.1:34165_solr c:org.apache.solr.search.facet.TestCloudJSONFacetSKG_collection s:shard1 r:core_node2 x:org.apache.solr.search.facet.TestCloudJSONFacetSKG_collection_shard1_replica_n1 ] o.a.s.s.IndexSchema Loaded schema example/1.6 with uniqueid field id
[junit4] 2> 222081 INFO (qtp1340971265-4308) [n:127.0.0.1:34165_solr c:org.apache.solr.search.facet.TestCloudJSONFacetSKG_collection s:shard1 r:core_node2 x:org.apache.solr.search.facet.TestCloudJSONFacetSKG_collection_shard1_replica_n1 ] o.a.s.c.CoreContainer Creating SolrCore 'org.apache.solr.search.facet.TestCloudJSONFacetSKG_collection_shard1_replica_n1' using configuration from collection org.apache.solr.search.facet.TestCloudJSONFacetSKG_collection, trusted=true
[junit4] 2> 222081 INFO (qtp1340971265-4308) [n:127.0.0.1:34165_solr c:org.apache.solr.search.facet.TestCloudJSONFacetSKG_collection s:shard1 r:core_node2 x:org.apache.solr.search.facet.TestCloudJSONFacetSKG_collection_shard1_replica_n1 ] o.a.s.m.r.SolrJmxReporter JMX monitoring for 'solr_34165.solr.core.org.apache.solr.search.facet.TestCloudJSONFacetSKG_collection.shard1.replica_n1' (registry 'solr.core.org.apache.solr.search.facet.TestCloudJSONFacetSKG_collection.shard1.replica_n1') enabled at server: com.sun.jmx.mbeanserver.JmxMBeanServer@62aa2e96
[junit4] 2> 222081 INFO (qtp1340971265-4308) [n:127.0.0.1:34165_solr c:org.apache.solr.search.facet.TestCloudJSONFacetSKG_collection s:shard1 r:core_node2 x:org.apache.solr.search.facet.TestCloudJSONFacetSKG_collection_shard1_replica_n1 ] o.a.s.c.SolrCore [[org.apache.solr.search.facet.TestCloudJSONFacetSKG_collection_shard1_replica_n1] ] Opening new SolrCore at [/home/jenkins/workspace/Lucene-Solr-master-Linux/solr/build/solr-core/test/J1/temp/solr.search.facet.TestCloudJSONFacetSKG_A39E0ADCB98259EB-001/tempDir-001/node1/org.apache.solr.search.facet.TestCloudJSONFacetSKG_collection_shard1_replica_n1], dataDir=[/home/jenkins/workspace/Lucene-Solr-master-Linux/solr/build/solr-core/test/J1/temp/solr.search.facet.TestCloudJSONFacetSKG_A39E0ADCB98259EB-001/tempDir-001/node1/./org.apache.solr.search.facet.TestCloudJSONFacetSKG_collection_shard1_replica_n1/data/]
[junit4] 2> 222083 INFO (qtp1340971265-4308) [n:127.0.0.1:34165_solr c:org.apache.solr.search.facet.TestCloudJSONFacetSKG_collection s:shard1 r:core_node2 x:org.apache.solr.search.facet.TestCloudJSONFacetSKG_collection_shard1_replica_n1 ] o.a.s.u.RandomMergePolicy RandomMergePolicy wrapping class org.apache.lucene.index.AlcoholicMergePolicy: [AlcoholicMergePolicy: minMergeSize=0, mergeFactor=10, maxMergeSize=188284467, maxMergeSizeForForcedMerge=9223372036854775807, calibrateSizeByDeletes=true, maxMergeDocs=2147483647, maxCFSSegmentSizeMB=8.796093022207999E12, noCFSRatio=0.1]
[junit4] 2> 222084 WARN (qtp1340971265-4308) [n:127.0.0.1:34165_solr c:org.apache.solr.search.facet.TestCloudJSONFacetSKG_collection s:shard1 r:core_node2 x:org.apache.solr.search.facet.TestCloudJSONFacetSKG_collection_shard1_replica_n1 ] o.a.s.c.RequestHandlers INVALID paramSet a in requestHandler {type = requestHandler,name = /dump,class = DumpRequestHandler,attributes = {initParams=a, name=/dump, class=DumpRequestHandler},args = {defaults={a=A,b=B}}}
[junit4] 2> 222110 INFO (qtp1340971265-4308) [n:127.0.0.1:34165_solr c:org.apache.solr.search.facet.TestCloudJSONFacetSKG_collection s:shard1 r:core_node2 x:org.apache.solr.search.facet.TestCloudJSONFacetSKG_collection_shard1_replica_n1 ] o.a.s.u.UpdateHandler Using UpdateLog implementation: org.apache.solr.update.UpdateLog
[junit4] 2> 222110 INFO (qtp1340971265-4308) [n:127.0.0.1:34165_solr c:org.apache.solr.search.facet.TestCloudJSONFacetSKG_collection s:shard1 r:core_node2 x:org.apache.solr.search.facet.TestCloudJSONFacetSKG_collection_shard1_replica_n1 ] o.a.s.u.UpdateLog Initializing UpdateLog: dataDir= defaultSyncLevel=FLUSH numRecordsToKeep=100 maxNumLogsToKeep=10 numVersionBuckets=65536
[junit4] 2> 222111 INFO (qtp1340971265-4308) [n:127.0.0.1:34165_solr c:org.apache.solr.search.facet.TestCloudJSONFacetSKG_collection s:shard1 r:core_node2 x:org.apache.solr.search.facet.TestCloudJSONFacetSKG_collection_shard1_replica_n1 ] o.a.s.u.CommitTracker Hard AutoCommit: disabled
[junit4] 2> 222111 INFO (qtp1340971265-4308) [n:127.0.0.1:34165_solr c:org.apache.solr.search.facet.TestCloudJSONFacetSKG_collection s:shard1 r:core_node2 x:org.apache.solr.search.facet.TestCloudJSONFacetSKG_collection_shard1_replica_n1 ] o.a.s.u.CommitTracker Soft AutoCommit: disabled
[junit4] 2> 222112 INFO (qtp1340971265-4308) [n:127.0.0.1:34165_solr c:org.apache.solr.search.facet.TestCloudJSONFacetSKG_collection s:shard1 r:core_node2 x:org.apache.solr.search.facet.TestCloudJSONFacetSKG_collection_shard1_replica_n1 ] o.a.s.u.RandomMergePolicy RandomMergePolicy wrapping class org.apache.lucene.index.TieredMergePolicy: [TieredMergePolicy: maxMergeAtOnce=34, maxMergeAtOnceExplicit=36, maxMergedSegmentMB=97.0673828125, floorSegmentMB=1.240234375, forceMergeDeletesPctAllowed=21.23992738128166, segmentsPerTier=43.0, maxCFSSegmentSizeMB=8.796093022207999E12, noCFSRatio=0.4535718856383104, deletesPctAllowed=47.40546234400554
[junit4] 2> 222112 INFO (qtp1340971265-4308) [n:127.0.0.1:34165_solr c:org.apache.solr.search.facet.TestCloudJSONFacetSKG_collection s:shard1 r:core_node2 x:org.apache.solr.search.facet.TestCloudJSONFacetSKG_collection_shard1_replica_n1 ] o.a.s.s.SolrIndexSearcher Opening [Searcher@10bd4fa6[org.apache.solr.search.facet.TestCloudJSONFacetSKG_collection_shard1_replica_n1] main]
[junit4] 2> 222113 INFO (qtp1340971265-4308) [n:127.0.0.1:34165_solr c:org.apache.solr.search.facet.TestCloudJSONFacetSKG_collection s:shard1 r:core_node2 x:org.apache.solr.search.facet.TestCloudJSONFacetSKG_collection_shard1_replica_n1 ] o.a.s.r.ManagedResourceStorage Configured ZooKeeperStorageIO with znodeBase: /configs/org.apache.solr.search.facet.TestCloudJSONFacetSKG_config-set
[junit4] 2> 222114 INFO (qtp1340971265-4308) [n:127.0.0.1:34165_solr c:org.apache.solr.search.facet.TestCloudJSONFacetSKG_collection s:shard1 r:core_node2 x:org.apache.solr.search.facet.TestCloudJSONFacetSKG_collection_shard1_replica_n1 ] o.a.s.r.ManagedResourceStorage Loaded null at path _rest_managed.json using ZooKeeperStorageIO:path=/configs/org.apache.solr.search.facet.TestCloudJSONFacetSKG_config-set
[junit4] 2> 222114 INFO (qtp1340971265-4308) [n:127.0.0.1:34165_solr c:org.apache.solr.search.facet.TestCloudJSONFacetSKG_collection s:shard1 r:core_node2 x:org.apache.solr.search.facet.TestCloudJSONFacetSKG_collection_shard1_replica_n1 ] o.a.s.h.ReplicationHandler Commits will be reserved for 10000ms.
[junit4] 2> 222114 INFO (qtp1340971265-4308) [n:127.0.0.1:34165_solr c:org.apache.solr.search.facet.TestCloudJSONFacetSKG_collection s:shard1 r:core_node2 x:org.apache.solr.search.facet.TestCloudJSONFacetSKG_collection_shard1_replica_n1 ] o.a.s.u.UpdateLog Could not find max version in index or recent updates, using new clock 1642025355687493632
[junit4] 2> 222116 INFO (searcherExecutor-1583-thread-1-processing-n:127.0.0.1:34165_solr x:org.apache.solr.search.facet.TestCloudJSONFacetSKG_collection_shard1_replica_n1 c:org.apache.solr.search.facet.TestCloudJSONFacetSKG_collection s:shard1 r:core_node2) [n:127.0.0.1:34165_solr c:org.apache.solr.search.facet.TestCloudJSONFacetSKG_collection s:shard1 r:core_node2 x:org.apache.solr.search.facet.TestCloudJSONFacetSKG_collection_shard1_replica_n1 ] o.a.s.c.SolrCore [org.apache.solr.search.facet.TestCloudJSONFacetSKG_collection_shard1_replica_n1] Registered new searcher Searcher@10bd4fa6[org.apache.solr.search.facet.TestCloudJSONFacetSKG_collection_shard1_replica_n1] main{ExitableDirectoryReader(UninvertingDirectoryReader())}
[junit4] 2> 222118 INFO (qtp1340971265-4308) [n:127.0.0.1:34165_solr c:org.apache.solr.search.facet.TestCloudJSONFacetSKG_collection s:shard1 r:core_node2 x:org.apache.solr.search.facet.TestCloudJSONFacetSKG_collection_shard1_replica_n1 ] o.a.s.c.ZkShardTerms Successful update of terms at /collections/org.apache.solr.search.facet.TestCloudJSONFacetSKG_collection/terms/shard1 to Terms{values={core_node2=0}, version=0}
[junit4] 2> 222118 INFO (qtp1340971265-4308) [n:127.0.0.1:34165_solr c:org.apache.solr.search.facet.TestCloudJSONFacetSKG_collection s:shard1 r:core_node2 x:org.apache.solr.search.facet.TestCloudJSONFacetSKG_collection_shard1_replica_n1 ] o.a.s.c.ShardLeaderElectionContextBase make sure parent is created /collections/org.apache.solr.search.facet.TestCloudJSONFacetSKG_collection/leaders/shard1
[junit4] 2> 222119 INFO (qtp1340971265-4308) [n:127.0.0.1:34165_solr c:org.apache.solr.search.facet.TestCloudJSONFacetSKG_collection s:shard1 r:core_node2 x:org.apache.solr.search.facet.TestCloudJSONFacetSKG_collection_shard1_replica_n1 ] o.a.s.c.ShardLeaderElectionContext Enough replicas found to continue.
[junit4] 2> 222119 INFO (qtp1340971265-4308) [n:127.0.0.1:34165_solr c:org.apache.solr.search.facet.TestCloudJSONFacetSKG_collection s:shard1 r:core_node2 x:org.apache.solr.search.facet.TestCloudJSONFacetSKG_collection_shard1_replica_n1 ] o.a.s.c.ShardLeaderElectionContext I may be the new leader - try and sync
[junit4] 2> 222119 INFO (qtp1340971265-4308) [n:127.0.0.1:34165_solr c:org.apache.solr.search.facet.TestCloudJSONFacetSKG_collection s:shard1 r:core_node2 x:org.apache.solr.search.facet.TestCloudJSONFacetSKG_collection_shard1_replica_n1 ] o.a.s.c.SyncStrategy Sync replicas to https://127.0.0.1:34165/solr/org.apache.solr.search.facet.TestCloudJSONFacetSKG_collection_shard1_replica_n1/
[junit4] 2> 222120 INFO (qtp1340971265-4308) [n:127.0.0.1:34165_solr c:org.apache.solr.search.facet.TestCloudJSONFacetSKG_collection s:shard1 r:core_node2 x:org.apache.solr.search.facet.TestCloudJSONFacetSKG_collection_shard1_replica_n1 ] o.a.s.c.SyncStrategy Sync Success - now sync replicas to me
[junit4] 2> 222120 INFO (qtp1340971265-4308) [n:127.0.0.1:34165_solr c:org.apache.solr.search.facet.TestCloudJSONFacetSKG_collection s:shard1 r:core_node2 x:org.apache.solr.search.facet.TestCloudJSONFacetSKG_collection_shard1_replica_n1 ] o.a.s.c.SyncStrategy https://127.0.0.1:34165/solr/org.apache.solr.search.facet.TestCloudJSONFacetSKG_collection_shard1_replica_n1/ has no replicas
[junit4] 2> 222120 INFO (qtp1340971265-4308) [n:127.0.0.1:34165_solr c:org.apache.solr.search.facet.TestCloudJSONFacetSKG_collection s:shard1 r:core_node2 x:org.apache.solr.search.facet.TestCloudJSONFacetSKG_collection_shard1_replica_n1 ] o.a.s.c.ShardLeaderElectionContextBase Creating leader registration node /collections/org.apache.solr.search.facet.TestCloudJSONFacetSKG_collection/leaders/shard1/leader after winning as /collections/org.apache.solr.search.facet.TestCloudJSONFacetSKG_collection/leader_elect/shard1/election/72126496235388933-core_node2-n_0000000000
[junit4] 2> 222120 INFO (qtp1340971265-4308) [n:127.0.0.1:34165_solr c:org.apache.solr.search.facet.TestCloudJSONFacetSKG_collection s:shard1 r:core_node2 x:org.apache.solr.search.facet.TestCloudJSONFacetSKG_collection_shard1_replica_n1 ] o.a.s.c.ShardLeaderElectionContext I am the new leader: https://127.0.0.1:34165/solr/org.apache.solr.search.facet.TestCloudJSONFacetSKG_collection_shard1_replica_n1/ shard1
[junit4] 2> 222221 INFO (zkCallback-1489-thread-1) [ ] o.a.s.c.c.ZkStateReader A cluster state change: [WatchedEvent state:SyncConnected type:NodeDataChanged path:/collections/org.apache.solr.search.facet.TestCloudJSONFacetSKG_collection/state.json] for collection [org.apache.solr.search.facet.TestCloudJSONFacetSKG_collection] has occurred - updating... (live nodes size: [1])
[junit4] 2> 222222 INFO (qtp1340971265-4308) [n:127.0.0.1:34165_solr c:org.apache.solr.search.facet.TestCloudJSONFacetSKG_collection s:shard1 r:core_node2 x:org.apache.solr.search.facet.TestCloudJSONFacetSKG_collection_shard1_replica_n1 ] o.a.s.c.ZkController I am the leader, no recovery necessary
[junit4] 2> 222228 INFO (zkCallback-1489-thread-2) [ ] o.a.s.c.c.ZkStateReader A cluster state change: [WatchedEvent state:SyncConnected type:NodeDataChanged path:/collections/org.apache.solr.search.facet.TestCloudJSONFacetSKG_collection/state.json] for collection [org.apache.solr.search.facet.TestCloudJSONFacetSKG_collection] has occurred - updating... (live nodes size: [1])
[junit4] 2> 222330 INFO (zkCallback-1489-thread-2) [ ] o.a.s.c.c.ZkStateReader A cluster state change: [WatchedEvent state:SyncConnected type:NodeDataChanged path:/collections/org.apache.solr.search.facet.TestCloudJSONFacetSKG_collection/state.json] for collection [org.apache.solr.search.facet.TestCloudJSONFacetSKG_collection] has occurred - updating... (live nodes size: [1])
[junit4] 2> 222330 INFO (zkCallback-1489-thread-1) [ ] o.a.s.c.c.ZkStateReader A cluster state change: [WatchedEvent state:SyncConnected type:NodeDataChanged path:/collections/org.apache.solr.search.facet.TestCloudJSONFacetSKG_collection/state.json] for collection [org.apache.solr.search.facet.TestCloudJSONFacetSKG_collection] has occurred - updating... (live nodes size: [1])
[junit4] 2> 222330 INFO (zkCallback-1489-thread-3) [ ] o.a.s.c.c.ZkStateReader A cluster state change: [WatchedEvent state:SyncConnected type:NodeDataChanged path:/collections/org.apache.solr.search.facet.TestCloudJSONFacetSKG_collection/state.json] for collection [org.apache.solr.search.facet.TestCloudJSONFacetSKG_collection] has occurred - updating... (live nodes size: [1])
[junit4] 2> 222339 INFO (qtp1340971265-4308) [n:127.0.0.1:34165_solr c:org.apache.solr.search.facet.TestCloudJSONFacetSKG_collection s:shard1 r:core_node2 x:org.apache.solr.search.facet.TestCloudJSONFacetSKG_collection_shard1_replica_n1 ] o.a.s.s.HttpSolrCall [admin] webapp=null path=/admin/cores params={qt=/admin/cores&collection.configName=org.apache.solr.search.facet.TestCloudJSONFacetSKG_config-set&newCollection=true&collection=org.apache.solr.search.facet.TestCloudJSONFacetSKG_collection&version=2&replicaType=NRT&property.schema=schema_latest.xml&property.config=solrconfig-tlog.xml&coreNodeName=core_node2&name=org.apache.solr.search.facet.TestCloudJSONFacetSKG_collection_shard1_replica_n1&action=CREATE&numShards=1&shard=shard1&wt=javabin} status=0 QTime=1317
[junit4] 2> 222340 INFO (qtp1340971265-4309) [n:127.0.0.1:34165_solr ] o.a.s.h.a.CollectionsHandler Wait for new collection to be active for at most 45 seconds. Check all shard replicas
[junit4] 2> 222340 INFO (qtp1340971265-4309) [n:127.0.0.1:34165_solr ] o.a.s.s.HttpSolrCall [admin] webapp=null path=/admin/collections params={property.schema=schema_latest.xml&property.config=solrconfig-tlog.xml&collection.configName=org.apache.solr.search.facet.TestCloudJSONFacetSKG_config-set&name=org.apache.solr.search.facet.TestCloudJSONFacetSKG_collection&nrtReplicas=1&action=CREATE&numShards=1&wt=javabin&version=2} status=0 QTime=1635
[junit4] 2> 222341 INFO (SUITE-TestCloudJSONFacetSKG-seed#[A39E0ADCB98259EB]-worker) [ ] o.a.s.c.AbstractDistribZkTestBase Wait for recoveries to finish - collection: org.apache.solr.search.facet.TestCloudJSONFacetSKG_collection failOnTimeout:true timeout (sec):330
[junit4] 1> replica:core_node2 rstate:active live:true
[junit4] 1> no one is recoverying
[junit4] 1> replica:core_node2 rstate:active live:true
[junit4] 1> no one is recoverying
[junit4] 1> replica:core_node2 rstate:active live:true
[junit4] 1> no one is recoverying
[junit4] 1> replica:core_node2 rstate:active live:true
[junit4] 1> no one is recoverying
[junit4] 2> 222341 INFO (SUITE-TestCloudJSONFacetSKG-seed#[A39E0ADCB98259EB]-worker) [ ] o.a.s.c.AbstractDistribZkTestBase Recoveries finished - collection: org.apache.solr.search.facet.TestCloudJSONFacetSKG_collection
[junit4] 2> 222350 INFO (qtp1340971265-4310) [n:127.0.0.1:34165_solr c:org.apache.solr.search.facet.TestCloudJSONFacetSKG_collection s:shard1 r:core_node2 x:org.apache.solr.search.facet.TestCloudJSONFacetSKG_collection_shard1_replica_n1 ] o.a.s.c.ZkShardTerms Successful update of terms at /collections/org.apache.solr.search.facet.TestCloudJSONFacetSKG_collection/terms/shard1 to Terms{values={core_node2=1}, version=1}
[junit4] 2> 222350 INFO (qtp1340971265-4310) [n:127.0.0.1:34165_solr c:org.apache.solr.search.facet.TestCloudJSONFacetSKG_collection s:shard1 r:core_node2 x:org.apache.solr.search.facet.TestCloudJSONFacetSKG_collection_shard1_replica_n1 ] o.a.s.u.p.LogUpdateProcessorFactory [org.apache.solr.search.facet.TestCloudJSONFacetSKG_collection_shard1_replica_n1] webapp=/solr path=/update params={wt=javabin&version=2}{add=[0 (1642025355932860416)]} 0 3
[junit4] 2> 222352 INFO (qtp1340971265-4308) [n:127.0
[...truncated too long message...]
DK 64-Bit Server VM warning: Option UseConcMarkSweepGC was deprecated in version 9.0 and will likely be removed in a future release.
[junit4] <<< JVM J0: EOF ----
[...truncated 566 lines...]
[junit4] JVM J0: stderr was not empty, see: /home/jenkins/workspace/Lucene-Solr-master-Linux/solr/build/contrib/solr-jaegertracer-configurator/test/temp/junit4-J0-20190816_125529_8084201971520041523685.syserr
[junit4] >>> JVM J0 emitted unexpected output (verbatim) ----
[junit4] OpenJDK 64-Bit Server VM warning: Option UseConcMarkSweepGC was deprecated in version 9.0 and will likely be removed in a future release.
[junit4] <<< JVM J0: EOF ----
[...truncated 577 lines...]
[junit4] JVM J2: stderr was not empty, see: /home/jenkins/workspace/Lucene-Solr-master-Linux/solr/build/contrib/solr-langid/test/temp/junit4-J2-20190816_125537_45212929380772847461244.syserr
[junit4] >>> JVM J2 emitted unexpected output (verbatim) ----
[junit4] OpenJDK 64-Bit Server VM warning: Option UseConcMarkSweepGC was deprecated in version 9.0 and will likely be removed in a future release.
[junit4] <<< JVM J2: EOF ----
[junit4] JVM J1: stderr was not empty, see: /home/jenkins/workspace/Lucene-Solr-master-Linux/solr/build/contrib/solr-langid/test/temp/junit4-J1-20190816_125537_45211407388826848288369.syserr
[junit4] >>> JVM J1 emitted unexpected output (verbatim) ----
[junit4] OpenJDK 64-Bit Server VM warning: Option UseConcMarkSweepGC was deprecated in version 9.0 and will likely be removed in a future release.
[junit4] <<< JVM J1: EOF ----
[...truncated 3 lines...]
[junit4] JVM J0: stderr was not empty, see: /home/jenkins/workspace/Lucene-Solr-master-Linux/solr/build/contrib/solr-langid/test/temp/junit4-J0-20190816_125537_45212189423016537634523.syserr
[junit4] >>> JVM J0 emitted unexpected output (verbatim) ----
[junit4] OpenJDK 64-Bit Server VM warning: Option UseConcMarkSweepGC was deprecated in version 9.0 and will likely be removed in a future release.
[junit4] <<< JVM J0: EOF ----
[...truncated 679 lines...]
[junit4] JVM J0: stderr was not empty, see: /home/jenkins/workspace/Lucene-Solr-master-Linux/solr/build/contrib/solr-ltr/test/temp/junit4-J0-20190816_125547_74411299440388622483023.syserr
[junit4] >>> JVM J0 emitted unexpected output (verbatim) ----
[junit4] OpenJDK 64-Bit Server VM warning: Option UseConcMarkSweepGC was deprecated in version 9.0 and will likely be removed in a future release.
[junit4] <<< JVM J0: EOF ----
[...truncated 3 lines...]
[junit4] JVM J2: stderr was not empty, see: /home/jenkins/workspace/Lucene-Solr-master-Linux/solr/build/contrib/solr-ltr/test/temp/junit4-J2-20190816_125547_74510257350691720475190.syserr
[junit4] >>> JVM J2 emitted unexpected output (verbatim) ----
[junit4] OpenJDK 64-Bit Server VM warning: Option UseConcMarkSweepGC was deprecated in version 9.0 and will likely be removed in a future release.
[junit4] <<< JVM J2: EOF ----
[...truncated 3 lines...]
[junit4] JVM J1: stderr was not empty, see: /home/jenkins/workspace/Lucene-Solr-master-Linux/solr/build/contrib/solr-ltr/test/temp/junit4-J1-20190816_125547_7447082599521853037070.syserr
[junit4] >>> JVM J1 emitted unexpected output (verbatim) ----
[junit4] OpenJDK 64-Bit Server VM warning: Option UseConcMarkSweepGC was deprecated in version 9.0 and will likely be removed in a future release.
[junit4] <<< JVM J1: EOF ----
[...truncated 580 lines...]
[junit4] JVM J1: stderr was not empty, see: /home/jenkins/workspace/Lucene-Solr-master-Linux/solr/build/contrib/solr-prometheus-exporter/test/temp/junit4-J1-20190816_125615_2133175055347383538052.syserr
[junit4] >>> JVM J1 emitted unexpected output (verbatim) ----
[junit4] OpenJDK 64-Bit Server VM warning: Option UseConcMarkSweepGC was deprecated in version 9.0 and will likely be removed in a future release.
[junit4] <<< JVM J1: EOF ----
[...truncated 3 lines...]
[junit4] JVM J0: stderr was not empty, see: /home/jenkins/workspace/Lucene-Solr-master-Linux/solr/build/contrib/solr-prometheus-exporter/test/temp/junit4-J0-20190816_125615_2133633019534529545459.syserr
[junit4] >>> JVM J0 emitted unexpected output (verbatim) ----
[junit4] OpenJDK 64-Bit Server VM warning: Option UseConcMarkSweepGC was deprecated in version 9.0 and will likely be removed in a future release.
[junit4] <<< JVM J0: EOF ----
[...truncated 3 lines...]
[junit4] JVM J2: stderr was not empty, see: /home/jenkins/workspace/Lucene-Solr-master-Linux/solr/build/contrib/solr-prometheus-exporter/test/temp/junit4-J2-20190816_125615_214838602299572052388.syserr
[junit4] >>> JVM J2 emitted unexpected output (verbatim) ----
[junit4] OpenJDK 64-Bit Server VM warning: Option UseConcMarkSweepGC was deprecated in version 9.0 and will likely be removed in a future release.
[junit4] <<< JVM J2: EOF ----
[...truncated 568 lines...]
[junit4] JVM J0: stderr was not empty, see: /home/jenkins/workspace/Lucene-Solr-master-Linux/solr/build/contrib/solr-velocity/test/temp/junit4-J0-20190816_125637_32810709251467565781098.syserr
[junit4] >>> JVM J0 emitted unexpected output (verbatim) ----
[junit4] OpenJDK 64-Bit Server VM warning: Option UseConcMarkSweepGC was deprecated in version 9.0 and will likely be removed in a future release.
[junit4] <<< JVM J0: EOF ----
[...truncated 39464 lines...]
-ecj-javadoc-lint-src:
[mkdir] Created dir: /tmp/ecj1731155925
[ecj-lint] Compiling 69 source files to /tmp/ecj1731155925
[ecj-lint] invalid Class-Path header in manifest of jar file: /home/jenkins/.ivy2/cache/org.restlet.jee/org.restlet/jars/org.restlet-2.3.0.jar
[ecj-lint] invalid Class-Path header in manifest of jar file: /home/jenkins/.ivy2/cache/org.restlet.jee/org.restlet.ext.servlet/jars/org.restlet.ext.servlet-2.3.0.jar
[ecj-lint] ----------
[ecj-lint] 1. ERROR in /home/jenkins/workspace/Lucene-Solr-master-Linux/solr/contrib/dataimporthandler/src/java/org/apache/solr/handler/dataimport/JdbcDataSource.java (at line 28)
[ecj-lint] import javax.naming.InitialContext;
[ecj-lint] ^^^^^^^^^^^^^^^^^^^^^^^^^^^
[ecj-lint] The type javax.naming.InitialContext is not accessible
[ecj-lint] ----------
[ecj-lint] 2. ERROR in /home/jenkins/workspace/Lucene-Solr-master-Linux/solr/contrib/dataimporthandler/src/java/org/apache/solr/handler/dataimport/JdbcDataSource.java (at line 29)
[ecj-lint] import javax.naming.NamingException;
[ecj-lint] ^^^^^^^^^^^^^^^^^^^^^^^^^^^^
[ecj-lint] The type javax.naming.NamingException is not accessible
[ecj-lint] ----------
[ecj-lint] 3. ERROR in /home/jenkins/workspace/Lucene-Solr-master-Linux/solr/contrib/dataimporthandler/src/java/org/apache/solr/handler/dataimport/JdbcDataSource.java (at line 182)
[ecj-lint] c = getFromJndi(initProps, jndiName);
[ecj-lint] ^^^^^^^^^^^
[ecj-lint] The method getFromJndi(Properties, String) from the type new Callable<Connection>(){} refers to the missing type NamingException
[ecj-lint] ----------
[ecj-lint] 4. ERROR in /home/jenkins/workspace/Lucene-Solr-master-Linux/solr/contrib/dataimporthandler/src/java/org/apache/solr/handler/dataimport/JdbcDataSource.java (at line 245)
[ecj-lint] private Connection getFromJndi(final Properties initProps, final String jndiName) throws NamingException,
[ecj-lint] ^^^^^^^^^^^^^^^
[ecj-lint] NamingException cannot be resolved to a type
[ecj-lint] ----------
[ecj-lint] 5. ERROR in /home/jenkins/workspace/Lucene-Solr-master-Linux/solr/contrib/dataimporthandler/src/java/org/apache/solr/handler/dataimport/JdbcDataSource.java (at line 249)
[ecj-lint] InitialContext ctx = new InitialContext();
[ecj-lint] ^^^^^^^^^^^^^^
[ecj-lint] InitialContext cannot be resolved to a type
[ecj-lint] ----------
[ecj-lint] 6. ERROR in /home/jenkins/workspace/Lucene-Solr-master-Linux/solr/contrib/dataimporthandler/src/java/org/apache/solr/handler/dataimport/JdbcDataSource.java (at line 249)
[ecj-lint] InitialContext ctx = new InitialContext();
[ecj-lint] ^^^^^^^^^^^^^^
[ecj-lint] InitialContext cannot be resolved to a type
[ecj-lint] ----------
[ecj-lint] 6 problems (6 errors)
BUILD FAILED
/home/jenkins/workspace/Lucene-Solr-master-Linux/build.xml:634: The following error occurred while executing this line:
/home/jenkins/workspace/Lucene-Solr-master-Linux/build.xml:101: The following error occurred while executing this line:
/home/jenkins/workspace/Lucene-Solr-master-Linux/solr/build.xml:651: The following error occurred while executing this line:
/home/jenkins/workspace/Lucene-Solr-master-Linux/solr/common-build.xml:479: The following error occurred while executing this line:
/home/jenkins/workspace/Lucene-Solr-master-Linux/lucene/common-build.xml:2009: The following error occurred while executing this line:
/home/jenkins/workspace/Lucene-Solr-master-Linux/lucene/common-build.xml:2048: Compile failed; see the compiler error output for details.
Total time: 90 minutes 23 seconds
Build step 'Invoke Ant' marked build as failure
Archiving artifacts
Setting ANT_1_8_2_HOME=/home/jenkins/tools/hudson.tasks.Ant_AntInstallation/ANT_1.8.2
[WARNINGS] Skipping publisher since build result is FAILURE
Recording test results
Setting ANT_1_8_2_HOME=/home/jenkins/tools/hudson.tasks.Ant_AntInstallation/ANT_1.8.2
Email was triggered for: Failure - Any
Sending email for trigger: Failure - Any
Setting ANT_1_8_2_HOME=/home/jenkins/tools/hudson.tasks.Ant_AntInstallation/ANT_1.8.2
Setting ANT_1_8_2_HOME=/home/jenkins/tools/hudson.tasks.Ant_AntInstallation/ANT_1.8.2
Setting ANT_1_8_2_HOME=/home/jenkins/tools/hudson.tasks.Ant_AntInstallation/ANT_1.8.2
Setting ANT_1_8_2_HOME=/home/jenkins/tools/hudson.tasks.Ant_AntInstallation/ANT_1.8.2
Setting ANT_1_8_2_HOME=/home/jenkins/tools/hudson.tasks.Ant_AntInstallation/ANT_1.8.2
Setting ANT_1_8_2_HOME=/home/jenkins/tools/hudson.tasks.Ant_AntInstallation/ANT_1.8.2