You are viewing a plain text version of this content. The canonical link for it is here.
Posted to dev@openmeetings.apache.org by Apache Jenkins Server <je...@builds.apache.org> on 2021/04/15 12:54:21 UTC
Build failed in Jenkins: OpenMeetings » openmeetings » Openmeetings Web #295
See <https://ci-builds.apache.org/job/OpenMeetings/job/openmeetings/org.apache.openmeetings$openmeetings-web/295/display/redirect?page=changes>
Changes:
[Maxim Solodovnik] [OPENMEETINGS-2613] JS error is fixed
[Maxim Solodovnik] [OPENMEETINGS-2613] JS error is fixed
------------------------------------------
[INFO]
[INFO] --------------< org.apache.openmeetings:openmeetings-web >--------------
[INFO] Building Openmeetings Web 6.1.0-SNAPSHOT [8/10]
[INFO] --------------------------------[ war ]---------------------------------
[INFO] Downloading from central: https://repo.maven.apache.org/maven2/org/apache/tomcat/tomcat-catalina/9.0.45/tomcat-catalina-9.0.45.jar
[INFO] Downloading from central: https://repo.maven.apache.org/maven2/org/apache/tomcat/tomcat-jni/9.0.45/tomcat-jni-9.0.45.jar
[INFO] Downloading from central: https://repo.maven.apache.org/maven2/org/apache/tomcat/tomcat-coyote/9.0.45/tomcat-coyote-9.0.45.jar
[INFO] Downloading from central: https://repo.maven.apache.org/maven2/org/apache/tomcat/tomcat-jaspic-api/9.0.45/tomcat-jaspic-api-9.0.45.jar
[INFO] Downloading from central: https://repo.maven.apache.org/maven2/org/apache/tomcat/embed/tomcat-embed-websocket/9.0.45/tomcat-embed-websocket-9.0.45.jar
[INFO] Downloaded from central: https://repo.maven.apache.org/maven2/org/apache/tomcat/tomcat-jaspic-api/9.0.45/tomcat-jaspic-api-9.0.45.jar (27 kB at 348 kB/s)
[INFO] Downloaded from central: https://repo.maven.apache.org/maven2/org/apache/tomcat/embed/tomcat-embed-websocket/9.0.45/tomcat-embed-websocket-9.0.45.jar (270 kB at 2.5 MB/s)
[INFO] Downloaded from central: https://repo.maven.apache.org/maven2/org/apache/tomcat/tomcat-jni/9.0.45/tomcat-jni-9.0.45.jar (36 kB at 247 kB/s)
[INFO] Downloaded from central: https://repo.maven.apache.org/maven2/org/apache/tomcat/tomcat-coyote/9.0.45/tomcat-coyote-9.0.45.jar (927 kB at 4.7 MB/s)
[INFO] Downloaded from central: https://repo.maven.apache.org/maven2/org/apache/tomcat/tomcat-catalina/9.0.45/tomcat-catalina-9.0.45.jar (1.7 MB at 7.3 MB/s)
[INFO]
[INFO] --- maven-clean-plugin:3.1.0:clean (default-clean) @ openmeetings-web ---
[INFO]
[INFO] --- buildnumber-maven-plugin:1.4:create (default) @ openmeetings-web ---
[INFO]
[INFO] --- apache-rat-plugin:0.13:check (default) @ openmeetings-web ---
[INFO] Added 3 additional default licenses.
[INFO] Enabled default license matchers.
[INFO] Added 3 custom approved licenses.
[INFO] Will parse SCM ignores for exclusions...
[INFO] Finished adding exclusions from SCM ignore files.
[INFO] 62 implicit excludes (use -debug for more details).
[INFO] 4 explicit excludes (use -debug for more details).
[INFO] 705 resources included (use -debug for more details)
[INFO] Rat check: Summary over all files. Unapproved: 0, unknown: 0, generated: 0, approved: 576 licenses.
[INFO]
[INFO] --- maven-enforcer-plugin:3.0.0-M3:enforce (enforce-versions) @ openmeetings-web ---
[INFO]
[INFO] --- maven-enforcer-plugin:3.0.0-M3:enforce (enforce-maven-version) @ openmeetings-web ---
[INFO]
[INFO] --- jacoco-maven-plugin:0.8.6:prepare-agent (prepare-agent) @ openmeetings-web ---
[INFO] argLine set to -javaagent:/home/jenkins/.m2/repository/org/jacoco/org.jacoco.agent/0.8.6/org.jacoco.agent-0.8.6-runtime.jar=destfile=<https://ci-builds.apache.org/job/OpenMeetings/job/openmeetings/org.apache.openmeetings$openmeetings-web/ws/../target/jacoco.exec,append=true>
[INFO]
[INFO] --- maven-remote-resources-plugin:1.7.0:process (process-resource-bundles) @ openmeetings-web ---
[INFO] Preparing remote bundle org.apache:apache-jar-resource-bundle:1.4
[INFO] Copying 3 resources from 1 bundle.
[INFO]
[INFO] --- frontend-maven-plugin:1.11.0:install-node-and-npm (install-node) @ openmeetings-web ---
[INFO] Installing node version v14.15.3
[INFO] Unpacking /home/jenkins/.m2/repository/com/github/eirslett/node/14.15.3/node-14.15.3-linux-x64.tar.gz into <https://ci-builds.apache.org/job/OpenMeetings/job/openmeetings/org.apache.openmeetings$openmeetings-web/ws/target/node/tmp>
[INFO] Copying node binary from <https://ci-builds.apache.org/job/OpenMeetings/job/openmeetings/org.apache.openmeetings$openmeetings-web/ws/target/node/tmp/node-v14.15.3-linux-x64/bin/node> to <https://ci-builds.apache.org/job/OpenMeetings/job/openmeetings/org.apache.openmeetings$openmeetings-web/ws/target/node/node>
[INFO] Extracting NPM
[INFO] Installed node locally.
[INFO]
[INFO] --- frontend-maven-plugin:1.11.0:npm (main-install) @ openmeetings-web ---
[INFO] Running 'npm install' in <https://ci-builds.apache.org/job/OpenMeetings/job/openmeetings/org.apache.openmeetings$openmeetings-web/ws/src/main/front/main>
[INFO] npm notice created a lockfile as package-lock.json. You should commit this file.
[INFO] npm WARN main@1.0.0 No repository field.
[INFO]
[INFO] added 280 packages from 360 contributors and audited 280 packages in 112.311s
[INFO]
[INFO] 38 packages are looking for funding
[INFO] run `npm fund` for details
[INFO]
[INFO] found 0 vulnerabilities
[INFO]
[INFO]
[INFO] --- frontend-maven-plugin:1.11.0:npm (main) @ openmeetings-web ---
[INFO] Running 'npm run build' in <https://ci-builds.apache.org/job/OpenMeetings/job/openmeetings/org.apache.openmeetings$openmeetings-web/ws/src/main/front/main>
[INFO]
[INFO] > main@1.0.0 build <https://ci-builds.apache.org/job/OpenMeetings/job/openmeetings/org.apache.openmeetings$openmeetings-web/ws/src/main/front/main>
[INFO] > npm run build-dev && npm run build-prod
[INFO]
[INFO]
[INFO] > main@1.0.0 build-dev <https://ci-builds.apache.org/job/OpenMeetings/job/openmeetings/org.apache.openmeetings$openmeetings-web/ws/src/main/front/main>
[INFO] > browserify src/index.js --transform-key=staging -o ${outDir}${npm_package_name}.js
[INFO]
[INFO]
[INFO] > main@1.0.0 build-prod <https://ci-builds.apache.org/job/OpenMeetings/job/openmeetings/org.apache.openmeetings$openmeetings-web/ws/src/main/front/main>
[INFO] > browserify src/index.js --transform-key=production -p tinyify -o ${outDir}${npm_package_name}.min.js
[INFO]
[INFO]
[INFO] --- frontend-maven-plugin:1.11.0:npm (chat-install) @ openmeetings-web ---
[INFO] Running 'npm install' in <https://ci-builds.apache.org/job/OpenMeetings/job/openmeetings/org.apache.openmeetings$openmeetings-web/ws/src/main/front/chat>
[INFO] npm notice created a lockfile as package-lock.json. You should commit this file.
[INFO] npm WARN chat@1.0.0 No repository field.
[INFO]
[INFO] added 279 packages from 237 contributors and audited 279 packages in 35.73s
[INFO]
[INFO] 37 packages are looking for funding
[INFO] run `npm fund` for details
[INFO]
[INFO] found 0 vulnerabilities
[INFO]
[INFO]
[INFO] --- frontend-maven-plugin:1.11.0:npm (chat) @ openmeetings-web ---
[INFO] Running 'npm run build' in <https://ci-builds.apache.org/job/OpenMeetings/job/openmeetings/org.apache.openmeetings$openmeetings-web/ws/src/main/front/chat>
[INFO]
[INFO] > chat@1.0.0 build <https://ci-builds.apache.org/job/OpenMeetings/job/openmeetings/org.apache.openmeetings$openmeetings-web/ws/src/main/front/chat>
[INFO] > npm run build-dev && npm run build-prod
[INFO]
[INFO]
[INFO] > chat@1.0.0 build-dev <https://ci-builds.apache.org/job/OpenMeetings/job/openmeetings/org.apache.openmeetings$openmeetings-web/ws/src/main/front/chat>
[INFO] > browserify src/index.js --transform-key=staging -o ${outDir}${npm_package_name}.js
[INFO]
[INFO]
[INFO] > chat@1.0.0 build-prod <https://ci-builds.apache.org/job/OpenMeetings/job/openmeetings/org.apache.openmeetings$openmeetings-web/ws/src/main/front/chat>
[INFO] > browserify src/index.js --transform-key=production -p tinyify -o ${outDir}${npm_package_name}.min.js
[INFO]
[INFO]
[INFO] --- frontend-maven-plugin:1.11.0:npm (settings-install) @ openmeetings-web ---
[INFO] Running 'npm install' in <https://ci-builds.apache.org/job/OpenMeetings/job/openmeetings/org.apache.openmeetings$openmeetings-web/ws/src/main/front/settings>
[INFO] npm notice created a lockfile as package-lock.json. You should commit this file.
[INFO] npm WARN settings@1.0.0 No repository field.
[INFO]
[INFO] added 291 packages from 374 contributors and audited 291 packages in 37.662s
[INFO]
[INFO] 38 packages are looking for funding
[INFO] run `npm fund` for details
[INFO]
[INFO] found 0 vulnerabilities
[INFO]
[INFO]
[INFO] --- frontend-maven-plugin:1.11.0:npm (settings) @ openmeetings-web ---
[INFO] Running 'npm run build' in <https://ci-builds.apache.org/job/OpenMeetings/job/openmeetings/org.apache.openmeetings$openmeetings-web/ws/src/main/front/settings>
[INFO]
[INFO] > settings@1.0.0 build <https://ci-builds.apache.org/job/OpenMeetings/job/openmeetings/org.apache.openmeetings$openmeetings-web/ws/src/main/front/settings>
[INFO] > npm run build-dev && npm run build-prod
[INFO]
[INFO]
[INFO] > settings@1.0.0 build-dev <https://ci-builds.apache.org/job/OpenMeetings/job/openmeetings/org.apache.openmeetings$openmeetings-web/ws/src/main/front/settings>
[INFO] > browserify src/index.js --transform-key=staging -o ${outDir}${npm_package_name}.js
[INFO]
[INFO]
[INFO] > settings@1.0.0 build-prod <https://ci-builds.apache.org/job/OpenMeetings/job/openmeetings/org.apache.openmeetings$openmeetings-web/ws/src/main/front/settings>
[INFO] > browserify src/index.js --transform-key=production -p tinyify -o ${outDir}${npm_package_name}.min.js
[INFO]
[INFO]
[INFO] --- frontend-maven-plugin:1.11.0:npm (room-install) @ openmeetings-web ---
[INFO] Running 'npm install' in <https://ci-builds.apache.org/job/OpenMeetings/job/openmeetings/org.apache.openmeetings$openmeetings-web/ws/src/main/front/room>
[INFO] npm notice created a lockfile as package-lock.json. You should commit this file.
[INFO] npm WARN room@1.0.0 No repository field.
[INFO]
[INFO] added 280 packages from 238 contributors and audited 280 packages in 33.416s
[INFO]
[INFO] 37 packages are looking for funding
[INFO] run `npm fund` for details
[INFO]
[INFO] found 0 vulnerabilities
[INFO]
[INFO]
[INFO] --- frontend-maven-plugin:1.11.0:npm (room) @ openmeetings-web ---
[INFO] Running 'npm run build' in <https://ci-builds.apache.org/job/OpenMeetings/job/openmeetings/org.apache.openmeetings$openmeetings-web/ws/src/main/front/room>
[INFO]
[INFO] > room@1.0.0 build <https://ci-builds.apache.org/job/OpenMeetings/job/openmeetings/org.apache.openmeetings$openmeetings-web/ws/src/main/front/room>
[INFO] > npm run build-dev && npm run build-prod
[INFO]
[INFO]
[INFO] > room@1.0.0 build-dev <https://ci-builds.apache.org/job/OpenMeetings/job/openmeetings/org.apache.openmeetings$openmeetings-web/ws/src/main/front/room>
[INFO] > browserify src/index.js --transform-key=staging -o ${outDir}${npm_package_name}.js
[INFO]
[INFO]
[INFO] > room@1.0.0 build-prod <https://ci-builds.apache.org/job/OpenMeetings/job/openmeetings/org.apache.openmeetings$openmeetings-web/ws/src/main/front/room>
[INFO] > browserify src/index.js --transform-key=production -p tinyify -o ${outDir}${npm_package_name}.min.js
[INFO]
[INFO]
[INFO] --- frontend-maven-plugin:1.11.0:npm (wb-install) @ openmeetings-web ---
[INFO] Running 'npm install' in <https://ci-builds.apache.org/job/OpenMeetings/job/openmeetings/org.apache.openmeetings$openmeetings-web/ws/src/main/front/wb>
[INFO] npm WARN deprecated request@2.88.2: request has been deprecated, see https://github.com/request/request/issues/3142
[INFO] npm WARN deprecated request-promise-native@1.0.9: request-promise-native has been deprecated because it extends the now deprecated request package, see https://github.com/request/request/issues/3142
[INFO] npm WARN deprecated node-pre-gyp@0.15.0: Please upgrade to @mapbox/node-pre-gyp: the non-scoped node-pre-gyp package is deprecated and only the @mapbox scoped package will recieve updates in the future
[INFO] npm WARN deprecated har-validator@5.1.5: this library is no longer supported
[INFO] npm WARN deprecated core-js@2.6.12: core-js@<3 is no longer maintained and not recommended for usage due to the number of issues. Please, upgrade your dependencies to the actual version of core-js@3.
[INFO]
[INFO] > canvas@2.7.0 install <https://ci-builds.apache.org/job/OpenMeetings/job/openmeetings/org.apache.openmeetings$openmeetings-web/ws/src/main/front/wb/node_modules/canvas>
[INFO] > node-pre-gyp install --fallback-to-build
[INFO]
[INFO] node-pre-gyp WARN Using request for node-pre-gyp https download
[INFO] [canvas] Success: "<https://ci-builds.apache.org/job/OpenMeetings/job/openmeetings/org.apache.openmeetings$openmeetings-web/ws/src/main/front/wb/node_modules/canvas/build/Release/canvas.node"> is installed via remote
[INFO]
[INFO] > core-js@2.6.12 postinstall <https://ci-builds.apache.org/job/OpenMeetings/job/openmeetings/org.apache.openmeetings$openmeetings-web/ws/src/main/front/wb/node_modules/core-js>
[INFO] > node -e "try{require('./postinstall')}catch(e){}"
[INFO]
[INFO] npm notice created a lockfile as package-lock.json. You should commit this file.
[INFO] npm WARN wb@1.0.0 No repository field.
[INFO]
[INFO] added 490 packages from 357 contributors and audited 490 packages in 106.791s
[INFO]
[INFO] 41 packages are looking for funding
[INFO] run `npm fund` for details
[INFO]
[INFO] found 0 vulnerabilities
[INFO]
[INFO]
[INFO] --- frontend-maven-plugin:1.11.0:npm (wb) @ openmeetings-web ---
[INFO] Running 'npm run build' in <https://ci-builds.apache.org/job/OpenMeetings/job/openmeetings/org.apache.openmeetings$openmeetings-web/ws/src/main/front/wb>
[INFO]
[INFO] > wb@1.0.0 build <https://ci-builds.apache.org/job/OpenMeetings/job/openmeetings/org.apache.openmeetings$openmeetings-web/ws/src/main/front/wb>
[INFO] > npm run build-dev && npm run build-prod
[INFO]
[INFO]
[INFO] > wb@1.0.0 build-dev <https://ci-builds.apache.org/job/OpenMeetings/job/openmeetings/org.apache.openmeetings$openmeetings-web/ws/src/main/front/wb>
[INFO] > browserify src/index.js --transform-key=staging -p esmify -o ${outDir}${npm_package_name}.js
[INFO]
[INFO] [BABEL] Note: The code generator has deoptimised the styling of <https://ci-builds.apache.org/job/OpenMeetings/job/openmeetings/org.apache.openmeetings$openmeetings-web/ws/src/main/front/wb/node_modules/fabric/dist/fabric.js> as it exceeds the max of 500KB.
[INFO] Error: Parsing file <https://ci-builds.apache.org/job/OpenMeetings/job/openmeetings/org.apache.openmeetings$openmeetings-web/ws/src/main/front/wb/src/wb-tools.js>: Assigning to rvalue (366:2)
[INFO] at Deps.parseDeps (<https://ci-builds.apache.org/job/OpenMeetings/job/openmeetings/org.apache.openmeetings$openmeetings-web/ws/src/main/front/wb/node_modules/module-deps/index.js>:519:15)
[INFO] at getDeps (<https://ci-builds.apache.org/job/OpenMeetings/job/openmeetings/org.apache.openmeetings$openmeetings-web/ws/src/main/front/wb/node_modules/module-deps/index.js>:447:44)
[INFO] at <https://ci-builds.apache.org/job/OpenMeetings/job/openmeetings/org.apache.openmeetings$openmeetings-web/ws/src/main/front/wb/node_modules/module-deps/index.js>:430:38
[INFO] at ConcatStream.<anonymous> (<https://ci-builds.apache.org/job/OpenMeetings/job/openmeetings/org.apache.openmeetings$openmeetings-web/ws/src/main/front/wb/node_modules/concat-stream/index.js>:37:43)
[INFO] at ConcatStream.emit (events.js:327:22)
[INFO] at finishMaybe (<https://ci-builds.apache.org/job/OpenMeetings/job/openmeetings/org.apache.openmeetings$openmeetings-web/ws/src/main/front/wb/node_modules/readable-stream/lib/_stream_writable.js>:630:14)
[INFO] at endWritable (<https://ci-builds.apache.org/job/OpenMeetings/job/openmeetings/org.apache.openmeetings$openmeetings-web/ws/src/main/front/wb/node_modules/readable-stream/lib/_stream_writable.js>:638:3)
[INFO] at ConcatStream.Writable.end (<https://ci-builds.apache.org/job/OpenMeetings/job/openmeetings/org.apache.openmeetings$openmeetings-web/ws/src/main/front/wb/node_modules/readable-stream/lib/_stream_writable.js>:594:41)
[INFO] at DuplexWrapper.onend (<https://ci-builds.apache.org/job/OpenMeetings/job/openmeetings/org.apache.openmeetings$openmeetings-web/ws/src/main/front/wb/node_modules/readable-stream/lib/_stream_readable.js>:577:10)
[INFO] at Object.onceWrapper (events.js:421:28)
[INFO] npm ERR! code ELIFECYCLE
[INFO] npm ERR! errno 1
[INFO] npm ERR! wb@1.0.0 build-dev: `browserify src/index.js --transform-key=staging -p esmify -o ${outDir}${npm_package_name}.js`
[INFO] npm ERR! Exit status 1
[INFO] npm ERR!
[INFO] npm ERR! Failed at the wb@1.0.0 build-dev script.
[INFO] npm ERR! This is probably not a problem with npm. There is likely additional logging output above.
[INFO]
[INFO] npm ERR! A complete log of this run can be found in:
[INFO] npm ERR! /home/jenkins/.npm/_logs/2021-04-15T12_53_45_397Z-debug.log
[INFO] npm ERR! code ELIFECYCLE
[INFO] npm ERR! errno 1
[INFO] npm ERR! wb@1.0.0 build: `npm run build-dev && npm run build-prod`
[INFO] npm ERR! Exit status 1
[INFO] npm ERR!
[INFO] npm ERR! Failed at the wb@1.0.0 build script.
[INFO] npm ERR! This is probably not a problem with npm. There is likely additional logging output above.
[INFO]
[INFO] npm ERR! A complete log of this run can be found in:
[INFO] npm ERR! /home/jenkins/.npm/_logs/2021-04-15T12_53_46_614Z-debug.log
Jenkins build is back to normal : OpenMeetings » openmeetings » Openmeetings Web #296
Posted by Apache Jenkins Server <je...@builds.apache.org>.
See <https://ci-builds.apache.org/job/OpenMeetings/job/openmeetings/org.apache.openmeetings$openmeetings-web/296/display/redirect?page=changes>