You are viewing a plain text version of this content. The canonical link for it is here.
Posted to builds@mesos.apache.org by Apache Jenkins Server <je...@builds.apache.org> on 2019/10/24 03:31:18 UTC

Branch: origin/1.6.x Mesos-Buildbot - Build # 6824 - Still Failing

Branch: origin/1.6.x

The Apache Jenkins build system has built Mesos-Buildbot (build #6824)

Status: Still Failing

Check console output at https://builds.apache.org/job/Mesos-Buildbot/6824/ to view the results.

All tests passed

Branch: origin/master Mesos-Buildbot - Build # 6851 - Still Failing

Posted by Apache Jenkins Server <je...@builds.apache.org>.
Branch: origin/master

The Apache Jenkins build system has built Mesos-Buildbot (build #6851)

Status: Still Failing

Check console output at https://builds.apache.org/job/Mesos-Buildbot/6851/ to view the results.

1 tests failed.
FAILED:  PersistentVolumeEndpointsTest.GoodCreateAndDestroyACL

Error Message:
/tmp/SRC/src/tests/persistent_volume_endpoints_tests.cpp:902
Value of: Resources(offer.resources()).contains( allocatedResources(volume, frameworkInfo.roles(0)))
  Actual: true
Expected: false

Stack Trace:
/tmp/SRC/src/tests/persistent_volume_endpoints_tests.cpp:902
Value of: Resources(offer.resources()).contains( allocatedResources(volume, frameworkInfo.roles(0)))
  Actual: true
Expected: false

Branch: origin/master Mesos-Buildbot - Build # 6850 - Still Failing

Posted by Apache Jenkins Server <je...@builds.apache.org>.
Branch: origin/master

The Apache Jenkins build system has built Mesos-Buildbot (build #6850)

Status: Still Failing

Check console output at https://builds.apache.org/job/Mesos-Buildbot/6850/ to view the results.

All tests passed

Branch: origin/master Mesos-Buildbot - Build # 6849 - Still Failing

Posted by Apache Jenkins Server <je...@builds.apache.org>.
Branch: origin/master

The Apache Jenkins build system has built Mesos-Buildbot (build #6849)

Status: Still Failing

Check console output at https://builds.apache.org/job/Mesos-Buildbot/6849/ to view the results.

All tests passed

Branch: origin/master Mesos-Buildbot - Build # 6848 - Still Failing

Posted by Apache Jenkins Server <je...@builds.apache.org>.
Branch: origin/master

The Apache Jenkins build system has built Mesos-Buildbot (build #6848)

Status: Still Failing

Check console output at https://builds.apache.org/job/Mesos-Buildbot/6848/ to view the results.

1 tests failed.
FAILED:  OversubscriptionTest.FixedResourceEstimator

Error Message:
../../../src/tests/oversubscription_tests.cpp:707
Value of: update->update_oversubscribed_resources()
  Actual: false
Expected: true

Stack Trace:
../../../src/tests/oversubscription_tests.cpp:707
Value of: update->update_oversubscribed_resources()
  Actual: false
Expected: true

Branch: origin/master Mesos-Buildbot - Build # 6847 - Still Failing

Posted by Apache Jenkins Server <je...@builds.apache.org>.
Branch: origin/master

The Apache Jenkins build system has built Mesos-Buildbot (build #6847)

Status: Still Failing

Check console output at https://builds.apache.org/job/Mesos-Buildbot/6847/ to view the results.

All tests passed

Branch: origin/master Mesos-Buildbot - Build # 6846 - Still Failing

Posted by Apache Jenkins Server <je...@builds.apache.org>.
Branch: origin/master

The Apache Jenkins build system has built Mesos-Buildbot (build #6846)

Status: Still Failing

Check console output at https://builds.apache.org/job/Mesos-Buildbot/6846/ to view the results.

All tests passed

Branch: origin/master Mesos-Buildbot - Build # 6845 - Still Failing

Posted by Apache Jenkins Server <je...@builds.apache.org>.
Branch: origin/master

The Apache Jenkins build system has built Mesos-Buildbot (build #6845)

Status: Still Failing

Check console output at https://builds.apache.org/job/Mesos-Buildbot/6845/ to view the results.

All tests passed

Branch: origin/master Mesos-Buildbot - Build # 6844 - Still Failing

Posted by Apache Jenkins Server <je...@builds.apache.org>.
Branch: origin/master

The Apache Jenkins build system has built Mesos-Buildbot (build #6844)

Status: Still Failing

Check console output at https://builds.apache.org/job/Mesos-Buildbot/6844/ to view the results.

All tests passed

Branch: origin/master Mesos-Buildbot - Build # 6843 - Still Failing

Posted by Apache Jenkins Server <je...@builds.apache.org>.
Branch: origin/master

The Apache Jenkins build system has built Mesos-Buildbot (build #6843)

Status: Still Failing

Check console output at https://builds.apache.org/job/Mesos-Buildbot/6843/ to view the results.

All tests passed

Branch: origin/master Mesos-Buildbot - Build # 6842 - Still Failing

Posted by Apache Jenkins Server <je...@builds.apache.org>.
Branch: origin/master

The Apache Jenkins build system has built Mesos-Buildbot (build #6842)

Status: Still Failing

Check console output at https://builds.apache.org/job/Mesos-Buildbot/6842/ to view the results.

All tests passed

Branch: origin/master Mesos-Buildbot - Build # 6841 - Still Failing

Posted by Apache Jenkins Server <je...@builds.apache.org>.
Branch: origin/master

The Apache Jenkins build system has built Mesos-Buildbot (build #6841)

Status: Still Failing

Check console output at https://builds.apache.org/job/Mesos-Buildbot/6841/ to view the results.

3 tests failed.
FAILED:  ReservationEndpointsTest.LabeledResources

Error Message:
/tmp/SRC/src/tests/reservation_endpoints_tests.cpp:711
Value of: offeredResources.contains( allocatedResources(labeledResources2, frameworkInfo.roles(0)))
  Actual: false
Expected: true

Stack Trace:
/tmp/SRC/src/tests/reservation_endpoints_tests.cpp:711
Value of: offeredResources.contains( allocatedResources(labeledResources2, frameworkInfo.roles(0)))
  Actual: false
Expected: true

FAILED:  bool/MasterTestPrePostReservationRefinement.StateEndpointPendingTasks/0

Error Message:
/tmp/SRC/src/tests/master_tests.cpp:10629
Mock function called more times than expected - returning default value.
    Function call: authorized(@0x7f9950d1fd80 48-byte object <E8-6D 8F-60 99-7F 00-00 00-00 00-00 00-00 00-00 07-00 00-00 00-00 00-00 90-C8 02-18 99-7F 00-00 F0-15 05-18 99-7F 00-00 02-00 00-00 99-7F 00-00>)
          Returns: Abandoned
         Expected: to be called once
           Actual: called twice - over-saturated and active

Stack Trace:
/tmp/SRC/src/tests/master_tests.cpp:10629
Mock function called more times than expected - returning default value.
    Function call: authorized(@0x7f9950d1fd80 48-byte object <E8-6D 8F-60 99-7F 00-00 00-00 00-00 00-00 00-00 07-00 00-00 00-00 00-00 90-C8 02-18 99-7F 00-00 F0-15 05-18 99-7F 00-00 02-00 00-00 99-7F 00-00>)
          Returns: Abandoned
         Expected: to be called once
           Actual: called twice - over-saturated and active

FAILED:  CSIVersion/StorageLocalResourceProviderTest.ProfileDisappeared/v1

Error Message:
/tmp/SRC/src/tests/storage_local_resource_provider_tests.cpp:1602
Failed to wait 1mins for offers

Stack Trace:
/tmp/SRC/src/tests/storage_local_resource_provider_tests.cpp:1602
Failed to wait 1mins for offers

Branch: origin/1.7.x Mesos-Buildbot - Build # 6840 - Still Failing

Posted by Apache Jenkins Server <je...@builds.apache.org>.
Branch: origin/1.7.x

The Apache Jenkins build system has built Mesos-Buildbot (build #6840)

Status: Still Failing

Check console output at https://builds.apache.org/job/Mesos-Buildbot/6840/ to view the results.

All tests passed

Branch: origin/1.8.x Mesos-Buildbot - Build # 6839 - Still Failing

Posted by Apache Jenkins Server <je...@builds.apache.org>.
Branch: origin/1.8.x

The Apache Jenkins build system has built Mesos-Buildbot (build #6839)

Status: Still Failing

Check console output at https://builds.apache.org/job/Mesos-Buildbot/6839/ to view the results.

All tests passed

Branch: origin/1.9.x Mesos-Buildbot - Build # 6838 - Still Failing

Posted by Apache Jenkins Server <je...@builds.apache.org>.
Branch: origin/1.9.x

The Apache Jenkins build system has built Mesos-Buildbot (build #6838)

Status: Still Failing

Check console output at https://builds.apache.org/job/Mesos-Buildbot/6838/ to view the results.

All tests passed

Branch: origin/master Mesos-Buildbot - Build # 6837 - Still Failing

Posted by Apache Jenkins Server <je...@builds.apache.org>.
Branch: origin/master

The Apache Jenkins build system has built Mesos-Buildbot (build #6837)

Status: Still Failing

Check console output at https://builds.apache.org/job/Mesos-Buildbot/6837/ to view the results.

All tests passed

Branch: origin/master Mesos-Buildbot - Build # 6836 - Still Failing

Posted by Apache Jenkins Server <je...@builds.apache.org>.
Branch: origin/master

The Apache Jenkins build system has built Mesos-Buildbot (build #6836)

Status: Still Failing

Check console output at https://builds.apache.org/job/Mesos-Buildbot/6836/ to view the results.

All tests passed

Branch: origin/master Mesos-Buildbot - Build # 6835 - Still Failing

Posted by Apache Jenkins Server <je...@builds.apache.org>.
Branch: origin/master

The Apache Jenkins build system has built Mesos-Buildbot (build #6835)

Status: Still Failing

Check console output at https://builds.apache.org/job/Mesos-Buildbot/6835/ to view the results.

All tests passed

Branch: origin/master Mesos-Buildbot - Build # 6834 - Still Failing

Posted by Apache Jenkins Server <je...@builds.apache.org>.
Branch: origin/master

The Apache Jenkins build system has built Mesos-Buildbot (build #6834)

Status: Still Failing

Check console output at https://builds.apache.org/job/Mesos-Buildbot/6834/ to view the results.

All tests passed

Branch: origin/1.7.x Mesos-Buildbot - Build # 6833 - Still Failing

Posted by Apache Jenkins Server <je...@builds.apache.org>.
Branch: origin/1.7.x

The Apache Jenkins build system has built Mesos-Buildbot (build #6833)

Status: Still Failing

Check console output at https://builds.apache.org/job/Mesos-Buildbot/6833/ to view the results.

5 tests failed.
FAILED:  MasterTest.CreateVolumesV1AuthorizationFailure

Error Message:
../../src/tests/master_tests.cpp:10154
Mock function called more times than expected - returning default value.
    Function call: authorized(@0x7fe9361fe108 48-byte object <58-30 ED-4B E9-7F 00-00 00-00 00-00 00-00 00-00 07-00 00-00 00-00 00-00 30-AF 00-1C E9-7F 00-00 00-2A 01-1C E9-7F 00-00 04-00 00-00 E9-7F 00-00>)
          Returns: Abandoned
         Expected: to be called once
           Actual: called twice - over-saturated and active

Stack Trace:
../../src/tests/master_tests.cpp:10154
Mock function called more times than expected - returning default value.
    Function call: authorized(@0x7fe9361fe108 48-byte object <58-30 ED-4B E9-7F 00-00 00-00 00-00 00-00 00-00 07-00 00-00 00-00 00-00 30-AF 00-1C E9-7F 00-00 00-2A 01-1C E9-7F 00-00 04-00 00-00 E9-7F 00-00>)
          Returns: Abandoned
         Expected: to be called once
           Actual: called twice - over-saturated and active

FAILED:  PersistentVolumeEndpointsTest.EndpointCreateThenOfferRemove

Error Message:
../../src/tests/persistent_volume_endpoints_tests.cpp:1745
Failed to wait 1mins for offers

Stack Trace:
../../src/tests/persistent_volume_endpoints_tests.cpp:1745
Failed to wait 1mins for offers

FAILED:  PersistentVolumeEndpointsTest.EndpointCreateThenOfferRemove

Error Message:
../../../src/tests/persistent_volume_endpoints_tests.cpp:1745
Failed to wait 1mins for offers

Stack Trace:
../../../src/tests/persistent_volume_endpoints_tests.cpp:1745
Failed to wait 1mins for offers

FAILED:  MasterTest.CreateVolumesV1AuthorizationFailure

Error Message:
/tmp/SRC/src/tests/master_tests.cpp:10154
Mock function called more times than expected - returning default value.
    Function call: authorized(@0x7f0dac2a5fe8 48-byte object <A8-2E AF-C1 0D-7F 00-00 00-00 00-00 00-00 00-00 07-00 00-00 00-00 00-00 D0-BB 00-5C 0D-7F 00-00 70-A1 00-5C 0D-7F 00-00 04-00 00-00 0D-7F 00-00>)
          Returns: Abandoned
         Expected: to be called once
           Actual: called twice - over-saturated and active

Stack Trace:
/tmp/SRC/src/tests/master_tests.cpp:10154
Mock function called more times than expected - returning default value.
    Function call: authorized(@0x7f0dac2a5fe8 48-byte object <A8-2E AF-C1 0D-7F 00-00 00-00 00-00 00-00 00-00 07-00 00-00 00-00 00-00 D0-BB 00-5C 0D-7F 00-00 70-A1 00-5C 0D-7F 00-00 04-00 00-00 0D-7F 00-00>)
          Returns: Abandoned
         Expected: to be called once
           Actual: called twice - over-saturated and active

FAILED:  bool/MasterTestPrePostReservationRefinement.ReserveCreateLaunchDestroyUnreserve/0

Error Message:
/tmp/SRC/src/tests/master_tests.cpp:9813
Mock function called more times than expected - returning directly.
    Function call: resourceOffers(0x7ffc3144c808, @0x7f0db3ab6550 { 160-byte object <00-1F B0-C1 0D-7F 00-00 00-00 00-00 00-00 00-00 5F-00 00-00 00-00 00-00 00-00 00-00 00-00 00-00 02-00 00-00 04-00 00-00 90-E2 00-6C 0D-7F 00-00 00-00 00-00 00-00 00-00 00-00 00-00 00-00 00-00 ... 10-05 01-6C 0D-7F 00-00 D0-5E 00-6C 0D-7F 00-00 E0-35 01-6C 0D-7F 00-00 F0-74 00-6C 0D-7F 00-00 C0-69 01-6C 0D-7F 00-00 00-00 00-00 00-00 00-00 10-22 00-6C 0D-7F 00-00 00-00 00-00 00-00 00-00> })
         Expected: to be called once
           Actual: called twice - over-saturated and active

Stack Trace:
/tmp/SRC/src/tests/master_tests.cpp:9813
Mock function called more times than expected - returning directly.
    Function call: resourceOffers(0x7ffc3144c808, @0x7f0db3ab6550 { 160-byte object <00-1F B0-C1 0D-7F 00-00 00-00 00-00 00-00 00-00 5F-00 00-00 00-00 00-00 00-00 00-00 00-00 00-00 02-00 00-00 04-00 00-00 90-E2 00-6C 0D-7F 00-00 00-00 00-00 00-00 00-00 00-00 00-00 00-00 00-00 ... 10-05 01-6C 0D-7F 00-00 D0-5E 00-6C 0D-7F 00-00 E0-35 01-6C 0D-7F 00-00 F0-74 00-6C 0D-7F 00-00 C0-69 01-6C 0D-7F 00-00 00-00 00-00 00-00 00-00 10-22 00-6C 0D-7F 00-00 00-00 00-00 00-00 00-00> })
         Expected: to be called once
           Actual: called twice - over-saturated and active

Branch: origin/1.9.x Mesos-Buildbot - Build # 6832 - Still Failing

Posted by Apache Jenkins Server <je...@builds.apache.org>.
Branch: origin/1.9.x

The Apache Jenkins build system has built Mesos-Buildbot (build #6832)

Status: Still Failing

Check console output at https://builds.apache.org/job/Mesos-Buildbot/6832/ to view the results.

2 tests failed.
FAILED:  CSIVersion/StorageLocalResourceProviderTest.Update/v0

Error Message:
/tmp/SRC/src/tests/storage_local_resource_provider_tests.cpp:6996
Failed to wait 1mins for getCapacity3

Stack Trace:
/tmp/SRC/src/tests/storage_local_resource_provider_tests.cpp:6996
Failed to wait 1mins for getCapacity3

FAILED:  CSIVersion/StorageLocalResourceProviderTest.Update/v0

Error Message:
../../src/tests/storage_local_resource_provider_tests.cpp:6986
Value of: updateSlave3.isPending()
  Actual: false
Expected: true

Stack Trace:
../../src/tests/storage_local_resource_provider_tests.cpp:6986
Value of: updateSlave3.isPending()
  Actual: false
Expected: true

Branch: origin/1.8.x Mesos-Buildbot - Build # 6831 - Still Failing

Posted by Apache Jenkins Server <je...@builds.apache.org>.
Branch: origin/1.8.x

The Apache Jenkins build system has built Mesos-Buildbot (build #6831)

Status: Still Failing

Check console output at https://builds.apache.org/job/Mesos-Buildbot/6831/ to view the results.

2 tests failed.
FAILED:  ExamplesTest.DynamicReservationFramework

Error Message:
/tmp/SRC/src/tests/script.cpp:86
Failed
dynamic_reservation_framework_test.sh terminated with signal Aborted (core dumped)

Stack Trace:
/tmp/SRC/src/tests/script.cpp:86
Failed
dynamic_reservation_framework_test.sh terminated with signal Aborted (core dumped)

FAILED:  ExamplesTest.DynamicReservationFramework

Error Message:
/tmp/SRC/src/tests/script.cpp:86
Failed
dynamic_reservation_framework_test.sh terminated with signal Aborted (core dumped)

Stack Trace:
/tmp/SRC/src/tests/script.cpp:86
Failed
dynamic_reservation_framework_test.sh terminated with signal Aborted (core dumped)

Branch: origin/master Mesos-Buildbot - Build # 6830 - Still Failing

Posted by Apache Jenkins Server <je...@builds.apache.org>.
Branch: origin/master

The Apache Jenkins build system has built Mesos-Buildbot (build #6830)

Status: Still Failing

Check console output at https://builds.apache.org/job/Mesos-Buildbot/6830/ to view the results.

All tests passed

Branch: origin/master Mesos-Buildbot - Build # 6829 - Still Failing

Posted by Apache Jenkins Server <je...@builds.apache.org>.
Branch: origin/master

The Apache Jenkins build system has built Mesos-Buildbot (build #6829)

Status: Still Failing

Check console output at https://builds.apache.org/job/Mesos-Buildbot/6829/ to view the results.

All tests passed

Branch: origin/master Mesos-Buildbot - Build # 6828 - Still Failing

Posted by Apache Jenkins Server <je...@builds.apache.org>.
Branch: origin/master

The Apache Jenkins build system has built Mesos-Buildbot (build #6828)

Status: Still Failing

Check console output at https://builds.apache.org/job/Mesos-Buildbot/6828/ to view the results.

2 tests failed.
FAILED:  MasterTest.UnreachableTaskAfterFailover

Error Message:
../../src/tests/master_tests.cpp:3119
Failed to wait 1mins for startingStatus

Stack Trace:
../../src/tests/master_tests.cpp:3119
Failed to wait 1mins for startingStatus

FAILED:  MasterAuthorizerTest/0.FilterOrphanedTasks

Error Message:
/tmp/SRC/src/tests/master_authorization_tests.cpp:2276
Mock function called more times than expected - returning directly.
    Function call: statusUpdate(0x7ffd2b50d598, @0x7fe9c98031d0 136-byte object <80-7F BF-E0 E9-7F 00-00 00-00 00-00 00-00 00-00 BC-A8 00-00 00-00 00-00 08-7A 47-DE E9-7F 00-00 08-7A 47-DE E9-7F 00-00 10-9F 00-88 E9-7F 00-00 A0-45 01-88 E9-7F 00-00 70-C4 02-88 E9-7F 00-00 ... 00-00 00-00 00-00 00-00 F0-E6 02-88 E9-7F 00-00 00-00 00-00 00-00 00-00 00-00 00-00 00-00 00-00 00-00 00-00 00-00 00-00 CF-C2 A2-49 7E-83 D7-41 00-00 00-00 02-00 00-00 00-00 00-00 01-00 00-00>)
         Expected: to be called once
           Actual: called twice - over-saturated and active

Stack Trace:
/tmp/SRC/src/tests/master_authorization_tests.cpp:2276
Mock function called more times than expected - returning directly.
    Function call: statusUpdate(0x7ffd2b50d598, @0x7fe9c98031d0 136-byte object <80-7F BF-E0 E9-7F 00-00 00-00 00-00 00-00 00-00 BC-A8 00-00 00-00 00-00 08-7A 47-DE E9-7F 00-00 08-7A 47-DE E9-7F 00-00 10-9F 00-88 E9-7F 00-00 A0-45 01-88 E9-7F 00-00 70-C4 02-88 E9-7F 00-00 ... 00-00 00-00 00-00 00-00 F0-E6 02-88 E9-7F 00-00 00-00 00-00 00-00 00-00 00-00 00-00 00-00 00-00 00-00 00-00 00-00 00-00 CF-C2 A2-49 7E-83 D7-41 00-00 00-00 02-00 00-00 00-00 00-00 01-00 00-00>)
         Expected: to be called once
           Actual: called twice - over-saturated and active

Branch: origin/master Mesos-Buildbot - Build # 6827 - Still Failing

Posted by Apache Jenkins Server <je...@builds.apache.org>.
Branch: origin/master

The Apache Jenkins build system has built Mesos-Buildbot (build #6827)

Status: Still Failing

Check console output at https://builds.apache.org/job/Mesos-Buildbot/6827/ to view the results.

2 tests failed.
FAILED:  MasterAuthorizerTest/1.FilterFrameworksEndpoint

Error Message:
/tmp/SRC/src/tests/master_authorization_tests.cpp:1804
Failed to wait 1mins for response

Stack Trace:
/tmp/SRC/src/tests/master_authorization_tests.cpp:1804
Failed to wait 1mins for response

FAILED:  SlaveTest.RestartSlaveRequireExecutorAuthentication

Error Message:
/tmp/SRC/src/tests/slave_tests.cpp:9148
Value of: value->contains(expected.get())
  Actual: false
Expected: true

Stack Trace:
/tmp/SRC/src/tests/slave_tests.cpp:9148
Value of: value->contains(expected.get())
  Actual: false
Expected: true

Branch: origin/1.5.x Mesos-Buildbot - Build # 6826 - Still Failing

Posted by Apache Jenkins Server <je...@builds.apache.org>.
Branch: origin/1.5.x

The Apache Jenkins build system has built Mesos-Buildbot (build #6826)

Status: Still Failing

Check console output at https://builds.apache.org/job/Mesos-Buildbot/6826/ to view the results.

All tests passed

Branch: origin/1.7.x Mesos-Buildbot - Build # 6825 - Still Failing

Posted by Apache Jenkins Server <je...@builds.apache.org>.
Branch: origin/1.7.x

The Apache Jenkins build system has built Mesos-Buildbot (build #6825)

Status: Still Failing

Check console output at https://builds.apache.org/job/Mesos-Buildbot/6825/ to view the results.

All tests passed