You are viewing a plain text version of this content. The canonical link for it is here.
Posted to notifications@maven.apache.org by Apache Jenkins Server <je...@builds.apache.org> on 2019/04/13 09:20:43 UTC

Build failed in Jenkins: Maven TLP » maven-checkstyle-plugin » MCHECKSTYLE-366 #2

See https://builds.apache.org/job/maven-box/job/maven-checkstyle-plugin/job/MCHECKSTYLE-366/2/

Changes:

* Fix checkstyle error on checkstyle plugin
* Fix checkstyle error on checkstyle plugin
* Fix checkstyle error on checkstyle plugin
* Fix checkstyle error on checkstyle plugin
* Fix checkstyle error on checkstyle plugin
* Fix checkstyle error on checkstyle plugin
* Fix checkstyle error on checkstyle plugin
* Fix checkstyle error on checkstyle plugin
* Fix checkstyle error on checkstyle plugin
* Fix checkstyle error on checkstyle plugin
* Fix checkstyle error on checkstyle plugin
* Fix checkstyle error on checkstyle plugin

All tests passed

Build log:
[...truncated 8526 lines...]
       |        [DEBUG]  F:\jenkins\jenkins-slave\workspace\heckstyle-plugin_MCHECKSTYLE-366@2@2\windows-jdk8-m3.5.x_build\target\local-repo\org\checkerframework\checker-qual\2.5.2\checker-qual-2.5.2.jar
       |        [DEBUG]  F:\jenkins\jenkins-slave\workspace\heckstyle-plugin_MCHECKSTYLE-366@2@2\windows-jdk8-m3.5.x_build\target\local-repo\com\google\errorprone\error_prone_annotations\2.2.0\error_prone_annotations-2.2.0.jar
       |        [DEBUG]  F:\jenkins\jenkins-slave\workspace\heckstyle-plugin_MCHECKSTYLE-366@2@2\windows-jdk8-m3.5.x_build\target\local-repo\com\google\j2objc\j2objc-annotations\1.1\j2objc-annotations-1.1.jar
       |        [DEBUG]  F:\jenkins\jenkins-slave\workspace\heckstyle-plugin_MCHECKSTYLE-366@2@2\windows-jdk8-m3.5.x_build\target\local-repo\org\codehaus\mojo\animal-sniffer-annotations\1.17\animal-sniffer-annotations-1.17.jar
       |        [DEBUG]  F:\jenkins\jenkins-slave\workspace\heckstyle-plugin_MCHECKSTYLE-366@2@2\windows-jdk8-m3.5.x_build\target\local-repo\net\sf\saxon\Saxon-HE\9.9.1-2\Saxon-HE-9.9.1-2.jar
       |        [DEBUG]  F:\jenkins\jenkins-slave\workspace\heckstyle-plugin_MCHECKSTYLE-366@2@2\windows-jdk8-m3.5.x_build\target\local-repo\com\ibm\icu\icu4j\63.1\icu4j-63.1.jar
       |        [DEBUG] Source roots:
       |        [DEBUG]  F:\jenkins\jenkins-slave\workspace\heckstyle-plugin_MCHECKSTYLE-366@2@2\windows-jdk8-m3.5.x_build\target\it\MCHECKSTYLE-338\empty-logging-check\src\main\java
       |        [DEBUG] Command line options:
       |        [DEBUG] -d F:\jenkins\jenkins-slave\workspace\heckstyle-plugin_MCHECKSTYLE-366@2@2\windows-jdk8-m3.5.x_build\target\it\MCHECKSTYLE-338\empty-logging-check\target\classes -classpath F:\jenkins\jenkins-slave\workspace\heckstyle-plugin_MCHECKSTYLE-366@2@2\windows-jdk8-m3.5.x_build\target\it\MCHECKSTYLE-338\empty-logging-check\target\classes;F:\jenkins\jenkins-slave\workspace\heckstyle-plugin_MCHECKSTYLE-366@2@2\windows-jdk8-m3.5.x_build\target\local-repo\com\puppycrawl\tools\checkstyle\8.19\checkstyle-8.19.jar;F:\jenkins\jenkins-slave\workspace\heckstyle-plugin_MCHECKSTYLE-366@2@2\windows-jdk8-m3.5.x_build\target\local-repo\info\picocli\picocli\3.9.5\picocli-3.9.5.jar;F:\jenkins\jenkins-slave\workspace\heckstyle-plugin_MCHECKSTYLE-366@2@2\windows-jdk8-m3.5.x_build\target\local-repo\antlr\antlr\2.7.7\antlr-2.7.7.jar;F:\jenkins\jenkins-slave\workspace\heckstyle-plugin_MCHECKSTYLE-366@2@2\windows-jdk8-m3.5.x_build\target\local-repo\org\antlr\antlr4-runtime\4.7.2\antlr4-runtime-4.7.2.jar;F:\jenkins\jenkins-slave\workspace\heckstyle-plugin_MCHECKSTYLE-366@2@2\windows-jdk8-m3.5.x_build\target\local-repo\commons-beanutils\commons-beanutils\1.9.3\commons-beanutils-1.9.3.jar;F:\jenkins\jenkins-slave\workspace\heckstyle-plugin_MCHECKSTYLE-366@2@2\windows-jdk8-m3.5.x_build\target\local-repo\commons-logging\commons-logging\1.2\commons-logging-1.2.jar;F:\jenkins\jenkins-slave\workspace\heckstyle-plugin_MCHECKSTYLE-366@2@2\windows-jdk8-m3.5.x_build\target\local-repo\commons-collections\commons-collections\3.2.2\commons-collections-3.2.2.jar;F:\jenkins\jenkins-slave\workspace\heckstyle-plugin_MCHECKSTYLE-366@2@2\windows-jdk8-m3.5.x_build\target\local-repo\com\google\guava\guava\27.1-jre\guava-27.1-jre.jar;F:\jenkins\jenkins-slave\workspace\heckstyle-plugin_MCHECKSTYLE-366@2@2\windows-jdk8-m3.5.x_build\target\local-repo\com\google\guava\failureaccess\1.0.1\failureaccess-1.0.1.jar;F:\jenkins\jenkins-slave\workspace\heckstyle-plugin_MCHECKSTYLE-366@2@2\windows-jdk8-m3.5.x_build\target\local-repo\com\google\guava\listenablefuture\9999.0-empty-to-avoid-conflict-with-guava\listenablefuture-9999.0-empty-to-avoid-conflict-with-guava.jar;F:\jenkins\jenkins-slave\workspace\heckstyle-plugin_MCHECKSTYLE-366@2@2\windows-jdk8-m3.5.x_build\target\local-repo\com\google\code\findbugs\jsr305\3.0.2\jsr305-3.0.2.jar;F:\jenkins\jenkins-slave\workspace\heckstyle-plugin_MCHECKSTYLE-366@2@2\windows-jdk8-m3.5.x_build\target\local-repo\org\checkerframework\checker-qual\2.5.2\checker-qual-2.5.2.jar;F:\jenkins\jenkins-slave\workspace\heckstyle-plugin_MCHECKSTYLE-366@2@2\windows-jdk8-m3.5.x_build\target\local-repo\com\google\errorprone\error_prone_annotations\2.2.0\error_prone_annotations-2.2.0.jar;F:\jenkins\jenkins-slave\workspace\heckstyle-plugin_MCHECKSTYLE-366@2@2\windows-jdk8-m3.5.x_build\target\local-repo\com\google\j2objc\j2objc-annotations\1.1\j2objc-annotations-1.1.jar;F:\jenkins\jenkins-slave\workspace\heckstyle-plugin_MCHECKSTYLE-366@2@2\windows-jdk8-m3.5.x_build\target\local-repo\org\codehaus\mojo\animal-sniffer-annotations\1.17\animal-sniffer-annotations-1.17.jar;F:\jenkins\jenkins-slave\workspace\heckstyle-plugin_MCHECKSTYLE-366@2@2\windows-jdk8-m3.5.x_build\target\local-repo\net\sf\saxon\Saxon-HE\9.9.1-2\Saxon-HE-9.9.1-2.jar;F:\jenkins\jenkins-slave\workspace\heckstyle-plugin_MCHECKSTYLE-366@2@2\windows-jdk8-m3.5.x_build\target\local-repo\com\ibm\icu\icu4j\63.1\icu4j-63.1.jar; -sourcepath F:\jenkins\jenkins-slave\workspace\heckstyle-plugin_MCHECKSTYLE-366@2@2\windows-jdk8-m3.5.x_build\target\it\MCHECKSTYLE-338\empty-logging-check\src\main\java; -s F:\jenkins\jenkins-slave\workspace\heckstyle-plugin_MCHECKSTYLE-366@2@2\windows-jdk8-m3.5.x_build\target\it\MCHECKSTYLE-338\empty-logging-check\target\generated-sources\annotations -g -nowarn -target 1.8 -source 1.8 -encoding UTF-8
       |        [DEBUG] incrementalBuildHelper#beforeRebuildExecution
       |        [INFO] Compiling 1 source file to F:\jenkins\jenkins-slave\workspace\heckstyle-plugin_MCHECKSTYLE-366@2@2\windows-jdk8-m3.5.x_build\target\it\MCHECKSTYLE-338\empty-logging-check\target\classes
       |        [DEBUG] incrementalBuildHelper#afterRebuildExecution
       |        [INFO] -------------------------------------------------------------
       |        [ERROR] COMPILATION ERROR : 
       |        [INFO] -------------------------------------------------------------
       |        [ERROR] /F:/jenkins/jenkins-slave/workspace/heckstyle-plugin_MCHECKSTYLE-366@2@2/windows-jdk8-m3.5.x_build/target/it/MCHECKSTYLE-338/empty-logging-check/src/main/java/org/apache/maven/plugins/checkstyle/EmptyLoggingCheck.java:[30,8] org.apache.maven.plugins.checkstyle.EmptyLoggingCheck is not abstract and does not override abstract method processFiltered(java.io.File,com.puppycrawl.tools.checkstyle.api.FileText) in com.puppycrawl.tools.checkstyle.api.AbstractFileSetCheck
       |        [ERROR] /F:/jenkins/jenkins-slave/workspace/heckstyle-plugin_MCHECKSTYLE-366@2@2/windows-jdk8-m3.5.x_build/target/it/MCHECKSTYLE-338/empty-logging-check/src/main/java/org/apache/maven/plugins/checkstyle/EmptyLoggingCheck.java:[34,5] method does not override or implement a method from a supertype
       |        [ERROR] /F:/jenkins/jenkins-slave/workspace/heckstyle-plugin_MCHECKSTYLE-366@2@2/windows-jdk8-m3.5.x_build/target/it/MCHECKSTYLE-338/empty-logging-check/src/main/java/org/apache/maven/plugins/checkstyle/EmptyLoggingCheck.java:[38,9] cannot find symbol
       |          symbol:   method getMessageCollector()
       |          location: class org.apache.maven.plugins.checkstyle.EmptyLoggingCheck
       |        [INFO] 3 errors 
       |        [INFO] -------------------------------------------------------------
       |        [INFO] ------------------------------------------------------------------------
       |        [INFO] Reactor Summary:
       |        [INFO] 
       |        [INFO] MCHECKSTYLE-338 .................................... SUCCESS [  0.459 s]
       |        [INFO] empty-logging-check ................................ FAILURE [  2.716 s]
       |        [INFO] omitignoredmodules-false ........................... SKIPPED
       |        [INFO] omitignoredmodules-true ............................ SKIPPED
       |        [INFO] ------------------------------------------------------------------------
       |        [INFO] BUILD FAILURE
       |        [INFO] ------------------------------------------------------------------------
       |        [INFO] Total time: 3.505 s
       |        [INFO] Finished at: 2019-04-13T02:17:20-07:00
       |        [INFO] Final Memory: 17M/140M
       |        [INFO] ------------------------------------------------------------------------
       |        [ERROR] Failed to execute goal org.apache.maven.plugins:maven-compiler-plugin:3.1:compile (default-compile) on project empty-logging-check: Compilation failure: Compilation failure: 
       |        [ERROR] /F:/jenkins/jenkins-slave/workspace/heckstyle-plugin_MCHECKSTYLE-366@2@2/windows-jdk8-m3.5.x_build/target/it/MCHECKSTYLE-338/empty-logging-check/src/main/java/org/apache/maven/plugins/checkstyle/EmptyLoggingCheck.java:[30,8] org.apache.maven.plugins.checkstyle.EmptyLoggingCheck is not abstract and does not override abstract method processFiltered(java.io.File,com.puppycrawl.tools.checkstyle.api.FileText) in com.puppycrawl.tools.checkstyle.api.AbstractFileSetCheck
       |        [ERROR] /F:/jenkins/jenkins-slave/workspace/heckstyle-plugin_MCHECKSTYLE-366@2@2/windows-jdk8-m3.5.x_build/target/it/MCHECKSTYLE-338/empty-logging-check/src/main/java/org/apache/maven/plugins/checkstyle/EmptyLoggingCheck.java:[34,5] method does not override or implement a method from a supertype
       |        [ERROR] /F:/jenkins/jenkins-slave/workspace/heckstyle-plugin_MCHECKSTYLE-366@2@2/windows-jdk8-m3.5.x_build/target/it/MCHECKSTYLE-338/empty-logging-check/src/main/java/org/apache/maven/plugins/checkstyle/EmptyLoggingCheck.java:[38,9] cannot find symbol
       |        [ERROR]   symbol:   method getMessageCollector()
       |        [ERROR]   location: class org.apache.maven.plugins.checkstyle.EmptyLoggingCheck
       |        [ERROR] -> [Help 1]
       |        org.apache.maven.lifecycle.LifecycleExecutionException: Failed to execute goal org.apache.maven.plugins:maven-compiler-plugin:3.1:compile (default-compile) on project empty-logging-check: Compilation failure
       |            at org.apache.maven.lifecycle.internal.MojoExecutor.execute (MojoExecutor.java:213)
       |            at org.apache.maven.lifecycle.internal.MojoExecutor.execute (MojoExecutor.java:154)
       |            at org.apache.maven.lifecycle.internal.MojoExecutor.execute (MojoExecutor.java:146)
       |            at org.apache.maven.lifecycle.internal.LifecycleModuleBuilder.buildProject (LifecycleModuleBuilder.java:117)
       |            at org.apache.maven.lifecycle.internal.LifecycleModuleBuilder.buildProject (LifecycleModuleBuilder.java:81)
       |            at org.apache.maven.lifecycle.internal.builder.singlethreaded.SingleThreadedBuilder.build (SingleThreadedBuilder.java:51)
       |            at org.apache.maven.lifecycle.internal.LifecycleStarter.execute (LifecycleStarter.java:128)
       |            at org.apache.maven.DefaultMaven.doExecute (DefaultMaven.java:309)
       |            at org.apache.maven.DefaultMaven.doExecute (DefaultMaven.java:194)
       |            at org.apache.maven.DefaultMaven.execute (DefaultMaven.java:107)
       |            at org.apache.maven.cli.MavenCli.execute (MavenCli.java:955)
       |            at org.apache.maven.cli.MavenCli.doMain (MavenCli.java:290)
       |            at org.apache.maven.cli.MavenCli.main (MavenCli.java:194)
       |            at sun.reflect.NativeMethodAccessorImpl.invoke0 (Native Method)
       |            at sun.reflect.NativeMethodAccessorImpl.invoke (NativeMethodAccessorImpl.java:62)
       |            at sun.reflect.DelegatingMethodAccessorImpl.invoke (DelegatingMethodAccessorImpl.java:43)
       |            at java.lang.reflect.Method.invoke (Method.java:498)
       |            at org.codehaus.plexus.classworlds.launcher.Launcher.launchEnhanced (Launcher.java:289)
       |            at org.codehaus.plexus.classworlds.launcher.Launcher.launch (Launcher.java:229)
       |            at org.codehaus.plexus.classworlds.launcher.Launcher.mainWithExitCode (Launcher.java:415)
       |            at org.codehaus.plexus.classworlds.launcher.Launcher.main (Launcher.java:356)
       |        Caused by: org.apache.maven.plugin.compiler.CompilationFailureException: Compilation failure
       |            at org.apache.maven.plugin.compiler.AbstractCompilerMojo.execute (AbstractCompilerMojo.java:858)
       |            at org.apache.maven.plugin.compiler.CompilerMojo.execute (CompilerMojo.java:129)
       |            at org.apache.maven.plugin.DefaultBuildPluginManager.executeMojo (DefaultBuildPluginManager.java:134)
       |            at org.apache.maven.lifecycle.internal.MojoExecutor.execute (MojoExecutor.java:208)
       |            at org.apache.maven.lifecycle.internal.MojoExecutor.execute (MojoExecutor.java:154)
       |            at org.apache.maven.lifecycle.internal.MojoExecutor.execute (MojoExecutor.java:146)
       |            at org.apache.maven.lifecycle.internal.LifecycleModuleBuilder.buildProject (LifecycleModuleBuilder.java:117)
       |            at org.apache.maven.lifecycle.internal.LifecycleModuleBuilder.buildProject (LifecycleModuleBuilder.java:81)
       |            at org.apache.maven.lifecycle.internal.builder.singlethreaded.SingleThreadedBuilder.build (SingleThreadedBuilder.java:51)
       |            at org.apache.maven.lifecycle.internal.LifecycleStarter.execute (LifecycleStarter.java:128)
       |            at org.apache.maven.DefaultMaven.doExecute (DefaultMaven.java:309)
       |            at org.apache.maven.DefaultMaven.doExecute (DefaultMaven.java:194)
       |            at org.apache.maven.DefaultMaven.execute (DefaultMaven.java:107)
       |            at org.apache.maven.cli.MavenCli.execute (MavenCli.java:955)
       |            at org.apache.maven.cli.MavenCli.doMain (MavenCli.java:290)
       |            at org.apache.maven.cli.MavenCli.main (MavenCli.java:194)
       |            at sun.reflect.NativeMethodAccessorImpl.invoke0 (Native Method)
       |            at sun.reflect.NativeMethodAccessorImpl.invoke (NativeMethodAccessorImpl.java:62)
       |            at sun.reflect.DelegatingMethodAccessorImpl.invoke (DelegatingMethodAccessorImpl.java:43)
       |            at java.lang.reflect.Method.invoke (Method.java:498)
       |            at org.codehaus.plexus.classworlds.launcher.Launcher.launchEnhanced (Launcher.java:289)
       |            at org.codehaus.plexus.classworlds.launcher.Launcher.launch (Launcher.java:229)
       |            at org.codehaus.plexus.classworlds.launcher.Launcher.mainWithExitCode (Launcher.java:415)
       |            at org.codehaus.plexus.classworlds.launcher.Launcher.main (Launcher.java:356)
       |        [ERROR] 
       |        [ERROR] 
       |        [ERROR] For more information about the errors and possible solutions, please read the following articles:
       |        [ERROR] [Help 1] http://cwiki.apache.org/confluence/display/MAVEN/MojoFailureException
       |        [ERROR] 
       |        [ERROR] After correcting the problems, you can resume the build with the command
       |        [ERROR]   mvn <goals> -rf :empty-logging-check
       |        Picked up JAVA_TOOL_OPTIONS: -Dmaven.ext.class.path="f:\jenkins\jenkins-slave\workspace\heckstyle-plugin_MCHECKSTYLE-366@2@2@tmp\withMavendc70f66e\pipeline-maven-spy.jar" -Dorg.jenkinsci.plugins.pipeline.maven.reportsFolder="f:\jenkins\jenkins-slave\workspace\heckstyle-plugin_MCHECKSTYLE-366@2@2@tmp\withMavendc70f66e" 
       |        Running post-build script: f:\jenkins\jenkins-slave\workspace\heckstyle-plugin_MCHECKSTYLE-366@2@2\windows-jdk8-m3.5.x_build\target\it\MCHECKSTYLE-338\verify.groovy
       f:\jenkins\jenkins-slave\workspace\heckstyle-plugin_MCHECKSTYLE-366@2@2\windows-jdk8-m3.5.x_build\target\it\MCHECKSTYLE-338\build.log
[INFO] Building: MCHECKSTYLE-347\pom.xml
[INFO] run post-build script verify.groovy
[INFO]           MCHECKSTYLE-347\pom.xml .......................... SUCCESS (6.6 s)
[INFO] Building: MCHECKSTYLE-357\pom.xml
[INFO] run post-build script verify.groovy
[INFO]           MCHECKSTYLE-357\pom.xml .......................... SUCCESS (12.6 s)
[INFO] Building: MCHECKSTYLE-357-with-header-override\pom.xml
[INFO] run post-build script verify.groovy
[INFO]           MCHECKSTYLE-357-with-header-override\pom.xml ..... SUCCESS (15.3 s)
[INFO] Building: MCHECKSTYLE-365\pom.xml
[INFO] run post-build script verify.groovy
[INFO]           MCHECKSTYLE-365\pom.xml .......................... SUCCESS (11.1 s)
[INFO] Building: MCHECKSTYLE-70-multi-sourcefolder\pom.xml
[INFO] run post-build script verify.groovy
[INFO]           MCHECKSTYLE-70-multi-sourcefolder\pom.xml ........ SUCCESS (12.2 s)
[INFO] Building: minimal-pom\pom.xml
[INFO] run post-build script verify.bsh
[INFO]           minimal-pom\pom.xml .............................. SUCCESS (11.9 s)
[INFO] Building: multi-modules\pom.xml
[INFO]           multi-modules\pom.xml ............................ SUCCESS (11.5 s)
[INFO] Building: multi-modules-aggregate\pom.xml
[INFO] run post-build script verify.groovy
[INFO]           multi-modules-aggregate\pom.xml .................. FAILED (8.9 s)
[INFO]   The post-build script did not succeed. assert new File( basedir, 'target/checkstyle-cachefile' ).exists()
       |         |                                        |
       |         |                                        false
       |         f:\jenkins\jenkins-slave\workspace\heckstyle-plugin_MCHECKSTYLE-366@2@2\windows-jdk8-m3.5.x_build\target\it\multi-modules-aggregate
       f:\jenkins\jenkins-slave\workspace\heckstyle-plugin_MCHECKSTYLE-366@2@2\windows-jdk8-m3.5.x_build\target\it\multi-modules-aggregate\target\checkstyle-cachefile
[INFO] Building: multimoduleproject\pom.xml
[INFO]           multimoduleproject\pom.xml ....................... SUCCESS (8.1 s)
[INFO] 
[INFO] --- maven-checkstyle-plugin:3.0.0:check (checkstyle-check) @ maven-checkstyle-plugin ---
[INFO] There is 1 error reported by Checkstyle 6.18 with config/maven_checks.xml ruleset.
[INFO] Ignored 1 error, 0 violation remaining.
[INFO] 
[INFO] --- maven-invoker-plugin:3.1.0:verify (integration-test) @ maven-checkstyle-plugin ---
[INFO] -------------------------------------------------
[INFO] Build Summary:
[INFO]   Passed: 37, Failed: 6, Errors: 0, Skipped: 0
[INFO] -------------------------------------------------
[ERROR] The following builds failed:
[ERROR] *  MCHECKSTYLE-129\pom.xml
[ERROR] *  MCHECKSTYLE-137\pom.xml
[ERROR] *  MCHECKSTYLE-169\pom.xml
[ERROR] *  MCHECKSTYLE-193\pom.xml
[ERROR] *  MCHECKSTYLE-338\pom.xml
[ERROR] *  multi-modules-aggregate\pom.xml
[INFO] -------------------------------------------------
[INFO] ------------------------------------------------------------------------
[INFO] BUILD FAILURE
[INFO] ------------------------------------------------------------------------
[INFO] Total time: 23:52 min
[INFO] Finished at: 2019-04-13T02:19:02-07:00
[INFO] Final Memory: 72M/1131M
[INFO] ------------------------------------------------------------------------
[INFO] [jenkins-event-spy] Generated F:\jenkins\jenkins-slave\workspace\heckstyle-plugin_MCHECKSTYLE-366@2@2@tmp\withMavendc70f66e\maven-spy-20190413-015509-3078199664323228237241.log
[ERROR] Failed to execute goal org.apache.maven.plugins:maven-invoker-plugin:3.1.0:verify (integration-test) on project maven-checkstyle-plugin: 6 builds failed. See console output above for details. -> [Help 1]
org.apache.maven.lifecycle.LifecycleExecutionException: Failed to execute goal org.apache.maven.plugins:maven-invoker-plugin:3.1.0:verify (integration-test) on project maven-checkstyle-plugin: 6 builds failed. See console output above for details.
    at org.apache.maven.lifecycle.internal.MojoExecutor.execute (MojoExecutor.java:213)
    at org.apache.maven.lifecycle.internal.MojoExecutor.execute (MojoExecutor.java:154)
    at org.apache.maven.lifecycle.internal.MojoExecutor.execute (MojoExecutor.java:146)
    at org.apache.maven.lifecycle.internal.LifecycleModuleBuilder.buildProject (LifecycleModuleBuilder.java:117)
    at org.apache.maven.lifecycle.internal.LifecycleModuleBuilder.buildProject (LifecycleModuleBuilder.java:81)
    at org.apache.maven.lifecycle.internal.builder.singlethreaded.SingleThreadedBuilder.build (SingleThreadedBuilder.java:51)
    at org.apache.maven.lifecycle.internal.LifecycleStarter.execute (LifecycleStarter.java:128)
    at org.apache.maven.DefaultMaven.doExecute (DefaultMaven.java:309)
    at org.apache.maven.DefaultMaven.doExecute (DefaultMaven.java:194)
    at org.apache.maven.DefaultMaven.execute (DefaultMaven.java:107)
    at org.apache.maven.cli.MavenCli.execute (MavenCli.java:955)
    at org.apache.maven.cli.MavenCli.doMain (MavenCli.java:290)
    at org.apache.maven.cli.MavenCli.main (MavenCli.java:194)
    at sun.reflect.NativeMethodAccessorImpl.invoke0 (Native Method)
    at sun.reflect.NativeMethodAccessorImpl.invoke (NativeMethodAccessorImpl.java:62)
    at sun.reflect.DelegatingMethodAccessorImpl.invoke (DelegatingMethodAccessorImpl.java:43)
    at java.lang.reflect.Method.invoke (Method.java:498)
    at org.codehaus.plexus.classworlds.launcher.Launcher.launchEnhanced (Launcher.java:289)
    at org.codehaus.plexus.classworlds.launcher.Launcher.launch (Launcher.java:229)
    at org.codehaus.plexus.classworlds.launcher.Launcher.mainWithExitCode (Launcher.java:415)
    at org.codehaus.plexus.classworlds.launcher.Launcher.main (Launcher.java:356)
Caused by: org.apache.maven.plugin.MojoFailureException: 6 builds failed. See console output above for details.
    at org.apache.maven.plugins.invoker.InvokerSession.handleFailures (InvokerSession.java:260)
    at org.apache.maven.plugins.invoker.VerifyMojo.execute (VerifyMojo.java:137)
    at org.apache.maven.plugin.DefaultBuildPluginManager.executeMojo (DefaultBuildPluginManager.java:134)
    at org.apache.maven.lifecycle.internal.MojoExecutor.execute (MojoExecutor.java:208)
    at org.apache.maven.lifecycle.internal.MojoExecutor.execute (MojoExecutor.java:154)
    at org.apache.maven.lifecycle.internal.MojoExecutor.execute (MojoExecutor.java:146)
    at org.apache.maven.lifecycle.internal.LifecycleModuleBuilder.buildProject (LifecycleModuleBuilder.java:117)
    at org.apache.maven.lifecycle.internal.LifecycleModuleBuilder.buildProject (LifecycleModuleBuilder.java:81)
    at org.apache.maven.lifecycle.internal.builder.singlethreaded.SingleThreadedBuilder.build (SingleThreadedBuilder.java:51)
    at org.apache.maven.lifecycle.internal.LifecycleStarter.execute (LifecycleStarter.java:128)
    at org.apache.maven.DefaultMaven.doExecute (DefaultMaven.java:309)
    at org.apache.maven.DefaultMaven.doExecute (DefaultMaven.java:194)
    at org.apache.maven.DefaultMaven.execute (DefaultMaven.java:107)
    at org.apache.maven.cli.MavenCli.execute (MavenCli.java:955)
    at org.apache.maven.cli.MavenCli.doMain (MavenCli.java:290)
    at org.apache.maven.cli.MavenCli.main (MavenCli.java:194)
    at sun.reflect.NativeMethodAccessorImpl.invoke0 (Native Method)
    at sun.reflect.NativeMethodAccessorImpl.invoke (NativeMethodAccessorImpl.java:62)
    at sun.reflect.DelegatingMethodAccessorImpl.invoke (DelegatingMethodAccessorImpl.java:43)
    at java.lang.reflect.Method.invoke (Method.java:498)
    at org.codehaus.plexus.classworlds.launcher.Launcher.launchEnhanced (Launcher.java:289)
    at org.codehaus.plexus.classworlds.launcher.Launcher.launch (Launcher.java:229)
    at org.codehaus.plexus.classworlds.launcher.Launcher.mainWithExitCode (Launcher.java:415)
    at org.codehaus.plexus.classworlds.launcher.Launcher.main (Launcher.java:356)
[ERROR] 
[ERROR] Re-run Maven using the -X switch to enable full debug logging.
[ERROR] 
[ERROR] For more information about the errors and possible solutions, please read the following articles:
[ERROR] [Help 1] http://cwiki.apache.org/confluence/display/MAVEN/MojoFailureException
Picked up JAVA_TOOL_OPTIONS: -Dmaven.ext.class.path="f:\jenkins\jenkins-slave\workspace\heckstyle-plugin_MCHECKSTYLE-366@2@2@tmp\withMavendc70f66e\pipeline-maven-spy.jar" -Dorg.jenkinsci.plugins.pipeline.maven.reportsFolder="f:\jenkins\jenkins-slave\workspace\heckstyle-plugin_MCHECKSTYLE-366@2@2@tmp\withMavendc70f66e" 
Cannot contact windows-2016-3: java.lang.InterruptedException
[Pipeline] }
[Pipeline] // dir
[Pipeline] }
[Fast Archiver] No prior successful build to compare, so performing full copy of artifacts
[withMaven] junitPublisher - Archive test results for Maven artifact org.apache.maven.plugins:maven-checkstyle-plugin:maven-plugin:3.0.1-SNAPSHOT generated by maven-surefire-plugin:test (default-test): windows-jdk8-m3.5.x_build\target\surefire-reports\*.xml
Recording test results
[withMaven] openTasksPublisher - Scan Tasks for Maven artifact org.apache.maven.plugins:maven-checkstyle-plugin:maven-plugin:3.0.1-SNAPSHOT in source directory windows-jdk8-m3.5.x_build\src\main\java
[TASKS] Scanning folder 'f:\jenkins\jenkins-slave\workspace\heckstyle-plugin_MCHECKSTYLE-366@2@2' for files matching the pattern 'windows-jdk8-m3.5.x_build\src\main\java\**\*' - excludes: null
[TASKS] Found 20 files to scan for tasks
[TASKS] Found 5 open tasks.
Skipping warnings blame since pipelines do not have an SCM link.%n
[withMaven] invokerPublisher - Archive invoker results for Maven artifact MavenArtifact{org.apache.maven.plugins:maven-checkstyle-plugin:maven-plugin:3.0.1-SNAPSHOT(version: 3.0.1-SNAPSHOT, snapshot:false) } generated by PluginInvocation{org.apache.maven.plugins:maven-invoker-plugin:3.1.0@integration-test  integration-test}: windows-jdk8-m3.5.x_build\target\invoker-reports\*.xml
[withMaven] Publishers: Generated Artifacts Publisher: 19 ms, Junit Publisher: 406 ms, Open Task Scanner Publisher: 574 ms, Invoker Publisher: 48679 ms
[Pipeline] // withMaven
[Pipeline] cleanWs
[WS-CLEANUP] Deleting project workspace...
[WS-CLEANUP] Deferred wipeout is used...
[WS-CLEANUP] done
[Pipeline] cleanWs
[WS-CLEANUP] Deleting project workspace...
[WS-CLEANUP] Deferred wipeout is used...
[WS-CLEANUP] done
[Pipeline] }
[Pipeline] // stage
[Pipeline] }
[Pipeline] // ws
[Pipeline] }
[Pipeline] // node
[Pipeline] }
Failed in branch windows-jdk8-m3.5.x_build
[Pipeline] // parallel
[Pipeline] stage
[Pipeline] { (Notifications)
[Pipeline] echo
Build result: FAILURE
[Pipeline] jiraIssueSelector
[Pipeline] emailext

Build succeeded in Jenkins: Maven TLP » maven-checkstyle-plugin » MCHECKSTYLE-366 #12

Posted by Apache Jenkins Server <je...@builds.apache.org>.
See https://builds.apache.org/job/maven-box/job/maven-checkstyle-plugin/job/MCHECKSTYLE-366/12/

No changes.

All tests passed

Build failed in Jenkins: Maven TLP » maven-checkstyle-plugin » MCHECKSTYLE-366 #11

Posted by Apache Jenkins Server <je...@builds.apache.org>.
See https://builds.apache.org/job/maven-box/job/maven-checkstyle-plugin/job/MCHECKSTYLE-366/11/

Changes:

* Use old maven-checks.xml file
* Use old maven-checks.xml file
* Use old maven-checks.xml file
* Use old maven-checks.xml file
* Use old maven-checks.xml file
* Use old maven-checks.xml file
* Use old maven-checks.xml file
* Use old maven-checks.xml file
* Use old maven-checks.xml file
* Use old maven-checks.xml file
* Use old maven-checks.xml file
* Use old maven-checks.xml file
* Use old maven-checks.xml file
* Use old maven-checks.xml file

All tests passed

Build log:
[...truncated 5870 lines...]
[Pipeline] // ws
[Pipeline] }
[Pipeline] // node
[Pipeline] }
Failed in branch linux-jdk8-m3.3.x_build
[INFO] run post-build script verify.groovy
[INFO]           MCHECKSTYLE-70-multi-sourcefolder\pom.xml ........ SUCCESS (12.0 s)
[INFO] Building: minimal-pom\pom.xml
[INFO] run post-build script verify.bsh
[INFO]           minimal-pom\pom.xml .............................. SUCCESS (16.5 s)
[INFO] Building: multi-modules\pom.xml
[withMaven] Publishers: Generated Artifacts Publisher: 17 ms, Junit Publisher: 473 ms, Open Task Scanner Publisher: 228 ms, Invoker Publisher: 20168 ms
[Pipeline] // withMaven
[Pipeline] cleanWs
[WS-CLEANUP] Deleting project workspace...
[WS-CLEANUP] Deferred wipeout is used...
[WS-CLEANUP] done
[Pipeline] cleanWs
[WS-CLEANUP] Deleting project workspace...
[WS-CLEANUP] Deferred wipeout is used...
[WS-CLEANUP] done
[Pipeline] }
[Pipeline] // stage
[Pipeline] }
[Pipeline] // ws
[Pipeline] }
[Pipeline] // node
[Pipeline] }
Failed in branch windows-jdk10-m3.6.x_build
[INFO] run post-build script verify.bsh
[INFO]           minimal-pom\pom.xml .............................. SUCCESS (12.9 s)
[INFO] Building: multi-modules\pom.xml
[INFO]           multi-modules\pom.xml ............................ SUCCESS (15.2 s)
[INFO] Building: multi-modules-aggregate\pom.xml
[INFO]           multi-modules\pom.xml ............................ SUCCESS (9.9 s)
[INFO] Building: multi-modules-aggregate\pom.xml
[INFO] run post-build script verify.groovy
[INFO]           multi-modules-aggregate\pom.xml .................. FAILED (9.8 s)
[INFO]   The post-build script did not succeed. assert new File( basedir, 'target/checkstyle-cachefile' ).exists()
       |         |                                        |
       |         |                                        false
       |         f:\jenkins\jenkins-slave\workspace\heckstyle-plugin_MCHECKSTYLE-366@2\windows-jdk11-m3.6.x_build\target\it\multi-modules-aggregate
       f:\jenkins\jenkins-slave\workspace\heckstyle-plugin_MCHECKSTYLE-366@2\windows-jdk11-m3.6.x_build\target\it\multi-modules-aggregate\target\checkstyle-cachefile
[INFO] Building: multimoduleproject\pom.xml
[INFO] run post-build script verify.groovy
[INFO]           multi-modules-aggregate\pom.xml .................. FAILED (7.5 s)
[INFO]   The post-build script did not succeed. assert new File( basedir, 'target/checkstyle-cachefile' ).exists()
       |         |                                        |
       |         |                                        false
       |         f:\jenkins\jenkins-slave\workspace\heckstyle-plugin_MCHECKSTYLE-366@3\windows-jdk8-m3.2.x_build\target\it\multi-modules-aggregate
       f:\jenkins\jenkins-slave\workspace\heckstyle-plugin_MCHECKSTYLE-366@3\windows-jdk8-m3.2.x_build\target\it\multi-modules-aggregate\target\checkstyle-cachefile
[INFO] Building: multimoduleproject\pom.xml
[INFO]           multimoduleproject\pom.xml ....................... SUCCESS (11.3 s)
[INFO] 
[INFO] --- maven-checkstyle-plugin:3.0.0:check (checkstyle-check) @ maven-checkstyle-plugin ---
[INFO]           multimoduleproject\pom.xml ....................... SUCCESS (7.3 s)
[INFO] 
[INFO] --- maven-checkstyle-plugin:3.0.0:check (checkstyle-check) @ maven-checkstyle-plugin ---
[INFO] There is 1 error reported by Checkstyle 6.18 with config/maven_checks.xml ruleset.
[INFO] Ignored 1 error, 0 violation remaining.
[INFO] 
[INFO] --- maven-invoker-plugin:3.1.0:verify (integration-test) @ maven-checkstyle-plugin ---
[INFO] -------------------------------------------------
[INFO] Build Summary:
[INFO]   Passed: 42, Failed: 1, Errors: 0, Skipped: 0
[INFO] -------------------------------------------------
[ERROR] The following builds failed:
[ERROR] *  multi-modules-aggregate\pom.xml
[INFO] -------------------------------------------------
[INFO] ------------------------------------------------------------------------
[INFO] BUILD FAILURE
[INFO] ------------------------------------------------------------------------
[INFO] Total time:  10:28 min
[INFO] Finished at: 2019-04-21T13:33:32Z
[INFO] ------------------------------------------------------------------------
[INFO] [jenkins-event-spy] Generated F:\jenkins\jenkins-slave\workspace\heckstyle-plugin_MCHECKSTYLE-366@2@tmp\withMaven438777de\maven-spy-20190421-132303-15513593377168303608940.log
[ERROR] Failed to execute goal org.apache.maven.plugins:maven-invoker-plugin:3.1.0:verify (integration-test) on project maven-checkstyle-plugin: 1 build failed. See console output above for details. -> [Help 1]
org.apache.maven.lifecycle.LifecycleExecutionException: Failed to execute goal org.apache.maven.plugins:maven-invoker-plugin:3.1.0:verify (integration-test) on project maven-checkstyle-plugin: 1 build failed. See console output above for details.
    at org.apache.maven.lifecycle.internal.MojoExecutor.execute (MojoExecutor.java:215)
    at org.apache.maven.lifecycle.internal.MojoExecutor.execute (MojoExecutor.java:156)
    at org.apache.maven.lifecycle.internal.MojoExecutor.execute (MojoExecutor.java:148)
    at org.apache.maven.lifecycle.internal.LifecycleModuleBuilder.buildProject (LifecycleModuleBuilder.java:117)
    at org.apache.maven.lifecycle.internal.LifecycleModuleBuilder.buildProject (LifecycleModuleBuilder.java:81)
    at org.apache.maven.lifecycle.internal.builder.singlethreaded.SingleThreadedBuilder.build (SingleThreadedBuilder.java:56)
    at org.apache.maven.lifecycle.internal.LifecycleStarter.execute (LifecycleStarter.java:128)
    at org.apache.maven.DefaultMaven.doExecute (DefaultMaven.java:305)
    at org.apache.maven.DefaultMaven.doExecute (DefaultMaven.java:192)
    at org.apache.maven.DefaultMaven.execute (DefaultMaven.java:105)
    at org.apache.maven.cli.MavenCli.execute (MavenCli.java:956)
    at org.apache.maven.cli.MavenCli.doMain (MavenCli.java:288)
    at org.apache.maven.cli.MavenCli.main (MavenCli.java:192)
    at jdk.internal.reflect.NativeMethodAccessorImpl.invoke0 (Native Method)
    at jdk.internal.reflect.NativeMethodAccessorImpl.invoke (NativeMethodAccessorImpl.java:62)
    at jdk.internal.reflect.DelegatingMethodAccessorImpl.invoke (DelegatingMethodAccessorImpl.java:43)
    at java.lang.reflect.Method.invoke (Method.java:566)
    at org.codehaus.plexus.classworlds.launcher.Launcher.launchEnhanced (Launcher.java:289)
    at org.codehaus.plexus.classworlds.launcher.Launcher.launch (Launcher.java:229)
    at org.codehaus.plexus.classworlds.launcher.Launcher.mainWithExitCode (Launcher.java:415)
    at org.codehaus.plexus.classworlds.launcher.Launcher.main (Launcher.java:356)
Caused by: org.apache.maven.plugin.MojoFailureException: 1 build failed. See console output above for details.
    at org.apache.maven.plugins.invoker.InvokerSession.handleFailures (InvokerSession.java:260)
    at org.apache.maven.plugins.invoker.VerifyMojo.execute (VerifyMojo.java:137)
    at org.apache.maven.plugin.DefaultBuildPluginManager.executeMojo (DefaultBuildPluginManager.java:137)
    at org.apache.maven.lifecycle.internal.MojoExecutor.execute (MojoExecutor.java:210)
    at org.apache.maven.lifecycle.internal.MojoExecutor.execute (MojoExecutor.java:156)
    at org.apache.maven.lifecycle.internal.MojoExecutor.execute (MojoExecutor.java:148)
    at org.apache.maven.lifecycle.internal.LifecycleModuleBuilder.buildProject (LifecycleModuleBuilder.java:117)
    at org.apache.maven.lifecycle.internal.LifecycleModuleBuilder.buildProject (LifecycleModuleBuilder.java:81)
    at org.apache.maven.lifecycle.internal.builder.singlethreaded.SingleThreadedBuilder.build (SingleThreadedBuilder.java:56)
    at org.apache.maven.lifecycle.internal.LifecycleStarter.execute (LifecycleStarter.java:128)
    at org.apache.maven.DefaultMaven.doExecute (DefaultMaven.java:305)
    at org.apache.maven.DefaultMaven.doExecute (DefaultMaven.java:192)
    at org.apache.maven.DefaultMaven.execute (DefaultMaven.java:105)
    at org.apache.maven.cli.MavenCli.execute (MavenCli.java:956)
    at org.apache.maven.cli.MavenCli.doMain (MavenCli.java:288)
    at org.apache.maven.cli.MavenCli.main (MavenCli.java:192)
    at jdk.internal.reflect.NativeMethodAccessorImpl.invoke0 (Native Method)
    at jdk.internal.reflect.NativeMethodAccessorImpl.invoke (NativeMethodAccessorImpl.java:62)
    at jdk.internal.reflect.DelegatingMethodAccessorImpl.invoke (DelegatingMethodAccessorImpl.java:43)
    at java.lang.reflect.Method.invoke (Method.java:566)
    at org.codehaus.plexus.classworlds.launcher.Launcher.launchEnhanced (Launcher.java:289)
    at org.codehaus.plexus.classworlds.launcher.Launcher.launch (Launcher.java:229)
    at org.codehaus.plexus.classworlds.launcher.Launcher.mainWithExitCode (Launcher.java:415)
    at org.codehaus.plexus.classworlds.launcher.Launcher.main (Launcher.java:356)
[ERROR] 
[ERROR] Re-run Maven using the -X switch to enable full debug logging.
[ERROR] 
[ERROR] For more information about the errors and possible solutions, please read the following articles:
[ERROR] [Help 1] http://cwiki.apache.org/confluence/display/MAVEN/MojoFailureException
[Pipeline] }
[Pipeline] // dir
[Pipeline] }
[Fast Archiver] No prior successful build to compare, so performing full copy of artifacts
[withMaven] junitPublisher - Archive test results for Maven artifact org.apache.maven.plugins:maven-checkstyle-plugin:maven-plugin:3.0.1-SNAPSHOT generated by maven-surefire-plugin:test (default-test): windows-jdk11-m3.6.x_build\target\surefire-reports\*.xml
Recording test results
[INFO] There is 1 error reported by Checkstyle 6.18 with config/maven_checks.xml ruleset.
[INFO] Ignored 1 error, 0 violation remaining.
[INFO] 
[INFO] --- maven-invoker-plugin:3.1.0:verify (integration-test) @ maven-checkstyle-plugin ---
[INFO] -------------------------------------------------
[INFO] Build Summary:
[INFO]   Passed: 42, Failed: 1, Errors: 0, Skipped: 0
[INFO] -------------------------------------------------
[ERROR] The following builds failed:
[ERROR] *  multi-modules-aggregate\pom.xml
[INFO] -------------------------------------------------
[INFO] ------------------------------------------------------------------------
[INFO] BUILD FAILURE
[INFO] ------------------------------------------------------------------------
[INFO] Total time: 10:25 min
[INFO] Finished at: 2019-04-21T06:33:34-07:00
[INFO] Final Memory: 61M/1080M
[INFO] ------------------------------------------------------------------------
[INFO] [jenkins-event-spy] Generated F:\jenkins\jenkins-slave\workspace\heckstyle-plugin_MCHECKSTYLE-366@3@tmp\withMavenf1ffad60\maven-spy-20190421-062307-6705151916479252575032.log
[ERROR] Failed to execute goal org.apache.maven.plugins:maven-invoker-plugin:3.1.0:verify (integration-test) on project maven-checkstyle-plugin: 1 build failed. See console output above for details. -> [Help 1]
org.apache.maven.lifecycle.LifecycleExecutionException: Failed to execute goal org.apache.maven.plugins:maven-invoker-plugin:3.1.0:verify (integration-test) on project maven-checkstyle-plugin: 1 build failed. See console output above for details.
	at org.apache.maven.lifecycle.internal.MojoExecutor.execute(MojoExecutor.java:212)
	at org.apache.maven.lifecycle.internal.MojoExecutor.execute(MojoExecutor.java:153)
	at org.apache.maven.lifecycle.internal.MojoExecutor.execute(MojoExecutor.java:145)
	at org.apache.maven.lifecycle.internal.LifecycleModuleBuilder.buildProject(LifecycleModuleBuilder.java:116)
	at org.apache.maven.lifecycle.internal.LifecycleModuleBuilder.buildProject(LifecycleModuleBuilder.java:80)
	at org.apache.maven.lifecycle.internal.builder.singlethreaded.SingleThreadedBuilder.build(SingleThreadedBuilder.java:51)
	at org.apache.maven.lifecycle.internal.LifecycleStarter.execute(LifecycleStarter.java:120)
	at org.apache.maven.DefaultMaven.doExecute(DefaultMaven.java:355)
	at org.apache.maven.DefaultMaven.execute(DefaultMaven.java:155)
	at org.apache.maven.cli.MavenCli.execute(MavenCli.java:584)
	at org.apache.maven.cli.MavenCli.doMain(MavenCli.java:216)
	at org.apache.maven.cli.MavenCli.main(MavenCli.java:160)
	at sun.reflect.NativeMethodAccessorImpl.invoke0(Native Method)
	at sun.reflect.NativeMethodAccessorImpl.invoke(NativeMethodAccessorImpl.java:62)
	at sun.reflect.DelegatingMethodAccessorImpl.invoke(DelegatingMethodAccessorImpl.java:43)
	at java.lang.reflect.Method.invoke(Method.java:498)
	at org.codehaus.plexus.classworlds.launcher.Launcher.launchEnhanced(Launcher.java:289)
	at org.codehaus.plexus.classworlds.launcher.Launcher.launch(Launcher.java:229)
	at org.codehaus.plexus.classworlds.launcher.Launcher.mainWithExitCode(Launcher.java:415)
	at org.codehaus.plexus.classworlds.launcher.Launcher.main(Launcher.java:356)
Caused by: org.apache.maven.plugin.MojoFailureException: 1 build failed. See console output above for details.
	at org.apache.maven.plugins.invoker.InvokerSession.handleFailures(InvokerSession.java:260)
	at org.apache.maven.plugins.invoker.VerifyMojo.execute(VerifyMojo.java:137)
	at org.apache.maven.plugin.DefaultBuildPluginManager.executeMojo(DefaultBuildPluginManager.java:132)
	at org.apache.maven.lifecycle.internal.MojoExecutor.execute(MojoExecutor.java:208)
	... 19 more
[ERROR] 
[ERROR] Re-run Maven using the -X switch to enable full debug logging.
[ERROR] 
[ERROR] For more information about the errors and possible solutions, please read the following articles:
[ERROR] [Help 1] http://cwiki.apache.org/confluence/display/MAVEN/MojoFailureException
Picked up JAVA_TOOL_OPTIONS: -Dmaven.ext.class.path="f:\jenkins\jenkins-slave\workspace\heckstyle-plugin_MCHECKSTYLE-366@3@tmp\withMavenf1ffad60\pipeline-maven-spy.jar" -Dorg.jenkinsci.plugins.pipeline.maven.reportsFolder="f:\jenkins\jenkins-slave\workspace\heckstyle-plugin_MCHECKSTYLE-366@3@tmp\withMavenf1ffad60" 
[Pipeline] }
[withMaven] openTasksPublisher - Scan Tasks for Maven artifact org.apache.maven.plugins:maven-checkstyle-plugin:maven-plugin:3.0.1-SNAPSHOT in source directory windows-jdk11-m3.6.x_build\src\main\java
[Pipeline] // dir
[Pipeline] }
[TASKS] Scanning folder 'f:\jenkins\jenkins-slave\workspace\heckstyle-plugin_MCHECKSTYLE-366@2' for files matching the pattern 'windows-jdk11-m3.6.x_build\src\main\java\**\*' - excludes: null
[TASKS] Found 20 files to scan for tasks
[TASKS] Found 5 open tasks.
Skipping warnings blame since pipelines do not have an SCM link.%n
[Fast Archiver] No prior successful build to compare, so performing full copy of artifacts
[withMaven] junitPublisher - Archive test results for Maven artifact org.apache.maven.plugins:maven-checkstyle-plugin:maven-plugin:3.0.1-SNAPSHOT generated by maven-surefire-plugin:test (default-test): windows-jdk8-m3.2.x_build\target\surefire-reports\*.xml
Recording test results
[withMaven] invokerPublisher - Archive invoker results for Maven artifact MavenArtifact{org.apache.maven.plugins:maven-checkstyle-plugin:maven-plugin:3.0.1-SNAPSHOT(version: 3.0.1-SNAPSHOT, snapshot:false) } generated by PluginInvocation{org.apache.maven.plugins:maven-invoker-plugin:3.1.0@integration-test  integration-test}: windows-jdk11-m3.6.x_build\target\invoker-reports\*.xml
[withMaven] openTasksPublisher - Scan Tasks for Maven artifact org.apache.maven.plugins:maven-checkstyle-plugin:maven-plugin:3.0.1-SNAPSHOT in source directory windows-jdk8-m3.2.x_build\src\main\java
[TASKS] Scanning folder 'f:\jenkins\jenkins-slave\workspace\heckstyle-plugin_MCHECKSTYLE-366@3' for files matching the pattern 'windows-jdk8-m3.2.x_build\src\main\java\**\*' - excludes: null
[TASKS] Found 20 files to scan for tasks
[TASKS] Found 5 open tasks.
Skipping warnings blame since pipelines do not have an SCM link.%n
[withMaven] invokerPublisher - Archive invoker results for Maven artifact MavenArtifact{org.apache.maven.plugins:maven-checkstyle-plugin:maven-plugin:3.0.1-SNAPSHOT(version: 3.0.1-SNAPSHOT, snapshot:false) } generated by PluginInvocation{org.apache.maven.plugins:maven-invoker-plugin:3.1.0@integration-test  integration-test}: windows-jdk8-m3.2.x_build\target\invoker-reports\*.xml
[withMaven] Publishers: Generated Artifacts Publisher: 22 ms, Junit Publisher: 435 ms, Open Task Scanner Publisher: 191 ms, Invoker Publisher: 15412 ms
[Pipeline] // withMaven
[Pipeline] cleanWs
[WS-CLEANUP] Deleting project workspace...
[WS-CLEANUP] Deferred wipeout is used...
[WS-CLEANUP] done
[Pipeline] cleanWs
[WS-CLEANUP] Deleting project workspace...
[WS-CLEANUP] Deferred wipeout is used...
[WS-CLEANUP] done
[Pipeline] }
[Pipeline] // stage
[Pipeline] }
[Pipeline] // ws
[Pipeline] }
[Pipeline] // node
[Pipeline] }
Failed in branch windows-jdk11-m3.6.x_build
[withMaven] Publishers: Generated Artifacts Publisher: 18 ms, Junit Publisher: 399 ms, Open Task Scanner Publisher: 183 ms, Invoker Publisher: 17816 ms
[Pipeline] // withMaven
[Pipeline] cleanWs
[WS-CLEANUP] Deleting project workspace...
[WS-CLEANUP] Deferred wipeout is used...
[WS-CLEANUP] done
[Pipeline] cleanWs
[WS-CLEANUP] Deleting project workspace...
[WS-CLEANUP] Deferred wipeout is used...
[WS-CLEANUP] done
[Pipeline] }
[Pipeline] // stage
[Pipeline] }
[Pipeline] // ws
[Pipeline] }
[Pipeline] // node
[Pipeline] }
Failed in branch windows-jdk8-m3.2.x_build
[Pipeline] // parallel
[Pipeline] stage
[Pipeline] { (Notifications)
[Pipeline] echo
Build result: FAILURE
[Pipeline] jiraIssueSelector
[Pipeline] emailext

Build failed in Jenkins: Maven TLP » maven-checkstyle-plugin » MCHECKSTYLE-366 #10

Posted by Apache Jenkins Server <je...@builds.apache.org>.
See https://builds.apache.org/job/maven-box/job/maven-checkstyle-plugin/job/MCHECKSTYLE-366/10/

Changes:

* Use a static not loaded from classpath
* Use a static not loaded from classpath
* Use a static not loaded from classpath
* Use a static not loaded from classpath
* Use a static not loaded from classpath
* Use a static not loaded from classpath
* Use a static not loaded from classpath
* Use a static not loaded from classpath
* Use a static not loaded from classpath
* Use a static not loaded from classpath
* Use a static not loaded from classpath
* Use a static not loaded from classpath
* Use a static not loaded from classpath
* Use a static not loaded from classpath

All tests passed

Build log:
[...truncated 5870 lines...]
[Pipeline] // ws
[Pipeline] }
[Pipeline] // node
[Pipeline] }
Failed in branch windows-jdk8-m3.5.x_build
[INFO] run post-build script verify.groovy
[INFO]           MCHECKSTYLE-70-multi-sourcefolder\pom.xml ........ SUCCESS (13.9 s)
[INFO] Building: minimal-pom\pom.xml
[withMaven] Publishers: Generated Artifacts Publisher: 17 ms, Junit Publisher: 844 ms, Open Task Scanner Publisher: 201 ms, Invoker Publisher: 21114 ms
[Pipeline] // withMaven
[Pipeline] cleanWs
[WS-CLEANUP] Deleting project workspace...
[WS-CLEANUP] Deferred wipeout is used...
[WS-CLEANUP] done
[Pipeline] cleanWs
[WS-CLEANUP] Deleting project workspace...
[WS-CLEANUP] Deferred wipeout is used...
[WS-CLEANUP] done
[Pipeline] }
[Pipeline] // stage
[Pipeline] }
[Pipeline] // ws
[Pipeline] }
[Pipeline] // node
[Pipeline] }
Failed in branch windows-jdk10-m3.6.x_build
[INFO] run post-build script verify.bsh
[INFO]           minimal-pom\pom.xml .............................. SUCCESS (12.8 s)
[INFO] Building: multi-modules\pom.xml
[INFO] run post-build script verify.bsh
[INFO]           minimal-pom\pom.xml .............................. SUCCESS (15.6 s)
[INFO] Building: multi-modules\pom.xml
[INFO]           multi-modules\pom.xml ............................ SUCCESS (10.9 s)
[INFO] Building: multi-modules-aggregate\pom.xml
[INFO] run post-build script verify.groovy
[INFO]           multi-modules-aggregate\pom.xml .................. FAILED (9.8 s)
[INFO]   The post-build script did not succeed. assert new File( basedir, 'target/checkstyle-header.txt' ).exists()
       |         |                                         |
       |         |                                         false
       |         f:\jenkins\jenkins-slave\workspace\heckstyle-plugin_MCHECKSTYLE-366@3\windows-jdk8-m3.2.x_build\target\it\multi-modules-aggregate
       f:\jenkins\jenkins-slave\workspace\heckstyle-plugin_MCHECKSTYLE-366@3\windows-jdk8-m3.2.x_build\target\it\multi-modules-aggregate\target\checkstyle-header.txt
[INFO] Building: multimoduleproject\pom.xml
[INFO]           multi-modules\pom.xml ............................ SUCCESS (15.2 s)
[INFO] Building: multi-modules-aggregate\pom.xml
[INFO]           multimoduleproject\pom.xml ....................... SUCCESS (7.4 s)
[INFO] 
[INFO] --- maven-checkstyle-plugin:3.0.0:check (checkstyle-check) @ maven-checkstyle-plugin ---
[INFO] There is 1 error reported by Checkstyle 6.18 with config/maven_checks.xml ruleset.
[INFO] Ignored 1 error, 0 violation remaining.
[INFO] 
[INFO] --- maven-invoker-plugin:3.1.0:verify (integration-test) @ maven-checkstyle-plugin ---
[INFO] -------------------------------------------------
[INFO] Build Summary:
[INFO]   Passed: 42, Failed: 1, Errors: 0, Skipped: 0
[INFO] -------------------------------------------------
[ERROR] The following builds failed:
[ERROR] *  multi-modules-aggregate\pom.xml
[INFO] -------------------------------------------------
[INFO] ------------------------------------------------------------------------
[INFO] BUILD FAILURE
[INFO] ------------------------------------------------------------------------
[INFO] Total time: 10:29 min
[INFO] Finished at: 2019-04-21T06:19:21-07:00
[INFO] Final Memory: 61M/1049M
[INFO] ------------------------------------------------------------------------
[INFO] [jenkins-event-spy] Generated F:\jenkins\jenkins-slave\workspace\heckstyle-plugin_MCHECKSTYLE-366@3@tmp\withMaven8b64d490\maven-spy-20190421-060851-4677630332651231623418.log
[ERROR] Failed to execute goal org.apache.maven.plugins:maven-invoker-plugin:3.1.0:verify (integration-test) on project maven-checkstyle-plugin: 1 build failed. See console output above for details. -> [Help 1]
org.apache.maven.lifecycle.LifecycleExecutionException: Failed to execute goal org.apache.maven.plugins:maven-invoker-plugin:3.1.0:verify (integration-test) on project maven-checkstyle-plugin: 1 build failed. See console output above for details.
	at org.apache.maven.lifecycle.internal.MojoExecutor.execute(MojoExecutor.java:212)
	at org.apache.maven.lifecycle.internal.MojoExecutor.execute(MojoExecutor.java:153)
	at org.apache.maven.lifecycle.internal.MojoExecutor.execute(MojoExecutor.java:145)
	at org.apache.maven.lifecycle.internal.LifecycleModuleBuilder.buildProject(LifecycleModuleBuilder.java:116)
	at org.apache.maven.lifecycle.internal.LifecycleModuleBuilder.buildProject(LifecycleModuleBuilder.java:80)
	at org.apache.maven.lifecycle.internal.builder.singlethreaded.SingleThreadedBuilder.build(SingleThreadedBuilder.java:51)
	at org.apache.maven.lifecycle.internal.LifecycleStarter.execute(LifecycleStarter.java:120)
	at org.apache.maven.DefaultMaven.doExecute(DefaultMaven.java:355)
	at org.apache.maven.DefaultMaven.execute(DefaultMaven.java:155)
	at org.apache.maven.cli.MavenCli.execute(MavenCli.java:584)
	at org.apache.maven.cli.MavenCli.doMain(MavenCli.java:216)
	at org.apache.maven.cli.MavenCli.main(MavenCli.java:160)
	at sun.reflect.NativeMethodAccessorImpl.invoke0(Native Method)
	at sun.reflect.NativeMethodAccessorImpl.invoke(NativeMethodAccessorImpl.java:62)
	at sun.reflect.DelegatingMethodAccessorImpl.invoke(DelegatingMethodAccessorImpl.java:43)
	at java.lang.reflect.Method.invoke(Method.java:498)
	at org.codehaus.plexus.classworlds.launcher.Launcher.launchEnhanced(Launcher.java:289)
	at org.codehaus.plexus.classworlds.launcher.Launcher.launch(Launcher.java:229)
	at org.codehaus.plexus.classworlds.launcher.Launcher.mainWithExitCode(Launcher.java:415)
	at org.codehaus.plexus.classworlds.launcher.Launcher.main(Launcher.java:356)
Caused by: org.apache.maven.plugin.MojoFailureException: 1 build failed. See console output above for details.
	at org.apache.maven.plugins.invoker.InvokerSession.handleFailures(InvokerSession.java:260)
	at org.apache.maven.plugins.invoker.VerifyMojo.execute(VerifyMojo.java:137)
	at org.apache.maven.plugin.DefaultBuildPluginManager.executeMojo(DefaultBuildPluginManager.java:132)
	at org.apache.maven.lifecycle.internal.MojoExecutor.execute(MojoExecutor.java:208)
	... 19 more
[ERROR] 
[ERROR] Re-run Maven using the -X switch to enable full debug logging.
[ERROR] 
[ERROR] For more information about the errors and possible solutions, please read the following articles:
[ERROR] [Help 1] http://cwiki.apache.org/confluence/display/MAVEN/MojoFailureException
Picked up JAVA_TOOL_OPTIONS: -Dmaven.ext.class.path="f:\jenkins\jenkins-slave\workspace\heckstyle-plugin_MCHECKSTYLE-366@3@tmp\withMaven8b64d490\pipeline-maven-spy.jar" -Dorg.jenkinsci.plugins.pipeline.maven.reportsFolder="f:\jenkins\jenkins-slave\workspace\heckstyle-plugin_MCHECKSTYLE-366@3@tmp\withMaven8b64d490" 
[Pipeline] }
[Pipeline] // dir
[Pipeline] }
[Fast Archiver] No prior successful build to compare, so performing full copy of artifacts
[withMaven] junitPublisher - Archive test results for Maven artifact org.apache.maven.plugins:maven-checkstyle-plugin:maven-plugin:3.0.1-SNAPSHOT generated by maven-surefire-plugin:test (default-test): windows-jdk8-m3.2.x_build\target\surefire-reports\*.xml
Recording test results
[withMaven] openTasksPublisher - Scan Tasks for Maven artifact org.apache.maven.plugins:maven-checkstyle-plugin:maven-plugin:3.0.1-SNAPSHOT in source directory windows-jdk8-m3.2.x_build\src\main\java
[TASKS] Scanning folder 'f:\jenkins\jenkins-slave\workspace\heckstyle-plugin_MCHECKSTYLE-366@3' for files matching the pattern 'windows-jdk8-m3.2.x_build\src\main\java\**\*' - excludes: null
[TASKS] Found 20 files to scan for tasks
[TASKS] Found 5 open tasks.
Skipping warnings blame since pipelines do not have an SCM link.%n
[withMaven] invokerPublisher - Archive invoker results for Maven artifact MavenArtifact{org.apache.maven.plugins:maven-checkstyle-plugin:maven-plugin:3.0.1-SNAPSHOT(version: 3.0.1-SNAPSHOT, snapshot:false) } generated by PluginInvocation{org.apache.maven.plugins:maven-invoker-plugin:3.1.0@integration-test  integration-test}: windows-jdk8-m3.2.x_build\target\invoker-reports\*.xml
[INFO] run post-build script verify.groovy
[INFO]           multi-modules-aggregate\pom.xml .................. FAILED (13.2 s)
[INFO]   The post-build script did not succeed. assert new File( basedir, 'target/checkstyle-header.txt' ).exists()
       |         |                                         |
       |         |                                         false
       |         f:\jenkins\jenkins-slave\workspace\heckstyle-plugin_MCHECKSTYLE-366@2\windows-jdk11-m3.6.x_build\target\it\multi-modules-aggregate
       f:\jenkins\jenkins-slave\workspace\heckstyle-plugin_MCHECKSTYLE-366@2\windows-jdk11-m3.6.x_build\target\it\multi-modules-aggregate\target\checkstyle-header.txt
[INFO] Building: multimoduleproject\pom.xml
[INFO]           multimoduleproject\pom.xml ....................... SUCCESS (10.7 s)
[INFO] 
[INFO] --- maven-checkstyle-plugin:3.0.0:check (checkstyle-check) @ maven-checkstyle-plugin ---
[INFO] There is 1 error reported by Checkstyle 6.18 with config/maven_checks.xml ruleset.
[INFO] Ignored 1 error, 0 violation remaining.
[INFO] 
[INFO] --- maven-invoker-plugin:3.1.0:verify (integration-test) @ maven-checkstyle-plugin ---
[INFO] -------------------------------------------------
[INFO] Build Summary:
[INFO]   Passed: 42, Failed: 1, Errors: 0, Skipped: 0
[INFO] -------------------------------------------------
[ERROR] The following builds failed:
[ERROR] *  multi-modules-aggregate\pom.xml
[INFO] -------------------------------------------------
[INFO] ------------------------------------------------------------------------
[INFO] BUILD FAILURE
[INFO] ------------------------------------------------------------------------
[INFO] Total time:  10:49 min
[INFO] Finished at: 2019-04-21T13:19:40Z
[INFO] ------------------------------------------------------------------------
[INFO] [jenkins-event-spy] Generated F:\jenkins\jenkins-slave\workspace\heckstyle-plugin_MCHECKSTYLE-366@2@tmp\withMaveneca96572\maven-spy-20190421-130850-6213432886906085862431.log
[ERROR] Failed to execute goal org.apache.maven.plugins:maven-invoker-plugin:3.1.0:verify (integration-test) on project maven-checkstyle-plugin: 1 build failed. See console output above for details. -> [Help 1]
org.apache.maven.lifecycle.LifecycleExecutionException: Failed to execute goal org.apache.maven.plugins:maven-invoker-plugin:3.1.0:verify (integration-test) on project maven-checkstyle-plugin: 1 build failed. See console output above for details.
    at org.apache.maven.lifecycle.internal.MojoExecutor.execute (MojoExecutor.java:215)
    at org.apache.maven.lifecycle.internal.MojoExecutor.execute (MojoExecutor.java:156)
    at org.apache.maven.lifecycle.internal.MojoExecutor.execute (MojoExecutor.java:148)
    at org.apache.maven.lifecycle.internal.LifecycleModuleBuilder.buildProject (LifecycleModuleBuilder.java:117)
    at org.apache.maven.lifecycle.internal.LifecycleModuleBuilder.buildProject (LifecycleModuleBuilder.java:81)
    at org.apache.maven.lifecycle.internal.builder.singlethreaded.SingleThreadedBuilder.build (SingleThreadedBuilder.java:56)
    at org.apache.maven.lifecycle.internal.LifecycleStarter.execute (LifecycleStarter.java:128)
    at org.apache.maven.DefaultMaven.doExecute (DefaultMaven.java:305)
    at org.apache.maven.DefaultMaven.doExecute (DefaultMaven.java:192)
    at org.apache.maven.DefaultMaven.execute (DefaultMaven.java:105)
    at org.apache.maven.cli.MavenCli.execute (MavenCli.java:956)
    at org.apache.maven.cli.MavenCli.doMain (MavenCli.java:288)
    at org.apache.maven.cli.MavenCli.main (MavenCli.java:192)
    at jdk.internal.reflect.NativeMethodAccessorImpl.invoke0 (Native Method)
    at jdk.internal.reflect.NativeMethodAccessorImpl.invoke (NativeMethodAccessorImpl.java:62)
    at jdk.internal.reflect.DelegatingMethodAccessorImpl.invoke (DelegatingMethodAccessorImpl.java:43)
    at java.lang.reflect.Method.invoke (Method.java:566)
    at org.codehaus.plexus.classworlds.launcher.Launcher.launchEnhanced (Launcher.java:289)
    at org.codehaus.plexus.classworlds.launcher.Launcher.launch (Launcher.java:229)
    at org.codehaus.plexus.classworlds.launcher.Launcher.mainWithExitCode (Launcher.java:415)
    at org.codehaus.plexus.classworlds.launcher.Launcher.main (Launcher.java:356)
Caused by: org.apache.maven.plugin.MojoFailureException: 1 build failed. See console output above for details.
    at org.apache.maven.plugins.invoker.InvokerSession.handleFailures (InvokerSession.java:260)
    at org.apache.maven.plugins.invoker.VerifyMojo.execute (VerifyMojo.java:137)
    at org.apache.maven.plugin.DefaultBuildPluginManager.executeMojo (DefaultBuildPluginManager.java:137)
    at org.apache.maven.lifecycle.internal.MojoExecutor.execute (MojoExecutor.java:210)
    at org.apache.maven.lifecycle.internal.MojoExecutor.execute (MojoExecutor.java:156)
    at org.apache.maven.lifecycle.internal.MojoExecutor.execute (MojoExecutor.java:148)
    at org.apache.maven.lifecycle.internal.LifecycleModuleBuilder.buildProject (LifecycleModuleBuilder.java:117)
    at org.apache.maven.lifecycle.internal.LifecycleModuleBuilder.buildProject (LifecycleModuleBuilder.java:81)
    at org.apache.maven.lifecycle.internal.builder.singlethreaded.SingleThreadedBuilder.build (SingleThreadedBuilder.java:56)
    at org.apache.maven.lifecycle.internal.LifecycleStarter.execute (LifecycleStarter.java:128)
    at org.apache.maven.DefaultMaven.doExecute (DefaultMaven.java:305)
    at org.apache.maven.DefaultMaven.doExecute (DefaultMaven.java:192)
    at org.apache.maven.DefaultMaven.execute (DefaultMaven.java:105)
    at org.apache.maven.cli.MavenCli.execute (MavenCli.java:956)
    at org.apache.maven.cli.MavenCli.doMain (MavenCli.java:288)
    at org.apache.maven.cli.MavenCli.main (MavenCli.java:192)
    at jdk.internal.reflect.NativeMethodAccessorImpl.invoke0 (Native Method)
    at jdk.internal.reflect.NativeMethodAccessorImpl.invoke (NativeMethodAccessorImpl.java:62)
    at jdk.internal.reflect.DelegatingMethodAccessorImpl.invoke (DelegatingMethodAccessorImpl.java:43)
    at java.lang.reflect.Method.invoke (Method.java:566)
    at org.codehaus.plexus.classworlds.launcher.Launcher.launchEnhanced (Launcher.java:289)
    at org.codehaus.plexus.classworlds.launcher.Launcher.launch (Launcher.java:229)
    at org.codehaus.plexus.classworlds.launcher.Launcher.mainWithExitCode (Launcher.java:415)
    at org.codehaus.plexus.classworlds.launcher.Launcher.main (Launcher.java:356)
[ERROR] 
[ERROR] Re-run Maven using the -X switch to enable full debug logging.
[ERROR] 
[ERROR] For more information about the errors and possible solutions, please read the following articles:
[ERROR] [Help 1] http://cwiki.apache.org/confluence/display/MAVEN/MojoFailureException
[Pipeline] }
[Pipeline] // dir
[Pipeline] }
[Fast Archiver] No prior successful build to compare, so performing full copy of artifacts
[withMaven] junitPublisher - Archive test results for Maven artifact org.apache.maven.plugins:maven-checkstyle-plugin:maven-plugin:3.0.1-SNAPSHOT generated by maven-surefire-plugin:test (default-test): windows-jdk11-m3.6.x_build\target\surefire-reports\*.xml
Recording test results
[withMaven] Publishers: Generated Artifacts Publisher: 16 ms, Junit Publisher: 436 ms, Open Task Scanner Publisher: 189 ms, Invoker Publisher: 18610 ms
[withMaven] openTasksPublisher - Scan Tasks for Maven artifact org.apache.maven.plugins:maven-checkstyle-plugin:maven-plugin:3.0.1-SNAPSHOT in source directory windows-jdk11-m3.6.x_build\src\main\java
[Pipeline] // withMaven
[TASKS] Scanning folder 'f:\jenkins\jenkins-slave\workspace\heckstyle-plugin_MCHECKSTYLE-366@2' for files matching the pattern 'windows-jdk11-m3.6.x_build\src\main\java\**\*' - excludes: null
[TASKS] Found 20 files to scan for tasks
[TASKS] Found 5 open tasks.
Skipping warnings blame since pipelines do not have an SCM link.%n
[Pipeline] cleanWs
[WS-CLEANUP] Deleting project workspace...
[WS-CLEANUP] Deferred wipeout is used...
[WS-CLEANUP] done
[Pipeline] cleanWs
[WS-CLEANUP] Deleting project workspace...
[WS-CLEANUP] Deferred wipeout is used...
[withMaven] invokerPublisher - Archive invoker results for Maven artifact MavenArtifact{org.apache.maven.plugins:maven-checkstyle-plugin:maven-plugin:3.0.1-SNAPSHOT(version: 3.0.1-SNAPSHOT, snapshot:false) } generated by PluginInvocation{org.apache.maven.plugins:maven-invoker-plugin:3.1.0@integration-test  integration-test}: windows-jdk11-m3.6.x_build\target\invoker-reports\*.xml
[WS-CLEANUP] done
[Pipeline] }
[Pipeline] // stage
[Pipeline] }
[Pipeline] // ws
[Pipeline] }
[Pipeline] // node
[Pipeline] }
Failed in branch windows-jdk8-m3.2.x_build
[withMaven] Publishers: Generated Artifacts Publisher: 16 ms, Junit Publisher: 405 ms, Open Task Scanner Publisher: 191 ms, Invoker Publisher: 15707 ms
[Pipeline] // withMaven
[Pipeline] cleanWs
[WS-CLEANUP] Deleting project workspace...
[WS-CLEANUP] Deferred wipeout is used...
[WS-CLEANUP] done
[Pipeline] cleanWs
[WS-CLEANUP] Deleting project workspace...
[WS-CLEANUP] Deferred wipeout is used...
[WS-CLEANUP] done
[Pipeline] }
[Pipeline] // stage
[Pipeline] }
[Pipeline] // ws
[Pipeline] }
[Pipeline] // node
[Pipeline] }
Failed in branch windows-jdk11-m3.6.x_build
[Pipeline] // parallel
[Pipeline] stage
[Pipeline] { (Notifications)
[Pipeline] echo
Build result: FAILURE
[Pipeline] jiraIssueSelector
[Pipeline] emailext

Build failed in Jenkins: Maven TLP » maven-checkstyle-plugin » MCHECKSTYLE-366 #9

Posted by Apache Jenkins Server <je...@builds.apache.org>.
See https://builds.apache.org/job/maven-box/job/maven-checkstyle-plugin/job/MCHECKSTYLE-366/9/

Changes:

* Do not use old sun-checks.xml from old svn repo
* Do not use old sun-checks.xml from old svn repo
* Do not use old sun-checks.xml from old svn repo
* Do not use old sun-checks.xml from old svn repo
* Do not use old sun-checks.xml from old svn repo
* Do not use old sun-checks.xml from old svn repo
* Do not use old sun-checks.xml from old svn repo
* Do not use old sun-checks.xml from old svn repo
* Do not use old sun-checks.xml from old svn repo
* Do not use old sun-checks.xml from old svn repo
* Do not use old sun-checks.xml from old svn repo
* Do not use old sun-checks.xml from old svn repo
* Do not use old sun-checks.xml from old svn repo
* Do not use old sun-checks.xml from old svn repo

All tests passed

Build log:
[...truncated 5872 lines...]
[Pipeline] // withMaven
[Pipeline] cleanWs
[WS-CLEANUP] Deleting project workspace...
[WS-CLEANUP] Deferred wipeout is used...
[WS-CLEANUP] done
[Pipeline] cleanWs
[WS-CLEANUP] Deleting project workspace...
[WS-CLEANUP] Deferred wipeout is used...
[WS-CLEANUP] done
[Pipeline] }
[Pipeline] // stage
[Pipeline] }
[Pipeline] // ws
[Pipeline] }
[Pipeline] // node
[Pipeline] }
Failed in branch windows-jdk8-m3.5.x_build
[INFO] run post-build script verify.bsh
[INFO]           minimal-pom\pom.xml .............................. SUCCESS (12.6 s)
[INFO] Building: multi-modules\pom.xml
[INFO] run post-build script verify.groovy
[INFO]           MCHECKSTYLE-357-with-header-override\pom.xml ..... SUCCESS (17.3 s)
[INFO] Building: MCHECKSTYLE-365\pom.xml
[INFO]           multi-modules\pom.xml ............................ SUCCESS (10.8 s)
[INFO] Building: multi-modules-aggregate\pom.xml
[INFO] run post-build script verify.groovy
[INFO]           multi-modules-aggregate\pom.xml .................. FAILED (9.2 s)
[INFO]   The post-build script did not succeed. assert new File( basedir, 'target/checkstyle-cachefile' ).exists()
       |         |                                        |
       |         |                                        false
       |         f:\jenkins\jenkins-slave\workspace\heckstyle-plugin_MCHECKSTYLE-366@3\windows-jdk8-m3.2.x_build\target\it\multi-modules-aggregate
       f:\jenkins\jenkins-slave\workspace\heckstyle-plugin_MCHECKSTYLE-366@3\windows-jdk8-m3.2.x_build\target\it\multi-modules-aggregate\target\checkstyle-cachefile
[INFO] Building: multimoduleproject\pom.xml
[INFO]           multimoduleproject\pom.xml ....................... SUCCESS (7.4 s)
[INFO] 
[INFO] --- maven-checkstyle-plugin:3.0.0:check (checkstyle-check) @ maven-checkstyle-plugin ---
[INFO] run post-build script verify.groovy
[INFO]           MCHECKSTYLE-365\pom.xml .......................... SUCCESS (20.6 s)
[INFO] Building: MCHECKSTYLE-70-multi-sourcefolder\pom.xml
[INFO] There is 1 error reported by Checkstyle 6.18 with config/maven_checks.xml ruleset.
[INFO] Ignored 1 error, 0 violation remaining.
[INFO] 
[INFO] --- maven-invoker-plugin:3.1.0:verify (integration-test) @ maven-checkstyle-plugin ---
[INFO] -------------------------------------------------
[INFO] Build Summary:
[INFO]   Passed: 42, Failed: 1, Errors: 0, Skipped: 0
[INFO] -------------------------------------------------
[ERROR] The following builds failed:
[ERROR] *  multi-modules-aggregate\pom.xml
[INFO] -------------------------------------------------
[INFO] ------------------------------------------------------------------------
[INFO] BUILD FAILURE
[INFO] ------------------------------------------------------------------------
[INFO] Total time: 10:34 min
[INFO] Finished at: 2019-04-21T06:05:45-07:00
[INFO] Final Memory: 62M/1088M
[INFO] ------------------------------------------------------------------------
[INFO] [jenkins-event-spy] Generated F:\jenkins\jenkins-slave\workspace\heckstyle-plugin_MCHECKSTYLE-366@3@tmp\withMavenbf34704b\maven-spy-20190421-055510-1414040296426319807049.log
[ERROR] Failed to execute goal org.apache.maven.plugins:maven-invoker-plugin:3.1.0:verify (integration-test) on project maven-checkstyle-plugin: 1 build failed. See console output above for details. -> [Help 1]
org.apache.maven.lifecycle.LifecycleExecutionException: Failed to execute goal org.apache.maven.plugins:maven-invoker-plugin:3.1.0:verify (integration-test) on project maven-checkstyle-plugin: 1 build failed. See console output above for details.
	at org.apache.maven.lifecycle.internal.MojoExecutor.execute(MojoExecutor.java:212)
	at org.apache.maven.lifecycle.internal.MojoExecutor.execute(MojoExecutor.java:153)
	at org.apache.maven.lifecycle.internal.MojoExecutor.execute(MojoExecutor.java:145)
	at org.apache.maven.lifecycle.internal.LifecycleModuleBuilder.buildProject(LifecycleModuleBuilder.java:116)
	at org.apache.maven.lifecycle.internal.LifecycleModuleBuilder.buildProject(LifecycleModuleBuilder.java:80)
	at org.apache.maven.lifecycle.internal.builder.singlethreaded.SingleThreadedBuilder.build(SingleThreadedBuilder.java:51)
	at org.apache.maven.lifecycle.internal.LifecycleStarter.execute(LifecycleStarter.java:120)
	at org.apache.maven.DefaultMaven.doExecute(DefaultMaven.java:355)
	at org.apache.maven.DefaultMaven.execute(DefaultMaven.java:155)
	at org.apache.maven.cli.MavenCli.execute(MavenCli.java:584)
	at org.apache.maven.cli.MavenCli.doMain(MavenCli.java:216)
	at org.apache.maven.cli.MavenCli.main(MavenCli.java:160)
	at sun.reflect.NativeMethodAccessorImpl.invoke0(Native Method)
	at sun.reflect.NativeMethodAccessorImpl.invoke(NativeMethodAccessorImpl.java:62)
	at sun.reflect.DelegatingMethodAccessorImpl.invoke(DelegatingMethodAccessorImpl.java:43)
	at java.lang.reflect.Method.invoke(Method.java:498)
	at org.codehaus.plexus.classworlds.launcher.Launcher.launchEnhanced(Launcher.java:289)
	at org.codehaus.plexus.classworlds.launcher.Launcher.launch(Launcher.java:229)
	at org.codehaus.plexus.classworlds.launcher.Launcher.mainWithExitCode(Launcher.java:415)
	at org.codehaus.plexus.classworlds.launcher.Launcher.main(Launcher.java:356)
Caused by: org.apache.maven.plugin.MojoFailureException: 1 build failed. See console output above for details.
	at org.apache.maven.plugins.invoker.InvokerSession.handleFailures(InvokerSession.java:260)
	at org.apache.maven.plugins.invoker.VerifyMojo.execute(VerifyMojo.java:137)
	at org.apache.maven.plugin.DefaultBuildPluginManager.executeMojo(DefaultBuildPluginManager.java:132)
	at org.apache.maven.lifecycle.internal.MojoExecutor.execute(MojoExecutor.java:208)
	... 19 more
[ERROR] 
[ERROR] Re-run Maven using the -X switch to enable full debug logging.
[ERROR] 
[ERROR] For more information about the errors and possible solutions, please read the following articles:
[ERROR] [Help 1] http://cwiki.apache.org/confluence/display/MAVEN/MojoFailureException
Picked up JAVA_TOOL_OPTIONS: -Dmaven.ext.class.path="f:\jenkins\jenkins-slave\workspace\heckstyle-plugin_MCHECKSTYLE-366@3@tmp\withMavenbf34704b\pipeline-maven-spy.jar" -Dorg.jenkinsci.plugins.pipeline.maven.reportsFolder="f:\jenkins\jenkins-slave\workspace\heckstyle-plugin_MCHECKSTYLE-366@3@tmp\withMavenbf34704b" 
[Pipeline] }
[Pipeline] // dir
[Pipeline] }
[Fast Archiver] No prior successful build to compare, so performing full copy of artifacts
[withMaven] junitPublisher - Archive test results for Maven artifact org.apache.maven.plugins:maven-checkstyle-plugin:maven-plugin:3.0.1-SNAPSHOT generated by maven-surefire-plugin:test (default-test): windows-jdk8-m3.2.x_build\target\surefire-reports\*.xml
Recording test results
[withMaven] openTasksPublisher - Scan Tasks for Maven artifact org.apache.maven.plugins:maven-checkstyle-plugin:maven-plugin:3.0.1-SNAPSHOT in source directory windows-jdk8-m3.2.x_build\src\main\java
[TASKS] Scanning folder 'f:\jenkins\jenkins-slave\workspace\heckstyle-plugin_MCHECKSTYLE-366@3' for files matching the pattern 'windows-jdk8-m3.2.x_build\src\main\java\**\*' - excludes: null
[TASKS] Found 20 files to scan for tasks
[TASKS] Found 5 open tasks.
Skipping warnings blame since pipelines do not have an SCM link.%n
[withMaven] invokerPublisher - Archive invoker results for Maven artifact MavenArtifact{org.apache.maven.plugins:maven-checkstyle-plugin:maven-plugin:3.0.1-SNAPSHOT(version: 3.0.1-SNAPSHOT, snapshot:false) } generated by PluginInvocation{org.apache.maven.plugins:maven-invoker-plugin:3.1.0@integration-test  integration-test}: windows-jdk8-m3.2.x_build\target\invoker-reports\*.xml
[INFO] run post-build script verify.groovy
[INFO]           MCHECKSTYLE-70-multi-sourcefolder\pom.xml ........ SUCCESS (16.9 s)
[INFO] Building: minimal-pom\pom.xml
[withMaven] Publishers: Generated Artifacts Publisher: 17 ms, Junit Publisher: 394 ms, Open Task Scanner Publisher: 183 ms, Invoker Publisher: 21003 ms
[Pipeline] // withMaven
[Pipeline] cleanWs
[WS-CLEANUP] Deleting project workspace...
[WS-CLEANUP] Deferred wipeout is used...
[WS-CLEANUP] done
[Pipeline] cleanWs
[WS-CLEANUP] Deleting project workspace...
[WS-CLEANUP] Deferred wipeout is used...
[WS-CLEANUP] done
[Pipeline] }
[Pipeline] // stage
[Pipeline] }
[Pipeline] // ws
[Pipeline] }
[Pipeline] // node
[Pipeline] }
Failed in branch windows-jdk8-m3.2.x_build
[INFO] run post-build script verify.bsh
[INFO]           minimal-pom\pom.xml .............................. SUCCESS (18.5 s)
[INFO] Building: multi-modules\pom.xml
[INFO]           multi-modules\pom.xml ............................ SUCCESS (16.3 s)
[INFO] Building: multi-modules-aggregate\pom.xml
[INFO] run post-build script verify.groovy
[INFO]           multi-modules-aggregate\pom.xml .................. FAILED (10.3 s)
[INFO]   The post-build script did not succeed. assert new File( basedir, 'target/checkstyle-cachefile' ).exists()
       |         |                                        |
       |         |                                        false
       |         f:\jenkins\jenkins-slave\workspace\heckstyle-plugin_MCHECKSTYLE-366@2\windows-jdk11-m3.6.x_build\target\it\multi-modules-aggregate
       f:\jenkins\jenkins-slave\workspace\heckstyle-plugin_MCHECKSTYLE-366@2\windows-jdk11-m3.6.x_build\target\it\multi-modules-aggregate\target\checkstyle-cachefile
[INFO] Building: multimoduleproject\pom.xml
[INFO]           multimoduleproject\pom.xml ....................... SUCCESS (13.3 s)
[INFO] 
[INFO] --- maven-checkstyle-plugin:3.0.0:check (checkstyle-check) @ maven-checkstyle-plugin ---
[INFO] There is 1 error reported by Checkstyle 6.18 with config/maven_checks.xml ruleset.
[INFO] Ignored 1 error, 0 violation remaining.
[INFO] 
[INFO] --- maven-invoker-plugin:3.1.0:verify (integration-test) @ maven-checkstyle-plugin ---
[INFO] -------------------------------------------------
[INFO] Build Summary:
[INFO]   Passed: 42, Failed: 1, Errors: 0, Skipped: 0
[INFO] -------------------------------------------------
[ERROR] The following builds failed:
[ERROR] *  multi-modules-aggregate\pom.xml
[INFO] -------------------------------------------------
[INFO] ------------------------------------------------------------------------
[INFO] BUILD FAILURE
[INFO] ------------------------------------------------------------------------
[INFO] Total time:  11:53 min
[INFO] Finished at: 2019-04-21T13:07:01Z
[INFO] ------------------------------------------------------------------------
[INFO] [jenkins-event-spy] Generated F:\jenkins\jenkins-slave\workspace\heckstyle-plugin_MCHECKSTYLE-366@2@tmp\withMaven2b2afa8a\maven-spy-20190421-125507-37710966750120621806074.log
[ERROR] Failed to execute goal org.apache.maven.plugins:maven-invoker-plugin:3.1.0:verify (integration-test) on project maven-checkstyle-plugin: 1 build failed. See console output above for details. -> [Help 1]
org.apache.maven.lifecycle.LifecycleExecutionException: Failed to execute goal org.apache.maven.plugins:maven-invoker-plugin:3.1.0:verify (integration-test) on project maven-checkstyle-plugin: 1 build failed. See console output above for details.
    at org.apache.maven.lifecycle.internal.MojoExecutor.execute (MojoExecutor.java:215)
    at org.apache.maven.lifecycle.internal.MojoExecutor.execute (MojoExecutor.java:156)
    at org.apache.maven.lifecycle.internal.MojoExecutor.execute (MojoExecutor.java:148)
    at org.apache.maven.lifecycle.internal.LifecycleModuleBuilder.buildProject (LifecycleModuleBuilder.java:117)
    at org.apache.maven.lifecycle.internal.LifecycleModuleBuilder.buildProject (LifecycleModuleBuilder.java:81)
    at org.apache.maven.lifecycle.internal.builder.singlethreaded.SingleThreadedBuilder.build (SingleThreadedBuilder.java:56)
    at org.apache.maven.lifecycle.internal.LifecycleStarter.execute (LifecycleStarter.java:128)
    at org.apache.maven.DefaultMaven.doExecute (DefaultMaven.java:305)
    at org.apache.maven.DefaultMaven.doExecute (DefaultMaven.java:192)
    at org.apache.maven.DefaultMaven.execute (DefaultMaven.java:105)
    at org.apache.maven.cli.MavenCli.execute (MavenCli.java:956)
    at org.apache.maven.cli.MavenCli.doMain (MavenCli.java:288)
    at org.apache.maven.cli.MavenCli.main (MavenCli.java:192)
    at jdk.internal.reflect.NativeMethodAccessorImpl.invoke0 (Native Method)
    at jdk.internal.reflect.NativeMethodAccessorImpl.invoke (NativeMethodAccessorImpl.java:62)
    at jdk.internal.reflect.DelegatingMethodAccessorImpl.invoke (DelegatingMethodAccessorImpl.java:43)
    at java.lang.reflect.Method.invoke (Method.java:566)
    at org.codehaus.plexus.classworlds.launcher.Launcher.launchEnhanced (Launcher.java:289)
    at org.codehaus.plexus.classworlds.launcher.Launcher.launch (Launcher.java:229)
    at org.codehaus.plexus.classworlds.launcher.Launcher.mainWithExitCode (Launcher.java:415)
    at org.codehaus.plexus.classworlds.launcher.Launcher.main (Launcher.java:356)
Caused by: org.apache.maven.plugin.MojoFailureException: 1 build failed. See console output above for details.
    at org.apache.maven.plugins.invoker.InvokerSession.handleFailures (InvokerSession.java:260)
    at org.apache.maven.plugins.invoker.VerifyMojo.execute (VerifyMojo.java:137)
    at org.apache.maven.plugin.DefaultBuildPluginManager.executeMojo (DefaultBuildPluginManager.java:137)
    at org.apache.maven.lifecycle.internal.MojoExecutor.execute (MojoExecutor.java:210)
    at org.apache.maven.lifecycle.internal.MojoExecutor.execute (MojoExecutor.java:156)
    at org.apache.maven.lifecycle.internal.MojoExecutor.execute (MojoExecutor.java:148)
    at org.apache.maven.lifecycle.internal.LifecycleModuleBuilder.buildProject (LifecycleModuleBuilder.java:117)
    at org.apache.maven.lifecycle.internal.LifecycleModuleBuilder.buildProject (LifecycleModuleBuilder.java:81)
    at org.apache.maven.lifecycle.internal.builder.singlethreaded.SingleThreadedBuilder.build (SingleThreadedBuilder.java:56)
    at org.apache.maven.lifecycle.internal.LifecycleStarter.execute (LifecycleStarter.java:128)
    at org.apache.maven.DefaultMaven.doExecute (DefaultMaven.java:305)
    at org.apache.maven.DefaultMaven.doExecute (DefaultMaven.java:192)
    at org.apache.maven.DefaultMaven.execute (DefaultMaven.java:105)
    at org.apache.maven.cli.MavenCli.execute (MavenCli.java:956)
    at org.apache.maven.cli.MavenCli.doMain (MavenCli.java:288)
    at org.apache.maven.cli.MavenCli.main (MavenCli.java:192)
    at jdk.internal.reflect.NativeMethodAccessorImpl.invoke0 (Native Method)
    at jdk.internal.reflect.NativeMethodAccessorImpl.invoke (NativeMethodAccessorImpl.java:62)
    at jdk.internal.reflect.DelegatingMethodAccessorImpl.invoke (DelegatingMethodAccessorImpl.java:43)
    at java.lang.reflect.Method.invoke (Method.java:566)
    at org.codehaus.plexus.classworlds.launcher.Launcher.launchEnhanced (Launcher.java:289)
    at org.codehaus.plexus.classworlds.launcher.Launcher.launch (Launcher.java:229)
    at org.codehaus.plexus.classworlds.launcher.Launcher.mainWithExitCode (Launcher.java:415)
    at org.codehaus.plexus.classworlds.launcher.Launcher.main (Launcher.java:356)
[ERROR] 
[ERROR] Re-run Maven using the -X switch to enable full debug logging.
[ERROR] 
[ERROR] For more information about the errors and possible solutions, please read the following articles:
[ERROR] [Help 1] http://cwiki.apache.org/confluence/display/MAVEN/MojoFailureException
[Pipeline] }
[Pipeline] // dir
[Pipeline] }
[Fast Archiver] No prior successful build to compare, so performing full copy of artifacts
[withMaven] junitPublisher - Archive test results for Maven artifact org.apache.maven.plugins:maven-checkstyle-plugin:maven-plugin:3.0.1-SNAPSHOT generated by maven-surefire-plugin:test (default-test): windows-jdk11-m3.6.x_build\target\surefire-reports\*.xml
Recording test results
[withMaven] openTasksPublisher - Scan Tasks for Maven artifact org.apache.maven.plugins:maven-checkstyle-plugin:maven-plugin:3.0.1-SNAPSHOT in source directory windows-jdk11-m3.6.x_build\src\main\java
[TASKS] Scanning folder 'f:\jenkins\jenkins-slave\workspace\heckstyle-plugin_MCHECKSTYLE-366@2' for files matching the pattern 'windows-jdk11-m3.6.x_build\src\main\java\**\*' - excludes: null
[TASKS] Found 20 files to scan for tasks
[TASKS] Found 5 open tasks.
Skipping warnings blame since pipelines do not have an SCM link.%n
[withMaven] invokerPublisher - Archive invoker results for Maven artifact MavenArtifact{org.apache.maven.plugins:maven-checkstyle-plugin:maven-plugin:3.0.1-SNAPSHOT(version: 3.0.1-SNAPSHOT, snapshot:false) } generated by PluginInvocation{org.apache.maven.plugins:maven-invoker-plugin:3.1.0@integration-test  integration-test}: windows-jdk11-m3.6.x_build\target\invoker-reports\*.xml
[withMaven] Publishers: Generated Artifacts Publisher: 24 ms, Junit Publisher: 451 ms, Open Task Scanner Publisher: 219 ms, Dependencies Fingerprint Publisher: 1 ms, Invoker Publisher: 16069 ms
[Pipeline] // withMaven
[Pipeline] cleanWs
[WS-CLEANUP] Deleting project workspace...
[WS-CLEANUP] Deferred wipeout is used...
[WS-CLEANUP] done
[Pipeline] cleanWs
[WS-CLEANUP] Deleting project workspace...
[WS-CLEANUP] Deferred wipeout is used...
[WS-CLEANUP] done
[Pipeline] }
[Pipeline] // stage
[Pipeline] }
[Pipeline] // ws
[Pipeline] }
[Pipeline] // node
[Pipeline] }
Failed in branch windows-jdk11-m3.6.x_build
[Pipeline] // parallel
[Pipeline] stage
[Pipeline] { (Notifications)
[Pipeline] echo
Build result: FAILURE
[Pipeline] jiraIssueSelector
[Pipeline] emailext

Build failed in Jenkins: Maven TLP » maven-checkstyle-plugin » MCHECKSTYLE-366 #8

Posted by Apache Jenkins Server <je...@builds.apache.org>.
See https://builds.apache.org/job/maven-box/job/maven-checkstyle-plugin/job/MCHECKSTYLE-366/8/

Changes:

* drop nb file
* drop nb file
* drop nb file
* drop nb file
* drop nb file
* drop nb file
* drop nb file
* drop nb file
* drop nb file
* drop nb file
* drop nb file
* drop nb file
* drop nb file

All tests passed

Build log:
[...truncated 5908 lines...]
    at org.apache.maven.lifecycle.internal.MojoExecutor.execute (MojoExecutor.java:146)
    at org.apache.maven.lifecycle.internal.LifecycleModuleBuilder.buildProject (LifecycleModuleBuilder.java:117)
    at org.apache.maven.lifecycle.internal.LifecycleModuleBuilder.buildProject (LifecycleModuleBuilder.java:81)
    at org.apache.maven.lifecycle.internal.builder.singlethreaded.SingleThreadedBuilder.build (SingleThreadedBuilder.java:51)
    at org.apache.maven.lifecycle.internal.LifecycleStarter.execute (LifecycleStarter.java:128)
    at org.apache.maven.DefaultMaven.doExecute (DefaultMaven.java:309)
    at org.apache.maven.DefaultMaven.doExecute (DefaultMaven.java:194)
    at org.apache.maven.DefaultMaven.execute (DefaultMaven.java:107)
    at org.apache.maven.cli.MavenCli.execute (MavenCli.java:955)
    at org.apache.maven.cli.MavenCli.doMain (MavenCli.java:290)
    at org.apache.maven.cli.MavenCli.main (MavenCli.java:194)
    at sun.reflect.NativeMethodAccessorImpl.invoke0 (Native Method)
    at sun.reflect.NativeMethodAccessorImpl.invoke (NativeMethodAccessorImpl.java:62)
    at sun.reflect.DelegatingMethodAccessorImpl.invoke (DelegatingMethodAccessorImpl.java:43)
    at java.lang.reflect.Method.invoke (Method.java:498)
    at org.codehaus.plexus.classworlds.launcher.Launcher.launchEnhanced (Launcher.java:289)
    at org.codehaus.plexus.classworlds.launcher.Launcher.launch (Launcher.java:229)
    at org.codehaus.plexus.classworlds.launcher.Launcher.mainWithExitCode (Launcher.java:415)
    at org.codehaus.plexus.classworlds.launcher.Launcher.main (Launcher.java:356)
[ERROR] 
[ERROR] Re-run Maven using the -X switch to enable full debug logging.
[ERROR] 
[ERROR] For more information about the errors and possible solutions, please read the following articles:
[ERROR] [Help 1] http://cwiki.apache.org/confluence/display/MAVEN/MojoFailureException
Picked up JAVA_TOOL_OPTIONS: -Dmaven.ext.class.path="f:\jenkins\jenkins-slave\workspace\heckstyle-plugin_MCHECKSTYLE-366@3@tmp\withMavenbb77c017\pipeline-maven-spy.jar" -Dorg.jenkinsci.plugins.pipeline.maven.reportsFolder="f:\jenkins\jenkins-slave\workspace\heckstyle-plugin_MCHECKSTYLE-366@3@tmp\withMavenbb77c017" 
[Pipeline] }
[INFO] run post-build script verify.bsh
[INFO]           minimal-pom/pom.xml .............................. SUCCESS (16.5 s)
[INFO] Building: MCHECKSTYLE-268/pom.xml
[Pipeline] // dir
[Pipeline] }
[Fast Archiver] No prior successful build to compare, so performing full copy of artifacts
[withMaven] junitPublisher - Archive test results for Maven artifact org.apache.maven.plugins:maven-checkstyle-plugin:maven-plugin:3.0.1-SNAPSHOT generated by maven-surefire-plugin:test (default-test): windows-jdk8-m3.5.x_build\target\surefire-reports\*.xml
Recording test results
[withMaven] openTasksPublisher - Scan Tasks for Maven artifact org.apache.maven.plugins:maven-checkstyle-plugin:maven-plugin:3.0.1-SNAPSHOT in source directory windows-jdk8-m3.5.x_build\src\main\java
[TASKS] Scanning folder 'f:\jenkins\jenkins-slave\workspace\heckstyle-plugin_MCHECKSTYLE-366@3' for files matching the pattern 'windows-jdk8-m3.5.x_build\src\main\java\**\*' - excludes: null
[TASKS] Found 20 files to scan for tasks
[TASKS] Found 5 open tasks.
Skipping warnings blame since pipelines do not have an SCM link.%n
[withMaven] invokerPublisher - Archive invoker results for Maven artifact MavenArtifact{org.apache.maven.plugins:maven-checkstyle-plugin:maven-plugin:3.0.1-SNAPSHOT(version: 3.0.1-SNAPSHOT, snapshot:false) } generated by PluginInvocation{org.apache.maven.plugins:maven-invoker-plugin:3.1.0@integration-test  integration-test}: windows-jdk8-m3.5.x_build\target\invoker-reports\*.xml
[INFO] run post-build script verify.bsh
[INFO]           minimal-pom/pom.xml .............................. SUCCESS (17.6 s)
[INFO] Building: MCHECKSTYLE-268/pom.xml
[withMaven] Publishers: Generated Artifacts Publisher: 16 ms, Junit Publisher: 391 ms, Open Task Scanner Publisher: 182 ms, Dependencies Fingerprint Publisher: 1 ms, Invoker Publisher: 11710 ms
[Pipeline] // withMaven
[Pipeline] cleanWs
[WS-CLEANUP] Deleting project workspace...
[WS-CLEANUP] Deferred wipeout is used...
[INFO] run post-build script verify.groovy
[INFO]           MCHECKSTYLE-268/pom.xml .......................... SUCCESS (12.9 s)
[INFO] Building: MCHECKSTYLE-129/pom.xml
[WS-CLEANUP] done
[Pipeline] cleanWs
[WS-CLEANUP] Deleting project workspace...
[WS-CLEANUP] Deferred wipeout is used...
[WS-CLEANUP] done
[Pipeline] }
[Pipeline] // stage
[Pipeline] }
[Pipeline] // ws
[Pipeline] }
[Pipeline] // node
[Pipeline] }
Failed in branch windows-jdk8-m3.5.x_build
[INFO] run post-build script verify.groovy
[INFO]           MCHECKSTYLE-268/pom.xml .......................... SUCCESS (13.5 s)
[INFO] Building: MCHECKSTYLE-129/pom.xml
[INFO]           MCHECKSTYLE-129/pom.xml .......................... FAILED (13.1 s)
[INFO]   The build exited with code 1. See /home/jenkins/jenkins-slave/workspace/heckstyle-plugin_MCHECKSTYLE-366@3/linux-jdk8-m3.2.x_build/target/it/MCHECKSTYLE-129/build.log for details.
[INFO] 
[INFO] --- maven-checkstyle-plugin:3.0.0:check (checkstyle-check) @ maven-checkstyle-plugin ---
[INFO] There is 1 error reported by Checkstyle 6.18 with config/maven_checks.xml ruleset.
[INFO] Ignored 1 error, 0 violation remaining.
[INFO] 
[INFO] --- maven-invoker-plugin:3.1.0:verify (integration-test) @ maven-checkstyle-plugin ---
[INFO] -------------------------------------------------
[INFO] Build Summary:
[INFO]   Passed: 41, Failed: 2, Errors: 0, Skipped: 0
[INFO] -------------------------------------------------
[ERROR] The following builds failed:
[ERROR] *  MCHECKSTYLE-129/pom.xml
[ERROR] *  multi-modules-aggregate/pom.xml
[INFO] -------------------------------------------------
[INFO] ------------------------------------------------------------------------
[INFO] BUILD FAILURE
[INFO] ------------------------------------------------------------------------
[INFO] Total time: 09:38 min
[INFO] Finished at: 2019-04-21T12:48:28+00:00
[INFO] Final Memory: 69M/1506M
[INFO] ------------------------------------------------------------------------
[INFO] [jenkins-event-spy] Generated /home/jenkins/jenkins-slave/workspace/heckstyle-plugin_MCHECKSTYLE-366@3@tmp/withMaven6787bfb2/maven-spy-20190421-123849-6714891697287856305145.log
[ERROR] Failed to execute goal org.apache.maven.plugins:maven-invoker-plugin:3.1.0:verify (integration-test) on project maven-checkstyle-plugin: 2 builds failed. See console output above for details. -> [Help 1]
org.apache.maven.lifecycle.LifecycleExecutionException: Failed to execute goal org.apache.maven.plugins:maven-invoker-plugin:3.1.0:verify (integration-test) on project maven-checkstyle-plugin: 2 builds failed. See console output above for details.
	at org.apache.maven.lifecycle.internal.MojoExecutor.execute(MojoExecutor.java:212)
	at org.apache.maven.lifecycle.internal.MojoExecutor.execute(MojoExecutor.java:153)
	at org.apache.maven.lifecycle.internal.MojoExecutor.execute(MojoExecutor.java:145)
	at org.apache.maven.lifecycle.internal.LifecycleModuleBuilder.buildProject(LifecycleModuleBuilder.java:116)
	at org.apache.maven.lifecycle.internal.LifecycleModuleBuilder.buildProject(LifecycleModuleBuilder.java:80)
	at org.apache.maven.lifecycle.internal.builder.singlethreaded.SingleThreadedBuilder.build(SingleThreadedBuilder.java:51)
	at org.apache.maven.lifecycle.internal.LifecycleStarter.execute(LifecycleStarter.java:120)
	at org.apache.maven.DefaultMaven.doExecute(DefaultMaven.java:355)
	at org.apache.maven.DefaultMaven.execute(DefaultMaven.java:155)
	at org.apache.maven.cli.MavenCli.execute(MavenCli.java:584)
	at org.apache.maven.cli.MavenCli.doMain(MavenCli.java:216)
	at org.apache.maven.cli.MavenCli.main(MavenCli.java:160)
	at sun.reflect.NativeMethodAccessorImpl.invoke0(Native Method)
	at sun.reflect.NativeMethodAccessorImpl.invoke(NativeMethodAccessorImpl.java:62)
	at sun.reflect.DelegatingMethodAccessorImpl.invoke(DelegatingMethodAccessorImpl.java:43)
	at java.lang.reflect.Method.invoke(Method.java:498)
	at org.codehaus.plexus.classworlds.launcher.Launcher.launchEnhanced(Launcher.java:289)
	at org.codehaus.plexus.classworlds.launcher.Launcher.launch(Launcher.java:229)
	at org.codehaus.plexus.classworlds.launcher.Launcher.mainWithExitCode(Launcher.java:415)
	at org.codehaus.plexus.classworlds.launcher.Launcher.main(Launcher.java:356)
Caused by: org.apache.maven.plugin.MojoFailureException: 2 builds failed. See console output above for details.
	at org.apache.maven.plugins.invoker.InvokerSession.handleFailures(InvokerSession.java:260)
	at org.apache.maven.plugins.invoker.VerifyMojo.execute(VerifyMojo.java:137)
	at org.apache.maven.plugin.DefaultBuildPluginManager.executeMojo(DefaultBuildPluginManager.java:132)
	at org.apache.maven.lifecycle.internal.MojoExecutor.execute(MojoExecutor.java:208)
	... 19 more
[ERROR] 
[ERROR] Re-run Maven using the -X switch to enable full debug logging.
[ERROR] 
[ERROR] For more information about the errors and possible solutions, please read the following articles:
[ERROR] [Help 1] http://cwiki.apache.org/confluence/display/MAVEN/MojoFailureException
[Pipeline] }
[Pipeline] // dir
[Pipeline] }
[Fast Archiver] No prior successful build to compare, so performing full copy of artifacts
[withMaven] junitPublisher - Archive test results for Maven artifact org.apache.maven.plugins:maven-checkstyle-plugin:maven-plugin:3.0.1-SNAPSHOT generated by maven-surefire-plugin:test (default-test): linux-jdk8-m3.2.x_build/target/surefire-reports/*.xml
Recording test results
[withMaven] openTasksPublisher - Scan Tasks for Maven artifact org.apache.maven.plugins:maven-checkstyle-plugin:maven-plugin:3.0.1-SNAPSHOT in source directory linux-jdk8-m3.2.x_build/src/main/java
[TASKS] Scanning folder '/home/jenkins/jenkins-slave/workspace/heckstyle-plugin_MCHECKSTYLE-366@3' for files matching the pattern 'linux-jdk8-m3.2.x_build/src/main/java/**/*' - excludes: null
[TASKS] Found 20 files to scan for tasks
[TASKS] Found 5 open tasks.
Skipping warnings blame since pipelines do not have an SCM link.%n
[withMaven] invokerPublisher - Archive invoker results for Maven artifact MavenArtifact{org.apache.maven.plugins:maven-checkstyle-plugin:maven-plugin:3.0.1-SNAPSHOT(version: 3.0.1-SNAPSHOT, snapshot:false) } generated by PluginInvocation{org.apache.maven.plugins:maven-invoker-plugin:3.1.0@integration-test  integration-test}: linux-jdk8-m3.2.x_build/target/invoker-reports/*.xml
[INFO]           MCHECKSTYLE-129/pom.xml .......................... FAILED (11.6 s)
[INFO]   The build exited with code 1. See /home/jenkins/jenkins-slave/workspace/heckstyle-plugin_MCHECKSTYLE-366@2@2/linux-jdk8-m3.3.x_build/target/it/MCHECKSTYLE-129/build.log for details.
[INFO] 
[INFO] --- maven-checkstyle-plugin:3.0.0:check (checkstyle-check) @ maven-checkstyle-plugin ---
[INFO] There is 1 error reported by Checkstyle 6.18 with config/maven_checks.xml ruleset.
[INFO] Ignored 1 error, 0 violation remaining.
[INFO] 
[INFO] --- maven-invoker-plugin:3.1.0:verify (integration-test) @ maven-checkstyle-plugin ---
[INFO] -------------------------------------------------
[INFO] Build Summary:
[INFO]   Passed: 41, Failed: 2, Errors: 0, Skipped: 0
[INFO] -------------------------------------------------
[ERROR] The following builds failed:
[ERROR] *  MCHECKSTYLE-129/pom.xml
[ERROR] *  multi-modules-aggregate/pom.xml
[INFO] -------------------------------------------------
[INFO] ------------------------------------------------------------------------
[INFO] BUILD FAILURE
[INFO] ------------------------------------------------------------------------
[INFO] Total time: 09:46 min
[INFO] Finished at: 2019-04-21T12:48:37+00:00
[INFO] Final Memory: 70M/1498M
[INFO] ------------------------------------------------------------------------
[INFO] [jenkins-event-spy] Generated /home/jenkins/jenkins-slave/workspace/heckstyle-plugin_MCHECKSTYLE-366@2@2@tmp/withMaven75dcead9/maven-spy-20190421-123850-6448899303329884342956.log
[ERROR] Failed to execute goal org.apache.maven.plugins:maven-invoker-plugin:3.1.0:verify (integration-test) on project maven-checkstyle-plugin: 2 builds failed. See console output above for details. -> [Help 1]
org.apache.maven.lifecycle.LifecycleExecutionException: Failed to execute goal org.apache.maven.plugins:maven-invoker-plugin:3.1.0:verify (integration-test) on project maven-checkstyle-plugin: 2 builds failed. See console output above for details.
	at org.apache.maven.lifecycle.internal.MojoExecutor.execute(MojoExecutor.java:212)
	at org.apache.maven.lifecycle.internal.MojoExecutor.execute(MojoExecutor.java:153)
	at org.apache.maven.lifecycle.internal.MojoExecutor.execute(MojoExecutor.java:145)
	at org.apache.maven.lifecycle.internal.LifecycleModuleBuilder.buildProject(LifecycleModuleBuilder.java:116)
	at org.apache.maven.lifecycle.internal.LifecycleModuleBuilder.buildProject(LifecycleModuleBuilder.java:80)
	at org.apache.maven.lifecycle.internal.builder.singlethreaded.SingleThreadedBuilder.build(SingleThreadedBuilder.java:51)
	at org.apache.maven.lifecycle.internal.LifecycleStarter.execute(LifecycleStarter.java:128)
	at org.apache.maven.DefaultMaven.doExecute(DefaultMaven.java:307)
	at org.apache.maven.DefaultMaven.doExecute(DefaultMaven.java:193)
	at org.apache.maven.DefaultMaven.execute(DefaultMaven.java:106)
	at org.apache.maven.cli.MavenCli.execute(MavenCli.java:863)
	at org.apache.maven.cli.MavenCli.doMain(MavenCli.java:288)
	at org.apache.maven.cli.MavenCli.main(MavenCli.java:199)
	at sun.reflect.NativeMethodAccessorImpl.invoke0(Native Method)
	at sun.reflect.NativeMethodAccessorImpl.invoke(NativeMethodAccessorImpl.java:62)
	at sun.reflect.DelegatingMethodAccessorImpl.invoke(DelegatingMethodAccessorImpl.java:43)
	at java.lang.reflect.Method.invoke(Method.java:498)
	at org.codehaus.plexus.classworlds.launcher.Launcher.launchEnhanced(Launcher.java:289)
	at org.codehaus.plexus.classworlds.launcher.Launcher.launch(Launcher.java:229)
	at org.codehaus.plexus.classworlds.launcher.Launcher.mainWithExitCode(Launcher.java:415)
	at org.codehaus.plexus.classworlds.launcher.Launcher.main(Launcher.java:356)
Caused by: org.apache.maven.plugin.MojoFailureException: 2 builds failed. See console output above for details.
	at org.apache.maven.plugins.invoker.InvokerSession.handleFailures(InvokerSession.java:260)
	at org.apache.maven.plugins.invoker.VerifyMojo.execute(VerifyMojo.java:137)
	at org.apache.maven.plugin.DefaultBuildPluginManager.executeMojo(DefaultBuildPluginManager.java:134)
	at org.apache.maven.lifecycle.internal.MojoExecutor.execute(MojoExecutor.java:207)
	... 20 more
[ERROR] 
[ERROR] Re-run Maven using the -X switch to enable full debug logging.
[ERROR] 
[ERROR] For more information about the errors and possible solutions, please read the following articles:
[ERROR] [Help 1] http://cwiki.apache.org/confluence/display/MAVEN/MojoFailureException
[Pipeline] }
[Pipeline] // dir
[Pipeline] }
[Fast Archiver] No prior successful build to compare, so performing full copy of artifacts
[withMaven] junitPublisher - Archive test results for Maven artifact org.apache.maven.plugins:maven-checkstyle-plugin:maven-plugin:3.0.1-SNAPSHOT generated by maven-surefire-plugin:test (default-test): linux-jdk8-m3.3.x_build/target/surefire-reports/*.xml
Recording test results
[withMaven] openTasksPublisher - Scan Tasks for Maven artifact org.apache.maven.plugins:maven-checkstyle-plugin:maven-plugin:3.0.1-SNAPSHOT in source directory linux-jdk8-m3.3.x_build/src/main/java
[TASKS] Scanning folder '/home/jenkins/jenkins-slave/workspace/heckstyle-plugin_MCHECKSTYLE-366@2@2' for files matching the pattern 'linux-jdk8-m3.3.x_build/src/main/java/**/*' - excludes: null
[TASKS] Found 20 files to scan for tasks
[TASKS] Found 5 open tasks.
Skipping warnings blame since pipelines do not have an SCM link.%n
[withMaven] invokerPublisher - Archive invoker results for Maven artifact MavenArtifact{org.apache.maven.plugins:maven-checkstyle-plugin:maven-plugin:3.0.1-SNAPSHOT(version: 3.0.1-SNAPSHOT, snapshot:false) } generated by PluginInvocation{org.apache.maven.plugins:maven-invoker-plugin:3.1.0@integration-test  integration-test}: linux-jdk8-m3.3.x_build/target/invoker-reports/*.xml
[withMaven] Publishers: Generated Artifacts Publisher: 16 ms, Junit Publisher: 398 ms, Open Task Scanner Publisher: 200 ms, Invoker Publisher: 14156 ms, Pipeline Graph Publisher: 1 ms
[Pipeline] // withMaven
[Pipeline] cleanWs
[WS-CLEANUP] Deleting project workspace...
[WS-CLEANUP] Deferred wipeout is used...
[WS-CLEANUP] done
[Pipeline] cleanWs
[WS-CLEANUP] Deleting project workspace...
[WS-CLEANUP] Deferred wipeout is used...
[WS-CLEANUP] done
[Pipeline] }
[Pipeline] // stage
[Pipeline] }
[Pipeline] // ws
[Pipeline] }
[Pipeline] // node
[Pipeline] }
Failed in branch linux-jdk8-m3.2.x_build
[withMaven] Publishers: Generated Artifacts Publisher: 16 ms, Junit Publisher: 390 ms, Open Task Scanner Publisher: 164 ms, Invoker Publisher: 9192 ms, Pipeline Graph Publisher: 1 ms
[Pipeline] // withMaven
[Pipeline] cleanWs
[WS-CLEANUP] Deleting project workspace...
[WS-CLEANUP] Deferred wipeout is used...
[WS-CLEANUP] done
[Pipeline] cleanWs
[WS-CLEANUP] Deleting project workspace...
[WS-CLEANUP] Deferred wipeout is used...
[WS-CLEANUP] done
[Pipeline] }
[Pipeline] // stage
[Pipeline] }
[Pipeline] // ws
[Pipeline] }
[Pipeline] // node
[Pipeline] }
Failed in branch linux-jdk8-m3.3.x_build
[Pipeline] // parallel
[Pipeline] stage
[Pipeline] { (Notifications)
[Pipeline] echo
Build result: FAILURE
[Pipeline] jiraIssueSelector
[Pipeline] emailext

Build failed in Jenkins: Maven TLP » maven-checkstyle-plugin » MCHECKSTYLE-366 #7

Posted by Apache Jenkins Server <je...@builds.apache.org>.
See https://builds.apache.org/job/maven-box/job/maven-checkstyle-plugin/job/MCHECKSTYLE-366/7/

Changes:

* [MNG-6573] Use Maven 3.6.0 as default
* H39 has weird issues, exclude it for now
* Fix no access to currentBuild.rawBuild
* Fix its
* Fix its
* Fix its
* Fix its
* Fix its
* Fix its
* Fix its
* Fix its
* Fix its
* Fix its
* Fix its
* Fix its
* Fix its
* Fix its

No tests ran.

Build log:
[...truncated 2469 lines...]
[INFO] ------------------------------------------------------------------------
[INFO] BUILD FAILURE
[INFO] ------------------------------------------------------------------------
[INFO] Total time:  16.060 s
[INFO] Finished at: 2019-04-21T12:38:50Z
[INFO] ------------------------------------------------------------------------
[INFO] [jenkins-event-spy] Generated F:\jenkins\jenkins-slave\workspace\heckstyle-plugin_MCHECKSTYLE-366@2@tmp\withMaven1769a829\maven-spy-20190421-123833-47312132010790806270664.log
[ERROR] Failed to execute goal org.apache.rat:apache-rat-plugin:0.12:check (rat-check) on project maven-checkstyle-plugin: Too many files with unapproved license: 1 See RAT report in: f:\jenkins\jenkins-slave\workspace\heckstyle-plugin_MCHECKSTYLE-366@2\windows-jdk12-m3.6.x_build\target\rat.txt -> [Help 1]
org.apache.maven.lifecycle.LifecycleExecutionException: Failed to execute goal org.apache.rat:apache-rat-plugin:0.12:check (rat-check) on project maven-checkstyle-plugin: Too many files with unapproved license: 1 See RAT report in: f:\jenkins\jenkins-slave\workspace\heckstyle-plugin_MCHECKSTYLE-366@2\windows-jdk12-m3.6.x_build\target\rat.txt
    at org.apache.maven.lifecycle.internal.MojoExecutor.execute (MojoExecutor.java:215)
    at org.apache.maven.lifecycle.internal.MojoExecutor.execute (MojoExecutor.java:156)
    at org.apache.maven.lifecycle.internal.MojoExecutor.execute (MojoExecutor.java:148)
    at org.apache.maven.lifecycle.internal.LifecycleModuleBuilder.buildProject (LifecycleModuleBuilder.java:117)
    at org.apache.maven.lifecycle.internal.LifecycleModuleBuilder.buildProject (LifecycleModuleBuilder.java:81)
    at org.apache.maven.lifecycle.internal.builder.singlethreaded.SingleThreadedBuilder.build (SingleThreadedBuilder.java:56)
    at org.apache.maven.lifecycle.internal.LifecycleStarter.execute (LifecycleStarter.java:128)
    at org.apache.maven.DefaultMaven.doExecute (DefaultMaven.java:305)
    at org.apache.maven.DefaultMaven.doExecute (DefaultMaven.java:192)
    at org.apache.maven.DefaultMaven.execute (DefaultMaven.java:105)
    at org.apache.maven.cli.MavenCli.execute (MavenCli.java:956)
    at org.apache.maven.cli.MavenCli.doMain (MavenCli.java:288)
    at org.apache.maven.cli.MavenCli.main (MavenCli.java:192)
    at jdk.internal.reflect.NativeMethodAccessorImpl.invoke0 (Native Method)
    at jdk.internal.reflect.NativeMethodAccessorImpl.invoke (NativeMethodAccessorImpl.java:62)
    at jdk.internal.reflect.DelegatingMethodAccessorImpl.invoke (DelegatingMethodAccessorImpl.java:43)
    at java.lang.reflect.Method.invoke (Method.java:567)
    at org.codehaus.plexus.classworlds.launcher.Launcher.launchEnhanced (Launcher.java:289)
    at org.codehaus.plexus.classworlds.launcher.Launcher.launch (Launcher.java:229)
    at org.codehaus.plexus.classworlds.launcher.Launcher.mainWithExitCode (Launcher.java:415)
    at org.codehaus.plexus.classworlds.launcher.Launcher.main (Launcher.java:356)
Caused by: org.apache.rat.mp.RatCheckException: Too many files with unapproved license: 1 See RAT report in: f:\jenkins\jenkins-slave\workspace\heckstyle-plugin_MCHECKSTYLE-366@2\windows-jdk12-m3.6.x_build\target\rat.txt
    at org.apache.rat.mp.RatCheckMojo.check (RatCheckMojo.java:183)
    at org.apache.rat.mp.RatCheckMojo.execute (RatCheckMojo.java:156)
    at org.apache.maven.plugin.DefaultBuildPluginManager.executeMojo (DefaultBuildPluginManager.java:137)
    at org.apache.maven.lifecycle.internal.MojoExecutor.execute (MojoExecutor.java:210)
    at org.apache.maven.lifecycle.internal.MojoExecutor.execute (MojoExecutor.java:156)
    at org.apache.maven.lifecycle.internal.MojoExecutor.execute (MojoExecutor.java:148)
    at org.apache.maven.lifecycle.internal.LifecycleModuleBuilder.buildProject (LifecycleModuleBuilder.java:117)
    at org.apache.maven.lifecycle.internal.LifecycleModuleBuilder.buildProject (LifecycleModuleBuilder.java:81)
    at org.apache.maven.lifecycle.internal.builder.singlethreaded.SingleThreadedBuilder.build (SingleThreadedBuilder.java:56)
    at org.apache.maven.lifecycle.internal.LifecycleStarter.execute (LifecycleStarter.java:128)
    at org.apache.maven.DefaultMaven.doExecute (DefaultMaven.java:305)
    at org.apache.maven.DefaultMaven.doExecute (DefaultMaven.java:192)
    at org.apache.maven.DefaultMaven.execute (DefaultMaven.java:105)
    at org.apache.maven.cli.MavenCli.execute (MavenCli.java:956)
    at org.apache.maven.cli.MavenCli.doMain (MavenCli.java:288)
    at org.apache.maven.cli.MavenCli.main (MavenCli.java:192)
    at jdk.internal.reflect.NativeMethodAccessorImpl.invoke0 (Native Method)
    at jdk.internal.reflect.NativeMethodAccessorImpl.invoke (NativeMethodAccessorImpl.java:62)
    at jdk.internal.reflect.DelegatingMethodAccessorImpl.invoke (DelegatingMethodAccessorImpl.java:43)
    at java.lang.reflect.Method.invoke (Method.java:567)
    at org.codehaus.plexus.classworlds.launcher.Launcher.launchEnhanced (Launcher.java:289)
    at org.codehaus.plexus.classworlds.launcher.Launcher.launch (Launcher.java:229)
    at org.codehaus.plexus.classworlds.launcher.Launcher.mainWithExitCode (Launcher.java:415)
    at org.codehaus.plexus.classworlds.launcher.Launcher.main (Launcher.java:356)
[ERROR] 
[ERROR] Re-run Maven using the -X switch to enable full debug logging.
[ERROR] 
[ERROR] For more information about the errors and possible solutions, please read the following articles:
[ERROR] [Help 1] http://cwiki.apache.org/confluence/display/MAVEN/MojoFailureException
[INFO] ------------------------------------------------------------------------
[INFO] BUILD FAILURE
[INFO] ------------------------------------------------------------------------
[INFO] Total time: 16.548 s
[INFO] Finished at: 2019-04-21T05:38:51-07:00
[INFO] Final Memory: 23M/538M
[INFO] ------------------------------------------------------------------------
[INFO] [jenkins-event-spy] Generated F:\jenkins\jenkins-slave\workspace\heckstyle-plugin_MCHECKSTYLE-366@2@2@tmp\withMaven30b32d9b\maven-spy-20190421-053833-5192165033100101985053.log
[ERROR] Failed to execute goal org.apache.rat:apache-rat-plugin:0.12:check (rat-check) on project maven-checkstyle-plugin: Too many files with unapproved license: 1 See RAT report in: f:\jenkins\jenkins-slave\workspace\heckstyle-plugin_MCHECKSTYLE-366@2@2\windows-jdk8-m3.5.x_build\target\rat.txt -> [Help 1]
org.apache.maven.lifecycle.LifecycleExecutionException: Failed to execute goal org.apache.rat:apache-rat-plugin:0.12:check (rat-check) on project maven-checkstyle-plugin: Too many files with unapproved license: 1 See RAT report in: f:\jenkins\jenkins-slave\workspace\heckstyle-plugin_MCHECKSTYLE-366@2@2\windows-jdk8-m3.5.x_build\target\rat.txt
    at org.apache.maven.lifecycle.internal.MojoExecutor.execute (MojoExecutor.java:213)
    at org.apache.maven.lifecycle.internal.MojoExecutor.execute (MojoExecutor.java:154)
    at org.apache.maven.lifecycle.internal.MojoExecutor.execute (MojoExecutor.java:146)
    at org.apache.maven.lifecycle.internal.LifecycleModuleBuilder.buildProject (LifecycleModuleBuilder.java:117)
    at org.apache.maven.lifecycle.internal.LifecycleModuleBuilder.buildProject (LifecycleModuleBuilder.java:81)
    at org.apache.maven.lifecycle.internal.builder.singlethreaded.SingleThreadedBuilder.build (SingleThreadedBuilder.java:51)
    at org.apache.maven.lifecycle.internal.LifecycleStarter.execute (LifecycleStarter.java:128)
    at org.apache.maven.DefaultMaven.doExecute (DefaultMaven.java:309)
    at org.apache.maven.DefaultMaven.doExecute (DefaultMaven.java:194)
    at org.apache.maven.DefaultMaven.execute (DefaultMaven.java:107)
    at org.apache.maven.cli.MavenCli.execute (MavenCli.java:955)
    at org.apache.maven.cli.MavenCli.doMain (MavenCli.java:290)
    at org.apache.maven.cli.MavenCli.main (MavenCli.java:194)
    at sun.reflect.NativeMethodAccessorImpl.invoke0 (Native Method)
    at sun.reflect.NativeMethodAccessorImpl.invoke (NativeMethodAccessorImpl.java:62)
    at sun.reflect.DelegatingMethodAccessorImpl.invoke (DelegatingMethodAccessorImpl.java:43)
    at java.lang.reflect.Method.invoke (Method.java:498)
    at org.codehaus.plexus.classworlds.launcher.Launcher.launchEnhanced (Launcher.java:289)
    at org.codehaus.plexus.classworlds.launcher.Launcher.launch (Launcher.java:229)
    at org.codehaus.plexus.classworlds.launcher.Launcher.mainWithExitCode (Launcher.java:415)
    at org.codehaus.plexus.classworlds.launcher.Launcher.main (Launcher.java:356)
Caused by: org.apache.rat.mp.RatCheckException: Too many files with unapproved license: 1 See RAT report in: f:\jenkins\jenkins-slave\workspace\heckstyle-plugin_MCHECKSTYLE-366@2@2\windows-jdk8-m3.5.x_build\target\rat.txt
    at org.apache.rat.mp.RatCheckMojo.check (RatCheckMojo.java:183)
    at org.apache.rat.mp.RatCheckMojo.execute (RatCheckMojo.java:156)
    at org.apache.maven.plugin.DefaultBuildPluginManager.executeMojo (DefaultBuildPluginManager.java:134)
    at org.apache.maven.lifecycle.internal.MojoExecutor.execute (MojoExecutor.java:208)
    at org.apache.maven.lifecycle.internal.MojoExecutor.execute (MojoExecutor.java:154)
    at org.apache.maven.lifecycle.internal.MojoExecutor.execute (MojoExecutor.java:146)
    at org.apache.maven.lifecycle.internal.LifecycleModuleBuilder.buildProject (LifecycleModuleBuilder.java:117)
    at org.apache.maven.lifecycle.internal.LifecycleModuleBuilder.buildProject (LifecycleModuleBuilder.java:81)
    at org.apache.maven.lifecycle.internal.builder.singlethreaded.SingleThreadedBuilder.build (SingleThreadedBuilder.java:51)
    at org.apache.maven.lifecycle.internal.LifecycleStarter.execute (LifecycleStarter.java:128)
    at org.apache.maven.DefaultMaven.doExecute (DefaultMaven.java:309)
    at org.apache.maven.DefaultMaven.doExecute (DefaultMaven.java:194)
    at org.apache.maven.DefaultMaven.execute (DefaultMaven.java:107)
    at org.apache.maven.cli.MavenCli.execute (MavenCli.java:955)
    at org.apache.maven.cli.MavenCli.doMain (MavenCli.java:290)
    at org.apache.maven.cli.MavenCli.main (MavenCli.java:194)
    at sun.reflect.NativeMethodAccessorImpl.invoke0 (Native Method)
    at sun.reflect.NativeMethodAccessorImpl.invoke (NativeMethodAccessorImpl.java:62)
    at sun.reflect.DelegatingMethodAccessorImpl.invoke (DelegatingMethodAccessorImpl.java:43)
    at java.lang.reflect.Method.invoke (Method.java:498)
    at org.codehaus.plexus.classworlds.launcher.Launcher.launchEnhanced (Launcher.java:289)
    at org.codehaus.plexus.classworlds.launcher.Launcher.launch (Launcher.java:229)
    at org.codehaus.plexus.classworlds.launcher.Launcher.mainWithExitCode (Launcher.java:415)
    at org.codehaus.plexus.classworlds.launcher.Launcher.main (Launcher.java:356)
[ERROR] 
[ERROR] Re-run Maven using the -X switch to enable full debug logging.
[ERROR] 
[ERROR] For more information about the errors and possible solutions, please read the following articles:
[ERROR] [Help 1] http://cwiki.apache.org/confluence/display/MAVEN/MojoFailureException
Picked up JAVA_TOOL_OPTIONS: -Dmaven.ext.class.path="f:\jenkins\jenkins-slave\workspace\heckstyle-plugin_MCHECKSTYLE-366@2@2@tmp\withMaven30b32d9b\pipeline-maven-spy.jar" -Dorg.jenkinsci.plugins.pipeline.maven.reportsFolder="f:\jenkins\jenkins-slave\workspace\heckstyle-plugin_MCHECKSTYLE-366@2@2@tmp\withMaven30b32d9b" 
[Pipeline] }
[INFO] Final Memory: 23M/541M
[INFO] ------------------------------------------------------------------------
[INFO] [jenkins-event-spy] Generated F:\jenkins\jenkins-slave\workspace\heckstyle-plugin_MCHECKSTYLE-366@3@tmp\withMaven0969d83c\maven-spy-20190421-053833-6278456550585505852156.log
[ERROR] Failed to execute goal org.apache.rat:apache-rat-plugin:0.12:check (rat-check) on project maven-checkstyle-plugin: Too many files with unapproved license: 1 See RAT report in: f:\jenkins\jenkins-slave\workspace\heckstyle-plugin_MCHECKSTYLE-366@3\windows-jdk8-m3.3.x_build\target\rat.txt -> [Help 1]
org.apache.maven.lifecycle.LifecycleExecutionException: Failed to execute goal org.apache.rat:apache-rat-plugin:0.12:check (rat-check) on project maven-checkstyle-plugin: Too many files with unapproved license: 1 See RAT report in: f:\jenkins\jenkins-slave\workspace\heckstyle-plugin_MCHECKSTYLE-366@3\windows-jdk8-m3.3.x_build\target\rat.txt
	at org.apache.maven.lifecycle.internal.MojoExecutor.execute(MojoExecutor.java:212)
	at org.apache.maven.lifecycle.internal.MojoExecutor.execute(MojoExecutor.java:153)
	at org.apache.maven.lifecycle.internal.MojoExecutor.execute(MojoExecutor.java:145)
	at org.apache.maven.lifecycle.internal.LifecycleModuleBuilder.buildProject(LifecycleModuleBuilder.java:116)
	at org.apache.maven.lifecycle.internal.LifecycleModuleBuilder.buildProject(LifecycleModuleBuilder.java:80)
	at org.apache.maven.lifecycle.internal.builder.singlethreaded.SingleThreadedBuilder.build(SingleThreadedBuilder.java:51)
	at org.apache.maven.lifecycle.internal.LifecycleStarter.execute(LifecycleStarter.java:128)
	at org.apache.maven.DefaultMaven.doExecute(DefaultMaven.java:307)
	at org.apache.maven.DefaultMaven.doExecute(DefaultMaven.java:193)
	at org.apache.maven.DefaultMaven.execute(DefaultMaven.java:106)
	at org.apache.maven.cli.MavenCli.execute(MavenCli.java:863)
	at org.apache.maven.cli.MavenCli.doMain(MavenCli.java:288)
	at org.apache.maven.cli.MavenCli.main(MavenCli.java:199)
	at sun.reflect.NativeMethodAccessorImpl.invoke0(Native Method)
	at sun.reflect.NativeMethodAccessorImpl.invoke(NativeMethodAccessorImpl.java:62)
	at sun.reflect.DelegatingMethodAccessorImpl.invoke(DelegatingMethodAccessorImpl.java:43)
	at java.lang.reflect.Method.invoke(Method.java:498)
	at org.codehaus.plexus.classworlds.launcher.Launcher.launchEnhanced(Launcher.java:289)
	at org.codehaus.plexus.classworlds.launcher.Launcher.launch(Launcher.java:229)
	at org.codehaus.plexus.classworlds.launcher.Launcher.mainWithExitCode(Launcher.java:415)
	at org.codehaus.plexus.classworlds.launcher.Launcher.main(Launcher.java:356)
Caused by: org.apache.rat.mp.RatCheckException: Too many files with unapproved license: 1 See RAT report in: f:\jenkins\jenkins-slave\workspace\heckstyle-plugin_MCHECKSTYLE-366@3\windows-jdk8-m3.3.x_build\target\rat.txt
	at org.apache.rat.mp.RatCheckMojo.check(RatCheckMojo.java:183)
	at org.apache.rat.mp.RatCheckMojo.execute(RatCheckMojo.java:156)
	at org.apache.maven.plugin.DefaultBuildPluginManager.executeMojo(DefaultBuildPluginManager.java:134)
	at org.apache.maven.lifecycle.internal.MojoExecutor.execute(MojoExecutor.java:207)
	... 20 more
[ERROR] 
[ERROR] Re-run Maven using the -X switch to enable full debug logging.
[ERROR] 
[ERROR] For more information about the errors and possible solutions, please read the following articles:
[ERROR] [Help 1] http://cwiki.apache.org/confluence/display/MAVEN/MojoFailureException
Picked up JAVA_TOOL_OPTIONS: -Dmaven.ext.class.path="f:\jenkins\jenkins-slave\workspace\heckstyle-plugin_MCHECKSTYLE-366@3@tmp\withMaven0969d83c\pipeline-maven-spy.jar" -Dorg.jenkinsci.plugins.pipeline.maven.reportsFolder="f:\jenkins\jenkins-slave\workspace\heckstyle-plugin_MCHECKSTYLE-366@3@tmp\withMaven0969d83c" 
[Pipeline] // dir
[Pipeline] }
[Fast Archiver] No prior successful build to compare, so performing full copy of artifacts
[Pipeline] }
[Pipeline] }
[Pipeline] // dir
[withMaven] openTasksPublisher - Scan Tasks for Maven artifact org.apache.maven.plugins:maven-checkstyle-plugin:maven-plugin:3.0.1-SNAPSHOT in source directory windows-jdk8-m3.5.x_build\src\main\java
[Pipeline] // dir
[TASKS] Scanning folder 'f:\jenkins\jenkins-slave\workspace\heckstyle-plugin_MCHECKSTYLE-366@2@2' for files matching the pattern 'windows-jdk8-m3.5.x_build\src\main\java\**\*' - excludes: null
[TASKS] Found 20 files to scan for tasks
[TASKS] Found 5 open tasks.
Skipping warnings blame since pipelines do not have an SCM link.%n
[Pipeline] }
[Pipeline] }
[Fast Archiver] No prior successful build to compare, so performing full copy of artifacts
[withMaven] Publishers: Generated Artifacts Publisher: 18 ms, Open Task Scanner Publisher: 168 ms
[withMaven] openTasksPublisher - Scan Tasks for Maven artifact org.apache.maven.plugins:maven-checkstyle-plugin:maven-plugin:3.0.1-SNAPSHOT in source directory windows-jdk8-m3.3.x_build\src\main\java
[Pipeline] // withMaven
[Pipeline] cleanWs
[TASKS] Scanning folder 'f:\jenkins\jenkins-slave\workspace\heckstyle-plugin_MCHECKSTYLE-366@3' for files matching the pattern 'windows-jdk8-m3.3.x_build\src\main\java\**\*' - excludes: null
[TASKS] Found 20 files to scan for tasks
[TASKS] Found 5 open tasks.
Skipping warnings blame since pipelines do not have an SCM link.%n
[Fast Archiver] No prior successful build to compare, so performing full copy of artifacts
[WS-CLEANUP] Deleting project workspace...
[WS-CLEANUP] Deferred wipeout is used...
[WS-CLEANUP] done
[Pipeline] cleanWs
[withMaven] openTasksPublisher - Scan Tasks for Maven artifact org.apache.maven.plugins:maven-checkstyle-plugin:maven-plugin:3.0.1-SNAPSHOT in source directory windows-jdk12-m3.6.x_build\src\main\java
[WS-CLEANUP] Deleting project workspace...
[WS-CLEANUP] Deferred wipeout is used...
[TASKS] Scanning folder 'f:\jenkins\jenkins-slave\workspace\heckstyle-plugin_MCHECKSTYLE-366@2' for files matching the pattern 'windows-jdk12-m3.6.x_build\src\main\java\**\*' - excludes: null
[TASKS] Found 20 files to scan for tasks
[TASKS] Found 5 open tasks.
Skipping warnings blame since pipelines do not have an SCM link.%n
[WS-CLEANUP] done
[Pipeline] }
[withMaven] Publishers: Generated Artifacts Publisher: 17 ms, Open Task Scanner Publisher: 433 ms, Dependencies Fingerprint Publisher: 1 ms
[Pipeline] // stage
[Pipeline] }
[Pipeline] // withMaven
[Pipeline] // ws
[Pipeline] }
[withMaven] Publishers: Generated Artifacts Publisher: 23 ms, Open Task Scanner Publisher: 254 ms, Dependencies Fingerprint Publisher: 1 ms
[Pipeline] cleanWs
[WS-CLEANUP] Deleting project workspace...
[WS-CLEANUP] Deferred wipeout is used...
[Pipeline] // node
[Pipeline] // withMaven
[Pipeline] }
[WS-CLEANUP] done
Failed in branch windows-jdk8-m3.5.x_build
[Pipeline] cleanWs
[Pipeline] cleanWs
[WS-CLEANUP] Deleting project workspace...
[WS-CLEANUP] Deferred wipeout is used...
[WS-CLEANUP] done
[Pipeline] }
[Pipeline] // stage
[Pipeline] }
[WS-CLEANUP] Deleting project workspace...
[WS-CLEANUP] Deferred wipeout is used...
[Pipeline] // ws
[WS-CLEANUP] done
[Pipeline] }
[Pipeline] // node
[Pipeline] }
Failed in branch windows-jdk8-m3.3.x_build
[Pipeline] cleanWs
[WS-CLEANUP] Deleting project workspace...
[WS-CLEANUP] Deferred wipeout is used...
[WS-CLEANUP] done
[Pipeline] }
[Pipeline] // stage
[Pipeline] }
[Pipeline] // ws
[Pipeline] }
[Pipeline] // node
[Pipeline] }
Failed in branch windows-jdk12-m3.6.x_build
[Pipeline] // parallel
[Pipeline] stage
[Pipeline] { (Notifications)
[Pipeline] echo
Build result: FAILURE
[Pipeline] jiraIssueSelector
[Pipeline] jiraComment
[Pipeline] emailext

Build failed in Jenkins: Maven TLP » maven-checkstyle-plugin » MCHECKSTYLE-366 #6

Posted by Apache Jenkins Server <je...@builds.apache.org>.
See https://builds.apache.org/job/maven-box/job/maven-checkstyle-plugin/job/MCHECKSTYLE-366/6/

Changes:

* Fix test
* Fix test
* Fix test
* Fix test
* Fix test
* Fix test
* Fix test
* Fix test
* Fix test
* Fix test
* Fix test
* Fix test
* Fix test
* Fix test

All tests passed

Build log:
[...truncated 16485 lines...]
[INFO] Ignored 1 error, 0 violation remaining.
[INFO] 
[INFO] --- maven-invoker-plugin:3.1.0:verify (integration-test) @ maven-checkstyle-plugin ---
[INFO] -------------------------------------------------
[INFO] Build Summary:
[INFO]   Passed: 38, Failed: 5, Errors: 0, Skipped: 0
[INFO] -------------------------------------------------
[ERROR] The following builds failed:
[ERROR] *  MCHECKSTYLE-129\pom.xml
[ERROR] *  MCHECKSTYLE-137\pom.xml
[ERROR] *  MCHECKSTYLE-169\pom.xml
[ERROR] *  MCHECKSTYLE-338\pom.xml
[ERROR] *  multi-modules-aggregate\pom.xml
[INFO] -------------------------------------------------
[INFO] ------------------------------------------------------------------------
[INFO] BUILD FAILURE
[INFO] ------------------------------------------------------------------------
[INFO] Total time: 11:44 min
[INFO] Finished at: 2019-04-14T20:09:42Z
[INFO] Final Memory: 47M/167M
[INFO] ------------------------------------------------------------------------
[INFO] [jenkins-event-spy] Generated F:\jenkins\jenkins-slave\workspace\heckstyle-plugin_MCHECKSTYLE-366@3@tmp\withMavend8d4b006\maven-spy-20190414-195756-7142461075139021671758.log
[ERROR] Failed to execute goal org.apache.maven.plugins:maven-invoker-plugin:3.1.0:verify (integration-test) on project maven-checkstyle-plugin: 5 builds failed. See console output above for details. -> [Help 1]
org.apache.maven.lifecycle.LifecycleExecutionException: Failed to execute goal org.apache.maven.plugins:maven-invoker-plugin:3.1.0:verify (integration-test) on project maven-checkstyle-plugin: 5 builds failed. See console output above for details.
    at org.apache.maven.lifecycle.internal.MojoExecutor.execute (MojoExecutor.java:213)
    at org.apache.maven.lifecycle.internal.MojoExecutor.execute (MojoExecutor.java:154)
    at org.apache.maven.lifecycle.internal.MojoExecutor.execute (MojoExecutor.java:146)
    at org.apache.maven.lifecycle.internal.LifecycleModuleBuilder.buildProject (LifecycleModuleBuilder.java:117)
    at org.apache.maven.lifecycle.internal.LifecycleModuleBuilder.buildProject (LifecycleModuleBuilder.java:81)
    at org.apache.maven.lifecycle.internal.builder.singlethreaded.SingleThreadedBuilder.build (SingleThreadedBuilder.java:51)
    at org.apache.maven.lifecycle.internal.LifecycleStarter.execute (LifecycleStarter.java:128)
    at org.apache.maven.DefaultMaven.doExecute (DefaultMaven.java:309)
    at org.apache.maven.DefaultMaven.doExecute (DefaultMaven.java:194)
    at org.apache.maven.DefaultMaven.execute (DefaultMaven.java:107)
    at org.apache.maven.cli.MavenCli.execute (MavenCli.java:955)
    at org.apache.maven.cli.MavenCli.doMain (MavenCli.java:290)
    at org.apache.maven.cli.MavenCli.main (MavenCli.java:194)
    at jdk.internal.reflect.NativeMethodAccessorImpl.invoke0 (Native Method)
    at jdk.internal.reflect.NativeMethodAccessorImpl.invoke (NativeMethodAccessorImpl.java:62)
    at jdk.internal.reflect.DelegatingMethodAccessorImpl.invoke (DelegatingMethodAccessorImpl.java:43)
    at java.lang.reflect.Method.invoke (Method.java:564)
    at org.codehaus.plexus.classworlds.launcher.Launcher.launchEnhanced (Launcher.java:289)
    at org.codehaus.plexus.classworlds.launcher.Launcher.launch (Launcher.java:229)
    at org.codehaus.plexus.classworlds.launcher.Launcher.mainWithExitCode (Launcher.java:415)
    at org.codehaus.plexus.classworlds.launcher.Launcher.main (Launcher.java:356)
Caused by: org.apache.maven.plugin.MojoFailureException: 5 builds failed. See console output above for details.
    at org.apache.maven.plugins.invoker.InvokerSession.handleFailures (InvokerSession.java:260)
    at org.apache.maven.plugins.invoker.VerifyMojo.execute (VerifyMojo.java:137)
    at org.apache.maven.plugin.DefaultBuildPluginManager.executeMojo (DefaultBuildPluginManager.java:134)
    at org.apache.maven.lifecycle.internal.MojoExecutor.execute (MojoExecutor.java:208)
    at org.apache.maven.lifecycle.internal.MojoExecutor.execute (MojoExecutor.java:154)
    at org.apache.maven.lifecycle.internal.MojoExecutor.execute (MojoExecutor.java:146)
    at org.apache.maven.lifecycle.internal.LifecycleModuleBuilder.buildProject (LifecycleModuleBuilder.java:117)
    at org.apache.maven.lifecycle.internal.LifecycleModuleBuilder.buildProject (LifecycleModuleBuilder.java:81)
    at org.apache.maven.lifecycle.internal.builder.singlethreaded.SingleThreadedBuilder.build (SingleThreadedBuilder.java:51)
    at org.apache.maven.lifecycle.internal.LifecycleStarter.execute (LifecycleStarter.java:128)
    at org.apache.maven.DefaultMaven.doExecute (DefaultMaven.java:309)
    at org.apache.maven.DefaultMaven.doExecute (DefaultMaven.java:194)
    at org.apache.maven.DefaultMaven.execute (DefaultMaven.java:107)
    at org.apache.maven.cli.MavenCli.execute (MavenCli.java:955)
    at org.apache.maven.cli.MavenCli.doMain (MavenCli.java:290)
    at org.apache.maven.cli.MavenCli.main (MavenCli.java:194)
    at jdk.internal.reflect.NativeMethodAccessorImpl.invoke0 (Native Method)
    at jdk.internal.reflect.NativeMethodAccessorImpl.invoke (NativeMethodAccessorImpl.java:62)
    at jdk.internal.reflect.DelegatingMethodAccessorImpl.invoke (DelegatingMethodAccessorImpl.java:43)
    at java.lang.reflect.Method.invoke (Method.java:564)
    at org.codehaus.plexus.classworlds.launcher.Launcher.launchEnhanced (Launcher.java:289)
    at org.codehaus.plexus.classworlds.launcher.Launcher.launch (Launcher.java:229)
    at org.codehaus.plexus.classworlds.launcher.Launcher.mainWithExitCode (Launcher.java:415)
    at org.codehaus.plexus.classworlds.launcher.Launcher.main (Launcher.java:356)
[ERROR] 
[ERROR] Re-run Maven using the -X switch to enable full debug logging.
[ERROR] 
[ERROR] For more information about the errors and possible solutions, please read the following articles:
[ERROR] [Help 1] http://cwiki.apache.org/confluence/display/MAVEN/MojoFailureException
[Pipeline] }
[Pipeline] // dir
[Pipeline] }
[Fast Archiver] No prior successful build to compare, so performing full copy of artifacts
[withMaven] junitPublisher - Archive test results for Maven artifact org.apache.maven.plugins:maven-checkstyle-plugin:maven-plugin:3.0.1-SNAPSHOT generated by maven-surefire-plugin:test (default-test): windows-jdk10-m3.5.x_build\target\surefire-reports\*.xml
Recording test results
[withMaven] openTasksPublisher - Scan Tasks for Maven artifact org.apache.maven.plugins:maven-checkstyle-plugin:maven-plugin:3.0.1-SNAPSHOT in source directory windows-jdk10-m3.5.x_build\src\main\java
[TASKS] Scanning folder 'f:\jenkins\jenkins-slave\workspace\heckstyle-plugin_MCHECKSTYLE-366@3' for files matching the pattern 'windows-jdk10-m3.5.x_build\src\main\java\**\*' - excludes: null
[TASKS] Found 20 files to scan for tasks
[TASKS] Found 5 open tasks.
Skipping warnings blame since pipelines do not have an SCM link.%n
[withMaven] invokerPublisher - Archive invoker results for Maven artifact MavenArtifact{org.apache.maven.plugins:maven-checkstyle-plugin:maven-plugin:3.0.1-SNAPSHOT(version: 3.0.1-SNAPSHOT, snapshot:false) } generated by PluginInvocation{org.apache.maven.plugins:maven-invoker-plugin:3.1.0@integration-test  integration-test}: windows-jdk10-m3.5.x_build\target\invoker-reports\*.xml
[INFO] run post-build script verify.groovy
[INFO]           MCHECKSTYLE-347\pom.xml .......................... SUCCESS (13.1 s)
[INFO] Building: MCHECKSTYLE-357\pom.xml
[INFO] run post-build script verify.groovy
[INFO]           MCHECKSTYLE-357\pom.xml .......................... SUCCESS (16.5 s)
[INFO] Building: MCHECKSTYLE-357-with-header-override\pom.xml
[withMaven] Publishers: Generated Artifacts Publisher: 23 ms, Junit Publisher: 573 ms, Open Task Scanner Publisher: 461 ms, Invoker Publisher: 20570 ms
[Pipeline] // withMaven
[Pipeline] cleanWs
[WS-CLEANUP] Deleting project workspace...
[WS-CLEANUP] Deferred wipeout is used...
[WS-CLEANUP] done
[Pipeline] cleanWs
[WS-CLEANUP] Deleting project workspace...
[WS-CLEANUP] Deferred wipeout is used...
[WS-CLEANUP] done
[Pipeline] }
[Pipeline] // stage
[Pipeline] }
[Pipeline] // ws
[Pipeline] }
[Pipeline] // node
[Pipeline] }
Failed in branch windows-jdk10-m3.5.x_build
[INFO] run post-build script verify.groovy
[INFO]           MCHECKSTYLE-357-with-header-override\pom.xml ..... SUCCESS (18.3 s)
[INFO] Building: MCHECKSTYLE-365\pom.xml
[INFO] run post-build script verify.groovy
[INFO]           MCHECKSTYLE-365\pom.xml .......................... SUCCESS (12.9 s)
[INFO] Building: MCHECKSTYLE-70-multi-sourcefolder\pom.xml
[INFO] run post-build script verify.groovy
[INFO]           MCHECKSTYLE-70-multi-sourcefolder\pom.xml ........ SUCCESS (12.1 s)
[INFO] Building: minimal-pom\pom.xml
[INFO] run post-build script verify.bsh
[INFO]           minimal-pom\pom.xml .............................. SUCCESS (13.7 s)
[INFO] Building: multi-modules\pom.xml
[INFO]           multi-modules\pom.xml ............................ SUCCESS (11.0 s)
[INFO] Building: multi-modules-aggregate\pom.xml
[INFO] run post-build script verify.groovy
[INFO]           multi-modules-aggregate\pom.xml .................. FAILED (11.0 s)
[INFO]   The post-build script did not succeed. assert new File( basedir, 'target/checkstyle-cachefile' ).exists()
       |         |                                        |
       |         |                                        false
       |         f:\jenkins\jenkins-slave\workspace\heckstyle-plugin_MCHECKSTYLE-366@2@2\windows-jdk11-m3.5.x_build\target\it\multi-modules-aggregate
       f:\jenkins\jenkins-slave\workspace\heckstyle-plugin_MCHECKSTYLE-366@2@2\windows-jdk11-m3.5.x_build\target\it\multi-modules-aggregate\target\checkstyle-cachefile
[INFO] Building: multimoduleproject\pom.xml
[INFO]           multimoduleproject\pom.xml ....................... SUCCESS (8.7 s)
[INFO] 
[INFO] --- maven-checkstyle-plugin:3.0.0:check (checkstyle-check) @ maven-checkstyle-plugin ---
[INFO] There is 1 error reported by Checkstyle 6.18 with config/maven_checks.xml ruleset.
[INFO] Ignored 1 error, 0 violation remaining.
[INFO] 
[INFO] --- maven-invoker-plugin:3.1.0:verify (integration-test) @ maven-checkstyle-plugin ---
[INFO] -------------------------------------------------
[INFO] Build Summary:
[INFO]   Passed: 38, Failed: 5, Errors: 0, Skipped: 0
[INFO] -------------------------------------------------
[ERROR] The following builds failed:
[ERROR] *  MCHECKSTYLE-129\pom.xml
[ERROR] *  MCHECKSTYLE-137\pom.xml
[ERROR] *  MCHECKSTYLE-169\pom.xml
[ERROR] *  MCHECKSTYLE-338\pom.xml
[ERROR] *  multi-modules-aggregate\pom.xml
[INFO] -------------------------------------------------
[INFO] ------------------------------------------------------------------------
[INFO] BUILD FAILURE
[INFO] ------------------------------------------------------------------------
[INFO] Total time: 13:38 min
[INFO] Finished at: 2019-04-14T20:11:33Z
[INFO] Final Memory: 52M/180M
[INFO] ------------------------------------------------------------------------
[INFO] [jenkins-event-spy] Generated F:\jenkins\jenkins-slave\workspace\heckstyle-plugin_MCHECKSTYLE-366@2@2@tmp\withMavenab06e87f\maven-spy-20190414-195754-3242584747590237774217.log
[ERROR] Failed to execute goal org.apache.maven.plugins:maven-invoker-plugin:3.1.0:verify (integration-test) on project maven-checkstyle-plugin: 5 builds failed. See console output above for details. -> [Help 1]
org.apache.maven.lifecycle.LifecycleExecutionException: Failed to execute goal org.apache.maven.plugins:maven-invoker-plugin:3.1.0:verify (integration-test) on project maven-checkstyle-plugin: 5 builds failed. See console output above for details.
    at org.apache.maven.lifecycle.internal.MojoExecutor.execute (MojoExecutor.java:213)
    at org.apache.maven.lifecycle.internal.MojoExecutor.execute (MojoExecutor.java:154)
    at org.apache.maven.lifecycle.internal.MojoExecutor.execute (MojoExecutor.java:146)
    at org.apache.maven.lifecycle.internal.LifecycleModuleBuilder.buildProject (LifecycleModuleBuilder.java:117)
    at org.apache.maven.lifecycle.internal.LifecycleModuleBuilder.buildProject (LifecycleModuleBuilder.java:81)
    at org.apache.maven.lifecycle.internal.builder.singlethreaded.SingleThreadedBuilder.build (SingleThreadedBuilder.java:51)
    at org.apache.maven.lifecycle.internal.LifecycleStarter.execute (LifecycleStarter.java:128)
    at org.apache.maven.DefaultMaven.doExecute (DefaultMaven.java:309)
    at org.apache.maven.DefaultMaven.doExecute (DefaultMaven.java:194)
    at org.apache.maven.DefaultMaven.execute (DefaultMaven.java:107)
    at org.apache.maven.cli.MavenCli.execute (MavenCli.java:955)
    at org.apache.maven.cli.MavenCli.doMain (MavenCli.java:290)
    at org.apache.maven.cli.MavenCli.main (MavenCli.java:194)
    at jdk.internal.reflect.NativeMethodAccessorImpl.invoke0 (Native Method)
    at jdk.internal.reflect.NativeMethodAccessorImpl.invoke (NativeMethodAccessorImpl.java:62)
    at jdk.internal.reflect.DelegatingMethodAccessorImpl.invoke (DelegatingMethodAccessorImpl.java:43)
    at java.lang.reflect.Method.invoke (Method.java:566)
    at org.codehaus.plexus.classworlds.launcher.Launcher.launchEnhanced (Launcher.java:289)
    at org.codehaus.plexus.classworlds.launcher.Launcher.launch (Launcher.java:229)
    at org.codehaus.plexus.classworlds.launcher.Launcher.mainWithExitCode (Launcher.java:415)
    at org.codehaus.plexus.classworlds.launcher.Launcher.main (Launcher.java:356)
Caused by: org.apache.maven.plugin.MojoFailureException: 5 builds failed. See console output above for details.
    at org.apache.maven.plugins.invoker.InvokerSession.handleFailures (InvokerSession.java:260)
    at org.apache.maven.plugins.invoker.VerifyMojo.execute (VerifyMojo.java:137)
    at org.apache.maven.plugin.DefaultBuildPluginManager.executeMojo (DefaultBuildPluginManager.java:134)
    at org.apache.maven.lifecycle.internal.MojoExecutor.execute (MojoExecutor.java:208)
    at org.apache.maven.lifecycle.internal.MojoExecutor.execute (MojoExecutor.java:154)
    at org.apache.maven.lifecycle.internal.MojoExecutor.execute (MojoExecutor.java:146)
    at org.apache.maven.lifecycle.internal.LifecycleModuleBuilder.buildProject (LifecycleModuleBuilder.java:117)
    at org.apache.maven.lifecycle.internal.LifecycleModuleBuilder.buildProject (LifecycleModuleBuilder.java:81)
    at org.apache.maven.lifecycle.internal.builder.singlethreaded.SingleThreadedBuilder.build (SingleThreadedBuilder.java:51)
    at org.apache.maven.lifecycle.internal.LifecycleStarter.execute (LifecycleStarter.java:128)
    at org.apache.maven.DefaultMaven.doExecute (DefaultMaven.java:309)
    at org.apache.maven.DefaultMaven.doExecute (DefaultMaven.java:194)
    at org.apache.maven.DefaultMaven.execute (DefaultMaven.java:107)
    at org.apache.maven.cli.MavenCli.execute (MavenCli.java:955)
    at org.apache.maven.cli.MavenCli.doMain (MavenCli.java:290)
    at org.apache.maven.cli.MavenCli.main (MavenCli.java:194)
    at jdk.internal.reflect.NativeMethodAccessorImpl.invoke0 (Native Method)
    at jdk.internal.reflect.NativeMethodAccessorImpl.invoke (NativeMethodAccessorImpl.java:62)
    at jdk.internal.reflect.DelegatingMethodAccessorImpl.invoke (DelegatingMethodAccessorImpl.java:43)
    at java.lang.reflect.Method.invoke (Method.java:566)
    at org.codehaus.plexus.classworlds.launcher.Launcher.launchEnhanced (Launcher.java:289)
    at org.codehaus.plexus.classworlds.launcher.Launcher.launch (Launcher.java:229)
    at org.codehaus.plexus.classworlds.launcher.Launcher.mainWithExitCode (Launcher.java:415)
    at org.codehaus.plexus.classworlds.launcher.Launcher.main (Launcher.java:356)
[ERROR] 
[ERROR] Re-run Maven using the -X switch to enable full debug logging.
[ERROR] 
[ERROR] For more information about the errors and possible solutions, please read the following articles:
[ERROR] [Help 1] http://cwiki.apache.org/confluence/display/MAVEN/MojoFailureException
[Pipeline] }
[Pipeline] // dir
[Pipeline] }
[Fast Archiver] No prior successful build to compare, so performing full copy of artifacts
[withMaven] junitPublisher - Archive test results for Maven artifact org.apache.maven.plugins:maven-checkstyle-plugin:maven-plugin:3.0.1-SNAPSHOT generated by maven-surefire-plugin:test (default-test): windows-jdk11-m3.5.x_build\target\surefire-reports\*.xml
Recording test results
[withMaven] openTasksPublisher - Scan Tasks for Maven artifact org.apache.maven.plugins:maven-checkstyle-plugin:maven-plugin:3.0.1-SNAPSHOT in source directory windows-jdk11-m3.5.x_build\src\main\java
[TASKS] Scanning folder 'f:\jenkins\jenkins-slave\workspace\heckstyle-plugin_MCHECKSTYLE-366@2@2' for files matching the pattern 'windows-jdk11-m3.5.x_build\src\main\java\**\*' - excludes: null
[TASKS] Found 20 files to scan for tasks
[TASKS] Found 5 open tasks.
Skipping warnings blame since pipelines do not have an SCM link.%n
[withMaven] invokerPublisher - Archive invoker results for Maven artifact MavenArtifact{org.apache.maven.plugins:maven-checkstyle-plugin:maven-plugin:3.0.1-SNAPSHOT(version: 3.0.1-SNAPSHOT, snapshot:false) } generated by PluginInvocation{org.apache.maven.plugins:maven-invoker-plugin:3.1.0@integration-test  integration-test}: windows-jdk11-m3.5.x_build\target\invoker-reports\*.xml
[withMaven] Publishers: Generated Artifacts Publisher: 17 ms, Junit Publisher: 391 ms, Open Task Scanner Publisher: 190 ms, Invoker Publisher: 14006 ms
[Pipeline] // withMaven
[Pipeline] cleanWs
[WS-CLEANUP] Deleting project workspace...
[WS-CLEANUP] Deferred wipeout is used...
[WS-CLEANUP] done
[Pipeline] cleanWs
[WS-CLEANUP] Deleting project workspace...
[WS-CLEANUP] Deferred wipeout is used...
[WS-CLEANUP] done
[Pipeline] }
[Pipeline] // stage
[Pipeline] }
[Pipeline] // ws
[Pipeline] }
[Pipeline] // node
[Pipeline] }
Failed in branch windows-jdk11-m3.5.x_build
[Pipeline] // parallel
[Pipeline] stage
[Pipeline] { (Notifications)
[Pipeline] echo
Build result: FAILURE
[Pipeline] jiraIssueSelector
[Pipeline] emailext

Build failed in Jenkins: Maven TLP » maven-checkstyle-plugin » MCHECKSTYLE-366 #5

Posted by Apache Jenkins Server <je...@builds.apache.org>.
See https://builds.apache.org/job/maven-box/job/maven-checkstyle-plugin/job/MCHECKSTYLE-366/5/

Changes:

* Fix test
* Fix test
* Fix test
* Fix test
* Fix test
* Fix test
* Fix test
* Fix test
* Fix test
* Fix test
* Fix test
* Fix test
* Fix test
* Fix test

All tests passed

Build log:
[...truncated 16503 lines...]
[Pipeline] // stage
[Pipeline] }
[Pipeline] // ws
[Pipeline] }
[Pipeline] // node
[Pipeline] }
Failed in branch windows-jdk8-m3.3.x_build
[withMaven] Publishers: Generated Artifacts Publisher: 15 ms, Junit Publisher: 490 ms, Open Task Scanner Publisher: 174 ms, Dependencies Fingerprint Publisher: 1 ms, Invoker Publisher: 18691 ms
[Pipeline] // withMaven
[Pipeline] cleanWs
[WS-CLEANUP] Deleting project workspace...
[WS-CLEANUP] Deferred wipeout is used...
[WS-CLEANUP] done
[Pipeline] cleanWs
[WS-CLEANUP] Deleting project workspace...
[WS-CLEANUP] Deferred wipeout is used...
[WS-CLEANUP] done
[Pipeline] }
[Pipeline] // stage
[Pipeline] }
[Pipeline] // ws
[Pipeline] }
[Pipeline] // node
[Pipeline] }
Failed in branch windows-jdk8-m3.5.x_build
[INFO]           multimoduleproject\pom.xml ....................... SUCCESS (11.1 s)
[INFO] 
[INFO] --- maven-checkstyle-plugin:3.0.0:check (checkstyle-check) @ maven-checkstyle-plugin ---
[INFO]           multimoduleproject\pom.xml ....................... SUCCESS (8.0 s)
[INFO] 
[INFO] --- maven-checkstyle-plugin:3.0.0:check (checkstyle-check) @ maven-checkstyle-plugin ---
[INFO] There is 1 error reported by Checkstyle 6.18 with config/maven_checks.xml ruleset.
[INFO] Ignored 1 error, 0 violation remaining.
[INFO] 
[INFO] --- maven-invoker-plugin:3.1.0:verify (integration-test) @ maven-checkstyle-plugin ---
[INFO] -------------------------------------------------
[INFO] Build Summary:
[INFO]   Passed: 38, Failed: 5, Errors: 0, Skipped: 0
[INFO] -------------------------------------------------
[ERROR] The following builds failed:
[ERROR] *  MCHECKSTYLE-129\pom.xml
[ERROR] *  MCHECKSTYLE-137\pom.xml
[ERROR] *  MCHECKSTYLE-169\pom.xml
[ERROR] *  MCHECKSTYLE-338\pom.xml
[ERROR] *  multi-modules-aggregate\pom.xml
[INFO] -------------------------------------------------
[INFO] ------------------------------------------------------------------------
[INFO] BUILD FAILURE
[INFO] ------------------------------------------------------------------------
[INFO] Total time: 09:56 min
[INFO] Finished at: 2019-04-13T21:31:21Z
[INFO] Final Memory: 47M/170M
[INFO] ------------------------------------------------------------------------
[INFO] [jenkins-event-spy] Generated F:\jenkins\jenkins-slave\workspace\heckstyle-plugin_MCHECKSTYLE-366@2@tmp\withMaven75b3c092\maven-spy-20190413-212124-6211317732764310730199.log
[ERROR] Failed to execute goal org.apache.maven.plugins:maven-invoker-plugin:3.1.0:verify (integration-test) on project maven-checkstyle-plugin: 5 builds failed. See console output above for details. -> [Help 1]
org.apache.maven.lifecycle.LifecycleExecutionException: Failed to execute goal org.apache.maven.plugins:maven-invoker-plugin:3.1.0:verify (integration-test) on project maven-checkstyle-plugin: 5 builds failed. See console output above for details.
    at org.apache.maven.lifecycle.internal.MojoExecutor.execute (MojoExecutor.java:213)
    at org.apache.maven.lifecycle.internal.MojoExecutor.execute (MojoExecutor.java:154)
    at org.apache.maven.lifecycle.internal.MojoExecutor.execute (MojoExecutor.java:146)
    at org.apache.maven.lifecycle.internal.LifecycleModuleBuilder.buildProject (LifecycleModuleBuilder.java:117)
    at org.apache.maven.lifecycle.internal.LifecycleModuleBuilder.buildProject (LifecycleModuleBuilder.java:81)
    at org.apache.maven.lifecycle.internal.builder.singlethreaded.SingleThreadedBuilder.build (SingleThreadedBuilder.java:51)
    at org.apache.maven.lifecycle.internal.LifecycleStarter.execute (LifecycleStarter.java:128)
    at org.apache.maven.DefaultMaven.doExecute (DefaultMaven.java:309)
    at org.apache.maven.DefaultMaven.doExecute (DefaultMaven.java:194)
    at org.apache.maven.DefaultMaven.execute (DefaultMaven.java:107)
    at org.apache.maven.cli.MavenCli.execute (MavenCli.java:955)
    at org.apache.maven.cli.MavenCli.doMain (MavenCli.java:290)
    at org.apache.maven.cli.MavenCli.main (MavenCli.java:194)
    at jdk.internal.reflect.NativeMethodAccessorImpl.invoke0 (Native Method)
    at jdk.internal.reflect.NativeMethodAccessorImpl.invoke (NativeMethodAccessorImpl.java:62)
    at jdk.internal.reflect.DelegatingMethodAccessorImpl.invoke (DelegatingMethodAccessorImpl.java:43)
    at java.lang.reflect.Method.invoke (Method.java:564)
    at org.codehaus.plexus.classworlds.launcher.Launcher.launchEnhanced (Launcher.java:289)
    at org.codehaus.plexus.classworlds.launcher.Launcher.launch (Launcher.java:229)
    at org.codehaus.plexus.classworlds.launcher.Launcher.mainWithExitCode (Launcher.java:415)
    at org.codehaus.plexus.classworlds.launcher.Launcher.main (Launcher.java:356)
Caused by: org.apache.maven.plugin.MojoFailureException: 5 builds failed. See console output above for details.
    at org.apache.maven.plugins.invoker.InvokerSession.handleFailures (InvokerSession.java:260)
    at org.apache.maven.plugins.invoker.VerifyMojo.execute (VerifyMojo.java:137)
    at org.apache.maven.plugin.DefaultBuildPluginManager.executeMojo (DefaultBuildPluginManager.java:134)
    at org.apache.maven.lifecycle.internal.MojoExecutor.execute (MojoExecutor.java:208)
    at org.apache.maven.lifecycle.internal.MojoExecutor.execute (MojoExecutor.java:154)
    at org.apache.maven.lifecycle.internal.MojoExecutor.execute (MojoExecutor.java:146)
    at org.apache.maven.lifecycle.internal.LifecycleModuleBuilder.buildProject (LifecycleModuleBuilder.java:117)
    at org.apache.maven.lifecycle.internal.LifecycleModuleBuilder.buildProject (LifecycleModuleBuilder.java:81)
    at org.apache.maven.lifecycle.internal.builder.singlethreaded.SingleThreadedBuilder.build (SingleThreadedBuilder.java:51)
    at org.apache.maven.lifecycle.internal.LifecycleStarter.execute (LifecycleStarter.java:128)
    at org.apache.maven.DefaultMaven.doExecute (DefaultMaven.java:309)
    at org.apache.maven.DefaultMaven.doExecute (DefaultMaven.java:194)
    at org.apache.maven.DefaultMaven.execute (DefaultMaven.java:107)
    at org.apache.maven.cli.MavenCli.execute (MavenCli.java:955)
    at org.apache.maven.cli.MavenCli.doMain (MavenCli.java:290)
    at org.apache.maven.cli.MavenCli.main (MavenCli.java:194)
    at jdk.internal.reflect.NativeMethodAccessorImpl.invoke0 (Native Method)
    at jdk.internal.reflect.NativeMethodAccessorImpl.invoke (NativeMethodAccessorImpl.java:62)
    at jdk.internal.reflect.DelegatingMethodAccessorImpl.invoke (DelegatingMethodAccessorImpl.java:43)
    at java.lang.reflect.Method.invoke (Method.java:564)
    at org.codehaus.plexus.classworlds.launcher.Launcher.launchEnhanced (Launcher.java:289)
    at org.codehaus.plexus.classworlds.launcher.Launcher.launch (Launcher.java:229)
    at org.codehaus.plexus.classworlds.launcher.Launcher.mainWithExitCode (Launcher.java:415)
    at org.codehaus.plexus.classworlds.launcher.Launcher.main (Launcher.java:356)
[ERROR] 
[ERROR] Re-run Maven using the -X switch to enable full debug logging.
[ERROR] 
[ERROR] For more information about the errors and possible solutions, please read the following articles:
[ERROR] [Help 1] http://cwiki.apache.org/confluence/display/MAVEN/MojoFailureException
[Pipeline] }
[Pipeline] // dir
[Pipeline] }
[Fast Archiver] No prior successful build to compare, so performing full copy of artifacts
[withMaven] junitPublisher - Archive test results for Maven artifact org.apache.maven.plugins:maven-checkstyle-plugin:maven-plugin:3.0.1-SNAPSHOT generated by maven-surefire-plugin:test (default-test): windows-jdk10-m3.5.x_build\target\surefire-reports\*.xml
Recording test results
[withMaven] openTasksPublisher - Scan Tasks for Maven artifact org.apache.maven.plugins:maven-checkstyle-plugin:maven-plugin:3.0.1-SNAPSHOT in source directory windows-jdk10-m3.5.x_build\src\main\java
[TASKS] Scanning folder 'f:\jenkins\jenkins-slave\workspace\heckstyle-plugin_MCHECKSTYLE-366@2' for files matching the pattern 'windows-jdk10-m3.5.x_build\src\main\java\**\*' - excludes: null
[TASKS] Found 20 files to scan for tasks
[TASKS] Found 5 open tasks.
Skipping warnings blame since pipelines do not have an SCM link.%n
[withMaven] invokerPublisher - Archive invoker results for Maven artifact MavenArtifact{org.apache.maven.plugins:maven-checkstyle-plugin:maven-plugin:3.0.1-SNAPSHOT(version: 3.0.1-SNAPSHOT, snapshot:false) } generated by PluginInvocation{org.apache.maven.plugins:maven-invoker-plugin:3.1.0@integration-test  integration-test}: windows-jdk10-m3.5.x_build\target\invoker-reports\*.xml
[INFO] There is 1 error reported by Checkstyle 6.18 with config/maven_checks.xml ruleset.
[INFO] Ignored 1 error, 0 violation remaining.
[INFO] 
[INFO] --- maven-invoker-plugin:3.1.0:verify (integration-test) @ maven-checkstyle-plugin ---
[INFO] -------------------------------------------------
[INFO] Build Summary:
[INFO]   Passed: 38, Failed: 5, Errors: 0, Skipped: 0
[INFO] -------------------------------------------------
[ERROR] The following builds failed:
[ERROR] *  MCHECKSTYLE-129\pom.xml
[ERROR] *  MCHECKSTYLE-137\pom.xml
[ERROR] *  MCHECKSTYLE-169\pom.xml
[ERROR] *  MCHECKSTYLE-338\pom.xml
[ERROR] *  multi-modules-aggregate\pom.xml
[INFO] -------------------------------------------------
[INFO] ------------------------------------------------------------------------
[INFO] BUILD FAILURE
[INFO] ------------------------------------------------------------------------
[INFO] Total time: 10:10 min
[INFO] Finished at: 2019-04-13T14:31:24-07:00
[INFO] Final Memory: 61M/1090M
[INFO] ------------------------------------------------------------------------
[INFO] [jenkins-event-spy] Generated F:\jenkins\jenkins-slave\workspace\heckstyle-plugin_MCHECKSTYLE-366@3@tmp\withMaven4f8ec897\maven-spy-20190413-142114-983453080879753057961.log
[ERROR] Failed to execute goal org.apache.maven.plugins:maven-invoker-plugin:3.1.0:verify (integration-test) on project maven-checkstyle-plugin: 5 builds failed. See console output above for details. -> [Help 1]
org.apache.maven.lifecycle.LifecycleExecutionException: Failed to execute goal org.apache.maven.plugins:maven-invoker-plugin:3.1.0:verify (integration-test) on project maven-checkstyle-plugin: 5 builds failed. See console output above for details.
	at org.apache.maven.lifecycle.internal.MojoExecutor.execute(MojoExecutor.java:212)
	at org.apache.maven.lifecycle.internal.MojoExecutor.execute(MojoExecutor.java:153)
	at org.apache.maven.lifecycle.internal.MojoExecutor.execute(MojoExecutor.java:145)
	at org.apache.maven.lifecycle.internal.LifecycleModuleBuilder.buildProject(LifecycleModuleBuilder.java:116)
	at org.apache.maven.lifecycle.internal.LifecycleModuleBuilder.buildProject(LifecycleModuleBuilder.java:80)
	at org.apache.maven.lifecycle.internal.builder.singlethreaded.SingleThreadedBuilder.build(SingleThreadedBuilder.java:51)
	at org.apache.maven.lifecycle.internal.LifecycleStarter.execute(LifecycleStarter.java:120)
	at org.apache.maven.DefaultMaven.doExecute(DefaultMaven.java:355)
	at org.apache.maven.DefaultMaven.execute(DefaultMaven.java:155)
	at org.apache.maven.cli.MavenCli.execute(MavenCli.java:584)
	at org.apache.maven.cli.MavenCli.doMain(MavenCli.java:216)
	at org.apache.maven.cli.MavenCli.main(MavenCli.java:160)
	at sun.reflect.NativeMethodAccessorImpl.invoke0(Native Method)
	at sun.reflect.NativeMethodAccessorImpl.invoke(NativeMethodAccessorImpl.java:62)
	at sun.reflect.DelegatingMethodAccessorImpl.invoke(DelegatingMethodAccessorImpl.java:43)
	at java.lang.reflect.Method.invoke(Method.java:498)
	at org.codehaus.plexus.classworlds.launcher.Launcher.launchEnhanced(Launcher.java:289)
	at org.codehaus.plexus.classworlds.launcher.Launcher.launch(Launcher.java:229)
	at org.codehaus.plexus.classworlds.launcher.Launcher.mainWithExitCode(Launcher.java:415)
	at org.codehaus.plexus.classworlds.launcher.Launcher.main(Launcher.java:356)
Caused by: org.apache.maven.plugin.MojoFailureException: 5 builds failed. See console output above for details.
	at org.apache.maven.plugins.invoker.InvokerSession.handleFailures(InvokerSession.java:260)
	at org.apache.maven.plugins.invoker.VerifyMojo.execute(VerifyMojo.java:137)
	at org.apache.maven.plugin.DefaultBuildPluginManager.executeMojo(DefaultBuildPluginManager.java:132)
	at org.apache.maven.lifecycle.internal.MojoExecutor.execute(MojoExecutor.java:208)
	... 19 more
[ERROR] 
[ERROR] Re-run Maven using the -X switch to enable full debug logging.
[ERROR] 
[ERROR] For more information about the errors and possible solutions, please read the following articles:
[ERROR] [Help 1] http://cwiki.apache.org/confluence/display/MAVEN/MojoFailureException
Picked up JAVA_TOOL_OPTIONS: -Dmaven.ext.class.path="f:\jenkins\jenkins-slave\workspace\heckstyle-plugin_MCHECKSTYLE-366@3@tmp\withMaven4f8ec897\pipeline-maven-spy.jar" -Dorg.jenkinsci.plugins.pipeline.maven.reportsFolder="f:\jenkins\jenkins-slave\workspace\heckstyle-plugin_MCHECKSTYLE-366@3@tmp\withMaven4f8ec897" 
[Pipeline] }
[Pipeline] // dir
[Pipeline] }
[Fast Archiver] No prior successful build to compare, so performing full copy of artifacts
[withMaven] junitPublisher - Archive test results for Maven artifact org.apache.maven.plugins:maven-checkstyle-plugin:maven-plugin:3.0.1-SNAPSHOT generated by maven-surefire-plugin:test (default-test): windows-jdk8-m3.2.x_build\target\surefire-reports\*.xml
Recording test results
[withMaven] openTasksPublisher - Scan Tasks for Maven artifact org.apache.maven.plugins:maven-checkstyle-plugin:maven-plugin:3.0.1-SNAPSHOT in source directory windows-jdk8-m3.2.x_build\src\main\java
[TASKS] Scanning folder 'f:\jenkins\jenkins-slave\workspace\heckstyle-plugin_MCHECKSTYLE-366@3' for files matching the pattern 'windows-jdk8-m3.2.x_build\src\main\java\**\*' - excludes: null
[TASKS] Found 20 files to scan for tasks
[TASKS] Found 5 open tasks.
Skipping warnings blame since pipelines do not have an SCM link.%n
[withMaven] invokerPublisher - Archive invoker results for Maven artifact MavenArtifact{org.apache.maven.plugins:maven-checkstyle-plugin:maven-plugin:3.0.1-SNAPSHOT(version: 3.0.1-SNAPSHOT, snapshot:false) } generated by PluginInvocation{org.apache.maven.plugins:maven-invoker-plugin:3.1.0@integration-test  integration-test}: windows-jdk8-m3.2.x_build\target\invoker-reports\*.xml
[withMaven] Publishers: Generated Artifacts Publisher: 21 ms, Junit Publisher: 453 ms, Open Task Scanner Publisher: 304 ms, Dependencies Fingerprint Publisher: 1 ms, Invoker Publisher: 19996 ms
[Pipeline] // withMaven
[Pipeline] cleanWs
[WS-CLEANUP] Deleting project workspace...
[WS-CLEANUP] Deferred wipeout is used...
[WS-CLEANUP] done
[Pipeline] cleanWs
[WS-CLEANUP] Deleting project workspace...
[WS-CLEANUP] Deferred wipeout is used...
[WS-CLEANUP] done
[Pipeline] }
[Pipeline] // stage
[Pipeline] }
[Pipeline] // ws
[Pipeline] }
[Pipeline] // node
[Pipeline] }
Failed in branch windows-jdk9-m3.5.x_build
[withMaven] Publishers: Generated Artifacts Publisher: 25 ms, Junit Publisher: 439 ms, Open Task Scanner Publisher: 203 ms, Invoker Publisher: 18713 ms
[Pipeline] // withMaven
[Pipeline] cleanWs
[WS-CLEANUP] Deleting project workspace...
[WS-CLEANUP] Deferred wipeout is used...
[WS-CLEANUP] done
[Pipeline] cleanWs
[WS-CLEANUP] Deleting project workspace...
[WS-CLEANUP] Deferred wipeout is used...
[WS-CLEANUP] done
[Pipeline] }
[Pipeline] // stage
[Pipeline] }
[Pipeline] // ws
[Pipeline] }
[Pipeline] // node
[Pipeline] }
Failed in branch windows-jdk10-m3.5.x_build
[withMaven] Publishers: Generated Artifacts Publisher: 16 ms, Junit Publisher: 420 ms, Open Task Scanner Publisher: 165 ms, Dependencies Fingerprint Publisher: 1 ms, Invoker Publisher: 17114 ms
[Pipeline] // withMaven
[Pipeline] cleanWs
[WS-CLEANUP] Deleting project workspace...
[WS-CLEANUP] Deferred wipeout is used...
[WS-CLEANUP] done
[Pipeline] cleanWs
[WS-CLEANUP] Deleting project workspace...
[WS-CLEANUP] Deferred wipeout is used...
[WS-CLEANUP] done
[Pipeline] }
[Pipeline] // stage
[Pipeline] }
[Pipeline] // ws
[Pipeline] }
[Pipeline] // node
[Pipeline] }
Failed in branch windows-jdk8-m3.2.x_build
[Pipeline] // parallel
[Pipeline] stage
[Pipeline] { (Notifications)
[Pipeline] echo
Build result: FAILURE
[Pipeline] jiraIssueSelector
[Pipeline] emailext

Build failed in Jenkins: Maven TLP » maven-checkstyle-plugin » MCHECKSTYLE-366 #4

Posted by Apache Jenkins Server <je...@builds.apache.org>.
See https://builds.apache.org/job/maven-box/job/maven-checkstyle-plugin/job/MCHECKSTYLE-366/4/

Changes:

* Remove FileContentsHolder, no more needed
* Remove FileContentsHolder, no more needed
* Remove FileContentsHolder, no more needed
* Remove FileContentsHolder, no more needed
* Remove FileContentsHolder, no more needed
* Remove FileContentsHolder, no more needed
* Remove FileContentsHolder, no more needed
* Remove FileContentsHolder, no more needed
* Remove FileContentsHolder, no more needed
* Remove FileContentsHolder, no more needed
* Remove FileContentsHolder, no more needed
* Remove FileContentsHolder, no more needed
* Remove FileContentsHolder, no more needed

All tests passed

Build log:
[...truncated 16697 lines...]
       |        [DEBUG]  F:\jenkins\jenkins-slave\workspace\heckstyle-plugin_MCHECKSTYLE-366@3\windows-jdk12-m3.5.x_build\target\local-repo\com\google\guava\failureaccess\1.0.1\failureaccess-1.0.1.jar
       |        [DEBUG]  F:\jenkins\jenkins-slave\workspace\heckstyle-plugin_MCHECKSTYLE-366@3\windows-jdk12-m3.5.x_build\target\local-repo\com\google\guava\listenablefuture\9999.0-empty-to-avoid-conflict-with-guava\listenablefuture-9999.0-empty-to-avoid-conflict-with-guava.jar
       |        [DEBUG]  F:\jenkins\jenkins-slave\workspace\heckstyle-plugin_MCHECKSTYLE-366@3\windows-jdk12-m3.5.x_build\target\local-repo\com\google\code\findbugs\jsr305\3.0.2\jsr305-3.0.2.jar
       |        [DEBUG]  F:\jenkins\jenkins-slave\workspace\heckstyle-plugin_MCHECKSTYLE-366@3\windows-jdk12-m3.5.x_build\target\local-repo\org\checkerframework\checker-qual\2.5.2\checker-qual-2.5.2.jar
       |        [DEBUG]  F:\jenkins\jenkins-slave\workspace\heckstyle-plugin_MCHECKSTYLE-366@3\windows-jdk12-m3.5.x_build\target\local-repo\com\google\errorprone\error_prone_annotations\2.2.0\error_prone_annotations-2.2.0.jar
       |        [DEBUG]  F:\jenkins\jenkins-slave\workspace\heckstyle-plugin_MCHECKSTYLE-366@3\windows-jdk12-m3.5.x_build\target\local-repo\com\google\j2objc\j2objc-annotations\1.1\j2objc-annotations-1.1.jar
       |        [DEBUG]  F:\jenkins\jenkins-slave\workspace\heckstyle-plugin_MCHECKSTYLE-366@3\windows-jdk12-m3.5.x_build\target\local-repo\org\codehaus\mojo\animal-sniffer-annotations\1.17\animal-sniffer-annotations-1.17.jar
       |        [DEBUG]  F:\jenkins\jenkins-slave\workspace\heckstyle-plugin_MCHECKSTYLE-366@3\windows-jdk12-m3.5.x_build\target\local-repo\net\sf\saxon\Saxon-HE\9.9.1-2\Saxon-HE-9.9.1-2.jar
       |        [DEBUG]  F:\jenkins\jenkins-slave\workspace\heckstyle-plugin_MCHECKSTYLE-366@3\windows-jdk12-m3.5.x_build\target\local-repo\com\ibm\icu\icu4j\63.1\icu4j-63.1.jar
       |        [DEBUG] Source roots:
       |        [DEBUG]  F:\jenkins\jenkins-slave\workspace\heckstyle-plugin_MCHECKSTYLE-366@3\windows-jdk12-m3.5.x_build\target\it\MCHECKSTYLE-338\empty-logging-check\src\main\java
       |        [DEBUG] Command line options:
       |        [DEBUG] -d F:\jenkins\jenkins-slave\workspace\heckstyle-plugin_MCHECKSTYLE-366@3\windows-jdk12-m3.5.x_build\target\it\MCHECKSTYLE-338\empty-logging-check\target\classes -classpath F:\jenkins\jenkins-slave\workspace\heckstyle-plugin_MCHECKSTYLE-366@3\windows-jdk12-m3.5.x_build\target\it\MCHECKSTYLE-338\empty-logging-check\target\classes;F:\jenkins\jenkins-slave\workspace\heckstyle-plugin_MCHECKSTYLE-366@3\windows-jdk12-m3.5.x_build\target\local-repo\com\puppycrawl\tools\checkstyle\8.19\checkstyle-8.19.jar;F:\jenkins\jenkins-slave\workspace\heckstyle-plugin_MCHECKSTYLE-366@3\windows-jdk12-m3.5.x_build\target\local-repo\info\picocli\picocli\3.9.5\picocli-3.9.5.jar;F:\jenkins\jenkins-slave\workspace\heckstyle-plugin_MCHECKSTYLE-366@3\windows-jdk12-m3.5.x_build\target\local-repo\antlr\antlr\2.7.7\antlr-2.7.7.jar;F:\jenkins\jenkins-slave\workspace\heckstyle-plugin_MCHECKSTYLE-366@3\windows-jdk12-m3.5.x_build\target\local-repo\org\antlr\antlr4-runtime\4.7.2\antlr4-runtime-4.7.2.jar;F:\jenkins\jenkins-slave\workspace\heckstyle-plugin_MCHECKSTYLE-366@3\windows-jdk12-m3.5.x_build\target\local-repo\commons-beanutils\commons-beanutils\1.9.3\commons-beanutils-1.9.3.jar;F:\jenkins\jenkins-slave\workspace\heckstyle-plugin_MCHECKSTYLE-366@3\windows-jdk12-m3.5.x_build\target\local-repo\commons-logging\commons-logging\1.2\commons-logging-1.2.jar;F:\jenkins\jenkins-slave\workspace\heckstyle-plugin_MCHECKSTYLE-366@3\windows-jdk12-m3.5.x_build\target\local-repo\commons-collections\commons-collections\3.2.2\commons-collections-3.2.2.jar;F:\jenkins\jenkins-slave\workspace\heckstyle-plugin_MCHECKSTYLE-366@3\windows-jdk12-m3.5.x_build\target\local-repo\com\google\guava\guava\27.1-jre\guava-27.1-jre.jar;F:\jenkins\jenkins-slave\workspace\heckstyle-plugin_MCHECKSTYLE-366@3\windows-jdk12-m3.5.x_build\target\local-repo\com\google\guava\failureaccess\1.0.1\failureaccess-1.0.1.jar;F:\jenkins\jenkins-slave\workspace\heckstyle-plugin_MCHECKSTYLE-366@3\windows-jdk12-m3.5.x_build\target\local-repo\com\google\guava\listenablefuture\9999.0-empty-to-avoid-conflict-with-guava\listenablefuture-9999.0-empty-to-avoid-conflict-with-guava.jar;F:\jenkins\jenkins-slave\workspace\heckstyle-plugin_MCHECKSTYLE-366@3\windows-jdk12-m3.5.x_build\target\local-repo\com\google\code\findbugs\jsr305\3.0.2\jsr305-3.0.2.jar;F:\jenkins\jenkins-slave\workspace\heckstyle-plugin_MCHECKSTYLE-366@3\windows-jdk12-m3.5.x_build\target\local-repo\org\checkerframework\checker-qual\2.5.2\checker-qual-2.5.2.jar;F:\jenkins\jenkins-slave\workspace\heckstyle-plugin_MCHECKSTYLE-366@3\windows-jdk12-m3.5.x_build\target\local-repo\com\google\errorprone\error_prone_annotations\2.2.0\error_prone_annotations-2.2.0.jar;F:\jenkins\jenkins-slave\workspace\heckstyle-plugin_MCHECKSTYLE-366@3\windows-jdk12-m3.5.x_build\target\local-repo\com\google\j2objc\j2objc-annotations\1.1\j2objc-annotations-1.1.jar;F:\jenkins\jenkins-slave\workspace\heckstyle-plugin_MCHECKSTYLE-366@3\windows-jdk12-m3.5.x_build\target\local-repo\org\codehaus\mojo\animal-sniffer-annotations\1.17\animal-sniffer-annotations-1.17.jar;F:\jenkins\jenkins-slave\workspace\heckstyle-plugin_MCHECKSTYLE-366@3\windows-jdk12-m3.5.x_build\target\local-repo\net\sf\saxon\Saxon-HE\9.9.1-2\Saxon-HE-9.9.1-2.jar;F:\jenkins\jenkins-slave\workspace\heckstyle-plugin_MCHECKSTYLE-366@3\windows-jdk12-m3.5.x_build\target\local-repo\com\ibm\icu\icu4j\63.1\icu4j-63.1.jar; -sourcepath F:\jenkins\jenkins-slave\workspace\heckstyle-plugin_MCHECKSTYLE-366@3\windows-jdk12-m3.5.x_build\target\it\MCHECKSTYLE-338\empty-logging-check\src\main\java; -s F:\jenkins\jenkins-slave\workspace\heckstyle-plugin_MCHECKSTYLE-366@3\windows-jdk12-m3.5.x_build\target\it\MCHECKSTYLE-338\empty-logging-check\target\generated-sources\annotations -g -nowarn -target 1.8 -source 1.8 -encoding UTF-8
       |        [DEBUG] incrementalBuildHelper#beforeRebuildExecution
       |        [INFO] Compiling 1 source file to F:\jenkins\jenkins-slave\workspace\heckstyle-plugin_MCHECKSTYLE-366@3\windows-jdk12-m3.5.x_build\target\it\MCHECKSTYLE-338\empty-logging-check\target\classes
       |        [DEBUG] incrementalBuildHelper#afterRebuildExecution
       |        [INFO] -------------------------------------------------------------
       |        [ERROR] COMPILATION ERROR : 
       |        [INFO] -------------------------------------------------------------
       |        [ERROR] /F:/jenkins/jenkins-slave/workspace/heckstyle-plugin_MCHECKSTYLE-366@3/windows-jdk12-m3.5.x_build/target/it/MCHECKSTYLE-338/empty-logging-check/src/main/java/org/apache/maven/plugins/checkstyle/EmptyLoggingCheck.java:[30,8] org.apache.maven.plugins.checkstyle.EmptyLoggingCheck is not abstract and does not override abstract method processFiltered(java.io.File,com.puppycrawl.tools.checkstyle.api.FileText) in com.puppycrawl.tools.checkstyle.api.AbstractFileSetCheck
       |        [ERROR] /F:/jenkins/jenkins-slave/workspace/heckstyle-plugin_MCHECKSTYLE-366@3/windows-jdk12-m3.5.x_build/target/it/MCHECKSTYLE-338/empty-logging-check/src/main/java/org/apache/maven/plugins/checkstyle/EmptyLoggingCheck.java:[34,5] method does not override or implement a method from a supertype
       |        [ERROR] /F:/jenkins/jenkins-slave/workspace/heckstyle-plugin_MCHECKSTYLE-366@3/windows-jdk12-m3.5.x_build/target/it/MCHECKSTYLE-338/empty-logging-check/src/main/java/org/apache/maven/plugins/checkstyle/EmptyLoggingCheck.java:[38,9] cannot find symbol
       |          symbol:   method getMessageCollector()
       |          location: class org.apache.maven.plugins.checkstyle.EmptyLoggingCheck
       |        [INFO] 3 errors 
       |        [INFO] -------------------------------------------------------------
       |        [INFO] ------------------------------------------------------------------------
       |        [INFO] Reactor Summary:
       |        [INFO] 
       |        [INFO] MCHECKSTYLE-338 .................................... SUCCESS [  0.300 s]
       |        [INFO] empty-logging-check ................................ FAILURE [  3.216 s]
       |        [INFO] omitignoredmodules-false ........................... SKIPPED
       |        [INFO] omitignoredmodules-true ............................ SKIPPED
       |        [INFO] ------------------------------------------------------------------------
       |        [INFO] BUILD FAILURE
       |        [INFO] ------------------------------------------------------------------------
       |        [INFO] Total time: 3.805 s
       |        [INFO] Finished at: 2019-04-13T20:35:20Z
       |        [INFO] Final Memory: 15M/44M
       |        [INFO] ------------------------------------------------------------------------
       |        [ERROR] Failed to execute goal org.apache.maven.plugins:maven-compiler-plugin:3.1:compile (default-compile) on project empty-logging-check: Compilation failure: Compilation failure: 
       |        [ERROR] /F:/jenkins/jenkins-slave/workspace/heckstyle-plugin_MCHECKSTYLE-366@3/windows-jdk12-m3.5.x_build/target/it/MCHECKSTYLE-338/empty-logging-check/src/main/java/org/apache/maven/plugins/checkstyle/EmptyLoggingCheck.java:[30,8] org.apache.maven.plugins.checkstyle.EmptyLoggingCheck is not abstract and does not override abstract method processFiltered(java.io.File,com.puppycrawl.tools.checkstyle.api.FileText) in com.puppycrawl.tools.checkstyle.api.AbstractFileSetCheck
       |        [ERROR] /F:/jenkins/jenkins-slave/workspace/heckstyle-plugin_MCHECKSTYLE-366@3/windows-jdk12-m3.5.x_build/target/it/MCHECKSTYLE-338/empty-logging-check/src/main/java/org/apache/maven/plugins/checkstyle/EmptyLoggingCheck.java:[34,5] method does not override or implement a method from a supertype
       |        [ERROR] /F:/jenkins/jenkins-slave/workspace/heckstyle-plugin_MCHECKSTYLE-366@3/windows-jdk12-m3.5.x_build/target/it/MCHECKSTYLE-338/empty-logging-check/src/main/java/org/apache/maven/plugins/checkstyle/EmptyLoggingCheck.java:[38,9] cannot find symbol
       |        [ERROR]   symbol:   method getMessageCollector()
       |        [ERROR]   location: class org.apache.maven.plugins.checkstyle.EmptyLoggingCheck
       |        [ERROR] -> [Help 1]
       |        org.apache.maven.lifecycle.LifecycleExecutionException: Failed to execute goal org.apache.maven.plugins:maven-compiler-plugin:3.1:compile (default-compile) on project empty-logging-check: Compilation failure
       |            at org.apache.maven.lifecycle.internal.MojoExecutor.execute (MojoExecutor.java:213)
       |            at org.apache.maven.lifecycle.internal.MojoExecutor.execute (MojoExecutor.java:154)
       |            at org.apache.maven.lifecycle.internal.MojoExecutor.execute (MojoExecutor.java:146)
       |            at org.apache.maven.lifecycle.internal.LifecycleModuleBuilder.buildProject (LifecycleModuleBuilder.java:117)
       |            at org.apache.maven.lifecycle.internal.LifecycleModuleBuilder.buildProject (LifecycleModuleBuilder.java:81)
       |            at org.apache.maven.lifecycle.internal.builder.singlethreaded.SingleThreadedBuilder.build (SingleThreadedBuilder.java:51)
       |            at org.apache.maven.lifecycle.internal.LifecycleStarter.execute (LifecycleStarter.java:128)
       |            at org.apache.maven.DefaultMaven.doExecute (DefaultMaven.java:309)
       |            at org.apache.maven.DefaultMaven.doExecute (DefaultMaven.java:194)
       |            at org.apache.maven.DefaultMaven.execute (DefaultMaven.java:107)
       |            at org.apache.maven.cli.MavenCli.execute (MavenCli.java:955)
       |            at org.apache.maven.cli.MavenCli.doMain (MavenCli.java:290)
       |            at org.apache.maven.cli.MavenCli.main (MavenCli.java:194)
       |            at jdk.internal.reflect.NativeMethodAccessorImpl.invoke0 (Native Method)
       |            at jdk.internal.reflect.NativeMethodAccessorImpl.invoke (NativeMethodAccessorImpl.java:62)
       |            at jdk.internal.reflect.DelegatingMethodAccessorImpl.invoke (DelegatingMethodAccessorImpl.java:43)
       |            at java.lang.reflect.Method.invoke (Method.java:567)
       |            at org.codehaus.plexus.classworlds.launcher.Launcher.launchEnhanced (Launcher.java:289)
       |            at org.codehaus.plexus.classworlds.launcher.Launcher.launch (Launcher.java:229)
       |            at org.codehaus.plexus.classworlds.launcher.Launcher.mainWithExitCode (Launcher.java:415)
       |            at org.codehaus.plexus.classworlds.launcher.Launcher.main (Launcher.java:356)
       |        Caused by: org.apache.maven.plugin.compiler.CompilationFailureException: Compilation failure
       |            at org.apache.maven.plugin.compiler.AbstractCompilerMojo.execute (AbstractCompilerMojo.java:858)
       |            at org.apache.maven.plugin.compiler.CompilerMojo.execute (CompilerMojo.java:129)
       |            at org.apache.maven.plugin.DefaultBuildPluginManager.executeMojo (DefaultBuildPluginManager.java:134)
       |            at org.apache.maven.lifecycle.internal.MojoExecutor.execute (MojoExecutor.java:208)
       |            at org.apache.maven.lifecycle.internal.MojoExecutor.execute (MojoExecutor.java:154)
       |            at org.apache.maven.lifecycle.internal.MojoExecutor.execute (MojoExecutor.java:146)
       |            at org.apache.maven.lifecycle.internal.LifecycleModuleBuilder.buildProject (LifecycleModuleBuilder.java:117)
       |            at org.apache.maven.lifecycle.internal.LifecycleModuleBuilder.buildProject (LifecycleModuleBuilder.java:81)
       |            at org.apache.maven.lifecycle.internal.builder.singlethreaded.SingleThreadedBuilder.build (SingleThreadedBuilder.java:51)
       |            at org.apache.maven.lifecycle.internal.LifecycleStarter.execute (LifecycleStarter.java:128)
       |            at org.apache.maven.DefaultMaven.doExecute (DefaultMaven.java:309)
       |            at org.apache.maven.DefaultMaven.doExecute (DefaultMaven.java:194)
       |            at org.apache.maven.DefaultMaven.execute (DefaultMaven.java:107)
       |            at org.apache.maven.cli.MavenCli.execute (MavenCli.java:955)
       |            at org.apache.maven.cli.MavenCli.doMain (MavenCli.java:290)
       |            at org.apache.maven.cli.MavenCli.main (MavenCli.java:194)
       |            at jdk.internal.reflect.NativeMethodAccessorImpl.invoke0 (Native Method)
       |            at jdk.internal.reflect.NativeMethodAccessorImpl.invoke (NativeMethodAccessorImpl.java:62)
       |            at jdk.internal.reflect.DelegatingMethodAccessorImpl.invoke (DelegatingMethodAccessorImpl.java:43)
       |            at java.lang.reflect.Method.invoke (Method.java:567)
       |            at org.codehaus.plexus.classworlds.launcher.Launcher.launchEnhanced (Launcher.java:289)
       |            at org.codehaus.plexus.classworlds.launcher.Launcher.launch (Launcher.java:229)
       |            at org.codehaus.plexus.classworlds.launcher.Launcher.mainWithExitCode (Launcher.java:415)
       |            at org.codehaus.plexus.classworlds.launcher.Launcher.main (Launcher.java:356)
       |        [ERROR] 
       |        [ERROR] 
       |        [ERROR] For more information about the errors and possible solutions, please read the following articles:
       |        [ERROR] [Help 1] http://cwiki.apache.org/confluence/display/MAVEN/MojoFailureException
       |        [ERROR] 
       |        [ERROR] After correcting the problems, you can resume the build with the command
       |        [ERROR]   mvn <goals> -rf :empty-logging-check
       |        Running post-build script: f:\jenkins\jenkins-slave\workspace\heckstyle-plugin_MCHECKSTYLE-366@3\windows-jdk12-m3.5.x_build\target\it\MCHECKSTYLE-338\verify.groovy
       f:\jenkins\jenkins-slave\workspace\heckstyle-plugin_MCHECKSTYLE-366@3\windows-jdk12-m3.5.x_build\target\it\MCHECKSTYLE-338\build.log
[INFO] Building: MCHECKSTYLE-347\pom.xml
[INFO] run post-build script verify.groovy
[INFO]           MCHECKSTYLE-347\pom.xml .......................... SUCCESS (6.5 s)
[INFO] Building: MCHECKSTYLE-357\pom.xml
[INFO] run post-build script verify.groovy
[INFO]           MCHECKSTYLE-357\pom.xml .......................... SUCCESS (12.6 s)
[INFO] Building: MCHECKSTYLE-357-with-header-override\pom.xml
[INFO] run post-build script verify.groovy
[INFO]           MCHECKSTYLE-357-with-header-override\pom.xml ..... SUCCESS (13.4 s)
[INFO] Building: MCHECKSTYLE-365\pom.xml
[INFO] run post-build script verify.groovy
[INFO]           MCHECKSTYLE-365\pom.xml .......................... SUCCESS (12.3 s)
[INFO] Building: MCHECKSTYLE-70-multi-sourcefolder\pom.xml
[INFO] run post-build script verify.groovy
[INFO]           MCHECKSTYLE-70-multi-sourcefolder\pom.xml ........ SUCCESS (8.0 s)
[INFO] Building: minimal-pom\pom.xml
[INFO] run post-build script verify.bsh
[INFO]           minimal-pom\pom.xml .............................. SUCCESS (8.6 s)
[INFO] Building: multi-modules\pom.xml
[INFO]           multi-modules\pom.xml ............................ SUCCESS (6.6 s)
[INFO] Building: multi-modules-aggregate\pom.xml
[INFO] run post-build script verify.groovy
[INFO]           multi-modules-aggregate\pom.xml .................. FAILED (6.2 s)
[INFO]   The post-build script did not succeed. assert new File( basedir, 'target/checkstyle-cachefile' ).exists()
       |         |                                        |
       |         |                                        false
       |         f:\jenkins\jenkins-slave\workspace\heckstyle-plugin_MCHECKSTYLE-366@3\windows-jdk12-m3.5.x_build\target\it\multi-modules-aggregate
       f:\jenkins\jenkins-slave\workspace\heckstyle-plugin_MCHECKSTYLE-366@3\windows-jdk12-m3.5.x_build\target\it\multi-modules-aggregate\target\checkstyle-cachefile
[INFO] Building: multimoduleproject\pom.xml
[INFO]           multimoduleproject\pom.xml ....................... SUCCESS (6.3 s)
[INFO] 
[INFO] --- maven-checkstyle-plugin:3.0.0:check (checkstyle-check) @ maven-checkstyle-plugin ---
[INFO] There is 1 error reported by Checkstyle 6.18 with config/maven_checks.xml ruleset.
[INFO] Ignored 1 error, 0 violation remaining.
[INFO] 
[INFO] --- maven-invoker-plugin:3.1.0:verify (integration-test) @ maven-checkstyle-plugin ---
[INFO] -------------------------------------------------
[INFO] Build Summary:
[INFO]   Passed: 37, Failed: 6, Errors: 0, Skipped: 0
[INFO] -------------------------------------------------
[ERROR] The following builds failed:
[ERROR] *  MCHECKSTYLE-129\pom.xml
[ERROR] *  MCHECKSTYLE-137\pom.xml
[ERROR] *  MCHECKSTYLE-169\pom.xml
[ERROR] *  MCHECKSTYLE-193\pom.xml
[ERROR] *  MCHECKSTYLE-338\pom.xml
[ERROR] *  multi-modules-aggregate\pom.xml
[INFO] -------------------------------------------------
[INFO] ------------------------------------------------------------------------
[INFO] BUILD FAILURE
[INFO] ------------------------------------------------------------------------
[INFO] Total time: 05:58 min
[INFO] Finished at: 2019-04-13T20:36:44Z
[INFO] Final Memory: 47M/160M
[INFO] ------------------------------------------------------------------------
[INFO] [jenkins-event-spy] Generated F:\jenkins\jenkins-slave\workspace\heckstyle-plugin_MCHECKSTYLE-366@3@tmp\withMaven74d96226\maven-spy-20190413-203045-81411503373538919727177.log
[ERROR] Failed to execute goal org.apache.maven.plugins:maven-invoker-plugin:3.1.0:verify (integration-test) on project maven-checkstyle-plugin: 6 builds failed. See console output above for details. -> [Help 1]
org.apache.maven.lifecycle.LifecycleExecutionException: Failed to execute goal org.apache.maven.plugins:maven-invoker-plugin:3.1.0:verify (integration-test) on project maven-checkstyle-plugin: 6 builds failed. See console output above for details.
    at org.apache.maven.lifecycle.internal.MojoExecutor.execute (MojoExecutor.java:213)
    at org.apache.maven.lifecycle.internal.MojoExecutor.execute (MojoExecutor.java:154)
    at org.apache.maven.lifecycle.internal.MojoExecutor.execute (MojoExecutor.java:146)
    at org.apache.maven.lifecycle.internal.LifecycleModuleBuilder.buildProject (LifecycleModuleBuilder.java:117)
    at org.apache.maven.lifecycle.internal.LifecycleModuleBuilder.buildProject (LifecycleModuleBuilder.java:81)
    at org.apache.maven.lifecycle.internal.builder.singlethreaded.SingleThreadedBuilder.build (SingleThreadedBuilder.java:51)
    at org.apache.maven.lifecycle.internal.LifecycleStarter.execute (LifecycleStarter.java:128)
    at org.apache.maven.DefaultMaven.doExecute (DefaultMaven.java:309)
    at org.apache.maven.DefaultMaven.doExecute (DefaultMaven.java:194)
    at org.apache.maven.DefaultMaven.execute (DefaultMaven.java:107)
    at org.apache.maven.cli.MavenCli.execute (MavenCli.java:955)
    at org.apache.maven.cli.MavenCli.doMain (MavenCli.java:290)
    at org.apache.maven.cli.MavenCli.main (MavenCli.java:194)
    at jdk.internal.reflect.NativeMethodAccessorImpl.invoke0 (Native Method)
    at jdk.internal.reflect.NativeMethodAccessorImpl.invoke (NativeMethodAccessorImpl.java:62)
    at jdk.internal.reflect.DelegatingMethodAccessorImpl.invoke (DelegatingMethodAccessorImpl.java:43)
    at java.lang.reflect.Method.invoke (Method.java:567)
    at org.codehaus.plexus.classworlds.launcher.Launcher.launchEnhanced (Launcher.java:289)
    at org.codehaus.plexus.classworlds.launcher.Launcher.launch (Launcher.java:229)
    at org.codehaus.plexus.classworlds.launcher.Launcher.mainWithExitCode (Launcher.java:415)
    at org.codehaus.plexus.classworlds.launcher.Launcher.main (Launcher.java:356)
Caused by: org.apache.maven.plugin.MojoFailureException: 6 builds failed. See console output above for details.
    at org.apache.maven.plugins.invoker.InvokerSession.handleFailures (InvokerSession.java:260)
    at org.apache.maven.plugins.invoker.VerifyMojo.execute (VerifyMojo.java:137)
    at org.apache.maven.plugin.DefaultBuildPluginManager.executeMojo (DefaultBuildPluginManager.java:134)
    at org.apache.maven.lifecycle.internal.MojoExecutor.execute (MojoExecutor.java:208)
    at org.apache.maven.lifecycle.internal.MojoExecutor.execute (MojoExecutor.java:154)
    at org.apache.maven.lifecycle.internal.MojoExecutor.execute (MojoExecutor.java:146)
    at org.apache.maven.lifecycle.internal.LifecycleModuleBuilder.buildProject (LifecycleModuleBuilder.java:117)
    at org.apache.maven.lifecycle.internal.LifecycleModuleBuilder.buildProject (LifecycleModuleBuilder.java:81)
    at org.apache.maven.lifecycle.internal.builder.singlethreaded.SingleThreadedBuilder.build (SingleThreadedBuilder.java:51)
    at org.apache.maven.lifecycle.internal.LifecycleStarter.execute (LifecycleStarter.java:128)
    at org.apache.maven.DefaultMaven.doExecute (DefaultMaven.java:309)
    at org.apache.maven.DefaultMaven.doExecute (DefaultMaven.java:194)
    at org.apache.maven.DefaultMaven.execute (DefaultMaven.java:107)
    at org.apache.maven.cli.MavenCli.execute (MavenCli.java:955)
    at org.apache.maven.cli.MavenCli.doMain (MavenCli.java:290)
    at org.apache.maven.cli.MavenCli.main (MavenCli.java:194)
    at jdk.internal.reflect.NativeMethodAccessorImpl.invoke0 (Native Method)
    at jdk.internal.reflect.NativeMethodAccessorImpl.invoke (NativeMethodAccessorImpl.java:62)
    at jdk.internal.reflect.DelegatingMethodAccessorImpl.invoke (DelegatingMethodAccessorImpl.java:43)
    at java.lang.reflect.Method.invoke (Method.java:567)
    at org.codehaus.plexus.classworlds.launcher.Launcher.launchEnhanced (Launcher.java:289)
    at org.codehaus.plexus.classworlds.launcher.Launcher.launch (Launcher.java:229)
    at org.codehaus.plexus.classworlds.launcher.Launcher.mainWithExitCode (Launcher.java:415)
    at org.codehaus.plexus.classworlds.launcher.Launcher.main (Launcher.java:356)
[ERROR] 
[ERROR] Re-run Maven using the -X switch to enable full debug logging.
[ERROR] 
[ERROR] For more information about the errors and possible solutions, please read the following articles:
[ERROR] [Help 1] http://cwiki.apache.org/confluence/display/MAVEN/MojoFailureException
[Pipeline] }
[Pipeline] // dir
[Pipeline] }
[Fast Archiver] No prior successful build to compare, so performing full copy of artifacts
[withMaven] junitPublisher - Archive test results for Maven artifact org.apache.maven.plugins:maven-checkstyle-plugin:maven-plugin:3.0.1-SNAPSHOT generated by maven-surefire-plugin:test (default-test): windows-jdk12-m3.5.x_build\target\surefire-reports\*.xml
Recording test results
[withMaven] openTasksPublisher - Scan Tasks for Maven artifact org.apache.maven.plugins:maven-checkstyle-plugin:maven-plugin:3.0.1-SNAPSHOT in source directory windows-jdk12-m3.5.x_build\src\main\java
[TASKS] Scanning folder 'f:\jenkins\jenkins-slave\workspace\heckstyle-plugin_MCHECKSTYLE-366@3' for files matching the pattern 'windows-jdk12-m3.5.x_build\src\main\java\**\*' - excludes: null
[TASKS] Found 20 files to scan for tasks
[TASKS] Found 5 open tasks.
Skipping warnings blame since pipelines do not have an SCM link.%n
[withMaven] invokerPublisher - Archive invoker results for Maven artifact MavenArtifact{org.apache.maven.plugins:maven-checkstyle-plugin:maven-plugin:3.0.1-SNAPSHOT(version: 3.0.1-SNAPSHOT, snapshot:false) } generated by PluginInvocation{org.apache.maven.plugins:maven-invoker-plugin:3.1.0@integration-test  integration-test}: windows-jdk12-m3.5.x_build\target\invoker-reports\*.xml
[withMaven] Publishers: Generated Artifacts Publisher: 21 ms, Junit Publisher: 399 ms, Open Task Scanner Publisher: 159 ms, Dependencies Fingerprint Publisher: 1 ms, Invoker Publisher: 12012 ms, Pipeline Graph Publisher: 1 ms
[Pipeline] // withMaven
[Pipeline] cleanWs
[WS-CLEANUP] Deleting project workspace...
[WS-CLEANUP] Deferred wipeout is used...
[WS-CLEANUP] done
[Pipeline] cleanWs
[WS-CLEANUP] Deleting project workspace...
[WS-CLEANUP] Deferred wipeout is used...
[WS-CLEANUP] done
[Pipeline] }
[Pipeline] // stage
[Pipeline] }
[Pipeline] // ws
[Pipeline] }
[Pipeline] // node
[Pipeline] }
Failed in branch windows-jdk12-m3.5.x_build
[Pipeline] // parallel
[Pipeline] stage
[Pipeline] { (Notifications)
[Pipeline] echo
Build result: FAILURE
[Pipeline] jiraIssueSelector
[Pipeline] emailext

Build failed in Jenkins: Maven TLP » maven-checkstyle-plugin » MCHECKSTYLE-366 #3

Posted by Apache Jenkins Server <je...@builds.apache.org>.
See https://builds.apache.org/job/maven-box/job/maven-checkstyle-plugin/job/MCHECKSTYLE-366/3/

Changes:

* build only on jdk8-12
* build only on jdk8-12
* build only on jdk8-12
* build only on jdk8-12
* build only on jdk8-12
* build only on jdk8-12
* build only on jdk8-12
* build only on jdk8-12
* build only on jdk8-12
* build only on jdk8-12

All tests passed

Build log:
[...truncated 16720 lines...]
[INFO] run post-build script verify.groovy
[INFO]           MCHECKSTYLE-357-with-header-override\pom.xml ..... SUCCESS (21.8 s)
[INFO] Building: MCHECKSTYLE-365\pom.xml
[INFO]           multimoduleproject\pom.xml ....................... SUCCESS (12.9 s)
[INFO] 
[INFO] --- maven-checkstyle-plugin:3.0.0:check (checkstyle-check) @ maven-checkstyle-plugin ---
[INFO] There is 1 error reported by Checkstyle 6.18 with config/maven_checks.xml ruleset.
[INFO] Ignored 1 error, 0 violation remaining.
[INFO] 
[INFO] --- maven-invoker-plugin:3.1.0:verify (integration-test) @ maven-checkstyle-plugin ---
[INFO] -------------------------------------------------
[INFO] Build Summary:
[INFO]   Passed: 37, Failed: 6, Errors: 0, Skipped: 0
[INFO] -------------------------------------------------
[ERROR] The following builds failed:
[ERROR] *  MCHECKSTYLE-129\pom.xml
[ERROR] *  MCHECKSTYLE-137\pom.xml
[ERROR] *  MCHECKSTYLE-169\pom.xml
[ERROR] *  MCHECKSTYLE-193\pom.xml
[ERROR] *  MCHECKSTYLE-338\pom.xml
[ERROR] *  multi-modules-aggregate\pom.xml
[INFO] -------------------------------------------------
[INFO] ------------------------------------------------------------------------
[INFO] BUILD FAILURE
[INFO] ------------------------------------------------------------------------
[INFO] Total time: 12:05 min
[INFO] Finished at: 2019-04-13T10:12:03Z
[INFO] Final Memory: 48M/167M
[INFO] ------------------------------------------------------------------------
[INFO] [jenkins-event-spy] Generated F:\jenkins\jenkins-slave\workspace\heckstyle-plugin_MCHECKSTYLE-366@3@tmp\withMaven94742c47\maven-spy-20190413-095957-21515270985034496033954.log
[ERROR] Failed to execute goal org.apache.maven.plugins:maven-invoker-plugin:3.1.0:verify (integration-test) on project maven-checkstyle-plugin: 6 builds failed. See console output above for details. -> [Help 1]
org.apache.maven.lifecycle.LifecycleExecutionException: Failed to execute goal org.apache.maven.plugins:maven-invoker-plugin:3.1.0:verify (integration-test) on project maven-checkstyle-plugin: 6 builds failed. See console output above for details.
    at org.apache.maven.lifecycle.internal.MojoExecutor.execute (MojoExecutor.java:213)
    at org.apache.maven.lifecycle.internal.MojoExecutor.execute (MojoExecutor.java:154)
    at org.apache.maven.lifecycle.internal.MojoExecutor.execute (MojoExecutor.java:146)
    at org.apache.maven.lifecycle.internal.LifecycleModuleBuilder.buildProject (LifecycleModuleBuilder.java:117)
    at org.apache.maven.lifecycle.internal.LifecycleModuleBuilder.buildProject (LifecycleModuleBuilder.java:81)
    at org.apache.maven.lifecycle.internal.builder.singlethreaded.SingleThreadedBuilder.build (SingleThreadedBuilder.java:51)
    at org.apache.maven.lifecycle.internal.LifecycleStarter.execute (LifecycleStarter.java:128)
    at org.apache.maven.DefaultMaven.doExecute (DefaultMaven.java:309)
    at org.apache.maven.DefaultMaven.doExecute (DefaultMaven.java:194)
    at org.apache.maven.DefaultMaven.execute (DefaultMaven.java:107)
    at org.apache.maven.cli.MavenCli.execute (MavenCli.java:955)
    at org.apache.maven.cli.MavenCli.doMain (MavenCli.java:290)
    at org.apache.maven.cli.MavenCli.main (MavenCli.java:194)
    at jdk.internal.reflect.NativeMethodAccessorImpl.invoke0 (Native Method)
    at jdk.internal.reflect.NativeMethodAccessorImpl.invoke (NativeMethodAccessorImpl.java:62)
    at jdk.internal.reflect.DelegatingMethodAccessorImpl.invoke (DelegatingMethodAccessorImpl.java:43)
    at java.lang.reflect.Method.invoke (Method.java:564)
    at org.codehaus.plexus.classworlds.launcher.Launcher.launchEnhanced (Launcher.java:289)
    at org.codehaus.plexus.classworlds.launcher.Launcher.launch (Launcher.java:229)
    at org.codehaus.plexus.classworlds.launcher.Launcher.mainWithExitCode (Launcher.java:415)
    at org.codehaus.plexus.classworlds.launcher.Launcher.main (Launcher.java:356)
Caused by: org.apache.maven.plugin.MojoFailureException: 6 builds failed. See console output above for details.
    at org.apache.maven.plugins.invoker.InvokerSession.handleFailures (InvokerSession.java:260)
    at org.apache.maven.plugins.invoker.VerifyMojo.execute (VerifyMojo.java:137)
    at org.apache.maven.plugin.DefaultBuildPluginManager.executeMojo (DefaultBuildPluginManager.java:134)
    at org.apache.maven.lifecycle.internal.MojoExecutor.execute (MojoExecutor.java:208)
    at org.apache.maven.lifecycle.internal.MojoExecutor.execute (MojoExecutor.java:154)
    at org.apache.maven.lifecycle.internal.MojoExecutor.execute (MojoExecutor.java:146)
    at org.apache.maven.lifecycle.internal.LifecycleModuleBuilder.buildProject (LifecycleModuleBuilder.java:117)
    at org.apache.maven.lifecycle.internal.LifecycleModuleBuilder.buildProject (LifecycleModuleBuilder.java:81)
    at org.apache.maven.lifecycle.internal.builder.singlethreaded.SingleThreadedBuilder.build (SingleThreadedBuilder.java:51)
    at org.apache.maven.lifecycle.internal.LifecycleStarter.execute (LifecycleStarter.java:128)
    at org.apache.maven.DefaultMaven.doExecute (DefaultMaven.java:309)
    at org.apache.maven.DefaultMaven.doExecute (DefaultMaven.java:194)
    at org.apache.maven.DefaultMaven.execute (DefaultMaven.java:107)
    at org.apache.maven.cli.MavenCli.execute (MavenCli.java:955)
    at org.apache.maven.cli.MavenCli.doMain (MavenCli.java:290)
    at org.apache.maven.cli.MavenCli.main (MavenCli.java:194)
    at jdk.internal.reflect.NativeMethodAccessorImpl.invoke0 (Native Method)
    at jdk.internal.reflect.NativeMethodAccessorImpl.invoke (NativeMethodAccessorImpl.java:62)
    at jdk.internal.reflect.DelegatingMethodAccessorImpl.invoke (DelegatingMethodAccessorImpl.java:43)
    at java.lang.reflect.Method.invoke (Method.java:564)
    at org.codehaus.plexus.classworlds.launcher.Launcher.launchEnhanced (Launcher.java:289)
    at org.codehaus.plexus.classworlds.launcher.Launcher.launch (Launcher.java:229)
    at org.codehaus.plexus.classworlds.launcher.Launcher.mainWithExitCode (Launcher.java:415)
    at org.codehaus.plexus.classworlds.launcher.Launcher.main (Launcher.java:356)
[ERROR] 
[ERROR] Re-run Maven using the -X switch to enable full debug logging.
[ERROR] 
[ERROR] For more information about the errors and possible solutions, please read the following articles:
[ERROR] [Help 1] http://cwiki.apache.org/confluence/display/MAVEN/MojoFailureException
[Pipeline] }
[Pipeline] // dir
[Pipeline] }
[Fast Archiver] No prior successful build to compare, so performing full copy of artifacts
[withMaven] junitPublisher - Archive test results for Maven artifact org.apache.maven.plugins:maven-checkstyle-plugin:maven-plugin:3.0.1-SNAPSHOT generated by maven-surefire-plugin:test (default-test): windows-jdk10-m3.5.x_build\target\surefire-reports\*.xml
Recording test results
[withMaven] openTasksPublisher - Scan Tasks for Maven artifact org.apache.maven.plugins:maven-checkstyle-plugin:maven-plugin:3.0.1-SNAPSHOT in source directory windows-jdk10-m3.5.x_build\src\main\java
[TASKS] Scanning folder 'f:\jenkins\jenkins-slave\workspace\heckstyle-plugin_MCHECKSTYLE-366@3' for files matching the pattern 'windows-jdk10-m3.5.x_build\src\main\java\**\*' - excludes: null
[TASKS] Found 20 files to scan for tasks
[TASKS] Found 5 open tasks.
Skipping warnings blame since pipelines do not have an SCM link.%n
[withMaven] invokerPublisher - Archive invoker results for Maven artifact MavenArtifact{org.apache.maven.plugins:maven-checkstyle-plugin:maven-plugin:3.0.1-SNAPSHOT(version: 3.0.1-SNAPSHOT, snapshot:false) } generated by PluginInvocation{org.apache.maven.plugins:maven-invoker-plugin:3.1.0@integration-test  integration-test}: windows-jdk10-m3.5.x_build\target\invoker-reports\*.xml
[INFO] run post-build script verify.groovy
[INFO]           MCHECKSTYLE-365\pom.xml .......................... SUCCESS (15.4 s)
[INFO] Building: MCHECKSTYLE-70-multi-sourcefolder\pom.xml
[INFO] run post-build script verify.groovy
[INFO]           MCHECKSTYLE-70-multi-sourcefolder\pom.xml ........ SUCCESS (15.6 s)
[INFO] Building: minimal-pom\pom.xml
[withMaven] Publishers: Generated Artifacts Publisher: 19 ms, Junit Publisher: 821 ms, Open Task Scanner Publisher: 2737 ms, Dependencies Fingerprint Publisher: 1 ms, Invoker Publisher: 25192 ms
[Pipeline] // withMaven
[Pipeline] cleanWs
[WS-CLEANUP] Deleting project workspace...
[WS-CLEANUP] Deferred wipeout is used...
[WS-CLEANUP] done
[Pipeline] cleanWs
[WS-CLEANUP] Deleting project workspace...
[WS-CLEANUP] Deferred wipeout is used...
[WS-CLEANUP] done
[Pipeline] }
[Pipeline] // stage
[Pipeline] }
[Pipeline] // ws
[Pipeline] }
[Pipeline] // node
[Pipeline] }
Failed in branch windows-jdk10-m3.5.x_build
[INFO] run post-build script verify.bsh
[INFO]           minimal-pom\pom.xml .............................. SUCCESS (16.0 s)
[INFO] Building: multi-modules\pom.xml
[INFO]           multi-modules\pom.xml ............................ SUCCESS (11.7 s)
[INFO] Building: multi-modules-aggregate\pom.xml
[INFO] run post-build script verify.groovy
[INFO]           multi-modules-aggregate\pom.xml .................. FAILED (10.8 s)
[INFO]   The post-build script did not succeed. assert new File( basedir, 'target/checkstyle-cachefile' ).exists()
       |         |                                        |
       |         |                                        false
       |         f:\jenkins\jenkins-slave\workspace\heckstyle-plugin_MCHECKSTYLE-366@2@2\windows-jdk11-m3.5.x_build\target\it\multi-modules-aggregate
       f:\jenkins\jenkins-slave\workspace\heckstyle-plugin_MCHECKSTYLE-366@2@2\windows-jdk11-m3.5.x_build\target\it\multi-modules-aggregate\target\checkstyle-cachefile
[INFO] Building: multimoduleproject\pom.xml
[INFO]           multimoduleproject\pom.xml ....................... SUCCESS (9.7 s)
[INFO] 
[INFO] --- maven-checkstyle-plugin:3.0.0:check (checkstyle-check) @ maven-checkstyle-plugin ---
[INFO] There is 1 error reported by Checkstyle 6.18 with config/maven_checks.xml ruleset.
[INFO] Ignored 1 error, 0 violation remaining.
[INFO] 
[INFO] --- maven-invoker-plugin:3.1.0:verify (integration-test) @ maven-checkstyle-plugin ---
[INFO] -------------------------------------------------
[INFO] Build Summary:
[INFO]   Passed: 37, Failed: 6, Errors: 0, Skipped: 0
[INFO] -------------------------------------------------
[ERROR] The following builds failed:
[ERROR] *  MCHECKSTYLE-129\pom.xml
[ERROR] *  MCHECKSTYLE-137\pom.xml
[ERROR] *  MCHECKSTYLE-169\pom.xml
[ERROR] *  MCHECKSTYLE-193\pom.xml
[ERROR] *  MCHECKSTYLE-338\pom.xml
[ERROR] *  multi-modules-aggregate\pom.xml
[INFO] -------------------------------------------------
[INFO] ------------------------------------------------------------------------
[INFO] BUILD FAILURE
[INFO] ------------------------------------------------------------------------
[INFO] Total time: 13:43 min
[INFO] Finished at: 2019-04-13T10:13:39Z
[INFO] Final Memory: 47M/164M
[INFO] ------------------------------------------------------------------------
[INFO] [jenkins-event-spy] Generated F:\jenkins\jenkins-slave\workspace\heckstyle-plugin_MCHECKSTYLE-366@2@2@tmp\withMaven520c6356\maven-spy-20190413-095956-1284729455395494623651.log
[ERROR] Failed to execute goal org.apache.maven.plugins:maven-invoker-plugin:3.1.0:verify (integration-test) on project maven-checkstyle-plugin: 6 builds failed. See console output above for details. -> [Help 1]
org.apache.maven.lifecycle.LifecycleExecutionException: Failed to execute goal org.apache.maven.plugins:maven-invoker-plugin:3.1.0:verify (integration-test) on project maven-checkstyle-plugin: 6 builds failed. See console output above for details.
    at org.apache.maven.lifecycle.internal.MojoExecutor.execute (MojoExecutor.java:213)
    at org.apache.maven.lifecycle.internal.MojoExecutor.execute (MojoExecutor.java:154)
    at org.apache.maven.lifecycle.internal.MojoExecutor.execute (MojoExecutor.java:146)
    at org.apache.maven.lifecycle.internal.LifecycleModuleBuilder.buildProject (LifecycleModuleBuilder.java:117)
    at org.apache.maven.lifecycle.internal.LifecycleModuleBuilder.buildProject (LifecycleModuleBuilder.java:81)
    at org.apache.maven.lifecycle.internal.builder.singlethreaded.SingleThreadedBuilder.build (SingleThreadedBuilder.java:51)
    at org.apache.maven.lifecycle.internal.LifecycleStarter.execute (LifecycleStarter.java:128)
    at org.apache.maven.DefaultMaven.doExecute (DefaultMaven.java:309)
    at org.apache.maven.DefaultMaven.doExecute (DefaultMaven.java:194)
    at org.apache.maven.DefaultMaven.execute (DefaultMaven.java:107)
    at org.apache.maven.cli.MavenCli.execute (MavenCli.java:955)
    at org.apache.maven.cli.MavenCli.doMain (MavenCli.java:290)
    at org.apache.maven.cli.MavenCli.main (MavenCli.java:194)
    at jdk.internal.reflect.NativeMethodAccessorImpl.invoke0 (Native Method)
    at jdk.internal.reflect.NativeMethodAccessorImpl.invoke (NativeMethodAccessorImpl.java:62)
    at jdk.internal.reflect.DelegatingMethodAccessorImpl.invoke (DelegatingMethodAccessorImpl.java:43)
    at java.lang.reflect.Method.invoke (Method.java:566)
    at org.codehaus.plexus.classworlds.launcher.Launcher.launchEnhanced (Launcher.java:289)
    at org.codehaus.plexus.classworlds.launcher.Launcher.launch (Launcher.java:229)
    at org.codehaus.plexus.classworlds.launcher.Launcher.mainWithExitCode (Launcher.java:415)
    at org.codehaus.plexus.classworlds.launcher.Launcher.main (Launcher.java:356)
Caused by: org.apache.maven.plugin.MojoFailureException: 6 builds failed. See console output above for details.
    at org.apache.maven.plugins.invoker.InvokerSession.handleFailures (InvokerSession.java:260)
    at org.apache.maven.plugins.invoker.VerifyMojo.execute (VerifyMojo.java:137)
    at org.apache.maven.plugin.DefaultBuildPluginManager.executeMojo (DefaultBuildPluginManager.java:134)
    at org.apache.maven.lifecycle.internal.MojoExecutor.execute (MojoExecutor.java:208)
    at org.apache.maven.lifecycle.internal.MojoExecutor.execute (MojoExecutor.java:154)
    at org.apache.maven.lifecycle.internal.MojoExecutor.execute (MojoExecutor.java:146)
    at org.apache.maven.lifecycle.internal.LifecycleModuleBuilder.buildProject (LifecycleModuleBuilder.java:117)
    at org.apache.maven.lifecycle.internal.LifecycleModuleBuilder.buildProject (LifecycleModuleBuilder.java:81)
    at org.apache.maven.lifecycle.internal.builder.singlethreaded.SingleThreadedBuilder.build (SingleThreadedBuilder.java:51)
    at org.apache.maven.lifecycle.internal.LifecycleStarter.execute (LifecycleStarter.java:128)
    at org.apache.maven.DefaultMaven.doExecute (DefaultMaven.java:309)
    at org.apache.maven.DefaultMaven.doExecute (DefaultMaven.java:194)
    at org.apache.maven.DefaultMaven.execute (DefaultMaven.java:107)
    at org.apache.maven.cli.MavenCli.execute (MavenCli.java:955)
    at org.apache.maven.cli.MavenCli.doMain (MavenCli.java:290)
    at org.apache.maven.cli.MavenCli.main (MavenCli.java:194)
    at jdk.internal.reflect.NativeMethodAccessorImpl.invoke0 (Native Method)
    at jdk.internal.reflect.NativeMethodAccessorImpl.invoke (NativeMethodAccessorImpl.java:62)
    at jdk.internal.reflect.DelegatingMethodAccessorImpl.invoke (DelegatingMethodAccessorImpl.java:43)
    at java.lang.reflect.Method.invoke (Method.java:566)
    at org.codehaus.plexus.classworlds.launcher.Launcher.launchEnhanced (Launcher.java:289)
    at org.codehaus.plexus.classworlds.launcher.Launcher.launch (Launcher.java:229)
    at org.codehaus.plexus.classworlds.launcher.Launcher.mainWithExitCode (Launcher.java:415)
    at org.codehaus.plexus.classworlds.launcher.Launcher.main (Launcher.java:356)
[ERROR] 
[ERROR] Re-run Maven using the -X switch to enable full debug logging.
[ERROR] 
[ERROR] For more information about the errors and possible solutions, please read the following articles:
[ERROR] [Help 1] http://cwiki.apache.org/confluence/display/MAVEN/MojoFailureException
[Pipeline] }
[Pipeline] // dir
[Pipeline] }
[Fast Archiver] No prior successful build to compare, so performing full copy of artifacts
[withMaven] junitPublisher - Archive test results for Maven artifact org.apache.maven.plugins:maven-checkstyle-plugin:maven-plugin:3.0.1-SNAPSHOT generated by maven-surefire-plugin:test (default-test): windows-jdk11-m3.5.x_build\target\surefire-reports\*.xml
Recording test results
[withMaven] openTasksPublisher - Scan Tasks for Maven artifact org.apache.maven.plugins:maven-checkstyle-plugin:maven-plugin:3.0.1-SNAPSHOT in source directory windows-jdk11-m3.5.x_build\src\main\java
[TASKS] Scanning folder 'f:\jenkins\jenkins-slave\workspace\heckstyle-plugin_MCHECKSTYLE-366@2@2' for files matching the pattern 'windows-jdk11-m3.5.x_build\src\main\java\**\*' - excludes: null
[TASKS] Found 20 files to scan for tasks
[TASKS] Found 5 open tasks.
Skipping warnings blame since pipelines do not have an SCM link.%n
[withMaven] invokerPublisher - Archive invoker results for Maven artifact MavenArtifact{org.apache.maven.plugins:maven-checkstyle-plugin:maven-plugin:3.0.1-SNAPSHOT(version: 3.0.1-SNAPSHOT, snapshot:false) } generated by PluginInvocation{org.apache.maven.plugins:maven-invoker-plugin:3.1.0@integration-test  integration-test}: windows-jdk11-m3.5.x_build\target\invoker-reports\*.xml
[withMaven] Publishers: Generated Artifacts Publisher: 16 ms, Junit Publisher: 371 ms, Open Task Scanner Publisher: 204 ms, Invoker Publisher: 15677 ms
[Pipeline] // withMaven
[Pipeline] cleanWs
[WS-CLEANUP] Deleting project workspace...
[WS-CLEANUP] Deferred wipeout is used...
[WS-CLEANUP] done
[Pipeline] cleanWs
[WS-CLEANUP] Deleting project workspace...
[WS-CLEANUP] Deferred wipeout is used...
[WS-CLEANUP] done
[Pipeline] }
[Pipeline] // stage
[Pipeline] }
[Pipeline] // ws
[Pipeline] }
[Pipeline] // node
[Pipeline] }
Failed in branch windows-jdk11-m3.5.x_build
[Pipeline] // parallel
[Pipeline] stage
[Pipeline] { (Notifications)
[Pipeline] echo
Build result: FAILURE
[Pipeline] jiraIssueSelector
[Pipeline] emailext