You are viewing a plain text version of this content. The canonical link for it is here.
Posted to yarn-dev@hadoop.apache.org by Apache Jenkins Server <je...@builds.apache.org> on 2015/03/06 13:56:01 UTC
Hadoop-Yarn-trunk - Build # 858 - Still Failing
See https://builds.apache.org/job/Hadoop-Yarn-trunk/858/
###################################################################################
########################## LAST 60 LINES OF THE CONSOLE ###########################
[...truncated 9319 lines...]
Results :
Tests in error:
TestRM.testAppOnMultiNode:161 ยป test timed out after 30000 milliseconds
Tests run: 1024, Failures: 0, Errors: 1, Skipped: 1
[INFO] ------------------------------------------------------------------------
[INFO] Reactor Summary:
[INFO]
[INFO] hadoop-yarn ....................................... SUCCESS [ 3.013 s]
[INFO] hadoop-yarn-api ................................... SUCCESS [03:09 min]
[INFO] hadoop-yarn-common ................................ SUCCESS [02:45 min]
[INFO] hadoop-yarn-server ................................ SUCCESS [ 0.096 s]
[INFO] hadoop-yarn-server-common ......................... SUCCESS [ 39.799 s]
[INFO] hadoop-yarn-server-nodemanager .................... SUCCESS [06:07 min]
[INFO] hadoop-yarn-server-web-proxy ...................... SUCCESS [ 22.147 s]
[INFO] hadoop-yarn-server-applicationhistoryservice ...... SUCCESS [03:13 min]
[INFO] hadoop-yarn-server-resourcemanager ................ FAILURE [50:17 min]
[INFO] hadoop-yarn-server-tests .......................... SKIPPED
[INFO] hadoop-yarn-client ................................ SKIPPED
[INFO] hadoop-yarn-server-sharedcachemanager ............. SKIPPED
[INFO] hadoop-yarn-applications .......................... SKIPPED
[INFO] hadoop-yarn-applications-distributedshell ......... SKIPPED
[INFO] hadoop-yarn-applications-unmanaged-am-launcher .... SKIPPED
[INFO] hadoop-yarn-site .................................. SKIPPED
[INFO] hadoop-yarn-registry .............................. SKIPPED
[INFO] hadoop-yarn-project ............................... SKIPPED
[INFO] ------------------------------------------------------------------------
[INFO] BUILD FAILURE
[INFO] ------------------------------------------------------------------------
[INFO] Total time: 01:06 h
[INFO] Finished at: 2015-03-06T12:55:45+00:00
[INFO] Final Memory: 60M/714M
[INFO] ------------------------------------------------------------------------
[ERROR] Failed to execute goal org.apache.maven.plugins:maven-surefire-plugin:2.17:test (default-test) on project hadoop-yarn-server-resourcemanager: There are test failures.
[ERROR]
[ERROR] Please refer to /home/jenkins/jenkins-slave/workspace/Hadoop-Yarn-trunk/hadoop-yarn-project/hadoop-yarn/hadoop-yarn-server/hadoop-yarn-server-resourcemanager/target/surefire-reports for the individual test results.
[ERROR] -> [Help 1]
[ERROR]
[ERROR] To see the full stack trace of the errors, re-run Maven with the -e switch.
[ERROR] Re-run Maven using the -X switch to enable full debug logging.
[ERROR]
[ERROR] For more information about the errors and possible solutions, please read the following articles:
[ERROR] [Help 1] http://cwiki.apache.org/confluence/display/MAVEN/MojoFailureException
[ERROR]
[ERROR] After correcting the problems, you can resume the build with the command
[ERROR] mvn <goals> -rf :hadoop-yarn-server-resourcemanager
Build step 'Execute shell' marked build as failure
Archiving artifacts
Recording test results
Updating YARN-1809
Updating YARN-2616
Updating YARN-3249
Updating YARN-2786
Updating HDFS-7855
Sending e-mails to: yarn-dev@hadoop.apache.org
Email was triggered for: Failure
Sending email for trigger: Failure
###################################################################################
############################## FAILED TESTS (if any) ##############################
1 tests failed.
FAILED: org.apache.hadoop.yarn.server.resourcemanager.TestRM.testAppOnMultiNode[1]
Error Message:
test timed out after 30000 milliseconds
Stack Trace:
java.lang.Exception: test timed out after 30000 milliseconds
at sun.misc.Unsafe.park(Native Method)
at java.util.concurrent.locks.LockSupport.park(LockSupport.java:186)
at java.util.concurrent.locks.AbstractQueuedSynchronizer.parkAndCheckInterrupt(AbstractQueuedSynchronizer.java:834)
at java.util.concurrent.locks.AbstractQueuedSynchronizer.doAcquireShared(AbstractQueuedSynchronizer.java:964)
at java.util.concurrent.locks.AbstractQueuedSynchronizer.acquireShared(AbstractQueuedSynchronizer.java:1282)
at java.util.concurrent.locks.ReentrantReadWriteLock$ReadLock.lock(ReentrantReadWriteLock.java:731)
at org.apache.hadoop.yarn.server.resourcemanager.rmapp.attempt.RMAppAttemptImpl.getAppAttemptState(RMAppAttemptImpl.java:481)
at org.apache.hadoop.yarn.server.resourcemanager.MockAM.waitForState(MockAM.java:77)
at org.apache.hadoop.yarn.server.resourcemanager.MockRM.sendAMLaunched(MockRM.java:495)
at org.apache.hadoop.yarn.server.resourcemanager.TestRM.testAppOnMultiNode(TestRM.java:161)