You are viewing a plain text version of this content. The canonical link for it is here.
Posted to commits@flex.apache.org by fl...@gmail.com on 2015/02/04 16:37:32 UTC

flex-sdk_mustella - Build # 1361 - Failure!

flex-sdk_mustella - Build # 1361 - Failure:

http://flex-mustella.cloudapp.net/job/flex-sdk_mustella/1361/

Changes for Build #1361
No changes


--------------------------------

[...truncated 83233 lines...]
     [java] ******** cmdArr after: 
     [java] 	C:\ApacheFlex\dependencies\FlashPlayer_Debug\flashplayer_16_sa_debug.exe
     [java] 	C:\jenkins_slave\workspace\flex-sdk_mustella\mustella\tests\containers\TitleWindow\SWFs\TitleWindow_Mirroring_Basic.swf
     [java] getting directory from the swf file
     [java] derived directory: C:\jenkins_slave\workspace\flex-sdk_mustella\mustella\tests\containers\TitleWindow\SWFs
     [java] Launching: 
     [java]  C:\ApacheFlex\dependencies\FlashPlayer_Debug\flashplayer_16_sa_debug.exe C:\jenkins_slave\workspace\flex-sdk_mustella\mustella\tests\containers\TitleWindow\SWFs\TitleWindow_Mirroring_Basic.swf Launching: C:\ApacheFlex\dependencies\FlashPlayer_Debug\flashplayer_16_sa_debug.exe C:\jenkins_slave\workspace\flex-sdk_mustella\mustella\tests\containers\TitleWindow\SWFs\TitleWindow_Mirroring_Basic.swf
     [java] USING directory: C:\jenkins_slave\workspace\flex-sdk_mustella\mustella\tests\containers\TitleWindow\SWFs
     [java] time: 10:36:36.769
     [java] SCRIPTDONE! 10:36:41.190
     [java] GET /ScriptComplete?0 HTTP/1.1
     [java] Before Wait loop 10:36:41.190 waiting = 0
     [java] After Wait loop 10:36:41.190 waiting = 0
     [java] clobberProcess false
     [java] Total Results so far: 2
     [java] Grab log, do parse = false
     [java] Grabbing the log from: C:\Users\ApacheFlex\AppData/Roaming\Macromedia/Flash Player/Logs/flashlog.txt to: C:\jenkins_slave\workspace\flex-sdk_mustella\mustella\tests\containers\TitleWindow\SWFs\TitleWindow_Mirroring_Basic.log
     [java] new test file: C:\jenkins_slave\workspace\flex-sdk_mustella\mustella\tests\gumbo\components\Application\SWFs\Application_Properties_App1.swf
     [java] ******** cmdArr before: 
     [java] 	C:\ApacheFlex\dependencies\FlashPlayer_Debug\flashplayer_16_sa_debug.exe
     [java] 	C:\jenkins_slave\workspace\flex-sdk_mustella\mustella\tests\gumbo\components\Application\SWFs\Application_Properties_App1.swf
     [java] ******** moreParameters before: 
     [java] ******** cmdArr after: 
     [java] 	C:\ApacheFlex\dependencies\FlashPlayer_Debug\flashplayer_16_sa_debug.exe
     [java] 	C:\jenkins_slave\workspace\flex-sdk_mustella\mustella\tests\gumbo\components\Application\SWFs\Application_Properties_App1.swf
     [java] getting directory from the swf file
     [java] derived directory: C:\jenkins_slave\workspace\flex-sdk_mustella\mustella\tests\gumbo\components\Application\SWFs
     [java] Launching: 
     [java]  C:\ApacheFlex\dependencies\FlashPlayer_Debug\flashplayer_16_sa_debug.exe C:\jenkins_slave\workspace\flex-sdk_mustella\mustella\tests\gumbo\components\Application\SWFs\Application_Properties_App1.swf Launching: C:\ApacheFlex\dependencies\FlashPlayer_Debug\flashplayer_16_sa_debug.exe C:\jenkins_slave\workspace\flex-sdk_mustella\mustella\tests\gumbo\components\Application\SWFs\Application_Properties_App1.swf
     [java] USING directory: C:\jenkins_slave\workspace\flex-sdk_mustella\mustella\tests\gumbo\components\Application\SWFs
     [java] time: 10:36:43.832
     [java] waited 2300
     [java] ClobberProcess, it was already null
     [java] SCRIPTDONE! 10:36:47.325
     [java] GET /ScriptComplete?0 HTTP/1.1
     [java] Before Wait loop 10:36:47.325 waiting = 0
     [java] After Wait loop 10:36:47.325 waiting = 0
     [java] clobberProcess false
     [java] Total Results so far: 3
     [java] Grab log, do parse = false
     [java] Grabbing the log from: C:\Users\ApacheFlex\AppData/Roaming\Macromedia/Flash Player/Logs/flashlog.txt to: C:\jenkins_slave\workspace\flex-sdk_mustella\mustella\tests\gumbo\components\Application\SWFs\Application_Properties_App1.log
     [java] new test file: C:\jenkins_slave\workspace\flex-sdk_mustella\mustella\tests\gumbo\components\Image\swfs\ImageMain.swf
     [java] ******** cmdArr before: 
     [java] 	C:\ApacheFlex\dependencies\FlashPlayer_Debug\flashplayer_16_sa_debug.exe
     [java] 	C:\jenkins_slave\workspace\flex-sdk_mustella\mustella\tests\gumbo\components\Image\swfs\ImageMain.swf
     [java] ******** moreParameters before: 
     [java] ******** cmdArr after: 
     [java] 	C:\ApacheFlex\dependencies\FlashPlayer_Debug\flashplayer_16_sa_debug.exe
     [java] 	C:\jenkins_slave\workspace\flex-sdk_mustella\mustella\tests\gumbo\components\Image\swfs\ImageMain.swf
     [java] getting directory from the swf file
     [java] derived directory: C:\jenkins_slave\workspace\flex-sdk_mustella\mustella\tests\gumbo\components\Image\swfs
     [java] Launching: 
     [java]  C:\ApacheFlex\dependencies\FlashPlayer_Debug\flashplayer_16_sa_debug.exe C:\jenkins_slave\workspace\flex-sdk_mustella\mustella\tests\gumbo\components\Image\swfs\ImageMain.swf Launching: C:\ApacheFlex\dependencies\FlashPlayer_Debug\flashplayer_16_sa_debug.exe C:\jenkins_slave\workspace\flex-sdk_mustella\mustella\tests\gumbo\components\Image\swfs\ImageMain.swf
     [java] USING directory: C:\jenkins_slave\workspace\flex-sdk_mustella\mustella\tests\gumbo\components\Image\swfs
     [java] time: 10:36:50.018
     [java] waited 2400
     [java] ClobberProcess, it was already null
     [java] SCRIPTDONE! 10:36:54.775
     [java] GET /ScriptComplete?0 HTTP/1.1
     [java] Before Wait loop 10:36:54.775 waiting = 0
     [java] After Wait loop 10:36:54.775 waiting = 0
     [java] clobberProcess false
     [java] Total Results so far: 6
     [java] waited 2300
     [java] ClobberProcess, it was already null
     [java] Grab log, do parse = false
     [java] Grabbing the log from: C:\Users\ApacheFlex\AppData/Roaming\Macromedia/Flash Player/Logs/flashlog.txt to: C:\jenkins_slave\workspace\flex-sdk_mustella\mustella\tests\gumbo\components\Image\swfs\ImageMain.log
     [java] new test file: C:\jenkins_slave\workspace\flex-sdk_mustella\mustella\tests\itemRenderers\Spark\List\SWFs\List_itemEditorTests_spark.swf
     [java] ******** cmdArr before: 
     [java] 	C:\ApacheFlex\dependencies\FlashPlayer_Debug\flashplayer_16_sa_debug.exe
     [java] 	C:\jenkins_slave\workspace\flex-sdk_mustella\mustella\tests\itemRenderers\Spark\List\SWFs\List_itemEditorTests_spark.swf
     [java] ******** moreParameters before: 
     [java] ******** cmdArr after: 
     [java] 	C:\ApacheFlex\dependencies\FlashPlayer_Debug\flashplayer_16_sa_debug.exe
     [java] 	C:\jenkins_slave\workspace\flex-sdk_mustella\mustella\tests\itemRenderers\Spark\List\SWFs\List_itemEditorTests_spark.swf
     [java] getting directory from the swf file
     [java] derived directory: C:\jenkins_slave\workspace\flex-sdk_mustella\mustella\tests\itemRenderers\Spark\List\SWFs
     [java] Launching: 
     [java]  C:\ApacheFlex\dependencies\FlashPlayer_Debug\flashplayer_16_sa_debug.exe C:\jenkins_slave\workspace\flex-sdk_mustella\mustella\tests\itemRenderers\Spark\List\SWFs\List_itemEditorTests_spark.swf Launching: C:\ApacheFlex\dependencies\FlashPlayer_Debug\flashplayer_16_sa_debug.exe C:\jenkins_slave\workspace\flex-sdk_mustella\mustella\tests\itemRenderers\Spark\List\SWFs\List_itemEditorTests_spark.swf
     [java] USING directory: C:\jenkins_slave\workspace\flex-sdk_mustella\mustella\tests\itemRenderers\Spark\List\SWFs
     [java] time: 10:36:57.426
     [java] SCRIPTDONE! 10:37:01.158
     [java] GET /ScriptComplete?0 HTTP/1.1
     [java] Before Wait loop 10:37:01.158 waiting = 0
     [java] After Wait loop 10:37:01.158 waiting = 0
     [java] clobberProcess false
     [java] Total Results so far: 7
     [java] waited 2300
     [java] ClobberProcess, it was already null
     [java] Grab log, do parse = false
     [java] Grabbing the log from: C:\Users\ApacheFlex\AppData/Roaming\Macromedia/Flash Player/Logs/flashlog.txt to: C:\jenkins_slave\workspace\flex-sdk_mustella\mustella\tests\itemRenderers\Spark\List\SWFs\List_itemEditorTests_spark.log
     [java] new test file: C:\jenkins_slave\workspace\flex-sdk_mustella\mustella\tests\itemRenderers\Spark\List\SWFs\List_itemRendererTests_spark.swf
     [java] ******** cmdArr before: 
     [java] 	C:\ApacheFlex\dependencies\FlashPlayer_Debug\flashplayer_16_sa_debug.exe
     [java] 	C:\jenkins_slave\workspace\flex-sdk_mustella\mustella\tests\itemRenderers\Spark\List\SWFs\List_itemRendererTests_spark.swf
     [java] ******** moreParameters before: 
     [java] ******** cmdArr after: 
     [java] 	C:\ApacheFlex\dependencies\FlashPlayer_Debug\flashplayer_16_sa_debug.exe
     [java] 	C:\jenkins_slave\workspace\flex-sdk_mustella\mustella\tests\itemRenderers\Spark\List\SWFs\List_itemRendererTests_spark.swf
     [java] getting directory from the swf file
     [java] derived directory: C:\jenkins_slave\workspace\flex-sdk_mustella\mustella\tests\itemRenderers\Spark\List\SWFs
     [java] Launching: 
     [java]  C:\ApacheFlex\dependencies\FlashPlayer_Debug\flashplayer_16_sa_debug.exe C:\jenkins_slave\workspace\flex-sdk_mustella\mustella\tests\itemRenderers\Spark\List\SWFs\List_itemRendererTests_spark.swf Launching: C:\ApacheFlex\dependencies\FlashPlayer_Debug\flashplayer_16_sa_debug.exe C:\jenkins_slave\workspace\flex-sdk_mustella\mustella\tests\itemRenderers\Spark\List\SWFs\List_itemRendererTests_spark.swf
     [java] USING directory: C:\jenkins_slave\workspace\flex-sdk_mustella\mustella\tests\itemRenderers\Spark\List\SWFs
     [java] time: 10:37:03.833
     [java] SCRIPTDONE! 10:37:07.641
     [java] GET /ScriptComplete?0 HTTP/1.1
     [java] Before Wait loop 10:37:07.641 waiting = 0
     [java] After Wait loop 10:37:07.641 waiting = 0
     [java] clobberProcess false
     [java] Total Results so far: 8
     [java] waited 2300
     [java] ClobberProcess, it was already null
     [java] Grab log, do parse = false
     [java] Grabbing the log from: C:\Users\ApacheFlex\AppData/Roaming\Macromedia/Flash Player/Logs/flashlog.txt to: C:\jenkins_slave\workspace\flex-sdk_mustella\mustella\tests\itemRenderers\Spark\List\SWFs\List_itemRendererTests_spark.log
     [java] new test file: C:\jenkins_slave\workspace\flex-sdk_mustella\mustella\tests\mx\states\Transition\SWFs\Transition_AutoReverse.swf
     [java] ******** cmdArr before: 
     [java] 	C:\ApacheFlex\dependencies\FlashPlayer_Debug\flashplayer_16_sa_debug.exe
     [java] 	C:\jenkins_slave\workspace\flex-sdk_mustella\mustella\tests\mx\states\Transition\SWFs\Transition_AutoReverse.swf
     [java] ******** moreParameters before: 
     [java] ******** cmdArr after: 
     [java] 	C:\ApacheFlex\dependencies\FlashPlayer_Debug\flashplayer_16_sa_debug.exe
     [java] 	C:\jenkins_slave\workspace\flex-sdk_mustella\mustella\tests\mx\states\Transition\SWFs\Transition_AutoReverse.swf
     [java] getting directory from the swf file
     [java] derived directory: C:\jenkins_slave\workspace\flex-sdk_mustella\mustella\tests\mx\states\Transition\SWFs
     [java] Launching: 
     [java]  C:\ApacheFlex\dependencies\FlashPlayer_Debug\flashplayer_16_sa_debug.exe C:\jenkins_slave\workspace\flex-sdk_mustella\mustella\tests\mx\states\Transition\SWFs\Transition_AutoReverse.swf Launching: C:\ApacheFlex\dependencies\FlashPlayer_Debug\flashplayer_16_sa_debug.exe C:\jenkins_slave\workspace\flex-sdk_mustella\mustella\tests\mx\states\Transition\SWFs\Transition_AutoReverse.swf
     [java] USING directory: C:\jenkins_slave\workspace\flex-sdk_mustella\mustella\tests\mx\states\Transition\SWFs
     [java] time: 10:37:10.274
     [java] FAIL: mx/states/Transition/properties/Transition_autoReverse Transition_autoReverse_ScaleWipe_Full
     [java] SCRIPTDONE! 10:37:21.188
     [java] GET /ScriptComplete?0 HTTP/1.1
     [java] Before Wait loop 10:37:21.188 waiting = 0
     [java] After Wait loop 10:37:21.188 waiting = 0
     [java] clobberProcess false
     [java] Total Results so far: 11
     [java] waited 2300
     [java] ClobberProcess, it was already null
     [java] Grab log, do parse = false
     [java] Grabbing the log from: C:\Users\ApacheFlex\AppData/Roaming\Macromedia/Flash Player/Logs/flashlog.txt to: C:\jenkins_slave\workspace\flex-sdk_mustella\mustella\tests\mx\states\Transition\SWFs\Transition_AutoReverse.log
     [java] new test file: C:\jenkins_slave\workspace\flex-sdk_mustella\mustella\tests\resources\ResourceManager\SWFs\ResourceManagerApp.swf
     [java] ******** cmdArr before: 
     [java] 	C:\ApacheFlex\dependencies\FlashPlayer_Debug\flashplayer_16_sa_debug.exe
     [java] 	C:\jenkins_slave\workspace\flex-sdk_mustella\mustella\tests\resources\ResourceManager\SWFs\ResourceManagerApp.swf
     [java] ******** moreParameters before: 
     [java] ******** cmdArr after: 
     [java] 	C:\ApacheFlex\dependencies\FlashPlayer_Debug\flashplayer_16_sa_debug.exe
     [java] 	C:\jenkins_slave\workspace\flex-sdk_mustella\mustella\tests\resources\ResourceManager\SWFs\ResourceManagerApp.swf
     [java] getting directory from the swf file
     [java] derived directory: C:\jenkins_slave\workspace\flex-sdk_mustella\mustella\tests\resources\ResourceManager\SWFs
     [java] Launching: 
     [java]  C:\ApacheFlex\dependencies\FlashPlayer_Debug\flashplayer_16_sa_debug.exe C:\jenkins_slave\workspace\flex-sdk_mustella\mustella\tests\resources\ResourceManager\SWFs\ResourceManagerApp.swf Launching: C:\ApacheFlex\dependencies\FlashPlayer_Debug\flashplayer_16_sa_debug.exe C:\jenkins_slave\workspace\flex-sdk_mustella\mustella\tests\resources\ResourceManager\SWFs\ResourceManagerApp.swf
     [java] USING directory: C:\jenkins_slave\workspace\flex-sdk_mustella\mustella\tests\resources\ResourceManager\SWFs
     [java] time: 10:37:23.816
     [java] SCRIPTDONE! 10:37:26.727
     [java] GET /ScriptComplete?0 HTTP/1.1
     [java] Before Wait loop 10:37:26.727 waiting = 0
     [java] After Wait loop 10:37:26.727 waiting = 0
     [java] clobberProcess false
     [java] Total Results so far: 12
     [java] waited 2300
     [java] ClobberProcess, it was already null
     [java] Grab log, do parse = false
     [java] Grabbing the log from: C:\Users\ApacheFlex\AppData/Roaming\Macromedia/Flash Player/Logs/flashlog.txt to: C:\jenkins_slave\workspace\flex-sdk_mustella\mustella\tests\resources\ResourceManager\SWFs\ResourceManagerApp.log
     [java] at the end of main
     [java] Shutting down the results server
     [java] shutting down the baseline server
     [java] done waiting for results...bye
     [java] =====================================================
     [java]     Passes: 11
     [java]     Fails: 1
     [java] =====================================================
     [java] 
     [java] =====================================================
     [java] =====================================================
     [java] 	Passed: 
     [java] =====================================================
     [java] containers/TitleWindow/Mirroring/TitleWindow_Mirroring_tester1 TitleWindow_layout_style1 Passed  
     [java] containers/TitleWindow/Mirroring/TitleWindow_Mirroring_tester1 TitleWindow_layout_style2 Passed  
     [java] gumbo/components/Application/properties/Application_Properties Application_Properties_skin_test7 Passed  
     [java] gumbo/components/Image/properties/Image_properties_scale_align Image_Scale_SDK-26600 Passed  
     [java] gumbo/components/Image/styles/Image_styles_smoothingQuality Image_Scale_stretch_smoothingQuality Passed  
     [java] gumbo/components/Image/styles/Image_styles_smoothingQuality Image_Scale_stretch_smoothingQuality_high Passed  
     [java] itemRenderers/Spark/List/test_scripts/List_itemEditor_spark DateFieldItemEditor_Scrolling Passed  
     [java] itemRenderers/Spark/List/test_scripts/List_itemRenderer_spark DateFieldRenderer_Scrolling Passed  
     [java] mx/states/Transition/properties/Transition_autoReverse Transition_autoReverse_Scale3D_Interrupted Passed  
     [java] mx/states/Transition/properties/Transition_autoReverse Transition_autoReverse_MoveRotate_Full Passed  
     [java] resources/ResourceManager/Integration/ResourceManager_Integration_UIComponent_resourcesChanged ResourceManager_Integration_UIComponent_resourcesChanged_localeChain Passed  
     [java] =====================================================
     [java] 	Failed: 
     [java] =====================================================
     [java] mx/states/Transition/properties/Transition_autoReverse Transition_autoReverse_ScaleWipe_Full Failed AssertPropertyValue(body:step 4)  transTemplate.monitor.passed false != true 
     [java] 
     [java] 
     [java] =====================================================
     [java]     Passes: 11
     [java]     Fails: 1
     [java] =====================================================
     [java] 
     [java] 
     [java] Wrote summary to results.txt
     [java] Wrote failures to failures.txt

BUILD FAILED
C:\jenkins_slave\workspace\flex-sdk_mustella\mustella\build.xml:1547: The following error occurred while executing this line:
C:\jenkins_slave\workspace\flex-sdk_mustella\mustella\build.xml:1665: Java returned: 1

Total time: 2 minutes 40 seconds



============ JENKINS MUSTELLA RUN REPORT ============

Date/Time: 02-04-2015 15:37

Run duration: 0 days 8 hours 34 mins 23 seconds

Settings:
player.version = 16.0
air.version = 16
FLASHPLAYER_DEBUGGER = C:\ApacheFlex\dependencies\FlashPlayer_Debug\flashplayer_16_sa_debug.exe
AIR_HOME = C:\ApacheFlex\dependencies\AdobeAIRSDK\16

Build: 
  type = main
  command = -timeout=60000
  set = -all

Log:
- Made Cygwin ignore carriage returns
- Set FLASH_VERSION to '16.0' and AIR_VERSION to '16'
- Set AIR_HOME to 'C:\ApacheFlex\dependencies\AdobeAIRSDK\16'
- Set FLASHPLAYER_DEBUGGER to 'C:\ApacheFlex\dependencies\FlashPlayer_Debug\flashplayer_16_sa_debug.exe'
- Cleaned up 'local.properties' files from previous runs
- Created fresh 'local.properties' files with containing run specific values
- Ran 'clean', 'main' and 'other.locales' ant targets to prepare the SDK for testing
- Ran Mustella on the SDK with these parameters: '-timeout=60000 -all'
- Some tests failed: running '-failures'
- Some of tests failed, even after running '-failures'...


=====================================================



Build step 'Execute shell' marked build as failure
Archiving artifacts
Email was triggered for: Failure - Any
Sending email for trigger: Failure - Any


(sent from ext-email)

flex-sdk_mustella - Build # 1363 - Fixed!

Posted by fl...@gmail.com.
flex-sdk_mustella - Build # 1363 - Fixed:

http://flex-mustella.cloudapp.net/job/flex-sdk_mustella/1363/

Changes for Build #1361
No changes

Changes for Build #1362
No changes

Changes for Build #1363
No changes


--------------------------------

[...truncated 83204 lines...]
     [java] 	C:\jenkins_slave\workspace\flex-sdk_mustella\mustella\tests\containers\TitleWindow\SWFs\TitleWindow_Mirroring_Basic.swf
     [java] ******** moreParameters before: 
     [java] ******** cmdArr after: 
     [java] 	C:\ApacheFlex\dependencies\FlashPlayer_Debug\flashplayer11_7r700_232_win_sa_debug.exe
     [java] 	C:\jenkins_slave\workspace\flex-sdk_mustella\mustella\tests\containers\TitleWindow\SWFs\TitleWindow_Mirroring_Basic.swf
     [java] getting directory from the swf file
     [java] derived directory: C:\jenkins_slave\workspace\flex-sdk_mustella\mustella\tests\containers\TitleWindow\SWFs
     [java] Launching: 
     [java]  C:\ApacheFlex\dependencies\FlashPlayer_Debug\flashplayer11_7r700_232_win_sa_debug.exe C:\jenkins_slave\workspace\flex-sdk_mustella\mustella\tests\containers\TitleWindow\SWFs\TitleWindow_Mirroring_Basic.swf Launching: C:\ApacheFlex\dependencies\FlashPlayer_Debug\flashplayer11_7r700_232_win_sa_debug.exe C:\jenkins_slave\workspace\flex-sdk_mustella\mustella\tests\containers\TitleWindow\SWFs\TitleWindow_Mirroring_Basic.swf
     [java] USING directory: C:\jenkins_slave\workspace\flex-sdk_mustella\mustella\tests\containers\TitleWindow\SWFs
     [java] time: 06:35:23.708
     [java] SCRIPTDONE! 06:35:28.044
     [java] GET /ScriptComplete?0 HTTP/1.1
     [java] Before Wait loop 06:35:28.044 waiting = 0
     [java] After Wait loop 06:35:28.044 waiting = 0
     [java] clobberProcess false
     [java] Total Results so far: 2
     [java] waited 2300
     [java] ClobberProcess, it was already null
     [java] Grab log, do parse = false
     [java] Grabbing the log from: C:\Users\ApacheFlex\AppData/Roaming\Macromedia/Flash Player/Logs/flashlog.txt to: C:\jenkins_slave\workspace\flex-sdk_mustella\mustella\tests\containers\TitleWindow\SWFs\TitleWindow_Mirroring_Basic.log
     [java] new test file: C:\jenkins_slave\workspace\flex-sdk_mustella\mustella\tests\gumbo\components\Application\SWFs\Application_Properties_App1.swf
     [java] ******** cmdArr before: 
     [java] 	C:\ApacheFlex\dependencies\FlashPlayer_Debug\flashplayer11_7r700_232_win_sa_debug.exe
     [java] 	C:\jenkins_slave\workspace\flex-sdk_mustella\mustella\tests\gumbo\components\Application\SWFs\Application_Properties_App1.swf
     [java] ******** moreParameters before: 
     [java] ******** cmdArr after: 
     [java] 	C:\ApacheFlex\dependencies\FlashPlayer_Debug\flashplayer11_7r700_232_win_sa_debug.exe
     [java] 	C:\jenkins_slave\workspace\flex-sdk_mustella\mustella\tests\gumbo\components\Application\SWFs\Application_Properties_App1.swf
     [java] getting directory from the swf file
     [java] derived directory: C:\jenkins_slave\workspace\flex-sdk_mustella\mustella\tests\gumbo\components\Application\SWFs
     [java] Launching: 
     [java]  C:\ApacheFlex\dependencies\FlashPlayer_Debug\flashplayer11_7r700_232_win_sa_debug.exe C:\jenkins_slave\workspace\flex-sdk_mustella\mustella\tests\gumbo\components\Application\SWFs\Application_Properties_App1.swf Launching: C:\ApacheFlex\dependencies\FlashPlayer_Debug\flashplayer11_7r700_232_win_sa_debug.exe C:\jenkins_slave\workspace\flex-sdk_mustella\mustella\tests\gumbo\components\Application\SWFs\Application_Properties_App1.swf
     [java] USING directory: C:\jenkins_slave\workspace\flex-sdk_mustella\mustella\tests\gumbo\components\Application\SWFs
     [java] time: 06:35:30.711
     [java] SCRIPTDONE! 06:35:34.267
     [java] GET /ScriptComplete?0 HTTP/1.1
     [java] Before Wait loop 06:35:34.267 waiting = 0
     [java] After Wait loop 06:35:34.267 waiting = 0
     [java] clobberProcess false
     [java] Total Results so far: 3
     [java] Grab log, do parse = false
     [java] Grabbing the log from: C:\Users\ApacheFlex\AppData/Roaming\Macromedia/Flash Player/Logs/flashlog.txt to: C:\jenkins_slave\workspace\flex-sdk_mustella\mustella\tests\gumbo\components\Application\SWFs\Application_Properties_App1.log
     [java] new test file: C:\jenkins_slave\workspace\flex-sdk_mustella\mustella\tests\gumbo\components\Image\swfs\ImageMain.swf
     [java] ******** cmdArr before: 
     [java] 	C:\ApacheFlex\dependencies\FlashPlayer_Debug\flashplayer11_7r700_232_win_sa_debug.exe
     [java] 	C:\jenkins_slave\workspace\flex-sdk_mustella\mustella\tests\gumbo\components\Image\swfs\ImageMain.swf
     [java] ******** moreParameters before: 
     [java] ******** cmdArr after: 
     [java] 	C:\ApacheFlex\dependencies\FlashPlayer_Debug\flashplayer11_7r700_232_win_sa_debug.exe
     [java] 	C:\jenkins_slave\workspace\flex-sdk_mustella\mustella\tests\gumbo\components\Image\swfs\ImageMain.swf
     [java] getting directory from the swf file
     [java] derived directory: C:\jenkins_slave\workspace\flex-sdk_mustella\mustella\tests\gumbo\components\Image\swfs
     [java] Launching: 
     [java]  C:\ApacheFlex\dependencies\FlashPlayer_Debug\flashplayer11_7r700_232_win_sa_debug.exe C:\jenkins_slave\workspace\flex-sdk_mustella\mustella\tests\gumbo\components\Image\swfs\ImageMain.swf Launching: C:\ApacheFlex\dependencies\FlashPlayer_Debug\flashplayer11_7r700_232_win_sa_debug.exe C:\jenkins_slave\workspace\flex-sdk_mustella\mustella\tests\gumbo\components\Image\swfs\ImageMain.swf
     [java] USING directory: C:\jenkins_slave\workspace\flex-sdk_mustella\mustella\tests\gumbo\components\Image\swfs
     [java] time: 06:35:36.958
     [java] waited 2400
     [java] ClobberProcess, it was already null
     [java] SCRIPTDONE! 06:35:40.651
     [java] GET /ScriptComplete?0 HTTP/1.1
     [java] Before Wait loop 06:35:40.651 waiting = 0
     [java] After Wait loop 06:35:40.651 waiting = 0
     [java] clobberProcess false
     [java] Total Results so far: 4
     [java] Grab log, do parse = false
     [java] Grabbing the log from: C:\Users\ApacheFlex\AppData/Roaming\Macromedia/Flash Player/Logs/flashlog.txt to: C:\jenkins_slave\workspace\flex-sdk_mustella\mustella\tests\gumbo\components\Image\swfs\ImageMain.log
     [java] new test file: C:\jenkins_slave\workspace\flex-sdk_mustella\mustella\tests\itemRenderers\Halo\List\SWFs\List_itemEditorTests.swf
     [java] ******** cmdArr before: 
     [java] 	C:\ApacheFlex\dependencies\FlashPlayer_Debug\flashplayer11_7r700_232_win_sa_debug.exe
     [java] 	C:\jenkins_slave\workspace\flex-sdk_mustella\mustella\tests\itemRenderers\Halo\List\SWFs\List_itemEditorTests.swf
     [java] ******** moreParameters before: 
     [java] ******** cmdArr after: 
     [java] 	C:\ApacheFlex\dependencies\FlashPlayer_Debug\flashplayer11_7r700_232_win_sa_debug.exe
     [java] 	C:\jenkins_slave\workspace\flex-sdk_mustella\mustella\tests\itemRenderers\Halo\List\SWFs\List_itemEditorTests.swf
     [java] getting directory from the swf file
     [java] derived directory: C:\jenkins_slave\workspace\flex-sdk_mustella\mustella\tests\itemRenderers\Halo\List\SWFs
     [java] Launching: 
     [java]  C:\ApacheFlex\dependencies\FlashPlayer_Debug\flashplayer11_7r700_232_win_sa_debug.exe C:\jenkins_slave\workspace\flex-sdk_mustella\mustella\tests\itemRenderers\Halo\List\SWFs\List_itemEditorTests.swf Launching: C:\ApacheFlex\dependencies\FlashPlayer_Debug\flashplayer11_7r700_232_win_sa_debug.exe C:\jenkins_slave\workspace\flex-sdk_mustella\mustella\tests\itemRenderers\Halo\List\SWFs\List_itemEditorTests.swf
     [java] USING directory: C:\jenkins_slave\workspace\flex-sdk_mustella\mustella\tests\itemRenderers\Halo\List\SWFs
     [java] time: 06:35:43.456
     [java] waited 2500
     [java] ClobberProcess, it was already null
     [java] SCRIPTDONE! 06:35:46.917
     [java] GET /ScriptComplete?0 HTTP/1.1
     [java] Before Wait loop 06:35:46.917 waiting = 0
     [java] After Wait loop 06:35:46.917 waiting = 0
     [java] clobberProcess false
     [java] Total Results so far: 5
     [java] Grab log, do parse = false
     [java] Grabbing the log from: C:\Users\ApacheFlex\AppData/Roaming\Macromedia/Flash Player/Logs/flashlog.txt to: C:\jenkins_slave\workspace\flex-sdk_mustella\mustella\tests\itemRenderers\Halo\List\SWFs\List_itemEditorTests.log
     [java] new test file: C:\jenkins_slave\workspace\flex-sdk_mustella\mustella\tests\itemRenderers\Halo\List\SWFs\List_itemRendererTests.swf
     [java] ******** cmdArr before: 
     [java] 	C:\ApacheFlex\dependencies\FlashPlayer_Debug\flashplayer11_7r700_232_win_sa_debug.exe
     [java] 	C:\jenkins_slave\workspace\flex-sdk_mustella\mustella\tests\itemRenderers\Halo\List\SWFs\List_itemRendererTests.swf
     [java] ******** moreParameters before: 
     [java] ******** cmdArr after: 
     [java] 	C:\ApacheFlex\dependencies\FlashPlayer_Debug\flashplayer11_7r700_232_win_sa_debug.exe
     [java] 	C:\jenkins_slave\workspace\flex-sdk_mustella\mustella\tests\itemRenderers\Halo\List\SWFs\List_itemRendererTests.swf
     [java] getting directory from the swf file
     [java] derived directory: C:\jenkins_slave\workspace\flex-sdk_mustella\mustella\tests\itemRenderers\Halo\List\SWFs
     [java] Launching: 
     [java]  C:\ApacheFlex\dependencies\FlashPlayer_Debug\flashplayer11_7r700_232_win_sa_debug.exe C:\jenkins_slave\workspace\flex-sdk_mustella\mustella\tests\itemRenderers\Halo\List\SWFs\List_itemRendererTests.swf Launching: C:\ApacheFlex\dependencies\FlashPlayer_Debug\flashplayer11_7r700_232_win_sa_debug.exe C:\jenkins_slave\workspace\flex-sdk_mustella\mustella\tests\itemRenderers\Halo\List\SWFs\List_itemRendererTests.swf
     [java] USING directory: C:\jenkins_slave\workspace\flex-sdk_mustella\mustella\tests\itemRenderers\Halo\List\SWFs
     [java] time: 06:35:49.664
     [java] waited 2400
     [java] ClobberProcess, it was already null
     [java] SCRIPTDONE! 06:35:53.212
     [java] GET /ScriptComplete?0 HTTP/1.1
     [java] Before Wait loop 06:35:53.212 waiting = 0
     [java] After Wait loop 06:35:53.212 waiting = 0
     [java] clobberProcess false
     [java] Total Results so far: 6
     [java] Grab log, do parse = false
     [java] Grabbing the log from: C:\Users\ApacheFlex\AppData/Roaming\Macromedia/Flash Player/Logs/flashlog.txt to: C:\jenkins_slave\workspace\flex-sdk_mustella\mustella\tests\itemRenderers\Halo\List\SWFs\List_itemRendererTests.log
     [java] new test file: C:\jenkins_slave\workspace\flex-sdk_mustella\mustella\tests\itemRenderers\Spark\List\SWFs\List_itemRendererTests_spark.swf
     [java] ******** cmdArr before: 
     [java] 	C:\ApacheFlex\dependencies\FlashPlayer_Debug\flashplayer11_7r700_232_win_sa_debug.exe
     [java] 	C:\jenkins_slave\workspace\flex-sdk_mustella\mustella\tests\itemRenderers\Spark\List\SWFs\List_itemRendererTests_spark.swf
     [java] ******** moreParameters before: 
     [java] ******** cmdArr after: 
     [java] 	C:\ApacheFlex\dependencies\FlashPlayer_Debug\flashplayer11_7r700_232_win_sa_debug.exe
     [java] 	C:\jenkins_slave\workspace\flex-sdk_mustella\mustella\tests\itemRenderers\Spark\List\SWFs\List_itemRendererTests_spark.swf
     [java] getting directory from the swf file
     [java] derived directory: C:\jenkins_slave\workspace\flex-sdk_mustella\mustella\tests\itemRenderers\Spark\List\SWFs
     [java] Launching: 
     [java]  C:\ApacheFlex\dependencies\FlashPlayer_Debug\flashplayer11_7r700_232_win_sa_debug.exe C:\jenkins_slave\workspace\flex-sdk_mustella\mustella\tests\itemRenderers\Spark\List\SWFs\List_itemRendererTests_spark.swf Launching: C:\ApacheFlex\dependencies\FlashPlayer_Debug\flashplayer11_7r700_232_win_sa_debug.exe C:\jenkins_slave\workspace\flex-sdk_mustella\mustella\tests\itemRenderers\Spark\List\SWFs\List_itemRendererTests_spark.swf
     [java] USING directory: C:\jenkins_slave\workspace\flex-sdk_mustella\mustella\tests\itemRenderers\Spark\List\SWFs
     [java] time: 06:35:55.907
     [java] waited 2400
     [java] ClobberProcess, it was already null
     [java] SCRIPTDONE! 06:35:59.764
     [java] GET /ScriptComplete?0 HTTP/1.1
     [java] Before Wait loop 06:35:59.764 waiting = 0
     [java] After Wait loop 06:35:59.764 waiting = 0
     [java] clobberProcess false
     [java] Total Results so far: 7
     [java] waited 2300
     [java] ClobberProcess, it was already null
     [java] Grab log, do parse = false
     [java] Grabbing the log from: C:\Users\ApacheFlex\AppData/Roaming\Macromedia/Flash Player/Logs/flashlog.txt to: C:\jenkins_slave\workspace\flex-sdk_mustella\mustella\tests\itemRenderers\Spark\List\SWFs\List_itemRendererTests_spark.log
     [java] new test file: C:\jenkins_slave\workspace\flex-sdk_mustella\mustella\tests\resources\ResourceManager\SWFs\ResourceManagerApp.swf
     [java] ******** cmdArr before: 
     [java] 	C:\ApacheFlex\dependencies\FlashPlayer_Debug\flashplayer11_7r700_232_win_sa_debug.exe
     [java] 	C:\jenkins_slave\workspace\flex-sdk_mustella\mustella\tests\resources\ResourceManager\SWFs\ResourceManagerApp.swf
     [java] ******** moreParameters before: 
     [java] ******** cmdArr after: 
     [java] 	C:\ApacheFlex\dependencies\FlashPlayer_Debug\flashplayer11_7r700_232_win_sa_debug.exe
     [java] 	C:\jenkins_slave\workspace\flex-sdk_mustella\mustella\tests\resources\ResourceManager\SWFs\ResourceManagerApp.swf
     [java] getting directory from the swf file
     [java] derived directory: C:\jenkins_slave\workspace\flex-sdk_mustella\mustella\tests\resources\ResourceManager\SWFs
     [java] Launching: 
     [java]  C:\ApacheFlex\dependencies\FlashPlayer_Debug\flashplayer11_7r700_232_win_sa_debug.exe C:\jenkins_slave\workspace\flex-sdk_mustella\mustella\tests\resources\ResourceManager\SWFs\ResourceManagerApp.swf Launching: C:\ApacheFlex\dependencies\FlashPlayer_Debug\flashplayer11_7r700_232_win_sa_debug.exe C:\jenkins_slave\workspace\flex-sdk_mustella\mustella\tests\resources\ResourceManager\SWFs\ResourceManagerApp.swf
     [java] USING directory: C:\jenkins_slave\workspace\flex-sdk_mustella\mustella\tests\resources\ResourceManager\SWFs
     [java] time: 06:36:02.405
     [java] SCRIPTDONE! 06:36:05.414
     [java] GET /ScriptComplete?0 HTTP/1.1
     [java] Before Wait loop 06:36:05.414 waiting = 0
     [java] After Wait loop 06:36:05.414 waiting = 0
     [java] clobberProcess false
     [java] Total Results so far: 8
     [java] waited 2300
     [java] ClobberProcess, it was already null
     [java] Grab log, do parse = false
     [java] Grabbing the log from: C:\Users\ApacheFlex\AppData/Roaming\Macromedia/Flash Player/Logs/flashlog.txt to: C:\jenkins_slave\workspace\flex-sdk_mustella\mustella\tests\resources\ResourceManager\SWFs\ResourceManagerApp.log
     [java] at the end of main
     [java] Shutting down the results server
     [java] shutting down the baseline server
     [java] done waiting for results...bye
     [java] =====================================================
     [java]     Passes: 8
     [java]     Fails: 0
     [java] =====================================================
     [java] 
     [java] =====================================================
     [java] =====================================================
     [java] 	Passed: 
     [java] =====================================================
     [java] containers/TitleWindow/Mirroring/TitleWindow_Mirroring_tester1 TitleWindow_layout_style1 Passed  
     [java] containers/TitleWindow/Mirroring/TitleWindow_Mirroring_tester1 TitleWindow_layout_style2 Passed  
     [java] gumbo/components/Application/properties/Application_Properties Application_Properties_skin_test7 Passed  
     [java] gumbo/components/Image/styles/Image_styles_smoothingQuality Image_Scale_stretch_smoothingQuality_high Passed  
     [java] itemRenderers/Halo/List/test_scripts/List_itemEditor DateFieldItemEditor_Scrolling Passed  
     [java] itemRenderers/Halo/List/test_scripts/List_itemRenderer DateFieldRenderer_Scrolling Passed  
     [java] itemRenderers/Spark/List/test_scripts/List_itemRenderer_spark DateFieldRenderer_Scrolling Passed  
     [java] resources/ResourceManager/Integration/ResourceManager_Integration_UIComponent_resourcesChanged ResourceManager_Integration_UIComponent_resourcesChanged_localeChain Passed  
     [java] =====================================================
     [java] 	Failed: 
     [java] =====================================================
     [java] 
     [java] 
     [java] =====================================================
     [java]     Passes: 8
     [java]     Fails: 0
     [java] =====================================================
     [java] 
     [java] 
     [java] Wrote summary to results.txt
     [java] Wrote failures to failures.txt

call_runners:

run:

BUILD SUCCESSFUL
Total time: 2 minutes 44 seconds



============ JENKINS MUSTELLA RUN REPORT ============

Date/Time: 02-05-2015 11:36

Run duration: 0 days 8 hours 16 mins 28 seconds

Settings:
player.version = 11.7
air.version = 3.7
FLASHPLAYER_DEBUGGER = C:\ApacheFlex\dependencies\FlashPlayer_Debug\flashplayer11_7r700_232_win_sa_debug.exe
AIR_HOME = C:\ApacheFlex\dependencies\AdobeAIRSDK\3.7

Build: 
  type = main
  command = -timeout=60000
  set = -all

Log:
- Made Cygwin ignore carriage returns
- Set FLASH_VERSION to '11.7' and AIR_VERSION to '3.7'
- Set AIR_HOME to 'C:\ApacheFlex\dependencies\AdobeAIRSDK\3.7'
- Set FLASHPLAYER_DEBUGGER to 'C:\ApacheFlex\dependencies\FlashPlayer_Debug\flashplayer11_7r700_232_win_sa_debug.exe'
- Cleaned up 'local.properties' files from previous runs
- Created fresh 'local.properties' files with containing run specific values
- Ran 'clean', 'main' and 'other.locales' ant targets to prepare the SDK for testing
- Ran Mustella on the SDK with these parameters: '-timeout=60000 -all'
- Some tests failed: running '-failures'
- All tests passed after running '-failures'


=====================================================



Archiving artifacts
WARN: No artifacts found that match the file pattern "mustella/tests/**/*.bad.png". Configuration error?
WARN: java.lang.InterruptedException: no matches found within 10000
Email was triggered for: Fixed
Trigger Success was overridden by another trigger and will not send an email.
Sending email for trigger: Fixed


(sent from ext-email)

flex-sdk_mustella - Build # 1362 - Still Failing!

Posted by fl...@gmail.com.
flex-sdk_mustella - Build # 1362 - Still Failing:

http://flex-mustella.cloudapp.net/job/flex-sdk_mustella/1362/

Changes for Build #1361
No changes

Changes for Build #1362
No changes


--------------------------------

[...truncated 83144 lines...]
     [java] 	C:\ApacheFlex\dependencies\FlashPlayer_Debug\flashplayer11_1r102_55_win_sa_debug_32bit.exe
     [java] 	C:\jenkins_slave\workspace\flex-sdk_mustella\mustella\tests\containers\TitleWindow\SWFs\TitleWindow_Mirroring_Basic.swf
     [java] ******** moreParameters before: 
     [java] ******** cmdArr after: 
     [java] 	C:\ApacheFlex\dependencies\FlashPlayer_Debug\flashplayer11_1r102_55_win_sa_debug_32bit.exe
     [java] 	C:\jenkins_slave\workspace\flex-sdk_mustella\mustella\tests\containers\TitleWindow\SWFs\TitleWindow_Mirroring_Basic.swf
     [java] getting directory from the swf file
     [java] derived directory: C:\jenkins_slave\workspace\flex-sdk_mustella\mustella\tests\containers\TitleWindow\SWFs
     [java] Launching: 
     [java]  C:\ApacheFlex\dependencies\FlashPlayer_Debug\flashplayer11_1r102_55_win_sa_debug_32bit.exe C:\jenkins_slave\workspace\flex-sdk_mustella\mustella\tests\containers\TitleWindow\SWFs\TitleWindow_Mirroring_Basic.swf Launching: C:\ApacheFlex\dependencies\FlashPlayer_Debug\flashplayer11_1r102_55_win_sa_debug_32bit.exe C:\jenkins_slave\workspace\flex-sdk_mustella\mustella\tests\containers\TitleWindow\SWFs\TitleWindow_Mirroring_Basic.swf
     [java] USING directory: C:\jenkins_slave\workspace\flex-sdk_mustella\mustella\tests\containers\TitleWindow\SWFs
     [java] time: 21:08:42.990
     [java] SCRIPTDONE! 21:08:47.233
     [java] GET /ScriptComplete?0 HTTP/1.1
     [java] Before Wait loop 21:08:47.233 waiting = 0
     [java] After Wait loop 21:08:47.233 waiting = 0
     [java] clobberProcess false
     [java] Total Results so far: 3
     [java] waited 2400
     [java] ClobberProcess, it was already null
     [java] Grab log, do parse = false
     [java] Grabbing the log from: C:\Users\ApacheFlex\AppData/Roaming\Macromedia/Flash Player/Logs/flashlog.txt to: C:\jenkins_slave\workspace\flex-sdk_mustella\mustella\tests\containers\TitleWindow\SWFs\TitleWindow_Mirroring_Basic.log
     [java] new test file: C:\jenkins_slave\workspace\flex-sdk_mustella\mustella\tests\gumbo\components\Application\SWFs\Application_Properties_App1.swf
     [java] ******** cmdArr before: 
     [java] 	C:\ApacheFlex\dependencies\FlashPlayer_Debug\flashplayer11_1r102_55_win_sa_debug_32bit.exe
     [java] 	C:\jenkins_slave\workspace\flex-sdk_mustella\mustella\tests\gumbo\components\Application\SWFs\Application_Properties_App1.swf
     [java] ******** moreParameters before: 
     [java] ******** cmdArr after: 
     [java] 	C:\ApacheFlex\dependencies\FlashPlayer_Debug\flashplayer11_1r102_55_win_sa_debug_32bit.exe
     [java] 	C:\jenkins_slave\workspace\flex-sdk_mustella\mustella\tests\gumbo\components\Application\SWFs\Application_Properties_App1.swf
     [java] getting directory from the swf file
     [java] derived directory: C:\jenkins_slave\workspace\flex-sdk_mustella\mustella\tests\gumbo\components\Application\SWFs
     [java] Launching: 
     [java]  C:\ApacheFlex\dependencies\FlashPlayer_Debug\flashplayer11_1r102_55_win_sa_debug_32bit.exe C:\jenkins_slave\workspace\flex-sdk_mustella\mustella\tests\gumbo\components\Application\SWFs\Application_Properties_App1.swf Launching: C:\ApacheFlex\dependencies\FlashPlayer_Debug\flashplayer11_1r102_55_win_sa_debug_32bit.exe C:\jenkins_slave\workspace\flex-sdk_mustella\mustella\tests\gumbo\components\Application\SWFs\Application_Properties_App1.swf
     [java] USING directory: C:\jenkins_slave\workspace\flex-sdk_mustella\mustella\tests\gumbo\components\Application\SWFs
     [java] time: 21:08:49.964
     [java] SCRIPTDONE! 21:08:53.472
     [java] GET /ScriptComplete?0 HTTP/1.1
     [java] Before Wait loop 21:08:53.472 waiting = 0
     [java] After Wait loop 21:08:53.472 waiting = 0
     [java] clobberProcess false
     [java] Total Results so far: 4
     [java] Grab log, do parse = false
     [java] Grabbing the log from: C:\Users\ApacheFlex\AppData/Roaming\Macromedia/Flash Player/Logs/flashlog.txt to: C:\jenkins_slave\workspace\flex-sdk_mustella\mustella\tests\gumbo\components\Application\SWFs\Application_Properties_App1.log
     [java] new test file: C:\jenkins_slave\workspace\flex-sdk_mustella\mustella\tests\gumbo\components\DataGrid\SWFs\DataGrid_LockedRC.swf
     [java] ******** cmdArr before: 
     [java] 	C:\ApacheFlex\dependencies\FlashPlayer_Debug\flashplayer11_1r102_55_win_sa_debug_32bit.exe
     [java] 	C:\jenkins_slave\workspace\flex-sdk_mustella\mustella\tests\gumbo\components\DataGrid\SWFs\DataGrid_LockedRC.swf
     [java] ******** moreParameters before: 
     [java] ******** cmdArr after: 
     [java] 	C:\ApacheFlex\dependencies\FlashPlayer_Debug\flashplayer11_1r102_55_win_sa_debug_32bit.exe
     [java] 	C:\jenkins_slave\workspace\flex-sdk_mustella\mustella\tests\gumbo\components\DataGrid\SWFs\DataGrid_LockedRC.swf
     [java] getting directory from the swf file
     [java] derived directory: C:\jenkins_slave\workspace\flex-sdk_mustella\mustella\tests\gumbo\components\DataGrid\SWFs
     [java] Launching: 
     [java]  C:\ApacheFlex\dependencies\FlashPlayer_Debug\flashplayer11_1r102_55_win_sa_debug_32bit.exe C:\jenkins_slave\workspace\flex-sdk_mustella\mustella\tests\gumbo\components\DataGrid\SWFs\DataGrid_LockedRC.swf Launching: C:\ApacheFlex\dependencies\FlashPlayer_Debug\flashplayer11_1r102_55_win_sa_debug_32bit.exe C:\jenkins_slave\workspace\flex-sdk_mustella\mustella\tests\gumbo\components\DataGrid\SWFs\DataGrid_LockedRC.swf
     [java] USING directory: C:\jenkins_slave\workspace\flex-sdk_mustella\mustella\tests\gumbo\components\DataGrid\SWFs
     [java] time: 21:08:56.130
     [java] waited 2400
     [java] ClobberProcess, it was already null
     [java] SCRIPTDONE! 21:09:00.710
     [java] GET /ScriptComplete?0 HTTP/1.1
     [java] Before Wait loop 21:09:00.710 waiting = 0
     [java] After Wait loop 21:09:00.710 waiting = 0
     [java] clobberProcess false
     [java] Total Results so far: 5
     [java] Grab log, do parse = false
     [java] Grabbing the log from: C:\Users\ApacheFlex\AppData/Roaming\Macromedia/Flash Player/Logs/flashlog.txt to: C:\jenkins_slave\workspace\flex-sdk_mustella\mustella\tests\gumbo\components\DataGrid\SWFs\DataGrid_LockedRC.log
     [java] new test file: C:\jenkins_slave\workspace\flex-sdk_mustella\mustella\tests\gumbo\components\ListDragDrop\swfs\SparkDNDListBasic.swf
     [java] ******** cmdArr before: 
     [java] 	C:\ApacheFlex\dependencies\FlashPlayer_Debug\flashplayer11_1r102_55_win_sa_debug_32bit.exe
     [java] 	C:\jenkins_slave\workspace\flex-sdk_mustella\mustella\tests\gumbo\components\ListDragDrop\swfs\SparkDNDListBasic.swf
     [java] ******** moreParameters before: 
     [java] ******** cmdArr after: 
     [java] 	C:\ApacheFlex\dependencies\FlashPlayer_Debug\flashplayer11_1r102_55_win_sa_debug_32bit.exe
     [java] 	C:\jenkins_slave\workspace\flex-sdk_mustella\mustella\tests\gumbo\components\ListDragDrop\swfs\SparkDNDListBasic.swf
     [java] getting directory from the swf file
     [java] derived directory: C:\jenkins_slave\workspace\flex-sdk_mustella\mustella\tests\gumbo\components\ListDragDrop\swfs
     [java] Launching: 
     [java]  C:\ApacheFlex\dependencies\FlashPlayer_Debug\flashplayer11_1r102_55_win_sa_debug_32bit.exe C:\jenkins_slave\workspace\flex-sdk_mustella\mustella\tests\gumbo\components\ListDragDrop\swfs\SparkDNDListBasic.swf Launching: C:\ApacheFlex\dependencies\FlashPlayer_Debug\flashplayer11_1r102_55_win_sa_debug_32bit.exe C:\jenkins_slave\workspace\flex-sdk_mustella\mustella\tests\gumbo\components\ListDragDrop\swfs\SparkDNDListBasic.swf
     [java] USING directory: C:\jenkins_slave\workspace\flex-sdk_mustella\mustella\tests\gumbo\components\ListDragDrop\swfs
     [java] time: 21:09:03.397
     [java] waited 2400
     [java] ClobberProcess, it was already null
     [java] Wrote file: c:/jenkins_slave/workspace/flex-sdk_mustella/mustella/tests/gumbo/components/ListDragDrop/swfs/../events/baselines/ListAbcDND1_dragDrop.png.bad.png length: 3461
     [java] FAIL: gumbo/components/ListDragDrop/events/SparkDNDList_events ListAbcDND1_dragDrop
     [java] SCRIPTDONE! 21:09:09.611
     [java] GET /ScriptComplete?0 HTTP/1.1
     [java] Before Wait loop 21:09:09.611 waiting = 0
     [java] After Wait loop 21:09:09.611 waiting = 0
     [java] clobberProcess false
     [java] Total Results so far: 7
     [java] Grab log, do parse = false
     [java] Grabbing the log from: C:\Users\ApacheFlex\AppData/Roaming\Macromedia/Flash Player/Logs/flashlog.txt to: C:\jenkins_slave\workspace\flex-sdk_mustella\mustella\tests\gumbo\components\ListDragDrop\swfs\SparkDNDListBasic.log
     [java] waited 2400
     [java] ClobberProcess, it was already null
     [java] new test file: C:\jenkins_slave\workspace\flex-sdk_mustella\mustella\tests\itemRenderers\Halo\List\SWFs\List_itemRendererTests.swf
     [java] ******** cmdArr before: 
     [java] 	C:\ApacheFlex\dependencies\FlashPlayer_Debug\flashplayer11_1r102_55_win_sa_debug_32bit.exe
     [java] 	C:\jenkins_slave\workspace\flex-sdk_mustella\mustella\tests\itemRenderers\Halo\List\SWFs\List_itemRendererTests.swf
     [java] ******** moreParameters before: 
     [java] ******** cmdArr after: 
     [java] 	C:\ApacheFlex\dependencies\FlashPlayer_Debug\flashplayer11_1r102_55_win_sa_debug_32bit.exe
     [java] 	C:\jenkins_slave\workspace\flex-sdk_mustella\mustella\tests\itemRenderers\Halo\List\SWFs\List_itemRendererTests.swf
     [java] getting directory from the swf file
     [java] derived directory: C:\jenkins_slave\workspace\flex-sdk_mustella\mustella\tests\itemRenderers\Halo\List\SWFs
     [java] Launching: 
     [java]  C:\ApacheFlex\dependencies\FlashPlayer_Debug\flashplayer11_1r102_55_win_sa_debug_32bit.exe C:\jenkins_slave\workspace\flex-sdk_mustella\mustella\tests\itemRenderers\Halo\List\SWFs\List_itemRendererTests.swf Launching: C:\ApacheFlex\dependencies\FlashPlayer_Debug\flashplayer11_1r102_55_win_sa_debug_32bit.exe C:\jenkins_slave\workspace\flex-sdk_mustella\mustella\tests\itemRenderers\Halo\List\SWFs\List_itemRendererTests.swf
     [java] USING directory: C:\jenkins_slave\workspace\flex-sdk_mustella\mustella\tests\itemRenderers\Halo\List\SWFs
     [java] time: 21:09:12.334
     [java] SCRIPTDONE! 21:09:15.871
     [java] GET /ScriptComplete?0 HTTP/1.1
     [java] Before Wait loop 21:09:15.871 waiting = 0
     [java] After Wait loop 21:09:15.871 waiting = 0
     [java] clobberProcess false
     [java] Total Results so far: 8
     [java] Grab log, do parse = false
     [java] Grabbing the log from: C:\Users\ApacheFlex\AppData/Roaming\Macromedia/Flash Player/Logs/flashlog.txt to: C:\jenkins_slave\workspace\flex-sdk_mustella\mustella\tests\itemRenderers\Halo\List\SWFs\List_itemRendererTests.log
     [java] new test file: C:\jenkins_slave\workspace\flex-sdk_mustella\mustella\tests\itemRenderers\Spark\List\SWFs\List_itemRendererTests_spark.swf
     [java] ******** cmdArr before: 
     [java] 	C:\ApacheFlex\dependencies\FlashPlayer_Debug\flashplayer11_1r102_55_win_sa_debug_32bit.exe
     [java] 	C:\jenkins_slave\workspace\flex-sdk_mustella\mustella\tests\itemRenderers\Spark\List\SWFs\List_itemRendererTests_spark.swf
     [java] ******** moreParameters before: 
     [java] ******** cmdArr after: 
     [java] 	C:\ApacheFlex\dependencies\FlashPlayer_Debug\flashplayer11_1r102_55_win_sa_debug_32bit.exe
     [java] 	C:\jenkins_slave\workspace\flex-sdk_mustella\mustella\tests\itemRenderers\Spark\List\SWFs\List_itemRendererTests_spark.swf
     [java] getting directory from the swf file
     [java] derived directory: C:\jenkins_slave\workspace\flex-sdk_mustella\mustella\tests\itemRenderers\Spark\List\SWFs
     [java] Launching: 
     [java]  C:\ApacheFlex\dependencies\FlashPlayer_Debug\flashplayer11_1r102_55_win_sa_debug_32bit.exe C:\jenkins_slave\workspace\flex-sdk_mustella\mustella\tests\itemRenderers\Spark\List\SWFs\List_itemRendererTests_spark.swf Launching: C:\ApacheFlex\dependencies\FlashPlayer_Debug\flashplayer11_1r102_55_win_sa_debug_32bit.exe C:\jenkins_slave\workspace\flex-sdk_mustella\mustella\tests\itemRenderers\Spark\List\SWFs\List_itemRendererTests_spark.swf
     [java] USING directory: C:\jenkins_slave\workspace\flex-sdk_mustella\mustella\tests\itemRenderers\Spark\List\SWFs
     [java] time: 21:09:18.493
     [java] waited 2300
     [java] ClobberProcess, it was already null
     [java] SCRIPTDONE! 21:09:22.331
     [java] GET /ScriptComplete?0 HTTP/1.1
     [java] Before Wait loop 21:09:22.331 waiting = 0
     [java] After Wait loop 21:09:22.331 waiting = 0
     [java] clobberProcess false
     [java] Total Results so far: 9
     [java] waited 2400
     [java] ClobberProcess, it was already null
     [java] Grab log, do parse = false
     [java] Grabbing the log from: C:\Users\ApacheFlex\AppData/Roaming\Macromedia/Flash Player/Logs/flashlog.txt to: C:\jenkins_slave\workspace\flex-sdk_mustella\mustella\tests\itemRenderers\Spark\List\SWFs\List_itemRendererTests_spark.log
     [java] new test file: C:\jenkins_slave\workspace\flex-sdk_mustella\mustella\tests\resources\ResourceManager\SWFs\ResourceManagerApp.swf
     [java] ******** cmdArr before: 
     [java] 	C:\ApacheFlex\dependencies\FlashPlayer_Debug\flashplayer11_1r102_55_win_sa_debug_32bit.exe
     [java] 	C:\jenkins_slave\workspace\flex-sdk_mustella\mustella\tests\resources\ResourceManager\SWFs\ResourceManagerApp.swf
     [java] ******** moreParameters before: 
     [java] ******** cmdArr after: 
     [java] 	C:\ApacheFlex\dependencies\FlashPlayer_Debug\flashplayer11_1r102_55_win_sa_debug_32bit.exe
     [java] 	C:\jenkins_slave\workspace\flex-sdk_mustella\mustella\tests\resources\ResourceManager\SWFs\ResourceManagerApp.swf
     [java] getting directory from the swf file
     [java] derived directory: C:\jenkins_slave\workspace\flex-sdk_mustella\mustella\tests\resources\ResourceManager\SWFs
     [java] Launching: 
     [java]  C:\ApacheFlex\dependencies\FlashPlayer_Debug\flashplayer11_1r102_55_win_sa_debug_32bit.exe C:\jenkins_slave\workspace\flex-sdk_mustella\mustella\tests\resources\ResourceManager\SWFs\ResourceManagerApp.swf Launching: C:\ApacheFlex\dependencies\FlashPlayer_Debug\flashplayer11_1r102_55_win_sa_debug_32bit.exe C:\jenkins_slave\workspace\flex-sdk_mustella\mustella\tests\resources\ResourceManager\SWFs\ResourceManagerApp.swf
     [java] USING directory: C:\jenkins_slave\workspace\flex-sdk_mustella\mustella\tests\resources\ResourceManager\SWFs
     [java] time: 21:09:25.057
     [java] SCRIPTDONE! 21:09:28.048
     [java] GET /ScriptComplete?0 HTTP/1.1
     [java] Before Wait loop 21:09:28.048 waiting = 0
     [java] After Wait loop 21:09:28.048 waiting = 0
     [java] clobberProcess false
     [java] Total Results so far: 10
     [java] Grab log, do parse = false
     [java] Grabbing the log from: C:\Users\ApacheFlex\AppData/Roaming\Macromedia/Flash Player/Logs/flashlog.txt to: C:\jenkins_slave\workspace\flex-sdk_mustella\mustella\tests\resources\ResourceManager\SWFs\ResourceManagerApp.log
     [java] at the end of main
     [java] Shutting down the results server
     [java] shutting down the baseline server
     [java] done waiting for results...bye
     [java] =====================================================
     [java]     Passes: 9
     [java]     Fails: 1
     [java] =====================================================
     [java] 
     [java] =====================================================
     [java] =====================================================
     [java] 	Passed: 
     [java] =====================================================
     [java] containers/Accordion/Styles/Accordion_SkinStates_Basic_Spark Accordion_Styles_SkinStates_runtime_SWF_mouseDown_NonselectedTab Passed  
     [java] containers/TitleWindow/Mirroring/TitleWindow_Mirroring_tester1 TitleWindow_layout_style1 Passed  
     [java] containers/TitleWindow/Mirroring/TitleWindow_Mirroring_tester1 TitleWindow_layout_style2 Passed  
     [java] gumbo/components/Application/properties/Application_Properties Application_Properties_skin_test7 Passed  
     [java] gumbo/components/DataGrid/Properties/DataGrid_Properties_lockedRC DataGrid_Properties_LRC_runtimeLock_lockedRowCount10_hScroll Passed  
     [java] gumbo/components/ListDragDrop/events/SparkDNDList_events HListAbcDND1_dragDrop Passed  
     [java] itemRenderers/Halo/List/test_scripts/List_itemRenderer DateFieldRenderer_Scrolling Passed  
     [java] itemRenderers/Spark/List/test_scripts/List_itemRenderer_spark DateFieldRenderer_Scrolling Passed  
     [java] resources/ResourceManager/Integration/ResourceManager_Integration_UIComponent_resourcesChanged ResourceManager_Integration_UIComponent_resourcesChanged_localeChain Passed  
     [java] =====================================================
     [java] 	Failed: 
     [java] =====================================================
     [java] gumbo/components/ListDragDrop/events/SparkDNDList_events ListAbcDND1_dragDrop Failed CompareBitmap(body:step 16)  compare returned[object BitmapData] 
     [java] 
     [java] 
     [java] =====================================================
     [java]     Passes: 9
     [java]     Fails: 1
     [java] =====================================================
     [java] 
     [java] 
     [java] Wrote summary to results.txt
     [java] Wrote failures to failures.txt

BUILD FAILED
C:\jenkins_slave\workspace\flex-sdk_mustella\mustella\build.xml:1547: The following error occurred while executing this line:
C:\jenkins_slave\workspace\flex-sdk_mustella\mustella\build.xml:1665: Java returned: 1

Total time: 2 minutes 48 seconds



============ JENKINS MUSTELLA RUN REPORT ============

Date/Time: 02-05-2015 02:09

Run duration: 0 days 8 hours 15 mins 13 seconds

Settings:
player.version = 11.1
air.version = 3.7
FLASHPLAYER_DEBUGGER = C:\ApacheFlex\dependencies\FlashPlayer_Debug\flashplayer11_1r102_55_win_sa_debug_32bit.exe
AIR_HOME = C:\ApacheFlex\dependencies\AdobeAIRSDK\3.7

Build: 
  type = main
  command = -timeout=60000
  set = -all

Log:
- Made Cygwin ignore carriage returns
- Set FLASH_VERSION to '11.1' and AIR_VERSION to '3.7'
- Set AIR_HOME to 'C:\ApacheFlex\dependencies\AdobeAIRSDK\3.7'
- Set FLASHPLAYER_DEBUGGER to 'C:\ApacheFlex\dependencies\FlashPlayer_Debug\flashplayer11_1r102_55_win_sa_debug_32bit.exe'
- Cleaned up 'local.properties' files from previous runs
- Created fresh 'local.properties' files with containing run specific values
- Ran 'clean', 'main' and 'other.locales' ant targets to prepare the SDK for testing
- Ran Mustella on the SDK with these parameters: '-timeout=60000 -all'
- Some tests failed: running '-failures'
- Some of tests failed, even after running '-failures'...


=====================================================



Build step 'Execute shell' marked build as failure
Archiving artifacts
Email was triggered for: Failure - Any
Sending email for trigger: Failure - Any


(sent from ext-email)