You are viewing a plain text version of this content. The canonical link for it is here.
Posted to dev@lucene.apache.org by Policeman Jenkins Server <je...@thetaphi.de> on 2015/01/14 01:20:09 UTC

[JENKINS] Lucene-Solr-trunk-Linux (64bit/jdk1.8.0_40-ea-b20) - Build # 11595 - Failure!

Build: http://jenkins.thetaphi.de/job/Lucene-Solr-trunk-Linux/11595/
Java: 64bit/jdk1.8.0_40-ea-b20 -XX:-UseCompressedOops -XX:+UseG1GC

1 tests failed.
FAILED:  org.apache.solr.core.TestDynamicLoading.testDistribSearch

Error Message:
Could not successfully add blob after 150 attempts. Expecting 2 items. time elapsed 15,669  output  for url is {   "responseHeader":{     "status":0,     "QTime":1},   "response":{     "numFound":1,     "start":0,     "docs":[{         "id":"test/1",         "md5":"1c045b1c3b68e3855b2ee205c2960ad",         "blobName":"test",         "version":1,         "timestamp":"2015-01-13T23:55:38.216Z",         "size":5318}]}}

Stack Trace:
java.lang.AssertionError: Could not successfully add blob after 150 attempts. Expecting 2 items. time elapsed 15,669  output  for url is {
  "responseHeader":{
    "status":0,
    "QTime":1},
  "response":{
    "numFound":1,
    "start":0,
    "docs":[{
        "id":"test/1",
        "md5":"1c045b1c3b68e3855b2ee205c2960ad",
        "blobName":"test",
        "version":1,
        "timestamp":"2015-01-13T23:55:38.216Z",
        "size":5318}]}}
	at __randomizedtesting.SeedInfo.seed([311CE47160590CA5:B0FA6A6917066C99]:0)
	at org.junit.Assert.fail(Assert.java:93)
	at org.apache.solr.handler.TestBlobHandler.postAndCheck(TestBlobHandler.java:150)
	at org.apache.solr.core.TestDynamicLoading.dynamicLoading(TestDynamicLoading.java:114)
	at org.apache.solr.core.TestDynamicLoading.doTest(TestDynamicLoading.java:70)
	at org.apache.solr.BaseDistributedSearchTestCase.testDistribSearch(BaseDistributedSearchTestCase.java:868)
	at sun.reflect.NativeMethodAccessorImpl.invoke0(Native Method)
	at sun.reflect.NativeMethodAccessorImpl.invoke(NativeMethodAccessorImpl.java:62)
	at sun.reflect.DelegatingMethodAccessorImpl.invoke(DelegatingMethodAccessorImpl.java:43)
	at java.lang.reflect.Method.invoke(Method.java:497)
	at com.carrotsearch.randomizedtesting.RandomizedRunner.invoke(RandomizedRunner.java:1618)
	at com.carrotsearch.randomizedtesting.RandomizedRunner$6.evaluate(RandomizedRunner.java:827)
	at com.carrotsearch.randomizedtesting.RandomizedRunner$7.evaluate(RandomizedRunner.java:863)
	at com.carrotsearch.randomizedtesting.RandomizedRunner$8.evaluate(RandomizedRunner.java:877)
	at com.carrotsearch.randomizedtesting.rules.SystemPropertiesRestoreRule$1.evaluate(SystemPropertiesRestoreRule.java:53)
	at org.apache.lucene.util.TestRuleSetupTeardownChained$1.evaluate(TestRuleSetupTeardownChained.java:50)
	at org.apache.lucene.util.AbstractBeforeAfterRule$1.evaluate(AbstractBeforeAfterRule.java:46)
	at com.carrotsearch.randomizedtesting.rules.SystemPropertiesInvariantRule$1.evaluate(SystemPropertiesInvariantRule.java:55)
	at org.apache.lucene.util.TestRuleThreadAndTestName$1.evaluate(TestRuleThreadAndTestName.java:49)
	at org.apache.lucene.util.TestRuleIgnoreAfterMaxFailures$1.evaluate(TestRuleIgnoreAfterMaxFailures.java:65)
	at org.apache.lucene.util.TestRuleMarkFailure$1.evaluate(TestRuleMarkFailure.java:48)
	at com.carrotsearch.randomizedtesting.rules.StatementAdapter.evaluate(StatementAdapter.java:36)
	at com.carrotsearch.randomizedtesting.ThreadLeakControl$StatementRunner.run(ThreadLeakControl.java:365)
	at com.carrotsearch.randomizedtesting.ThreadLeakControl.forkTimeoutingTask(ThreadLeakControl.java:798)
	at com.carrotsearch.randomizedtesting.ThreadLeakControl$3.evaluate(ThreadLeakControl.java:458)
	at com.carrotsearch.randomizedtesting.RandomizedRunner.runSingleTest(RandomizedRunner.java:836)
	at com.carrotsearch.randomizedtesting.RandomizedRunner$3.evaluate(RandomizedRunner.java:738)
	at com.carrotsearch.randomizedtesting.RandomizedRunner$4.evaluate(RandomizedRunner.java:772)
	at com.carrotsearch.randomizedtesting.RandomizedRunner$5.evaluate(RandomizedRunner.java:783)
	at com.carrotsearch.randomizedtesting.rules.StatementAdapter.evaluate(StatementAdapter.java:36)
	at com.carrotsearch.randomizedtesting.rules.SystemPropertiesRestoreRule$1.evaluate(SystemPropertiesRestoreRule.java:53)
	at org.apache.lucene.util.AbstractBeforeAfterRule$1.evaluate(AbstractBeforeAfterRule.java:46)
	at org.apache.lucene.util.TestRuleStoreClassName$1.evaluate(TestRuleStoreClassName.java:42)
	at com.carrotsearch.randomizedtesting.rules.SystemPropertiesInvariantRule$1.evaluate(SystemPropertiesInvariantRule.java:55)
	at com.carrotsearch.randomizedtesting.rules.NoShadowingOrOverridesOnMethodsRule$1.evaluate(NoShadowingOrOverridesOnMethodsRule.java:39)
	at com.carrotsearch.randomizedtesting.rules.NoShadowingOrOverridesOnMethodsRule$1.evaluate(NoShadowingOrOverridesOnMethodsRule.java:39)
	at com.carrotsearch.randomizedtesting.rules.StatementAdapter.evaluate(StatementAdapter.java:36)
	at com.carrotsearch.randomizedtesting.rules.StatementAdapter.evaluate(StatementAdapter.java:36)
	at com.carrotsearch.randomizedtesting.rules.StatementAdapter.evaluate(StatementAdapter.java:36)
	at org.apache.lucene.util.TestRuleAssertionsRequired$1.evaluate(TestRuleAssertionsRequired.java:54)
	at org.apache.lucene.util.TestRuleMarkFailure$1.evaluate(TestRuleMarkFailure.java:48)
	at org.apache.lucene.util.TestRuleIgnoreAfterMaxFailures$1.evaluate(TestRuleIgnoreAfterMaxFailures.java:65)
	at org.apache.lucene.util.TestRuleIgnoreTestSuites$1.evaluate(TestRuleIgnoreTestSuites.java:55)
	at com.carrotsearch.randomizedtesting.rules.StatementAdapter.evaluate(StatementAdapter.java:36)
	at com.carrotsearch.randomizedtesting.ThreadLeakControl$StatementRunner.run(ThreadLeakControl.java:365)
	at java.lang.Thread.run(Thread.java:745)




Build Log:
[...truncated 9089 lines...]
   [junit4] Suite: org.apache.solr.core.TestDynamicLoading
   [junit4]   2> Creating dataDir: /mnt/ssd/jenkins/workspace/Lucene-Solr-trunk-Linux/solr/build/solr-core/test/J1/temp/solr.core.TestDynamicLoading 311CE47160590CA5-001/init-core-data-001
   [junit4]   2> 409675 T1600 oas.SolrTestCaseJ4.buildSSLConfig Randomized ssl (false) and clientAuth (true)
   [junit4]   2> 409675 T1600 oas.BaseDistributedSearchTestCase.initHostContext Setting hostContext system property: /
   [junit4]   2> 409677 T1600 oas.SolrTestCaseJ4.setUp ###Starting testDown
   [junit4]   2> 409677 T1600 oasc.ZkTestServer.run STARTING ZK TEST SERVER
   [junit4]   1> client port:0.0.0.0/0.0.0.0:0
   [junit4]   2> 409678 T1601 oasc.ZkTestServer$ZKServerMain.runFromConfig Starting server
   [junit4]   2> 409778 T1600 oasc.ZkTestServer.run start zk server on port:45329
   [junit4]   2> 409778 T1600 oascc.SolrZkClient.createZkCredentialsToAddAutomatically Using default ZkCredentialsProvider
   [junit4]   2> 409779 T1600 oascc.ConnectionManager.waitForConnected Waiting for client to connect to ZooKeeper
   [junit4]   2> 409784 T1608 oascc.ConnectionManager.process Watcher org.apache.solr.common.cloud.ConnectionManager@7e12b121 name:ZooKeeperConnection Watcher:127.0.0.1:45329 got event WatchedEvent state:SyncConnected type:None path:null path:null type:None
   [junit4]   2> 409785 T1600 oascc.ConnectionManager.waitForConnected Client is connected to ZooKeeper
   [junit4]   2> 409785 T1600 oascc.SolrZkClient.createZkACLProvider Using default ZkACLProvider
   [junit4]   2> 409785 T1600 oascc.SolrZkClient.makePath makePath: /solr
   [junit4]   2> 409788 T1600 oascc.SolrZkClient.createZkCredentialsToAddAutomatically Using default ZkCredentialsProvider
   [junit4]   2> 409788 T1600 oascc.ConnectionManager.waitForConnected Waiting for client to connect to ZooKeeper
   [junit4]   2> 409790 T1611 oascc.ConnectionManager.process Watcher org.apache.solr.common.cloud.ConnectionManager@36d2a83e name:ZooKeeperConnection Watcher:127.0.0.1:45329/solr got event WatchedEvent state:SyncConnected type:None path:null path:null type:None
   [junit4]   2> 409790 T1600 oascc.ConnectionManager.waitForConnected Client is connected to ZooKeeper
   [junit4]   2> 409791 T1600 oascc.SolrZkClient.createZkACLProvider Using default ZkACLProvider
   [junit4]   2> 409791 T1600 oascc.SolrZkClient.makePath makePath: /collections/collection1
   [junit4]   2> 409793 T1600 oascc.SolrZkClient.makePath makePath: /collections/collection1/shards
   [junit4]   2> 409794 T1600 oascc.SolrZkClient.makePath makePath: /collections/control_collection
   [junit4]   2> 409795 T1600 oascc.SolrZkClient.makePath makePath: /collections/control_collection/shards
   [junit4]   2> 409796 T1600 oasc.AbstractZkTestCase.putConfig put /mnt/ssd/jenkins/workspace/Lucene-Solr-trunk-Linux/solr/core/src/test-files/solr/collection1/conf/solrconfig-tlog.xml to /configs/conf1/solrconfig.xml
   [junit4]   2> 409796 T1600 oascc.SolrZkClient.makePath makePath: /configs/conf1/solrconfig.xml
   [junit4]   2> 409798 T1600 oasc.AbstractZkTestCase.putConfig put /mnt/ssd/jenkins/workspace/Lucene-Solr-trunk-Linux/solr/core/src/test-files/solr/collection1/conf/schema.xml to /configs/conf1/schema.xml
   [junit4]   2> 409798 T1600 oascc.SolrZkClient.makePath makePath: /configs/conf1/schema.xml
   [junit4]   2> 409800 T1600 oasc.AbstractZkTestCase.putConfig put /mnt/ssd/jenkins/workspace/Lucene-Solr-trunk-Linux/solr/core/src/test-files/solr/collection1/conf/solrconfig.snippet.randomindexconfig.xml to /configs/conf1/solrconfig.snippet.randomindexconfig.xml
   [junit4]   2> 409800 T1600 oascc.SolrZkClient.makePath makePath: /configs/conf1/solrconfig.snippet.randomindexconfig.xml
   [junit4]   2> 409801 T1600 oasc.AbstractZkTestCase.putConfig put /mnt/ssd/jenkins/workspace/Lucene-Solr-trunk-Linux/solr/core/src/test-files/solr/collection1/conf/stopwords.txt to /configs/conf1/stopwords.txt
   [junit4]   2> 409801 T1600 oascc.SolrZkClient.makePath makePath: /configs/conf1/stopwords.txt
   [junit4]   2> 409802 T1600 oasc.AbstractZkTestCase.putConfig put /mnt/ssd/jenkins/workspace/Lucene-Solr-trunk-Linux/solr/core/src/test-files/solr/collection1/conf/protwords.txt to /configs/conf1/protwords.txt
   [junit4]   2> 409803 T1600 oascc.SolrZkClient.makePath makePath: /configs/conf1/protwords.txt
   [junit4]   2> 409804 T1600 oasc.AbstractZkTestCase.putConfig put /mnt/ssd/jenkins/workspace/Lucene-Solr-trunk-Linux/solr/core/src/test-files/solr/collection1/conf/currency.xml to /configs/conf1/currency.xml
   [junit4]   2> 409804 T1600 oascc.SolrZkClient.makePath makePath: /configs/conf1/currency.xml
   [junit4]   2> 409816 T1600 oasc.AbstractZkTestCase.putConfig put /mnt/ssd/jenkins/workspace/Lucene-Solr-trunk-Linux/solr/core/src/test-files/solr/collection1/conf/enumsConfig.xml to /configs/conf1/enumsConfig.xml
   [junit4]   2> 409817 T1600 oascc.SolrZkClient.makePath makePath: /configs/conf1/enumsConfig.xml
   [junit4]   2> 409819 T1600 oasc.AbstractZkTestCase.putConfig put /mnt/ssd/jenkins/workspace/Lucene-Solr-trunk-Linux/solr/core/src/test-files/solr/collection1/conf/open-exchange-rates.json to /configs/conf1/open-exchange-rates.json
   [junit4]   2> 409819 T1600 oascc.SolrZkClient.makePath makePath: /configs/conf1/open-exchange-rates.json
   [junit4]   2> 409820 T1600 oasc.AbstractZkTestCase.putConfig put /mnt/ssd/jenkins/workspace/Lucene-Solr-trunk-Linux/solr/core/src/test-files/solr/collection1/conf/mapping-ISOLatin1Accent.txt to /configs/conf1/mapping-ISOLatin1Accent.txt
   [junit4]   2> 409820 T1600 oascc.SolrZkClient.makePath makePath: /configs/conf1/mapping-ISOLatin1Accent.txt
   [junit4]   2> 409822 T1600 oasc.AbstractZkTestCase.putConfig put /mnt/ssd/jenkins/workspace/Lucene-Solr-trunk-Linux/solr/core/src/test-files/solr/collection1/conf/old_synonyms.txt to /configs/conf1/old_synonyms.txt
   [junit4]   2> 409822 T1600 oascc.SolrZkClient.makePath makePath: /configs/conf1/old_synonyms.txt
   [junit4]   2> 409823 T1600 oasc.AbstractZkTestCase.putConfig put /mnt/ssd/jenkins/workspace/Lucene-Solr-trunk-Linux/solr/core/src/test-files/solr/collection1/conf/synonyms.txt to /configs/conf1/synonyms.txt
   [junit4]   2> 409823 T1600 oascc.SolrZkClient.makePath makePath: /configs/conf1/synonyms.txt
   [junit4]   2> 409826 T1600 oas.SolrTestCaseJ4.tearDown ###Ending testDown
   [junit4]   2> 409826 T1600 oasc.ZkTestServer.send4LetterWord connecting to 127.0.0.1:45329 45329
   [junit4]   2> 410371 T1601 oasc.ZkTestServer.send4LetterWord connecting to 127.0.0.1:45329 45329
   [junit4]   2> 410373 T1600 oas.SolrTestCaseJ4.tearDown ###Ending testDown
   [junit4]   2> 410373 T1600 oasc.ZkTestServer.send4LetterWord connecting to 127.0.0.1:45329 45329
   [junit4]   2> 410374 T1600 oas.SolrTestCaseJ4.tearDown ###Ending testDown
   [junit4]   2> 410374 T1600 oasc.ZkTestServer.send4LetterWord connecting to 127.0.0.1:45329 45329
   [junit4]   2> 410379 T1600 oas.SolrTestCaseJ4.setUp ###Starting testDistribSearch
   [junit4]   2> 410380 T1600 oasc.ZkTestServer.run STARTING ZK TEST SERVER
   [junit4]   1> client port:0.0.0.0/0.0.0.0:0
   [junit4]   2> 410380 T1612 oasc.ZkTestServer$ZKServerMain.runFromConfig Starting server
   [junit4]   2> 410480 T1600 oasc.ZkTestServer.run start zk server on port:51711
   [junit4]   2> 410481 T1600 oascc.SolrZkClient.createZkCredentialsToAddAutomatically Using default ZkCredentialsProvider
   [junit4]   2> 410481 T1600 oascc.ConnectionManager.waitForConnected Waiting for client to connect to ZooKeeper
   [junit4]   2> 410486 T1619 oascc.ConnectionManager.process Watcher org.apache.solr.common.cloud.ConnectionManager@22266dc8 name:ZooKeeperConnection Watcher:127.0.0.1:51711 got event WatchedEvent state:SyncConnected type:None path:null path:null type:None
   [junit4]   2> 410487 T1600 oascc.ConnectionManager.waitForConnected Client is connected to ZooKeeper
   [junit4]   2> 410487 T1600 oascc.SolrZkClient.createZkACLProvider Using default ZkACLProvider
   [junit4]   2> 410487 T1600 oascc.SolrZkClient.makePath makePath: /solr
   [junit4]   2> 410489 T1600 oascc.SolrZkClient.createZkCredentialsToAddAutomatically Using default ZkCredentialsProvider
   [junit4]   2> 410490 T1600 oascc.ConnectionManager.waitForConnected Waiting for client to connect to ZooKeeper
   [junit4]   2> 410497 T1622 oascc.ConnectionManager.process Watcher org.apache.solr.common.cloud.ConnectionManager@5f5df6dc name:ZooKeeperConnection Watcher:127.0.0.1:51711/solr got event WatchedEvent state:SyncConnected type:None path:null path:null type:None
   [junit4]   2> 410498 T1600 oascc.ConnectionManager.waitForConnected Client is connected to ZooKeeper
   [junit4]   2> 410498 T1600 oascc.SolrZkClient.createZkACLProvider Using default ZkACLProvider
   [junit4]   2> 410498 T1600 oascc.SolrZkClient.makePath makePath: /collections/collection1
   [junit4]   2> 410501 T1600 oascc.SolrZkClient.makePath makePath: /collections/collection1/shards
   [junit4]   2> 410502 T1600 oascc.SolrZkClient.makePath makePath: /collections/control_collection
   [junit4]   2> 410503 T1600 oascc.SolrZkClient.makePath makePath: /collections/control_collection/shards
   [junit4]   2> 410504 T1600 oasc.AbstractZkTestCase.putConfig put /mnt/ssd/jenkins/workspace/Lucene-Solr-trunk-Linux/solr/core/src/test-files/solr/collection1/conf/solrconfig-tlog.xml to /configs/conf1/solrconfig.xml
   [junit4]   2> 410504 T1600 oascc.SolrZkClient.makePath makePath: /configs/conf1/solrconfig.xml
   [junit4]   2> 410506 T1600 oasc.AbstractZkTestCase.putConfig put /mnt/ssd/jenkins/workspace/Lucene-Solr-trunk-Linux/solr/core/src/test-files/solr/collection1/conf/schema.xml to /configs/conf1/schema.xml
   [junit4]   2> 410506 T1600 oascc.SolrZkClient.makePath makePath: /configs/conf1/schema.xml
   [junit4]   2> 410508 T1600 oasc.AbstractZkTestCase.putConfig put /mnt/ssd/jenkins/workspace/Lucene-Solr-trunk-Linux/solr/core/src/test-files/solr/collection1/conf/solrconfig.snippet.randomindexconfig.xml to /configs/conf1/solrconfig.snippet.randomindexconfig.xml
   [junit4]   2> 410508 T1600 oascc.SolrZkClient.makePath makePath: /configs/conf1/solrconfig.snippet.randomindexconfig.xml
   [junit4]   2> 410509 T1600 oasc.AbstractZkTestCase.putConfig put /mnt/ssd/jenkins/workspace/Lucene-Solr-trunk-Linux/solr/core/src/test-files/solr/collection1/conf/stopwords.txt to /configs/conf1/stopwords.txt
   [junit4]   2> 410510 T1600 oascc.SolrZkClient.makePath makePath: /configs/conf1/stopwords.txt
   [junit4]   2> 410511 T1600 oasc.AbstractZkTestCase.putConfig put /mnt/ssd/jenkins/workspace/Lucene-Solr-trunk-Linux/solr/core/src/test-files/solr/collection1/conf/protwords.txt to /configs/conf1/protwords.txt
   [junit4]   2> 410511 T1600 oascc.SolrZkClient.makePath makePath: /configs/conf1/protwords.txt
   [junit4]   2> 410512 T1600 oasc.AbstractZkTestCase.putConfig put /mnt/ssd/jenkins/workspace/Lucene-Solr-trunk-Linux/solr/core/src/test-files/solr/collection1/conf/currency.xml to /configs/conf1/currency.xml
   [junit4]   2> 410513 T1600 oascc.SolrZkClient.makePath makePath: /configs/conf1/currency.xml
   [junit4]   2> 410514 T1600 oasc.AbstractZkTestCase.putConfig put /mnt/ssd/jenkins/workspace/Lucene-Solr-trunk-Linux/solr/core/src/test-files/solr/collection1/conf/enumsConfig.xml to /configs/conf1/enumsConfig.xml
   [junit4]   2> 410514 T1600 oascc.SolrZkClient.makePath makePath: /configs/conf1/enumsConfig.xml
   [junit4]   2> 410515 T1600 oasc.AbstractZkTestCase.putConfig put /mnt/ssd/jenkins/workspace/Lucene-Solr-trunk-Linux/solr/core/src/test-files/solr/collection1/conf/open-exchange-rates.json to /configs/conf1/open-exchange-rates.json
   [junit4]   2> 410515 T1600 oascc.SolrZkClient.makePath makePath: /configs/conf1/open-exchange-rates.json
   [junit4]   2> 410517 T1600 oasc.AbstractZkTestCase.putConfig put /mnt/ssd/jenkins/workspace/Lucene-Solr-trunk-Linux/solr/core/src/test-files/solr/collection1/conf/mapping-ISOLatin1Accent.txt to /configs/conf1/mapping-ISOLatin1Accent.txt
   [junit4]   2> 410517 T1600 oascc.SolrZkClient.makePath makePath: /configs/conf1/mapping-ISOLatin1Accent.txt
   [junit4]   2> 410518 T1600 oasc.AbstractZkTestCase.putConfig put /mnt/ssd/jenkins/workspace/Lucene-Solr-trunk-Linux/solr/core/src/test-files/solr/collection1/conf/old_synonyms.txt to /configs/conf1/old_synonyms.txt
   [junit4]   2> 410518 T1600 oascc.SolrZkClient.makePath makePath: /configs/conf1/old_synonyms.txt
   [junit4]   2> 410520 T1600 oasc.AbstractZkTestCase.putConfig put /mnt/ssd/jenkins/workspace/Lucene-Solr-trunk-Linux/solr/core/src/test-files/solr/collection1/conf/synonyms.txt to /configs/conf1/synonyms.txt
   [junit4]   2> 410520 T1600 oascc.SolrZkClient.makePath makePath: /configs/conf1/synonyms.txt
   [junit4]   2> 410764 T1600 oejs.Server.doStart jetty-9.2.6.v20141205
   [junit4]   2> 410783 T1600 oejsh.ContextHandler.doStart Started o.e.j.s.ServletContextHandler@a0cf17d{/,null,AVAILABLE}
   [junit4]   2> 410786 T1600 oejs.AbstractConnector.doStart Started ServerConnector@186bbbba{HTTP/1.1}{127.0.0.1:55326}
   [junit4]   2> 410786 T1600 oejs.Server.doStart Started @412030ms
   [junit4]   2> 410787 T1600 oass.SolrDispatchFilter.init SolrDispatchFilter.init()sun.misc.Launcher$AppClassLoader@4e0e2f2a
   [junit4]   2> 410787 T1600 oasc.SolrResourceLoader.locateSolrHome JNDI not configured for solr (NoInitialContextEx)
   [junit4]   2> 410787 T1600 oasc.SolrResourceLoader.locateSolrHome using system property solr.solr.home: /mnt/ssd/jenkins/workspace/Lucene-Solr-trunk-Linux/solr/build/solr-core/test/J1/temp/solr.core.TestDynamicLoading 311CE47160590CA5-001/tempDir-003
   [junit4]   2> 410788 T1600 oasc.SolrResourceLoader.<init> new SolrResourceLoader for directory: '/mnt/ssd/jenkins/workspace/Lucene-Solr-trunk-Linux/solr/build/solr-core/test/J1/temp/solr.core.TestDynamicLoading 311CE47160590CA5-001/tempDir-003/'
   [junit4]   2> 410798 T1600 oasc.ConfigSolr.fromFile Loading container configuration from /mnt/ssd/jenkins/workspace/Lucene-Solr-trunk-Linux/solr/build/solr-core/test/J1/temp/solr.core.TestDynamicLoading 311CE47160590CA5-001/tempDir-003/solr.xml
   [junit4]   2> 410807 T1600 oasc.CoreContainer.<init> New CoreContainer 233968674
   [junit4]   2> 410807 T1600 oasc.CoreContainer.load Loading cores into CoreContainer [instanceDir=/mnt/ssd/jenkins/workspace/Lucene-Solr-trunk-Linux/solr/build/solr-core/test/J1/temp/solr.core.TestDynamicLoading 311CE47160590CA5-001/tempDir-003/]
   [junit4]   2> 410808 T1600 oashc.HttpShardHandlerFactory.getParameter Setting socketTimeout to: 90000
   [junit4]   2> 410808 T1600 oashc.HttpShardHandlerFactory.getParameter Setting urlScheme to: 
   [junit4]   2> 410808 T1600 oashc.HttpShardHandlerFactory.getParameter Setting connTimeout to: 15000
   [junit4]   2> 410809 T1600 oashc.HttpShardHandlerFactory.getParameter Setting maxConnectionsPerHost to: 20
   [junit4]   2> 410809 T1600 oashc.HttpShardHandlerFactory.getParameter Setting maxConnections to: 10000
   [junit4]   2> 410809 T1600 oashc.HttpShardHandlerFactory.getParameter Setting corePoolSize to: 0
   [junit4]   2> 410809 T1600 oashc.HttpShardHandlerFactory.getParameter Setting maximumPoolSize to: 2147483647
   [junit4]   2> 410809 T1600 oashc.HttpShardHandlerFactory.getParameter Setting maxThreadIdleTime to: 5
   [junit4]   2> 410810 T1600 oashc.HttpShardHandlerFactory.getParameter Setting sizeOfQueue to: -1
   [junit4]   2> 410810 T1600 oashc.HttpShardHandlerFactory.getParameter Setting fairnessPolicy to: false
   [junit4]   2> 410810 T1600 oasu.UpdateShardHandler.<init> Creating UpdateShardHandler HTTP client with params: socketTimeout=340000&connTimeout=45000&retry=false
   [junit4]   2> 410810 T1600 oasl.LogWatcher.createWatcher SLF4J impl is org.slf4j.impl.Log4jLoggerFactory
   [junit4]   2> 410811 T1600 oasl.LogWatcher.newRegisteredLogWatcher Registering Log Listener [Log4j (org.slf4j.impl.Log4jLoggerFactory)]
   [junit4]   2> 410811 T1600 oasc.CoreContainer.load Host Name: 127.0.0.1
   [junit4]   2> 410811 T1600 oasc.ZkContainer.initZooKeeper Zookeeper client=127.0.0.1:51711/solr
   [junit4]   2> 410811 T1600 oasc.ZkController.checkChrootPath zkHost includes chroot
   [junit4]   2> 410812 T1600 oascc.SolrZkClient.createZkCredentialsToAddAutomatically Using default ZkCredentialsProvider
   [junit4]   2> 410812 T1600 oascc.ConnectionManager.waitForConnected Waiting for client to connect to ZooKeeper
   [junit4]   2> 410814 T1636 oascc.ConnectionManager.process Watcher org.apache.solr.common.cloud.ConnectionManager@388635e name:ZooKeeperConnection Watcher:127.0.0.1:51711 got event WatchedEvent state:SyncConnected type:None path:null path:null type:None
   [junit4]   2> 410815 T1600 oascc.ConnectionManager.waitForConnected Client is connected to ZooKeeper
   [junit4]   2> 410815 T1600 oascc.SolrZkClient.createZkACLProvider Using default ZkACLProvider
   [junit4]   2> 410817 T1600 oascc.ConnectionManager.waitForConnected Waiting for client to connect to ZooKeeper
   [junit4]   2> 410820 T1639 oascc.ConnectionManager.process Watcher org.apache.solr.common.cloud.ConnectionManager@68ecc49b name:ZooKeeperConnection Watcher:127.0.0.1:51711/solr got event WatchedEvent state:SyncConnected type:None path:null path:null type:None
   [junit4]   2> 410820 T1600 oascc.ConnectionManager.waitForConnected Client is connected to ZooKeeper
   [junit4]   2> 410822 T1600 oascc.SolrZkClient.makePath makePath: /overseer/queue
   [junit4]   2> 410824 T1600 oascc.SolrZkClient.makePath makePath: /overseer/collection-queue-work
   [junit4]   2> 410825 T1600 oascc.SolrZkClient.makePath makePath: /overseer/collection-map-running
   [junit4]   2> 410827 T1600 oascc.SolrZkClient.makePath makePath: /overseer/collection-map-completed
   [junit4]   2> 410829 T1600 oascc.SolrZkClient.makePath makePath: /overseer/collection-map-failure
   [junit4]   2> 410830 T1600 oascc.SolrZkClient.makePath makePath: /live_nodes
   [junit4]   2> 410831 T1600 oasc.ZkController.createEphemeralLiveNode Register node as live in ZooKeeper:/live_nodes/127.0.0.1:55326_
   [junit4]   2> 410832 T1600 oascc.SolrZkClient.makePath makePath: /live_nodes/127.0.0.1:55326_
   [junit4]   2> 410833 T1600 oascc.SolrZkClient.makePath makePath: /overseer_elect
   [junit4]   2> 410834 T1600 oascc.SolrZkClient.makePath makePath: /overseer_elect/election
   [junit4]   2> 410835 T1600 oasc.Overseer.close Overseer (id=null) closing
   [junit4]   2> 410835 T1600 oasc.OverseerElectionContext.runLeaderProcess I am going to be the leader 127.0.0.1:55326_
   [junit4]   2> 410836 T1600 oascc.SolrZkClient.makePath makePath: /overseer_elect/leader
   [junit4]   2> 410837 T1600 oasc.Overseer.start Overseer (id=93139325610229763-127.0.0.1:55326_-n_0000000000) starting
   [junit4]   2> 410838 T1600 oascc.SolrZkClient.makePath makePath: /overseer/queue-work
   [junit4]   2> 410841 T1600 oasc.OverseerAutoReplicaFailoverThread.<init> Starting OverseerAutoReplicaFailoverThread autoReplicaFailoverWorkLoopDelay=10000 autoReplicaFailoverWaitAfterExpiration=30000 autoReplicaFailoverBadNodeExpiration=60000
   [junit4]   2> 410842 T1641 oasc.OverseerCollectionProcessor.run Process current queue of collection creations
   [junit4]   2> 410842 T1600 oascc.SolrZkClient.makePath makePath: /clusterstate.json
   [junit4]   2> 410844 T1600 oascc.SolrZkClient.makePath makePath: /aliases.json
   [junit4]   2> 410845 T1600 oascc.ZkStateReader.createClusterStateWatchersAndUpdate Updating cluster state from ZooKeeper... 
   [junit4]   2> 410847 T1640 oasc.Overseer$ClusterStateUpdater.run Starting to work on the main queue
   [junit4]   2> 410848 T1643 oasc.ZkController.publish publishing core=collection1 state=down collection=control_collection
   [junit4]   2> 410848 T1643 oasc.ZkController.publish numShards not found on descriptor - reading it from system property
   [junit4]   2> 410849 T1639 oasc.DistributedQueue$LatchWatcher.process NodeChildrenChanged fired on path /overseer/queue state SyncConnected
   [junit4]   2> 410849 T1643 oasc.ZkController.waitForCoreNodeName look for our core node name
   [junit4]   2> 410850 T1640 oasc.Overseer$ClusterStateUpdater.run processMessage: queueSize: 0, message = {
   [junit4]   2> 	  "core":"collection1",
   [junit4]   2> 	  "roles":null,
   [junit4]   2> 	  "base_url":"http://127.0.0.1:55326",
   [junit4]   2> 	  "node_name":"127.0.0.1:55326_",
   [junit4]   2> 	  "numShards":"1",
   [junit4]   2> 	  "state":"down",
   [junit4]   2> 	  "shard":null,
   [junit4]   2> 	  "collection":"control_collection",
   [junit4]   2> 	  "operation":"state"} current state version: 0
   [junit4]   2> 410851 T1640 oasco.ReplicaMutator.updateState Update state numShards=1 message={
   [junit4]   2> 	  "core":"collection1",
   [junit4]   2> 	  "roles":null,
   [junit4]   2> 	  "base_url":"http://127.0.0.1:55326",
   [junit4]   2> 	  "node_name":"127.0.0.1:55326_",
   [junit4]   2> 	  "numShards":"1",
   [junit4]   2> 	  "state":"down",
   [junit4]   2> 	  "shard":null,
   [junit4]   2> 	  "collection":"control_collection",
   [junit4]   2> 	  "operation":"state"}
   [junit4]   2> 410851 T1640 oasco.ClusterStateMutator.createCollection building a new cName: control_collection
   [junit4]   2> 410851 T1640 oasco.ReplicaMutator.updateState Assigning new node to shard shard=shard1
   [junit4]   2> 410852 T1639 oascc.ZkStateReader$2.process A cluster state change: WatchedEvent state:SyncConnected type:NodeDataChanged path:/clusterstate.json, has occurred - updating... (live nodes size: 1)
   [junit4]   2> 411849 T1643 oasc.ZkController.waitForShardId waiting to find shard id in clusterstate for collection1
   [junit4]   2> 411849 T1643 oasc.ZkController.createCollectionZkNode Check for collection zkNode:control_collection
   [junit4]   2> 411850 T1643 oasc.ZkController.createCollectionZkNode Collection zkNode exists
   [junit4]   2> 411850 T1643 oascc.ZkStateReader.readConfigName Load collection config from:/collections/control_collection
   [junit4]   2> 411851 T1643 oascc.ZkStateReader.readConfigName path=/collections/control_collection configName=conf1 specified config exists in ZooKeeper
   [junit4]   2> 411851 T1643 oasc.SolrResourceLoader.<init> new SolrResourceLoader for directory: '/mnt/ssd/jenkins/workspace/Lucene-Solr-trunk-Linux/solr/build/solr-core/test/J1/temp/solr.core.TestDynamicLoading 311CE47160590CA5-001/tempDir-003/collection1/'
   [junit4]   2> 411851 T1643 oasc.SolrResourceLoader.replaceClassLoader Adding 'file:/mnt/ssd/jenkins/workspace/Lucene-Solr-trunk-Linux/solr/build/solr-core/test/J1/temp/solr.core.TestDynamicLoading%20311CE47160590CA5-001/tempDir-003/collection1/lib/.svn/' to classloader
   [junit4]   2> 411851 T1643 oasc.SolrResourceLoader.replaceClassLoader Adding 'file:/mnt/ssd/jenkins/workspace/Lucene-Solr-trunk-Linux/solr/build/solr-core/test/J1/temp/solr.core.TestDynamicLoading%20311CE47160590CA5-001/tempDir-003/collection1/lib/classes/' to classloader
   [junit4]   2> 411852 T1643 oasc.SolrResourceLoader.replaceClassLoader Adding 'file:/mnt/ssd/jenkins/workspace/Lucene-Solr-trunk-Linux/solr/build/solr-core/test/J1/temp/solr.core.TestDynamicLoading%20311CE47160590CA5-001/tempDir-003/collection1/lib/README' to classloader
   [junit4]   2> 411861 T1643 oasc.ZkController.watchZKConfDir watch zkdir /configs/conf1
   [junit4]   2> 411862 T1643 oasc.Config.<init> loaded config solrconfig.xml with version 0 
   [junit4]   2> 411866 T1643 oasc.SolrConfig.refreshRequestParams current version of requestparams : -1
   [junit4]   2> 411870 T1643 oasc.SolrConfig.<init> Using Lucene MatchVersion: 6.0.0
   [junit4]   2> 411879 T1643 oasc.SolrConfig.<init> Loaded SolrConfig: solrconfig.xml
   [junit4]   2> 411879 T1643 oass.IndexSchema.readSchema Reading Solr Schema from /configs/conf1/schema.xml
   [junit4]   2> 411884 T1643 oass.IndexSchema.readSchema [collection1] Schema name=test
   [junit4]   2> 411975 T1643 oass.OpenExchangeRatesOrgProvider.init Initialized with rates=open-exchange-rates.json, refreshInterval=1440.
   [junit4]   2> 411978 T1643 oass.IndexSchema.readSchema default search field in schema is text
   [junit4]   2> 411979 T1643 oass.IndexSchema.readSchema unique key field: id
   [junit4]   2> 411985 T1643 oass.FileExchangeRateProvider.reload Reloading exchange rates from file currency.xml
   [junit4]   2> 411987 T1643 oass.FileExchangeRateProvider.reload Reloading exchange rates from file currency.xml
   [junit4]   2> 411989 T1643 oass.OpenExchangeRatesOrgProvider.reload Reloading exchange rates from open-exchange-rates.json
   [junit4]   2> 411989 T1643 oass.OpenExchangeRatesOrgProvider$OpenExchangeRates.<init> WARN Unknown key IMPORTANT NOTE
   [junit4]   2> 411989 T1643 oass.OpenExchangeRatesOrgProvider$OpenExchangeRates.<init> WARN Expected key, got STRING
   [junit4]   2> 411989 T1643 oass.OpenExchangeRatesOrgProvider.reload Reloading exchange rates from open-exchange-rates.json
   [junit4]   2> 411990 T1643 oass.OpenExchangeRatesOrgProvider$OpenExchangeRates.<init> WARN Unknown key IMPORTANT NOTE
   [junit4]   2> 411990 T1643 oass.OpenExchangeRatesOrgProvider$OpenExchangeRates.<init> WARN Expected key, got STRING
   [junit4]   2> 411990 T1643 oasc.CoreContainer.create Creating SolrCore 'collection1' using configuration from collection control_collection
   [junit4]   2> 411990 T1643 oasc.SolrCore.initDirectoryFactory org.apache.solr.core.MockDirectoryFactory
   [junit4]   2> 411991 T1643 oasc.SolrCore.<init> [collection1] Opening new SolrCore at /mnt/ssd/jenkins/workspace/Lucene-Solr-trunk-Linux/solr/build/solr-core/test/J1/temp/solr.core.TestDynamicLoading 311CE47160590CA5-001/tempDir-003/collection1/, dataDir=/mnt/ssd/jenkins/workspace/Lucene-Solr-trunk-Linux/solr/build/solr-core/test/J1/temp/solr.core.TestDynamicLoading 311CE47160590CA5-001/tempDir-002/control/data/
   [junit4]   2> 411991 T1643 oasc.JmxMonitoredMap.<init> JMX monitoring is enabled. Adding Solr mbeans to JMX Server: com.sun.jmx.mbeanserver.JmxMBeanServer@172b2815
   [junit4]   2> 411991 T1643 oasc.CachingDirectoryFactory.get return new directory for /mnt/ssd/jenkins/workspace/Lucene-Solr-trunk-Linux/solr/build/solr-core/test/J1/temp/solr.core.TestDynamicLoading 311CE47160590CA5-001/tempDir-002/control/data
   [junit4]   2> 411991 T1643 oasc.SolrCore.getNewIndexDir New index directory detected: old=null new=/mnt/ssd/jenkins/workspace/Lucene-Solr-trunk-Linux/solr/build/solr-core/test/J1/temp/solr.core.TestDynamicLoading 311CE47160590CA5-001/tempDir-002/control/data/index/
   [junit4]   2> 411992 T1643 oasc.SolrCore.initIndex WARN [collection1] Solr index directory '/mnt/ssd/jenkins/workspace/Lucene-Solr-trunk-Linux/solr/build/solr-core/test/J1/temp/solr.core.TestDynamicLoading 311CE47160590CA5-001/tempDir-002/control/data/index' doesn't exist. Creating new index...
   [junit4]   2> 411992 T1643 oasc.CachingDirectoryFactory.get return new directory for /mnt/ssd/jenkins/workspace/Lucene-Solr-trunk-Linux/solr/build/solr-core/test/J1/temp/solr.core.TestDynamicLoading 311CE47160590CA5-001/tempDir-002/control/data/index
   [junit4]   2> 411992 T1643 oasu.RandomMergePolicy.<init> RandomMergePolicy wrapping class org.apache.lucene.index.TieredMergePolicy: [TieredMergePolicy: maxMergeAtOnce=38, maxMergeAtOnceExplicit=47, maxMergedSegmentMB=22.0, floorSegmentMB=0.2392578125, forceMergeDeletesPctAllowed=22.055732698967546, segmentsPerTier=25.0, maxCFSSegmentSizeMB=8.796093022207999E12, noCFSRatio=0.42370587619276046
   [junit4]   2> 411993 T1643 oasc.SolrDeletionPolicy.onCommit SolrDeletionPolicy.onCommit: commits: num=1
   [junit4]   2> 		commit{dir=MockDirectoryWrapper(RAMDirectory@1813d311 lockFactory=org.apache.lucene.store.SingleInstanceLockFactory@616a0204),segFN=segments_1,generation=1}
   [junit4]   2> 411993 T1643 oasc.SolrDeletionPolicy.updateCommits newest commit generation = 1
   [junit4]   2> 411995 T1643 oasup.UpdateRequestProcessorChain.init creating updateRequestProcessorChain "nodistrib"
   [junit4]   2> 411995 T1643 oasup.UpdateRequestProcessorChain.init creating updateRequestProcessorChain "dedupe"
   [junit4]   2> 411995 T1643 oasup.UpdateRequestProcessorChain.init inserting DistributedUpdateProcessorFactory into updateRequestProcessorChain "dedupe"
   [junit4]   2> 411995 T1643 oasup.UpdateRequestProcessorChain.init creating updateRequestProcessorChain "stored_sig"
   [junit4]   2> 411995 T1643 oasup.UpdateRequestProcessorChain.init inserting DistributedUpdateProcessorFactory into updateRequestProcessorChain "stored_sig"
   [junit4]   2> 411995 T1643 oasup.UpdateRequestProcessorChain.init creating updateRequestProcessorChain "distrib-dup-test-chain-explicit"
   [junit4]   2> 411996 T1643 oasup.UpdateRequestProcessorChain.init creating updateRequestProcessorChain "distrib-dup-test-chain-implicit"
   [junit4]   2> 411996 T1643 oasup.UpdateRequestProcessorChain.init inserting DistributedUpdateProcessorFactory into updateRequestProcessorChain "distrib-dup-test-chain-implicit"
   [junit4]   2> 411996 T1643 oasc.SolrCore.loadUpdateProcessorChains no updateRequestProcessorChain defined as default, creating implicit default
   [junit4]   2> 411996 T1643 oasc.RequestHandlers.initHandlersFromConfig created /update: org.apache.solr.handler.UpdateRequestHandler
   [junit4]   2> 411997 T1643 oasc.RequestHandlers.initHandlersFromConfig created /update/json: org.apache.solr.handler.UpdateRequestHandler
   [junit4]   2> 411997 T1643 oasc.RequestHandlers.initHandlersFromConfig created /update/csv: org.apache.solr.handler.UpdateRequestHandler
   [junit4]   2> 411997 T1643 oasc.RequestHandlers.initHandlersFromConfig created /update/json/docs: org.apache.solr.handler.UpdateRequestHandler
   [junit4]   2> 411997 T1643 oasc.RequestHandlers.initHandlersFromConfig created /config: org.apache.solr.handler.SolrConfigHandler
   [junit4]   2> 411997 T1643 oasc.RequestHandlers.initHandlersFromConfig created /schema: org.apache.solr.handler.SchemaHandler
   [junit4]   2> 411998 T1643 oasc.RequestHandlers.initHandlersFromConfig created /replication: org.apache.solr.handler.ReplicationHandler
   [junit4]   2> 411998 T1643 oasc.RequestHandlers.initHandlersFromConfig created /get: org.apache.solr.handler.RealTimeGetHandler
   [junit4]   2> 411998 T1643 oasc.RequestHandlers.initHandlersFromConfig created /admin/luke: org.apache.solr.handler.admin.LukeRequestHandler
   [junit4]   2> 411999 T1643 oasc.RequestHandlers.initHandlersFromConfig created /admin/system: org.apache.solr.handler.admin.SystemInfoHandler
   [junit4]   2> 411999 T1643 oasc.RequestHandlers.initHandlersFromConfig created /admin/mbeans: org.apache.solr.handler.admin.SolrInfoMBeanHandler
   [junit4]   2> 411999 T1643 oasc.RequestHandlers.initHandlersFromConfig created /admin/plugins: org.apache.solr.handler.admin.PluginInfoHandler
   [junit4]   2> 411999 T1643 oasc.RequestHandlers.initHandlersFromConfig created /admin/threads: org.apache.solr.handler.admin.ThreadDumpHandler
   [junit4]   2> 412000 T1643 oasc.RequestHandlers.initHandlersFromConfig created /admin/properties: org.apache.solr.handler.admin.PropertiesRequestHandler
   [junit4]   2> 412000 T1643 oasc.RequestHandlers.initHandlersFromConfig created /admin/logging: org.apache.solr.handler.admin.LoggingHandler
   [junit4]   2> 412000 T1643 oasc.RequestHandlers.initHandlersFromConfig created /admin/ping: org.apache.solr.handler.PingRequestHandler
   [junit4]   2> 412000 T1643 oasc.RequestHandlers.initHandlersFromConfig created standard: solr.StandardRequestHandler
   [junit4]   2> 412001 T1643 oasc.RequestHandlers.initHandlersFromConfig created /admin/file: solr.admin.ShowFileRequestHandler
   [junit4]   2> 412002 T1643 oashl.XMLLoader.init xsltCacheLifetimeSeconds=60
   [junit4]   2> 412003 T1643 oashl.XMLLoader.init xsltCacheLifetimeSeconds=60
   [junit4]   2> 412003 T1643 oashl.XMLLoader.init xsltCacheLifetimeSeconds=60
   [junit4]   2> 412004 T1643 oashl.XMLLoader.init xsltCacheLifetimeSeconds=60
   [junit4]   2> 412004 T1643 oasc.SolrCore.initStatsCache Using default statsCache cache: org.apache.solr.search.stats.LocalStatsCache
   [junit4]   2> 412005 T1643 oasu.CommitTracker.<init> Hard AutoCommit: disabled
   [junit4]   2> 412005 T1643 oasu.CommitTracker.<init> Soft AutoCommit: disabled
   [junit4]   2> 412006 T1643 oasu.RandomMergePolicy.<init> RandomMergePolicy wrapping class org.apache.lucene.index.AlcoholicMergePolicy: [AlcoholicMergePolicy: minMergeSize=0, mergeFactor=10, maxMergeSize=368075249, maxMergeSizeForForcedMerge=9223372036854775807, calibrateSizeByDeletes=true, maxMergeDocs=2147483647, maxCFSSegmentSizeMB=8.796093022207999E12, noCFSRatio=0.1]
   [junit4]   2> 412006 T1643 oasc.SolrDeletionPolicy.onInit SolrDeletionPolicy.onInit: commits: num=1
   [junit4]   2> 		commit{dir=MockDirectoryWrapper(RAMDirectory@1813d311 lockFactory=org.apache.lucene.store.SingleInstanceLockFactory@616a0204),segFN=segments_1,generation=1}
   [junit4]   2> 412006 T1643 oasc.SolrDeletionPolicy.updateCommits newest commit generation = 1
   [junit4]   2> 412006 T1643 oass.SolrIndexSearcher.<init> Opening Searcher@5682bc7d[collection1] main
   [junit4]   2> 412007 T1643 oascc.ZkStateReader.readConfigName Load collection config from:/collections/control_collection
   [junit4]   2> 412007 T1643 oascc.ZkStateReader.readConfigName path=/collections/control_collection configName=conf1 specified config exists in ZooKeeper
   [junit4]   2> 412007 T1643 oasr.ManagedResourceStorage.newStorageIO Setting up ZooKeeper-based storage for the RestManager with znodeBase: /configs/conf1
   [junit4]   2> 412008 T1643 oasr.ManagedResourceStorage$ZooKeeperStorageIO.configure Configured ZooKeeperStorageIO with znodeBase: /configs/conf1
   [junit4]   2> 412008 T1643 oasr.RestManager.init Initializing RestManager with initArgs: {}
   [junit4]   2> 412008 T1643 oasr.ManagedResourceStorage.load Reading _rest_managed.json using ZooKeeperStorageIO:path=/configs/conf1
   [junit4]   2> 412008 T1643 oasr.ManagedResourceStorage$ZooKeeperStorageIO.openInputStream No data found for znode /configs/conf1/_rest_managed.json
   [junit4]   2> 412008 T1643 oasr.ManagedResourceStorage.load Loaded null at path _rest_managed.json using ZooKeeperStorageIO:path=/configs/conf1
   [junit4]   2> 412008 T1643 oasr.RestManager.init Initializing 0 registered ManagedResources
   [junit4]   2> 412009 T1643 oash.ReplicationHandler.inform Commits will be reserved for  10000
   [junit4]   2> 412009 T1644 oasc.SolrCore.registerSearcher [collection1] Registered new searcher Searcher@5682bc7d[collection1] main{ExitableDirectoryReader(UninvertingDirectoryReader())}
   [junit4]   2> 412010 T1643 oasc.CoreContainer.registerCore registering core: collection1
   [junit4]   2> 412010 T1647 oasc.ZkController.register Register replica - core:collection1 address:http://127.0.0.1:55326 collection:control_collection shard:shard1
   [junit4]   2> 412010 T1600 oass.SolrDispatchFilter.init user.dir=/mnt/ssd/jenkins/workspace/Lucene-Solr-trunk-Linux/solr/build/solr-core/test/J1
   [junit4]   2> 412011 T1600 oass.SolrDispatchFilter.init SolrDispatchFilter.init() done
   [junit4]   2> 412011 T1647 oascc.SolrZkClient.makePath makePath: /collections/control_collection/leader_elect/shard1/election
   [junit4]   2> 412011 T1600 oascc.SolrZkClient.createZkCredentialsToAddAutomatically Using default ZkCredentialsProvider
   [junit4]   2> 412012 T1600 oascc.ConnectionManager.waitForConnected Waiting for client to connect to ZooKeeper
   [junit4]   2> 412015 T1650 oascc.ConnectionManager.process Watcher org.apache.solr.common.cloud.ConnectionManager@664e49bc name:ZooKeeperConnection Watcher:127.0.0.1:51711/solr got event WatchedEvent state:SyncConnected type:None path:null path:null type:None
   [junit4]   2> 412015 T1600 oascc.ConnectionManager.waitForConnected Client is connected to ZooKeeper
   [junit4]   2> 412016 T1600 oascc.SolrZkClient.createZkACLProvider Using default ZkACLProvider
   [junit4]   2> 412017 T1600 oascc.ZkStateReader.createClusterStateWatchersAndUpdate Updating cluster state from ZooKeeper... 
   [junit4]   2> 412017 T1647 oasc.ShardLeaderElectionContext.runLeaderProcess Running the leader process for shard shard1
   [junit4]   2> 412018 T1639 oasc.DistributedQueue$LatchWatcher.process NodeChildrenChanged fired on path /overseer/queue state SyncConnected
   [junit4]   2> 412019 T1647 oasc.ShardLeaderElectionContext.waitForReplicasToComeUp Enough replicas found to continue.
   [junit4]   2> 412019 T1647 oasc.ShardLeaderElectionContext.runLeaderProcess I may be the new leader - try and sync
   [junit4]   2> ASYNC  NEW_CORE C400 name=collection1 org.apache.solr.core.SolrCore@2feac203 url=http://127.0.0.1:55326/collection1 node=127.0.0.1:55326_ C400_STATE=coll:control_collection core:collection1 props:{core=collection1, base_url=http://127.0.0.1:55326, node_name=127.0.0.1:55326_, state=down}
   [junit4]   2> 412019 T1647 C400 P55326 oasc.SyncStrategy.sync Sync replicas to http://127.0.0.1:55326/collection1/
   [junit4]   2> 412019 T1640 oasc.Overseer$ClusterStateUpdater.run processMessage: queueSize: 1, message = {
   [junit4]   2> 	  "operation":"leader",
   [junit4]   2> 	  "shard":"shard1",
   [junit4]   2> 	  "collection":"control_collection"} current state version: 1
   [junit4]   2> 412019 T1600 oasc.ChaosMonkey.monkeyLog monkey: init - expire sessions:false cause connection loss:false
   [junit4]   2> 412019 T1647 C400 P55326 oasc.SyncStrategy.syncReplicas Sync Success - now sync replicas to me
   [junit4]   2> 412020 T1647 C400 P55326 oasc.SyncStrategy.syncToMe http://127.0.0.1:55326/collection1/ has no replicas
   [junit4]   2> 412020 T1647 oasc.ShardLeaderElectionContext.runLeaderProcess I am the new leader: http://127.0.0.1:55326/collection1/ shard1
   [junit4]   2> 412020 T1647 oascc.SolrZkClient.makePath makePath: /collections/control_collection/leaders/shard1
   [junit4]   2> 412022 T1639 oasc.DistributedQueue$LatchWatcher.process NodeChildrenChanged fired on path /overseer/queue state SyncConnected
   [junit4]   2> 412022 T1640 oasc.Overseer$ClusterStateUpdater.run processMessage: queueSize: 1, message = {
   [junit4]   2> 	  "operation":"leader",
   [junit4]   2> 	  "shard":"shard1",
   [junit4]   2> 	  "collection":"control_collection",
   [junit4]   2> 	  "base_url":"http://127.0.0.1:55326",
   [junit4]   2> 	  "core":"collection1",
   [junit4]   2> 	  "state":"active"} current state version: 1
   [junit4]   2> 412124 T1639 oascc.ZkStateReader$2.process A cluster state change: WatchedEvent state:SyncConnected type:NodeDataChanged path:/clusterstate.json, has occurred - updating... (live nodes size: 1)
   [junit4]   2> 412124 T1650 oascc.ZkStateReader$2.process A cluster state change: WatchedEvent state:SyncConnected type:NodeDataChanged path:/clusterstate.json, has occurred - updating... (live nodes size: 1)
   [junit4]   2> 412173 T1647 oasc.ZkController.register We are http://127.0.0.1:55326/collection1/ and leader is http://127.0.0.1:55326/collection1/
   [junit4]   2> 412173 T1647 oasc.ZkController.register No LogReplay needed for core=collection1 baseURL=http://127.0.0.1:55326
   [junit4]   2> 412173 T1647 oasc.ZkController.checkRecovery I am the leader, no recovery necessary
   [junit4]   2> 412173 T1647 oasc.ZkController.publish publishing core=collection1 state=active collection=control_collection
   [junit4]   2> 412173 T1647 oasc.ZkController.publish numShards not found on descriptor - reading it from system property
   [junit4]   2> 412174 T1639 oasc.DistributedQueue$LatchWatcher.process NodeChildrenChanged fired on path /overseer/queue state SyncConnected
   [junit4]   2> 412176 T1640 oasc.Overseer$ClusterStateUpdater.run processMessage: queueSize: 1, message = {
   [junit4]   2> 	  "core":"collection1",
   [junit4]   2> 	  "core_node_name":"core_node1",
   [junit4]   2> 	  "roles":null,
   [junit4]   2> 	  "base_url":"http://127.0.0.1:55326",
   [junit4]   2> 	  "node_name":"127.0.0.1:55326_",
   [junit4]   2> 	  "numShards":"2",
   [junit4]   2> 	  "state":"active",
   [junit4]   2> 	  "shard":"shard1",
   [junit4]   2> 	  "collection":"control_collection",
   [junit4]   2> 	  "operation":"state"} current state version: 2
   [junit4]   2> 412176 T1640 oasco.ReplicaMutator.updateState Update state numShards=2 message={
   [junit4]   2> 	  "core":"collection1",
   [junit4]   2> 	  "core_node_name":"core_node1",
   [junit4]   2> 	  "roles":null,
   [junit4]   2> 	  "base_url":"http://127.0.0.1:55326",
   [junit4]   2> 	  "node_name":"127.0.0.1:55326_",
   [junit4]   2> 	  "numShards":"2",
   [junit4]   2> 	  "state":"active",
   [junit4]   2> 	  "shard":"shard1",
   [junit4]   2> 	  "collection":"control_collection",
   [junit4]   2> 	  "operation":"state"}
   [junit4]   2> 412278 T1639 oascc.ZkStateReader$2.process A cluster state change: WatchedEvent state:SyncConnected type:NodeDataChanged path:/clusterstate.json, has occurred - updating... (live nodes size: 1)
   [junit4]   2> 412278 T1650 oascc.ZkStateReader$2.process A cluster state change: WatchedEvent state:SyncConnected type:NodeDataChanged path:/clusterstate.json, has occurred - updating... (live nodes size: 1)
   [junit4]   2> 412281 T1600 oasc.AbstractFullDistribZkTestBase.createJettys create jetty 1
   [junit4]   2> 412282 T1600 oejs.Server.doStart jetty-9.2.6.v20141205
   [junit4]   2> 412284 T1600 oejsh.ContextHandler.doStart Started o.e.j.s.ServletContextHandler@4b24e4d5{/,null,AVAILABLE}
   [junit4]   2> 412285 T1600 oejs.AbstractConnector.doStart Started ServerConnector@5f34595b{HTTP/1.1}{127.0.0.1:37857}
   [junit4]   2> 412285 T1600 oejs.Server.doStart Started @413528ms
   [junit4]   2> 412285 T1600 oass.SolrDispatchFilter.init SolrDispatchFilter.init()sun.misc.Launcher$AppClassLoader@4e0e2f2a
   [junit4]   2> 412286 T1600 oasc.SolrResourceLoader.locateSolrHome JNDI not configured for solr (NoInitialContextEx)
   [junit4]   2> 412286 T1600 oasc.SolrResourceLoader.locateSolrHome using system property solr.solr.home: /mnt/ssd/jenkins/workspace/Lucene-Solr-trunk-Linux/solr/build/solr-core/test/J1/temp/solr.core.TestDynamicLoading 311CE47160590CA5-001/tempDir-004
   [junit4]   2> 412286 T1600 oasc.SolrResourceLoader.<init> new SolrResourceLoader for directory: '/mnt/ssd/jenkins/workspace/Lucene-Solr-trunk-Linux/solr/build/solr-core/test/J1/temp/solr.core.TestDynamicLoading 311CE47160590CA5-001/tempDir-004/'
   [junit4]   2> 412296 T1600 oasc.ConfigSolr.fromFile Loading container configuration from /mnt/ssd/jenkins/workspace/Lucene-Solr-trunk-Linux/solr/build/solr-core/test/J1/temp/solr.core.TestDynamicLoading 311CE47160590CA5-001/tempDir-004/solr.xml
   [junit4]   2> 412304 T1600 oasc.CoreContainer.<init> New CoreContainer 258023365
   [junit4]   2> 412305 T1600 oasc.CoreContainer.load Loading cores into CoreContainer [instanceDir=/mnt/ssd/jenkins/workspace/Lucene-Solr-trunk-Linux/solr/build/solr-core/test/J1/temp/solr.core.TestDynamicLoading 311CE47160590CA5-001/tempDir-004/]
   [junit4]   2> 412305 T1600 oashc.HttpShardHandlerFactory.getParameter Setting socketTimeout to: 90000
   [junit4]   2> 412305 T1600 oashc.HttpShardHandlerFactory.getParameter Setting urlScheme to: 
   [junit4]   2> 412305 T1600 oashc.HttpShardHandlerFactory.getParameter Setting connTimeout to: 15000
   [junit4]   2> 412306 T1600 oashc.HttpShardHandlerFactory.getParameter Setting maxConnectionsPerHost to: 20
   [junit4]   2> 412306 T1600 oashc.HttpShardHandlerFactory.getParameter Setting maxConnections to: 10000
   [junit4]   2> 412306 T1600 oashc.HttpShardHandlerFactory.getParameter Setting corePoolSize to: 0
   [junit4]   2> 412306 T1600 oashc.HttpShardHandlerFactory.getParameter Setting maximumPoolSize to: 2147483647
   [junit4]   2> 412306 T1600 oashc.HttpShardHandlerFactory.getParameter Setting maxThreadIdleTime to: 5
   [junit4]   2> 412307 T1600 oashc.HttpShardHandlerFactory.getParameter Setting sizeOfQueue to: -1
   [junit4]   2> 412307 T1600 oashc.HttpShardHandlerFactory.getParameter Setting fairnessPolicy to: false
   [junit4]   2> 412307 T1600 oasu.UpdateShardHandler.<init> Creating UpdateShardHandler HTTP client with params: socketTimeout=340000&connTimeout=45000&retry=false
   [junit4]   2> 412308 T1600 oasl.LogWatcher.createWatcher SLF4J impl is org.slf4j.impl.Log4jLoggerFactory
   [junit4]   2> 412308 T1600 oasl.LogWatcher.newRegisteredLogWatcher Registering Log Listener [Log4j (org.slf4j.impl.Log4jLoggerFactory)]
   [junit4]   2> 412308 T1600 oasc.CoreContainer.load Host Name: 127.0.0.1
   [junit4]   2> 412308 T1600 oasc.ZkContainer.initZooKeeper Zookeeper client=127.0.0.1:51711/solr
   [junit4]   2> 412308 T1600 oasc.ZkController.checkChrootPath zkHost includes chroot
   [junit4]   2> 412309 T1600 oascc.SolrZkClient.createZkCredentialsToAddAutomatically Using default ZkCredentialsProvider
   [junit4]   2> 412309 T1600 oascc.ConnectionManager.waitForConnected Waiting for client to connect to ZooKeeper
   [junit4]   2> 412312 T1664 oascc.ConnectionManager.process Watcher org.apache.solr.common.cloud.ConnectionManager@1611183e name:ZooKeeperConnection Watcher:127.0.0.1:51711 got event WatchedEvent state:SyncConnected type:None path:null path:null type:None
   [junit4]   2> 412312 T1600 oascc.ConnectionManager.waitForConnected Client is connected to ZooKeeper
   [junit4]   2> 412312 T1600 oascc.SolrZkClient.createZkACLProvider Using default ZkACLProvider
   [junit4]   2> 412314 T1600 oascc.ConnectionManager.waitForConnected Waiting for client to connect to ZooKeeper
   [junit4]   2> 412316 T1667 oascc.ConnectionManager.process Watcher org.apache.solr.common.cloud.ConnectionManager@10146c55 name:ZooKeeperConnection Watcher:127.0.0.1:51711/solr got event WatchedEvent state:SyncConnected type:None path:null path:null type:None
   [junit4]   2> 412316 T1600 oascc.ConnectionManager.waitForConnected Client is connected to ZooKeeper
   [junit4]   2> 412320 T1600 oascc.ZkStateReader.createClusterStateWatchersAndUpdate Updating cluster state from ZooKeeper... 
   [junit4]   2> 413322 T1600 oasc.ZkController.createEphemeralLiveNode Register node as live in ZooKeeper:/live_nodes/127.0.0.1:37857_
   [junit4]   2> 413323 T1600 oascc.SolrZkClient.makePath makePath: /live_nodes/127.0.0.1:37857_
   [junit4]   2> 413326 T1600 oasc.Overseer.close Overseer (id=null) closing
   [junit4]   2> 413330 T1668 oasc.ZkController.publish publishing core=collection1 state=down collection=collection1
   [junit4]   2> 413330 T1668 oasc.ZkController.publish numShards not found on descriptor - reading it from system property
   [junit4]   2> 413330 T1639 oasc.DistributedQueue$LatchWatcher.process NodeChildrenChanged fired on path /overseer/queue state SyncConnected
   [junit4]   2> 413330 T1668 oasc.ZkController.waitForCoreNodeName look for our core node name
   [junit4]   2> 413331 T1640 oasc.Overseer$ClusterStateUpdater.run processMessage: queueSize: 1, message = {
   [junit4]   2> 	  "core":"collection1",
   [junit4]   2> 	  "roles":null,
   [junit4]   2> 	  "base_url":"http://127.0.0.1:37857",
   [junit4]   2> 	  "node_name":"127.0.0.1:37857_",
   [junit4]   2> 	  "numShards":"2",
   [junit4]   2> 	  "state":"down",
   [junit4]   2> 	  "shard":null,
   [junit4]   2> 	  "collection":"collection1",
   [junit4]   2> 	  "operation":"state"} current state version: 3
   [junit4]   2> 413332 T1640 oasco.ReplicaMutator.updateState Update state numShards=2 message={
   [junit4]   2> 	  "core":"collection1",
   [junit4]   2> 	  "roles":null,
   [junit4]   2> 	  "base_url":"http://127.0.0.1:37857",
   [junit4]   2> 	  "node_name":"127.0.0.1:37857_",
   [junit4]   2> 	  "numShards":"2",
   [junit4]   2> 	  "state":"down",
   [junit4]   2> 	  "shard":null,
   [junit4]   2> 	  "collection":"collection1",
   [junit4]   2> 	  "operation":"state"}
   [junit4]   2> 413332 T1640 oasco.ClusterStateMutator.createCollection building a new cName: collection1
   [junit4]   2> 413332 T1640 oasco.ReplicaMutator.updateState Assigning new node to shard shard=shard2
   [junit4]   2> 413434 T1639 oascc.ZkStateReader$2.process A cluster state change: WatchedEvent state:SyncConnected type:NodeDataChanged path:/clusterstate.json, has occurred - updating... (live nodes size: 2)
   [junit4]   2> 413434 T1650 oascc.ZkStateReader$2.process A cluster state change: WatchedEvent state:SyncConnected type:NodeDataChanged path:/clusterstate.json, has occurred - updating... (live nodes size: 2)
   [junit4]   2> 413435 T1667 oascc.ZkStateReader$2.process A cluster state change: WatchedEvent state:SyncConnected type:NodeDataChanged path:/clusterstate.json, has occurred - updating... (live nodes size: 2)
   [junit4]   2> 414331 T1668 oasc.ZkController.waitForShardId waiting to find shard id in clusterstate for collection1
   [junit4]   2> 414331 T1668 oasc.ZkController.createCollectionZkNode Check for collection zkNode:collection1
   [junit4]   2> 414332 T1668 oasc.ZkController.createCollectionZkNode Collection zkNode exists
   [junit4]   2> 414332 T1668 oascc.ZkStateReader.readConfigName Load collection config from:/collections/collection1
   [junit4]   2> 414332 T1668 oascc.ZkStateReader.readConfigName path=/collections/collection1 configName=conf1 specified config exists in ZooKeeper
   [junit4]   2> 414332 T1668 oasc.SolrResourceLoader.<init> new SolrResourceLoader for directory: '/mnt/ssd/jenkins/workspace/Lucene-Solr-trunk-Linux/solr/build/solr-core/test/J1/temp/solr.core.TestDynamicLoading 311CE47160590CA5-001/tempDir-004/collection1/'
   [junit4]   2> 414333 T1668 oasc.SolrResourceLoader.replaceClassLoader Adding 'file:/mnt/ssd/jenkins/workspace/Lucene-Solr-trunk-Linux/solr/build/solr-core/test/J1/temp/solr.core.TestDynamicLoading%20311CE47160590CA5-001/tempDir-004/collection1/lib/.svn/' to classloader
   [junit4]   2> 414333 T1668 oasc.SolrResourceLoader.replaceClassLoader Adding 'file:/mnt/ssd/jenkins/workspace/Lucene-Solr-trunk-Linux/solr/build/solr-core/test/J1/temp/solr.core.TestDynamicLoading%20311CE47160590CA5-001/tempDir-004/collection1/lib/classes/' to classloader
   [junit4]   2> 414333 T1668 oasc.SolrResourceLoader.replaceClassLoader Adding 'file:/mnt/ssd/jenkins/workspace/Lucene-Solr-trunk-Linux/solr/build/solr-core/test/J1/temp/solr.core.TestDynamicLoading%20311CE47160590CA5-001/tempDir-004/collection1/lib/README' to classloader
   [junit4]   2> 414343 T1668 oasc.ZkController.watchZKConfDir watch zkdir /configs/conf1
   [junit4]   2> 414344 T1668 oasc.Config.<init> loaded config solrconfig.xml with version 0 
   [junit4]   2> 414348 T1668 oasc.SolrConfig.refreshRequestParams current version of requestparams : -1
   [junit4]   2> 414352 T1668 oasc.SolrConfig.<init> Using Lucene MatchVersion: 6.0.0
   [junit4]   2> 414363 T1668 oasc.SolrConfig.<init> Loaded SolrConfig: solrconfig.xml
   [junit4]   2> 414364 T1668 oass.IndexSchema.readSchema Reading Solr Schema from /configs/conf1/schema.xml
   [junit4]   2> 414368 T1668 oass.IndexSchema.readSchema [collection1] Schema name=test
   [junit4]   2> 414454 T1668 oass.OpenExchangeRatesOrgProvider.init Initialized with rates=open-exchange-rates.json, refreshInterval=1440.
   [junit4]   2> 414457 T1668 oass.IndexSchema.readSchema default search field in schema is text
   [junit4]   2> 414459 T1668 oass.IndexSchema.readSchema unique key field: id
   [junit4]   2> 414475 T1668 oass.FileExchangeRateProvider.reload Reloading exchange rates from file currency.xml
   [junit4]   2> 414477 T1668 oass.FileExchangeRateProvider.reload Reloading exchange rates from file currency.xml
   [junit4]   2> 414478 T1668 oass.OpenExchangeRatesOrgProvider.reload Reloading exchange rates from open-exchange-rates.json
   [junit4]   2> 414479 T1668 oass.OpenExchangeRatesOrgProvider$OpenExchangeRates.<init> WARN Unknown key IMPORTANT NOTE
   [junit4]   2> 414479 T1668 oass.OpenExchangeRatesOrgProvider$OpenExchangeRates.<init> WARN Expected key, got STRING
   [junit4]   2> 414479 T1668 oass.OpenExchangeRatesOrgProvider.reload Reloading exchange rates from open-exchange-rates.json
   [junit4]   2> 414480 T1668 oass.OpenExchangeRatesOrgProvider$OpenExchangeRates.<init> WARN Unknown key IMPORTANT NOTE
   [junit4]   2> 414480 T1668 oass.OpenExchangeRatesOrgProvider$OpenExchangeRates.<init> WARN Expected key, got STRING
   [junit4]   2> 414480 T1668 oasc.CoreContainer.create Creating SolrCore 'collection1' using configuration from collection collection1
   [junit4]   2> 414480 T1668 oasc.SolrCore.initDirectoryFactory org.apache.solr.core.MockDirectoryFactory
   [junit4]   2> 414481 T1668 oasc.SolrCore.<init> [collection1] Opening new SolrCore at /mnt/ssd/jenkins/workspace/Lucene-Solr-trunk-Linux/solr/build/solr-core/test/J1/temp/solr.core.TestDynamicLoading 311CE47160590CA5-001/tempDir-004/collection1/, dataDir=/mnt/ssd/jenkins/workspace/Lucene-Solr-trunk-Linux/solr/build/solr-core/test/J1/temp/solr.core.TestDynamicLoading 311CE47160590CA5-001/tempDir-002/jetty1/
   [junit4]   2> 414481 T1668 oasc.JmxMonitoredMap.<init> JMX monitoring is enabled. Adding Solr mbeans to JMX Server: com.sun.jmx.mbeanserver.JmxMBeanServer@172b2815
   [junit4]   2> 414481 T1668 oasc.CachingDirectoryFactory.get return new directory for /mnt/ssd/jenkins/workspace/Lucene-Solr-trunk-Linux/solr/build/solr-core/test/J1/temp/solr.core.TestDynamicLoading 311CE47160590CA5-001/tempDir-002/jetty1
   [junit4]   2> 414482 T1668 oasc.SolrCore.getNewIndexDir New index directory detected: old=null new=/mnt/ssd/jenkins/workspace/Lucene-Solr-trunk-Linux/solr/build/solr-core/test/J1/temp/solr.core.TestDynamicLoading 311CE47160590CA5-001/tempDir-002/jetty1/index/
   [junit4]   2> 414482 T1668 oasc.SolrCore.initIndex WARN [collection1] Solr index directory '/mnt/ssd/jenkins/workspace/Lucene-Solr-trunk-Linux/solr/build/solr-core/test/J1/temp/solr.core.TestDynamicLoading 311CE47160590CA5-001/tempDir-002/jetty1/index' doesn't exist. Creating new index...
   [junit4]   2> 414482 T1668 oasc.CachingDirectoryFactory.get return new directory for /mnt/ssd/jenkins/workspace/Lucene-Solr-trunk-Linux/solr/build/solr-core/test/J1/temp/solr.core.TestDynamicLoading 311CE47160590CA5-001/tempDir-002/jetty1/index
   [junit4]   2> 414482 T1668 oasu.RandomMergePolicy.<init> RandomMergePolicy wrapping class org.apache.lucene.index.TieredMergePolicy: [TieredMergePolicy: maxMergeAtOnce=38, maxMergeAtOnceExplicit=47, maxMergedSegmentMB=22.0, floorSegmentMB=0.2392578125, forceMergeDeletesPctAllowed=22.055732698967546, segmentsPerTier=25.0, maxCFSSegmentSizeMB=8.796093022207999E12, noCFSRatio=0.42370587619276046
   [junit4]   2> 414483 T1668 oasc.SolrDeletionPolicy.onCommit SolrDeletionPolicy.onCommit: commits: num=1
   [junit4]   2> 		commit{dir=MockDirectoryWrapper(RAMDirectory@1273fefc lockFactory=org.apache.lucene.store.SingleInstanceLockFactory@3159a0eb),segFN=segments_1,generation=1}
   [junit4]   2> 414483 T1668 oasc.SolrDeletionPolicy.updateCommits newest commit generation = 1
   [junit4]   2> 414485 T1668 oasup.UpdateRequestProcessorChain.init creating updateRequestProcessorChain "nodistrib"
   [junit4]   2> 414486 T1668 oasup.UpdateRequestProcessorChain.init creating updateRequestProcessorChain "dedupe"
   [junit4]   2> 414486 T1668 oasup.UpdateRequestProcessorChain.init inserting DistributedUpdateProcessorFactory into updateRequestProcessorChain "dedupe"
   [junit4]   2> 414486 T1668 oasup.UpdateRequestProcessorChain.init creating updateRequestProcessorChain "stored_sig"
   [junit4]   2> 414486 T1668 oasup.UpdateRequestProcessorChain.init inserting DistributedUpdateProcessorFactory into updateRequestProcessorChain "stored_sig"
   [junit4]   2> 414486 T1668 oasup.UpdateRequestProcessorChain.init creating updateRequestProcessorChain "distrib-dup-test-chain-explicit"
   [junit4]   2> 414487 T1668 oasup.UpdateRequestProcessorChain.init creating updateRequestProcessorChain "distrib-dup-test-chain-implicit"
   [junit4]   2> 414487 T1668 oasup.UpdateRequestProcessorChain.init inserting DistributedUpdateProcessorFactory into updateRequestProcessorChain "distrib-dup-test-chain-implicit"
   [junit4]   2> 414487 T1668 oasc.SolrCore.loadUpdateProcessorChains no updateRequestProcessorChain defined as default, creating implicit default
   [junit4]   2> 414487 T1668 oasc.RequestHandlers.initHandlersFromConfig created /update: org.apache.solr.handler.UpdateRequestHandler
   [junit4]   2> 414488 T1668 oasc.RequestHandlers.initHandlersFromConfig created /update/json: org.apache.solr.handler.UpdateRequestHandler
   [junit4]   2> 414488 T1668 oasc.RequestHandlers.initHandlersFromConfig created /update/csv: org.apache.solr.handler.UpdateRequestHandler
   [junit4]   2> 414488 T1668 oasc.RequestHandlers.initHandlersFromConfig created /update/json/docs: org.apache.solr.handler.UpdateRequestHandler
   [junit4]   2> 414488 T1668 oasc.RequestHandlers.initHandlersFromConfig created /config: org.apache.solr.handler.SolrConfigHandler
   [junit4]   2> 414489 T1668 oasc.RequestHandlers.initHandlersFromConfig created /schema: org.apache.solr.handler.SchemaHandler
   [junit4]   2> 414489 T1668 oasc.RequestHandlers.initHandlersFromConfig created /replication: org.apache.solr.handler.ReplicationHandler
   [junit4]   2> 414489 T1668 oasc.RequestHandlers.initHandlersFromConfig created /get: org.apache.solr.handler.RealTimeGetHandler
   [junit4]   2> 414490 T1668 oasc.RequestHandlers.initHandlersFromConfig created /admin/luke: org.apache.solr.handler.admin.LukeRequestHandler
   [junit4]   2> 414490 T1668 oasc.RequestHandlers.initHandlersFromConfig created /admin/system: org.apache.solr.handler.admin.SystemInfoHandler
   [junit4]   2> 414491 T1668 oasc.RequestHandlers.initHandlersFromConfig created /admin/mbeans: org.apache.solr.handler.admin.SolrInfoMBeanHandler
   [junit4]   2> 414491 T1668 oasc.RequestHandlers.initHandlersFromConfig created /admin/plugins: org.apache.solr.handler.admin.PluginInfoHandler
   [junit4]   2> 414491 T1668 oasc.RequestHandlers.initHandlersFromConfig created /admin/threads: org.apache.solr.handler.admin.ThreadDumpHandler
   [junit4]   2> 414491 T1668 oasc.RequestHandlers.initHandlersFromConfig created /admin/properties: org.apache.solr.handler.admin.PropertiesRequestHandler
   [junit4]   2> 414492 T1668 oasc.RequestHandlers.initHandlersFromConfig created /admin/logging: org.apache.solr.handler.admin.LoggingHandler
   [junit4]   2> 414492 T1668 oasc.RequestHandlers.initHandlersFromConfig created /admin/ping: org.apache.solr.handler.PingRequestHandler
   [junit4]   2> 414492 T1668 oasc.RequestHandlers.initHandlersFromConfig created standard: solr.StandardRequestHandler
   [junit4]   2> 414493 T1668 oasc.RequestHandlers.initHandlersFromConfig created /admin/file: solr.admin.ShowFileRequestHandler
   [junit4]   2> 414494 T1668 oashl.XMLLoader.init xsltCacheLifetimeSeconds=60
   [junit4]   2> 414495 T1668 oashl.XMLLoader.init xsltCacheLifetimeSeconds=60
   [junit4]   2> 414495 T1668 oashl.XMLLoader.init xsltCacheLifetimeSeconds=60
   [junit4]   2> 414496 T1668 oashl.XMLLoader.init xsltCacheLifetimeSeconds=60
   [junit4]   2> 414496 T1668 oasc.SolrCore.initStatsCache Using default statsCache cache: org.apache.solr.search.stats.LocalStatsCache
   [junit4]   2> 414497 T1668 oasu.CommitTracker.<init> Hard AutoCommit: disabled
   [junit4]   2> 414497 T1668 oasu.CommitTracker.<init> Soft AutoCommit: disabled
   [junit4]   2> 414499 T1668 oasu.RandomMergePolicy.<init> RandomMergePolicy wrapping class org.apache.lucene.index.AlcoholicMergePolicy: [AlcoholicMergePolicy: minMergeSize=0, mergeFactor=10, maxMergeSize=368075249, maxMergeSizeForForcedMerge=9223372036854775807, calibrateSizeByDeletes=true, maxMergeDocs=2147483647, maxCFSSegmentSizeMB=8.796093022207999E12, noCFSRatio=0.1]
   [junit4]   2> 414499 T1668 oasc.SolrDeletionPolicy.onInit SolrDeletionPolicy.onInit: commits: num=1
   [junit4]   2> 		commit{dir=MockDirectoryWrapper(RAMDirectory@1273fefc lockFactory=org.apache.lucene.store.SingleInstanceLockFactory@3159a0eb),segFN=segments_1,generation=1}
   [junit4]   2> 414499 T1668 oasc.SolrDeletionPolicy.updateCommits newest commit generation = 1
   [junit4]   2> 414499 T1668 oass.SolrIndexSearcher.<init> Opening Searcher@32eee54[collection1] main
   [junit4]   2> 414500 T1668 oascc.ZkStateReader.readConfigName Load collection config from:/collections/collection1
   [junit4]   2> 414500 T1668 oascc.ZkStateReader.readConfigName path=/collections/collection1 configName=conf1 specified config exists in ZooKeeper
   [junit4]   2> 414501 T1668 oasr.ManagedResourceStorage.newStorageIO Setting up ZooKeeper-based storage for the RestManager with znodeBase: /configs/conf1
   [junit4]   2> 414501 T1668 oasr.ManagedResourceStorage$ZooKeeperStorageIO.configure Configured ZooKeeperStorageIO with znodeBase: /configs/conf1
   [junit4]   2> 414501 T1668 oasr.RestManager.init Initializing RestManager with initArgs: {}
   [junit4]   2> 414501 T1668 oasr.ManagedResourceStorage.load Reading _rest_managed.json using ZooKeeperStorageIO:path=/configs/conf1
   [junit4]   2> 414502 T1668 oasr.ManagedResourceStorage$ZooKeeperStorageIO.openInputStream No data found for znode /configs/conf1/_rest_managed.json
   [junit4]   2> 414502 T1668 oasr.ManagedResourceStorage.load Loaded null at path _rest_managed.json using ZooKeeperStorageIO:path=/configs/conf1
   [junit4]   2> 414502 T1668 oasr.RestManager.init Initializing 0 registered ManagedResources
   [junit4]   2> 414502 T1668 oash.ReplicationHandler.inform Commits will be reserved for  10000
   [junit4]   2> 414503 T1669 oasc.SolrCore.registerSearcher [collection1] Registered new searcher Searcher@32eee54[collection1] main{ExitableDirectoryReader(UninvertingDirectoryReader())}
   [junit4]   2> 414503 T1668 oasc.CoreContainer.registerCore registering core: collection1
   [junit4]   2> 414504 T1672 oasc.ZkController.register Register replica - core:collection1 address:http://127.0.0.1:37857 collection:collection1 shard:shard2
   [junit4]   2> 414504 T1600 oass.SolrDispatchFilter.init user.dir=/mnt/ssd/jenkins/workspace/Lucene-Solr-trunk-Linux/solr/build/solr-core/test/J1
   [junit4]   2> 414504 T1600 oass.SolrDispatchFilter.init SolrDispatchFilter.init() done
   [junit4]   2> 414504 T1672 oascc.SolrZkClient.makePath makePath: /collections/collection1/leader_elect/shard2/election
   [junit4]   2> 414509 T1672 oasc.ShardLeaderElectionContext.runLeaderProcess Running the leader process for shard shard2
   [junit4]   2> 414510 T1639 oasc.DistributedQueue$LatchWatcher.process NodeChildrenChanged fired on path /overseer/queue state SyncConnected
   [junit4]   2> 414510 T1672 oasc.ShardLeaderElectionContext.waitForReplicasToComeUp Enough replicas found to continue.
   [junit4]   2> 414510 T1672 oasc.ShardLeaderElectionContext.runLeaderProcess I may be the new leader - try and sync
   [junit4]   2> 414510 T1640 oasc.Overseer$ClusterStateUpdater.run processMessage: queueSize: 1, message = {
   [junit4]   2> 	  "operation":"leader",
   [junit4]   2> 	  "shard":"shard2",
   [junit4]   2> 	  "collection":"collection1"} current state version: 4
   [junit4]   2> ASYNC  NEW_CORE C401 name=collection1 org.apache.solr.core.SolrCore@5469d188 url=http://127.0.0.1:37857/collection1 node=127.0.0.1:37857_ C401_STATE=coll:collection1 core:collection1 props:{core=collection1, base_url=http://127.0.0.1:37857, node_name=127.0.0.1:37857_, state=down}
   [junit4]   2> 414510 T1672 C401 P37857 oasc.SyncStrategy.sync Sync replicas to http://127.0.0.1:37857/collection1/
   [junit4]   2> 414511 T1672 C401 P37857 oasc.SyncStrategy.syncReplicas Sync Success - now sync replicas to me
   [junit4]   2> 414511 T1672 C401 P37857 oasc.SyncStrategy.syncToMe http://127.0.0.1:37857/collection1/ has no replicas
   [junit4]   2> 414511 T1672 oasc.ShardLeaderElectionContext.runLeaderProcess I am the new leader: http://127.0.0.1:37857/collection1/ shard2
   [junit4]   2> 414511 T1672 oascc.SolrZkClient.makePath makePath: /collections/collection1/leaders/shard2
   [junit4]   2> 414513 T1639 oasc.DistributedQueue$LatchWatcher.process NodeChildrenChanged fired on path /overseer/queue state SyncConnected
   [junit4]   2> 414514 T1640 oasc.Overseer$ClusterStateUpdater.run processMessage: queueSize: 1, message = {
   [junit4]   2> 	  "operation":"leader",
   [junit4]   2> 	  "shard":"shard2",
   [junit4]   2> 	  "collection":"collection1",
   [junit4]   2> 	  "base_url":"http://127.0.0.1:37857",
   [junit4]   2> 	  "core":"collection1",
   [junit4]   2> 	  "state":"active"} current state version: 4
   [junit4]   2> 414616 T1667 oascc.ZkStateReader$2.process A cluster state change: WatchedEvent state:SyncConnected type:NodeDataChanged path:/clusterstate.json, has occurred - updating... (live nodes size: 2)
   [junit4]   2> 414616 T1639 oascc.ZkStateReader$2.process A cluster state change: WatchedEvent state:SyncConnected type:NodeDataChanged path:/clusterstate.json, has occurred - updating... (live nodes size: 2)
   [junit4]   2> 414616 T1650 oascc.ZkStateReader$2.process A cluster state change: WatchedEvent state:SyncConnected type:NodeDataChanged path:/clusterstate.json, has occurred - updating... (live nodes size: 2)
   [junit4]   2> 414664 T1672 oasc.ZkController.register We are http://127.0.0.1:37857/collection1/ and leader is http://127.0.0.1:37857/collection1/
   [junit4]   2> 414664 T1672 oasc.ZkController.register No LogReplay needed for core=collection1 baseURL=http://127.0.0.1:37857
   [junit4]   2> 414664 T1672 oasc.ZkController.checkRecovery I am the leader, no recovery necessary
   [junit4]   2> 414665 T1672 oasc.ZkController.publish publishing core=collection1 state=active collection=collection1
   [junit4]   2> 414665 T1672 oasc.ZkController.publish numShards not found on descriptor - reading it from system property
   [junit4]   2> 414666 T1639 oasc.DistributedQueue$LatchWatcher.process NodeChildrenChanged fired on path /overseer/queue state SyncConnected
   [junit4]   2> 414666 T1640 oasc.Overseer$ClusterStateUpdater.run processMessage: queueSize: 1, message = {
   [junit4]   2> 	  "core":"collection1",
   [junit4]   2> 	  "core_node_name":"core_node1",
   [junit4]   2> 	  "roles":null,
   [junit4]   2> 	  "base_url":"http://127.0.0.1:37857",
   [junit4]   2> 	  "node_name":"127.0.0.1:37857_",
   [junit4]   2> 	  "numShards":"2",
   [junit4]   2> 	  "state":"active",
   [junit4]   2> 	  "shard":"shard2",
   [junit4]   2> 	  "collection":"collection1",
   [junit4]   2> 	  "operation":"state"} current state version: 5
   [junit4]   2> 414667 T1640 oasco.ReplicaMutator.updateState Update state numShards=2 message={
   [junit4]   2> 	  "core":"collection1",
   [junit4]   2> 	  "core_node_name":"core_node1",
   [junit4]   2> 	  "roles":null,
   [junit4]   2> 	  "base_url":"http://127.0.0.1:37857",
   [junit4]   2> 	  "node_name":"127.0.0.1:37857_",
   [junit4]   2> 	  "numShards":"2",
   [junit4]   2> 	  "state":"active",
   [junit4]   2> 	  "shard":"shard2",
   [junit4]   2> 	  "collection":"collection1",
   [junit4]   2> 	  "operation":"state"}
   [junit4]   2> 414743 T1600 oasc.AbstractFullDistribZkTestBase.createJettys create jetty 2
   [junit4]   2> 414743 T1600 oejs.Server.doStart jetty-9.2.6.v20141205
   [junit4]   2> 414745 T1600 oejsh.ContextHandler.doStart Started o.e.j.s.ServletContextHandler@78a84d72{/,null,AVAILABLE}
   [junit4]   2> 414745 T1600 oejs.AbstractConnector.doStart Started ServerConnector@6912e121{HTTP/1.1}{127.0.0.1:54479}
   [junit4]   2> 414746 T1600 oejs.Server.doStart Started @415989ms
   [junit4]   2> 414746 T1600 oass.SolrDispatchFilter.init SolrDispatchFilter.init()sun.misc.Launcher$AppClassLoader@4e0e2f2a
   [junit4]   2> 414746 T1600 oasc.SolrResourceLoader.locateSolrHome JNDI not configured for solr (NoInitialContextEx)
   [junit4]   2> 414747 T1600 oasc.SolrResourceLoader.locateSolrHome using system property solr.solr.home: ../../../../../../../../../../mnt/ssd/jenkins/workspace/Lucene-Solr-trunk-Linux/solr/build/solr-core/test/J1/temp/solr.core.TestDynamicLoading 311CE47160590CA5-001/tempDir-005
   [junit4]   2> 414747 T1600 oasc.SolrResourceLoader.<init> new SolrResourceLoader for directory: '../../../../../../../../../../mnt/ssd/jenkins/workspace/Lucene-Solr-trunk-Linux/solr/build/solr-core/test/J1/temp/solr.core.TestDynamicLoading 311CE47160590CA5-001/tempDir-005/'
   [junit4]   2> 414757 T1600 oasc.ConfigSolr.fromFile Loading container configuration from /mnt/ssd/jenkins/workspace/Lucene-Solr-trunk-Linux/solr/build/solr-core/test/J1/../../../../../../../../../../mnt/ssd/jenkins/workspace/Lucene-Solr-trunk-Linux/solr/build/solr-core/test/J1/temp/solr.core.TestDynamicLoading 311CE47160590CA5-001/tempDir-005/solr.xml
   [junit4]   2> 414766 T1600 oasc.CoreContainer.<init> New CoreContainer 1882620637
   [junit4]   2> 414766 T1600 oasc.CoreContainer.load Loading cores into CoreContainer [instanceDir=../../../../../../../../../../mnt/ssd/jenkins/workspace/Lucene-Solr-trunk-Linux/solr/build/solr-core/test/J1/temp/solr.core.TestDynamicLoading 311CE47160590CA5-001/tempDir-005/]
   [junit4]   2> 414766 T1600 oashc.HttpShardHandlerFactory.getParameter Setting socketTimeout to: 90000
   [junit4]   2> 414767 T1600 oashc.HttpShardHandlerFactory.getParameter Setting urlScheme to: 
   [junit4]   2> 414767 T1600 oashc.HttpShardHandlerFactory.getParameter Setting connTimeout to: 15000
   [junit4]   2> 414767 T1600 oashc.HttpShardHandlerFactory.getParameter Setting maxConnectionsPerHost to: 20
   [junit4]   2> 414767 T1600 oashc.HttpShardHandlerFactory.getParameter Setting maxConnections to: 10000
   [junit4]   2> 414767 T1600 oashc.HttpShardHandlerFactory.getParameter Setting corePoolSize to: 0
   [junit4]   2> 414768 T1600 oashc.HttpShardHandlerFactory.getParameter Setting maximumPoolSize to: 2147483647
   [junit4]   2> 414768 T1600 oashc.HttpShardHandlerFactory.getParameter Setting maxThreadIdleTime to: 5
   [junit4]   2> 414768 T1600 oashc.HttpShardHandlerFactory.getParameter Setting sizeOfQueue to: -1
   [junit4]   2> 414768 T1600 oashc.HttpShardHandlerFactory.getParameter Setting fairnessPolicy to: false
   [junit4]   2> 414768 T1639 oascc.ZkStateReader$2.process A cluster state change: WatchedEvent state:SyncConnected type:NodeDataChanged path:/clusterstate.json, has occurred - updating... (live nodes size: 2)
   [junit4]   2> 414769 T1667 oascc.ZkStateReader$2.process A cluster state change: WatchedEvent state:SyncConnected type:NodeDataChanged path:/clusterstate.json, has occurred - updating... (live nodes size: 2)
   [junit4]   2> 414769 T1650 oascc.ZkStateReader$2.process A cluster state change: WatchedEvent state:SyncConnected type:NodeDataChanged path:/clusterstate.json, has occurred - updating... (live nodes size: 2)
   [junit4]   2> 414769 T1600 oasu.UpdateShardHandler.<init> Creating UpdateShardHandler HTTP client with params: socketTimeout=340000&connTimeout=45000&retry=false
   [junit4]   2> 414769 T1600 oasl.LogWatcher.createWatcher SLF4J impl is org.slf4j.impl.Log4jLoggerFactory
   [junit4]   2> 414770 T1600 oasl.LogWatcher.newRegisteredLogWatcher Registering Log Listener [Log4j (org.slf4j.impl.Log4jLoggerFactory)]
   [junit4]   2> 414770 T1600 oasc.CoreContainer.load Host Name: 127.0.0.1
   [junit4]   2> 414770 T1600 oasc.ZkContainer.initZooKeeper Zookeeper client=127.0.0.1:51711/solr
   [junit4]   2> 414771 T1600 oasc.ZkController.checkChrootPath zkHost includes chroot
   [junit4]   2> 414771 T1600 oascc.SolrZkClient.createZkCredentialsToAddAutomatically Using default ZkCredentialsProvider
   [junit4]   2> 414771 T1600 oascc.ConnectionManager.waitForConnected Waiting for client to connect to ZooKeeper
   [junit4]   2> 414773 T1686 oascc.ConnectionManager.process Watcher org.apache.solr.common.cloud.ConnectionManager@4b65a1f0 name:ZooKeeperConnection Watcher:127.0.0.1:51711 got event WatchedEvent state:SyncConnected type:None path:null path:null type:None
   [junit4]   2> 414774 T1600 oascc.ConnectionManager.waitForConnected Client is connected to ZooKeeper
   [junit4]   2> 414774 T1600 oascc.SolrZkClient.createZkACLProvider Using default ZkACLProvider
   [junit4]   2> 414776 T1600 oascc.ConnectionManager.waitForConnected Waiting for client to connect to ZooKeeper
   [junit4]   2> 414780 T1689 oascc.ConnectionManager.process Watcher org.apache.solr.common.cloud.ConnectionManager@1bd0322a name:ZooKeeperConnection Watcher:127.0.0.1:51711/solr got event WatchedEvent state:SyncConnected type:None path:null path:null type:None
   [junit4]   2> 414780 T1600 oascc.ConnectionManager.waitForConnected Client is connected to ZooKeeper
   [junit4]   2> 414784 T1600 oascc.ZkStateReader.createClusterStateWatchersAndUpdate Updating cluster state from ZooKeeper... 
   [junit4]   2> 415786 T1600 oasc.ZkController.createEphemeralLiveNode Register node as live in ZooKeeper:/live_nodes/127.0.0.1:54479_
   [junit4]   2> 415787 T1600 oascc.SolrZkClient.makePath makePath: /live_nodes/127.0.0.1:54479_
   [junit4]   2> 415790 T1600 oasc.Overseer.close Overseer (id=null) closing
   [junit4]   2> 415792 T1690 oasc.ZkController.publish publishing core=collection1 state=down collection=collection1
   [junit4]   2> 415793 T1690 oasc.ZkController.publish numShards not found on descriptor - reading it from system property
   [junit4]   2> 415793 T1690 oasc.ZkController.waitForCoreNodeName look for our core node name
   [junit4]   2> 415793 T1639 oasc.DistributedQueue$LatchWatcher.process NodeChildrenChanged fired on path /overseer/queue state SyncConnected
   [junit4]   2> 415794 T1640 oasc.Overseer$ClusterStateUpdater.run processMessage: queueSize: 1, message = {
   [junit4]   2> 	  "core":"collection1",
   [junit4]   2> 	  "roles":null,
   [junit4]   2> 	  "base_url":"http://127.0.0.1:54479",
   [junit4]   2> 	  "node_name":"127.0.0.1:54479_",
   [junit4]   2> 	  "numShards":"2",
   [junit4]   2> 	  "state":"down",
   [junit4]   2> 	  "shard":null,
   [junit4]   2> 	  "collection":"collection1",
   [junit4]   2> 	  "operation":"state"} current state version: 6
   [junit4]   2> 415794 T1640 oasco.ReplicaMutator.updateState Update state numShards=2 message={
   [junit4]   2> 	  "core":"collection1",
   [junit4]   2> 	  "roles":null,
   [junit4]   2> 	  "base_url":"http://127.0.0.1:54479",
   [junit4]   2> 	  "node_name":"127.0.0.1:54479_",
   [junit4]   2> 	  "numShards":"2",
   [junit4]   2> 	  "state":"down",
   [junit4]   2> 	  "shard":null,
   [junit4]   2> 	  "collection":"collection1",
   [junit4]   2> 	  "operation":"state"}
   [junit4]   2> 415795 T1640 oasco.ReplicaMutator.updateState Collection already exists with numShards=2
   [junit4]   2> 415795 T1640 oasco.ReplicaMutator.updateState Assigning new node to shard shard=shard1
   [junit4]   2> 415898 T1667 oascc.ZkStateReader$2.process A cluster state change: WatchedEvent state:SyncConnected type:NodeDataChanged path:/clusterstate.json, has occurred - updating... (live nodes size: 3)
   [junit4]   2> 415898 T1639 oascc.ZkStateReader$2.process A cluster state change: WatchedEvent state:SyncConnected type:NodeDataChanged path:/clusterstate.json, has occurred - updating... (live nodes size: 3)
   [junit4]   2> 415898 T1650 oascc.ZkStateReader$2.process A cluster state change: WatchedEvent state:SyncConnected type:NodeDataChanged path:/clusterstate.json, has occurred - updating... (live nodes size: 3)
   [junit4]   2> 415898 T1689 oascc.ZkStateReader$2.process A cluster state change: WatchedEvent state:SyncConnected type:NodeDataChanged path:/clusterstate.json, has occurred - updating... (live nodes size: 3)
   [junit4]   2> 416793 T1690 oasc.ZkController.waitForShardId waiting to find shard id in clusterstate for collection1
   [junit4]   2> 416794 T1690 oasc.ZkController.createCollectionZkNode Check for collection zkNode:collection1
   [junit4]   2> 416794 T1690 oasc.ZkController.createCollectionZkNode Collection zkNode exists
   [junit4]   2> 416794 T1690 oascc.ZkStateReader.readConfigName Load collection config from:/collections/collection1
   [junit4]   2> 416795 T1690 oascc.ZkStateReader.readConfigName path=/collections/collection1 configName=conf1 specified config exists in ZooKeeper
   [junit4]   2> 416795 T1690 oasc.SolrResourceLoader.<init> new SolrResourceLoader for directory: '../../../../../../../../../../mnt/ssd/jenkins/workspace/Lucene-Solr-trunk-Linux/solr/build/solr-core/test/J1/temp/solr.core.TestDynamicLoading 311CE47160590CA5-001/tempDir-005/collection1/'
   [junit4]   2> 416796 T1690 oasc.SolrResourceLoader.replaceClassLoader Adding 'file:/mnt/ssd/jenkins/workspace/Lucene-Solr-trunk-Linux/solr/build/solr-core/test/J1/temp/solr.core.TestDynamicLoading%20311CE47160590CA5-001/tempDir-005/collection1/lib/.svn/' to classloader
   [junit4]   2> 416796 T1690 oasc.SolrResourceLoader.replaceClassLoader Adding 'file:/mnt/ssd/jenkins/workspace/Lucene-Solr-trunk-Linux/solr/build/solr-core/test/J1/temp/solr.core.TestDynamicLoading%20311CE47160590CA5-001/tempDir-005/collection1/lib/classes/' to classloader
   [junit4]   2> 416796 T1690 oasc.SolrResourceLoader.replaceClassLoader Adding 'file:/mnt/ssd/jenkins/workspace/Lucene-Solr-trunk-Linux/solr/build/solr-core/test/J1/temp/solr.core.TestDynamicLoading%20311CE47160590CA5-001/tempDir-005/collection1/lib/README' to classloader
   [junit4]   2> 416805 T1690 oasc.ZkController.watchZKConfDir watch zkdir /configs/conf1
   [junit4]   2> 416806 T1690 oasc.Config.<init> loaded config solrconfig.xml with version 0 
   [junit4]   2> 416810 T1690 oasc.SolrConfig.refreshRequestParams current version of requestparams : -1
   [junit4]   2> 416814 T1690 oasc.SolrConfig.<init> Using Lucene MatchVersion: 6.0.0
   [junit4]   2> 416823 T1690 oasc.SolrConfig.<init> Loaded SolrConfig: solrconfig.xml
   [junit4]   2> 416824 T1690 oass.IndexSchema.readSchema Reading Solr Schema from /configs/conf1/schema.xml
   [junit4]   2> 416828 T1690 oass.IndexSchema.readSchema [collection1] Schema name=test
   [junit4]   2> 416928 T1690 oass.OpenExchangeRatesOrgProvider.init Initialized with rates=open-exchange-rates.json, refreshInterval=1440.
   [junit4]   2> 416932 T1690 oass.IndexSchema.readSchema default search field in schema is text
   [junit4]   2> 416933 T1690 oass.IndexSchema.readSchema unique key field: id
   [junit4]   2> 416942 T1690 oass.FileExchangeRateProvider.reload Reloading exchange rates from file currency.xml
   [junit4]   2> 416945 T1690 oass.FileExchangeRateProvider.reload Reloading exchange rates from file currency.xml
   [junit4]   2> 416947 T1690 oass.OpenExchangeRatesOrgProvider.reload Reloading exchange rates from open-exchange-rates.json
   [junit4]   2> 416948 T1690 oass.OpenExchangeRatesOrgProvider$OpenExchangeRates.<init> WARN Unknown key IMPORTANT NOTE
   [junit4]   2> 416948 T1690 oass.OpenExchangeRatesOrgProvider$OpenExchangeRates.<init> WARN Expected key, got STRING
   [junit4]   2> 416948 T1690 oass.OpenExchangeRatesOrgProvider.reload Reloading exchange rates from open-exchange-rates.json
   [junit4]   2> 416949 T1690 oass.OpenExchangeRatesOrgProvider$OpenExchangeRates.<init> WARN Unknown key IMPORTANT NOTE
   [junit4]   2> 416949 T1690 oass.OpenExchangeRatesOrgProvider$OpenExchangeRates.<init> WARN Expected key, got STRING
   [junit4]   2> 416949 T1690 oasc.CoreContainer.create Creating SolrCore 'collection1' using configuration from collection collection1
   [junit4]   2> 416949 T1690 oasc.SolrCore.initDirectoryFactory org.apache.solr.core.MockDirectoryFactory
   [junit4]   2> 416950 T1690 oasc.SolrCore.<init> [collection1] Opening new SolrCore at ../../../../../../../../../../mnt/ssd/jenkins/workspace/Lucene-Solr-trunk-Linux/solr/build/solr-core/test/J1/temp/solr.core.TestDynamicLoading 311CE47160590CA5-001/tempDir-005/collection1/, dataDir=/mnt/ssd/jenkins/workspace/Lucene-Solr-trunk-Linux/solr/build/solr-core/test/J1/temp/solr.core.TestDynamicLoading 311CE47160590CA5-001/tempDir-002/jetty2/
   [junit4]   2> 416950 T1690 oasc.JmxMonitoredMap.<init> JMX monitoring is enabled. Adding Solr mbeans to JMX Server: com.sun.jmx.mbeanserver.JmxMBeanServer@172b2815
   [junit4]   2> 416951 T1690 oasc.CachingDirectoryFactory.get return new directory for /mnt/ssd/jenkins/workspace/Lucene-Solr-trunk-Linux/solr/build/solr-core/test/J1/temp/solr.core.TestDynamicLoading 311CE47160590CA5-001/tempDir-002/jetty2
   [junit4]   2> 416951 T1690 oasc.SolrCore.getNewIndexDir New index directory detected: old=null new=/mnt/ssd/jenkins/workspace/Lucene-Solr-trunk-Linux/solr/build/solr-core/test/J1/temp/solr.core.TestDynamicLoading 311CE47160590CA5-001/tempDir-002/jetty2/index/
   [junit4]   2> 416952 T1690 oasc.SolrCore.initIndex WARN [collection1] Solr index directory '/mnt/ssd/jenkins/workspace/Lucene-Solr-trunk-Linux/solr/build/solr-core/test/J1/temp/solr.core.TestDynamicLoading 311CE47160590CA5-001/tempDir-002/jetty2/index' doesn't exist. Creating new index...
   [junit4]   2> 416952 T1690 oasc.CachingDirectoryFactory.get return new directory for /mnt/ssd/jenkins/workspace/Lucene-Solr-trunk-Linux/solr/build/solr-core/test/J1/temp/solr.core.TestDynamicLoading 311CE47160590CA5-001/tempDir-002/jetty2/index
   [junit4]   2> 416953 T1690 oasu.RandomMergePolicy.<init> RandomMergePolicy wrapping class org.apache.lucene.index.TieredMergePolicy: [TieredMergePolicy: maxMergeAtOnce=38, maxMergeAtOnceExplicit=47, maxMergedSegmentMB=22.0, floorSegmentMB=0.2392578125, forceMergeDeletesPctAllowed=22.055732698967546, segmentsPerTier=25.0, maxCFSSegmentSizeMB=8.796093022207999E12, noCFSRatio=0.42370587619276046
   [junit4]   2> 416953 T1690 oasc.SolrDeletionPolicy.onCommit SolrDeletionPolicy.onCommit: commits: num=1
   [junit4]   2> 		commit{dir=MockDirectoryWrapper(RAMDirectory@751f3474 lockFactory=org.apache.lucene.store.SingleInstanceLockFactory@5fdfddb5),segFN=segments_1,generation=1}
   [junit4]   2> 416954 T1690 oasc.SolrDeletionPolicy.updateCommits newest commit generation = 1
   [junit4]   2> 416958 T1690 oasup.UpdateRequestProcessorChain.init creating updateRequestProcessorChain "nodistrib"
   [junit4]   2> 416958 T1690 oasup.UpdateRequestProcessorChain.init creating updateRequestProcessorChain "dedupe"
   [junit4]   2> 416959 T1690 oasup.UpdateRequestProcessorChain.init inserting DistributedUpdateProcessorFactory into updateRequestProcessorChain "dedupe"
   [junit4]   2> 416959 T1690 oasup.UpdateRequestProcessorChain.init creating updateRequestProcessorChain "stored_sig"
   [junit4]   2> 416959 T1690 oasup.UpdateRequestProcessorChain.init inserting DistributedUpdateProcessorFactory into updateRequestProcessorChain "stored_sig"
   [junit4]   2> 416960 T1690 oasup.UpdateRequestProcessorChain.init creating updateRequestProcessorChain "distrib-dup-test-chain-explicit"
   [junit4]   2> 416960 T1690 oasup.UpdateRequestProcessorChain.init creating updateRequestProcessorChain "distrib-dup-test-chain-implicit"
   [junit4]   2> 416960 T1690 oasup.UpdateRequestProcessorChain.init inserting DistributedUpdateProcessorFactory into updateRequestProcessorChain "distrib-dup-test-chain-implicit"
   [junit4]   2> 416961 T1690 oasc.SolrCore.loadUpdateProcessorChains no updateRequestProcessorChain defined as default, creating implicit default
   [junit4]   2> 416961 T1690 oasc.RequestHandlers.initHandlersFromConfig created /update: org.apache.solr.handler.UpdateRequestHandler
   [junit4]   2> 416962 T1690 oasc.RequestHandlers.initHandlersFromConfig created /update/json: org.apache.solr.handler.UpdateRequestHandler
   [junit4]   2> 416962 T1690 oasc.RequestHandlers.initHandlersFromConfig created /update/csv: org.apache.solr.handler.UpdateRequestHandler
   [junit4]   2> 416963 T1690 oasc.RequestHandlers.initHandlersFromConfig created /update/json/docs: org.apache.solr.handler.UpdateRequestHandler
   [junit4]   2> 416963 T1690 oasc.RequestHandlers.initHandlersFromConfig created /config: org.apache.solr.handler.SolrConfigHandler
   [junit4]   2> 416964 T1690 oasc.RequestHandlers.initHandlersFromConfig created /schema: org.apache.solr.handler.SchemaHandler
   [junit4]   2> 416965 T1690 oasc.RequestHandlers.initHandlersFromConfig created /replication: org.apache.solr.handler.ReplicationHandler
   [junit4]   2> 416965 T1690 oasc.RequestHandlers.initHandlersFromConfig created /get: org.apache.solr.handler.RealTimeGetHandler
   [junit4]   2> 416966 T1690 oasc.RequestHandlers.initHandlersFromConfig created /admin/luke: org.apache.solr.handler.admin.LukeRequestHandler
   [junit4]   2> 416966 T1690 oasc.RequestHandlers.initHandlersFromConfig created /admin/system: org.apache.solr.handler.admin.SystemInfoHandler
   [junit4]   2> 416967 T1690 oasc.RequestH

[...truncated too long message...]

it4]   2> 447037 T1736 oascc.SolrZkClient.makePath makePath: /collections/collection1/leaders/shard1
   [junit4]   2> 447037 T1736 oasc.SolrException.log ERROR There was a problem trying to register as the leader:org.apache.solr.common.SolrException: Could not register as the leader because creating the ephemeral registration node in ZooKeeper failed
   [junit4]   2> 		at org.apache.solr.cloud.ShardLeaderElectionContextBase.runLeaderProcess(ElectionContext.java:147)
   [junit4]   2> 		at org.apache.solr.cloud.ShardLeaderElectionContext.runLeaderProcess(ElectionContext.java:308)
   [junit4]   2> 		at org.apache.solr.cloud.LeaderElector.runIamLeaderProcess(LeaderElector.java:198)
   [junit4]   2> 		at org.apache.solr.cloud.LeaderElector.checkIfIamLeader(LeaderElector.java:159)
   [junit4]   2> 		at org.apache.solr.cloud.LeaderElector.access$200(LeaderElector.java:56)
   [junit4]   2> 		at org.apache.solr.cloud.LeaderElector$ElectionWatcher.process(LeaderElector.java:390)
   [junit4]   2> 		at org.apache.solr.common.cloud.SolrZkClient$3$1.run(SolrZkClient.java:263)
   [junit4]   2> 		at java.util.concurrent.Executors$RunnableAdapter.call(Executors.java:511)
   [junit4]   2> 		at java.util.concurrent.FutureTask.run(FutureTask.java:266)
   [junit4]   2> 		at java.util.concurrent.ThreadPoolExecutor.runWorker(ThreadPoolExecutor.java:1142)
   [junit4]   2> 		at java.util.concurrent.ThreadPoolExecutor$Worker.run(ThreadPoolExecutor.java:617)
   [junit4]   2> 		at java.lang.Thread.run(Thread.java:745)
   [junit4]   2> 	Caused by: org.apache.zookeeper.KeeperException$SessionExpiredException: KeeperErrorCode = Session expired for /collections
   [junit4]   2> 		at org.apache.zookeeper.KeeperException.create(KeeperException.java:127)
   [junit4]   2> 		at org.apache.zookeeper.KeeperException.create(KeeperException.java:51)
   [junit4]   2> 		at org.apache.zookeeper.ZooKeeper.exists(ZooKeeper.java:1045)
   [junit4]   2> 		at org.apache.solr.common.cloud.SolrZkClient$4.execute(SolrZkClient.java:293)
   [junit4]   2> 		at org.apache.solr.common.cloud.SolrZkClient$4.execute(SolrZkClient.java:290)
   [junit4]   2> 		at org.apache.solr.common.cloud.ZkCmdExecutor.retryOperation(ZkCmdExecutor.java:61)
   [junit4]   2> 		at org.apache.solr.common.cloud.SolrZkClient.exists(SolrZkClient.java:290)
   [junit4]   2> 		at org.apache.solr.common.cloud.SolrZkClient.makePath(SolrZkClient.java:485)
   [junit4]   2> 		at org.apache.solr.common.cloud.SolrZkClient.makePath(SolrZkClient.java:454)
   [junit4]   2> 		at org.apache.solr.common.cloud.SolrZkClient.makePath(SolrZkClient.java:441)
   [junit4]   2> 		at org.apache.solr.cloud.ShardLeaderElectionContextBase$1.execute(ElectionContext.java:139)
   [junit4]   2> 		at org.apache.solr.common.util.RetryUtil.retryOnThrowable(RetryUtil.java:31)
   [junit4]   2> 		at org.apache.solr.cloud.ShardLeaderElectionContextBase.runLeaderProcess(ElectionContext.java:135)
   [junit4]   2> 		... 11 more
   [junit4]   2> 	
   [junit4]   2> 447553 T1797 oascc.ZkStateReader$3.process WARN ZooKeeper watch triggered, but Solr cannot talk to ZK
   [junit4]   2> 447555 T1600 oejs.AbstractConnector.doStop Stopped ServerConnector@683f7b51{HTTP/1.1}{127.0.0.1:0}
   [junit4]   2> 447562 T1600 oejsh.ContextHandler.doStop Stopped o.e.j.s.ServletContextHandler@49b64a62{/,null,UNAVAILABLE}
   [junit4]   2> 447567 T1600 oas.SolrTestCaseJ4.tearDown ###Ending testDistribSearch
   [junit4]   2> 447568 T1600 oasc.ZkTestServer.send4LetterWord connecting to 127.0.0.1:51711 51711
   [junit4]   2> 448340 T1612 oasc.ZkTestServer.send4LetterWord connecting to 127.0.0.1:51711 51711
   [junit4]   2> 448343 T1612 oasc.ZkTestServer$ZKServerMain.runFromConfig WARN Watch limit violations: 
   [junit4]   2> 	Maximum concurrent create/delete watches above limit:
   [junit4]   2> 	
   [junit4]   2> 		10	/solr/configs/conf1
   [junit4]   2> 		6	/solr/aliases.json
   [junit4]   2> 		6	/solr/clusterstate.json
   [junit4]   2> 		2	/solr/configs/.system
   [junit4]   2> 	
   [junit4]   2> 	Maximum concurrent children watches above limit:
   [junit4]   2> 	
   [junit4]   2> 		6	/solr/live_nodes
   [junit4]   2> 		5	/solr/overseer/collection-queue-work
   [junit4]   2> 		4	/solr/overseer/queue
   [junit4]   2> 	
   [junit4]   2> 448344 T1600 oasc.ChaosMonkey.monkeyLog monkey: stop shard! 55326
   [junit4]   2> 448344 T1600 oas.SolrTestCaseJ4.tearDown ###Ending testDistribSearch
   [junit4]   2> 448344 T1600 oasc.ZkTestServer.send4LetterWord connecting to 127.0.0.1:51711 51711
   [junit4]   2> NOTE: reproduce with: ant test  -Dtestcase=TestDynamicLoading -Dtests.method=testDistribSearch -Dtests.seed=311CE47160590CA5 -Dtests.multiplier=3 -Dtests.slow=true -Dtests.locale=es_GT -Dtests.timezone=Pacific/Pohnpei -Dtests.asserts=true -Dtests.file.encoding=UTF-8
   [junit4] FAILURE 38.0s J1 | TestDynamicLoading.testDistribSearch <<<
   [junit4]    > Throwable #1: java.lang.AssertionError: Could not successfully add blob after 150 attempts. Expecting 2 items. time elapsed 15,669  output  for url is {
   [junit4]    >   "responseHeader":{
   [junit4]    >     "status":0,
   [junit4]    >     "QTime":1},
   [junit4]    >   "response":{
   [junit4]    >     "numFound":1,
   [junit4]    >     "start":0,
   [junit4]    >     "docs":[{
   [junit4]    >         "id":"test/1",
   [junit4]    >         "md5":"1c045b1c3b68e3855b2ee205c2960ad",
   [junit4]    >         "blobName":"test",
   [junit4]    >         "version":1,
   [junit4]    >         "timestamp":"2015-01-13T23:55:38.216Z",
   [junit4]    >         "size":5318}]}}
   [junit4]    > 	at __randomizedtesting.SeedInfo.seed([311CE47160590CA5:B0FA6A6917066C99]:0)
   [junit4]    > 	at org.apache.solr.handler.TestBlobHandler.postAndCheck(TestBlobHandler.java:150)
   [junit4]    > 	at org.apache.solr.core.TestDynamicLoading.dynamicLoading(TestDynamicLoading.java:114)
   [junit4]    > 	at org.apache.solr.core.TestDynamicLoading.doTest(TestDynamicLoading.java:70)
   [junit4]    > 	at org.apache.solr.BaseDistributedSearchTestCase.testDistribSearch(BaseDistributedSearchTestCase.java:868)
   [junit4]    > 	at java.lang.Thread.run(Thread.java:745)
   [junit4]   2> 448363 T1600 oas.SolrTestCaseJ4.deleteCore ###deleteCore
   [junit4]   2> NOTE: leaving temporary files on disk at: /mnt/ssd/jenkins/workspace/Lucene-Solr-trunk-Linux/solr/build/solr-core/test/J1/temp/solr.core.TestDynamicLoading 311CE47160590CA5-001
   [junit4]   2> 38692 T1599 ccr.ThreadLeakControl.checkThreadLeaks WARNING Will linger awaiting termination of 1 leaked thread(s).
   [junit4]   2> NOTE: test params are: codec=FastDecompressionCompressingStoredFields(storedFieldsFormat=CompressingStoredFieldsFormat(compressionMode=FAST_DECOMPRESSION, chunkSize=3, maxDocsPerChunk=779, blockSize=516), termVectorsFormat=CompressingTermVectorsFormat(compressionMode=FAST_DECOMPRESSION, chunkSize=3, blockSize=516)), sim=RandomSimilarityProvider(queryNorm=false,coord=yes): {}, locale=es_GT, timezone=Pacific/Pohnpei
   [junit4]   2> NOTE: Linux 3.13.0-43-generic amd64/Oracle Corporation 1.8.0_40-ea (64-bit)/cpus=8,threads=1,free=341891984,total=536870912
   [junit4]   2> NOTE: All tests run in this JVM: [DistributedTermsComponentTest, TestSolr4Spatial2, TestReload, TestDocBasedVersionConstraints, TestFiltering, DisMaxRequestHandlerTest, ChangedSchemaMergeTest, SpellCheckComponentTest, SpellPossibilityIteratorTest, UpdateParamsTest, FieldMutatingUpdateProcessorTest, TestJoin, TestRTGBase, BinaryUpdateRequestHandlerTest, TermVectorComponentDistributedTest, TestMaxScoreQueryParser, TestRawResponseWriter, TestSolrXmlPersistence, TestSolrIndexConfig, ShardRoutingCustomTest, TestConfigOverlay, TestElisionMultitermQuery, StatsComponentTest, EnumFieldTest, AddSchemaFieldsUpdateProcessorFactoryTest, TestManagedSchema, TestNoOpRegenerator, UpdateRequestProcessorFactoryTest, FastVectorHighlighterTest, IndexSchemaTest, EchoParamsTest, TestJmxMonitoredMap, TestFieldTypeCollectionResource, TestDynamicFieldCollectionResource, TestSolrJ, BufferStoreTest, TestFreeTextSuggestions, TestOrdValues, MBeansHandlerTest, TestDynamicFieldResource, TestAddFieldRealTimeGet, StatelessScriptUpdateProcessorFactoryTest, QueryParsingTest, DistributedQueueTest, TestLuceneMatchVersion, TimeZoneUtilsTest, TestDocSet, PreAnalyzedUpdateProcessorTest, ExternalFileFieldSortTest, TestNRTOpen, ShardSplitTest, WordBreakSolrSpellCheckerTest, OverseerStatusTest, AnalysisErrorHandlingTest, BadIndexSchemaTest, TestFieldCollectionResource, TestDynamicLoading]
   [junit4] Completed on J1 in 38.96s, 2 tests, 1 failure <<< FAILURES!

[...truncated 1129 lines...]
BUILD FAILED
/mnt/ssd/jenkins/workspace/Lucene-Solr-trunk-Linux/build.xml:519: The following error occurred while executing this line:
/mnt/ssd/jenkins/workspace/Lucene-Solr-trunk-Linux/build.xml:467: The following error occurred while executing this line:
/mnt/ssd/jenkins/workspace/Lucene-Solr-trunk-Linux/build.xml:61: The following error occurred while executing this line:
/mnt/ssd/jenkins/workspace/Lucene-Solr-trunk-Linux/extra-targets.xml:39: The following error occurred while executing this line:
/mnt/ssd/jenkins/workspace/Lucene-Solr-trunk-Linux/solr/build.xml:187: The following error occurred while executing this line:
/mnt/ssd/jenkins/workspace/Lucene-Solr-trunk-Linux/solr/common-build.xml:510: The following error occurred while executing this line:
/mnt/ssd/jenkins/workspace/Lucene-Solr-trunk-Linux/lucene/common-build.xml:1348: The following error occurred while executing this line:
/mnt/ssd/jenkins/workspace/Lucene-Solr-trunk-Linux/lucene/common-build.xml:956: There were test failures: 463 suites, 1870 tests, 1 failure, 47 ignored (21 assumptions)

Total time: 60 minutes 9 seconds
Build step 'Invoke Ant' marked build as failure
[description-setter] Description set: Java: 64bit/jdk1.8.0_40-ea-b20 -XX:-UseCompressedOops -XX:+UseG1GC
Archiving artifacts
Recording test results
Email was triggered for: Failure - Any
Sending email for trigger: Failure - Any



[JENKINS] Lucene-Solr-trunk-Linux (64bit/jdk1.8.0_40-ea-b20) - Build # 11597 - Still Failing!

Posted by Policeman Jenkins Server <je...@thetaphi.de>.
Build: http://jenkins.thetaphi.de/job/Lucene-Solr-trunk-Linux/11597/
Java: 64bit/jdk1.8.0_40-ea-b20 -XX:-UseCompressedOops -XX:+UseG1GC

All tests passed

Build Log:
[...truncated 2929 lines...]
   [junit4] JVM J0: stderr was not empty, see: /mnt/ssd/jenkins/workspace/Lucene-Solr-trunk-Linux/lucene/build/analysis/icu/test/temp/junit4-J0-20150114_044045_599.syserr
   [junit4] >>> JVM J0: stderr (verbatim) ----
   [junit4] *** glibc detected *** /var/lib/jenkins/tools/java/64bit/jdk1.8.0_40-ea-b20/jre/bin/java: free(): invalid pointer: 0x00007f2a2298a948 ***
   [junit4] ======= Backtrace: =========
   [junit4] /lib/x86_64-linux-gnu/libc.so.6(+0x7e846)[0x7f2ac03d6846]
   [junit4] /var/lib/jenkins/tools/java/64bit/jdk1.8.0_40-ea-b20/jre/lib/amd64/server/libjvm.so(+0x621d31)[0x7f2abf9b2d31]
   [junit4] /var/lib/jenkins/tools/java/64bit/jdk1.8.0_40-ea-b20/jre/lib/amd64/server/libjvm.so(+0x9a3dbc)[0x7f2abfd34dbc]
   [junit4] /var/lib/jenkins/tools/java/64bit/jdk1.8.0_40-ea-b20/jre/lib/amd64/server/libjvm.so(+0x9a4ab6)[0x7f2abfd35ab6]
   [junit4] /var/lib/jenkins/tools/java/64bit/jdk1.8.0_40-ea-b20/jre/lib/amd64/server/libjvm.so(+0xab2f0f)[0x7f2abfe43f0f]
   [junit4] /var/lib/jenkins/tools/java/64bit/jdk1.8.0_40-ea-b20/jre/lib/amd64/server/libjvm.so(+0xab3390)[0x7f2abfe44390]
   [junit4] /var/lib/jenkins/tools/java/64bit/jdk1.8.0_40-ea-b20/jre/lib/amd64/server/libjvm.so(+0x9102d8)[0x7f2abfca12d8]
   [junit4] /lib/x86_64-linux-gnu/libpthread.so.0(+0x7e9a)[0x7f2ac0b38e9a]
   [junit4] /lib/x86_64-linux-gnu/libc.so.6(clone+0x6d)[0x7f2ac044c2ed]
   [junit4] ======= Memory map: ========
   [junit4] 00400000-00401000 r-xp 00000000 09:01 21922585                           /var/lib/jenkins/tools/java/64bit/jdk1.8.0_40-ea-b20/jre/bin/java
   [junit4] 00600000-00601000 rw-p 00000000 09:01 21922585                           /var/lib/jenkins/tools/java/64bit/jdk1.8.0_40-ea-b20/jre/bin/java
   [junit4] 0097b000-0099c000 rw-p 00000000 00:00 0                                  [heap]
   [junit4] 7f29d4000000-7f29d4021000 rw-p 00000000 00:00 0 
   [junit4] 7f29d4021000-7f29d8000000 ---p 00000000 00:00 0 
   [junit4] 7f29dc000000-7f29dc021000 rw-p 00000000 00:00 0 
   [junit4] 7f29dc021000-7f29e0000000 ---p 00000000 00:00 0 
   [junit4] 7f29e0000000-7f29e0021000 rw-p 00000000 00:00 0 
   [junit4] 7f29e0021000-7f29e4000000 ---p 00000000 00:00 0 
   [junit4] 7f29e4000000-7f29e4029000 rw-p 00000000 00:00 0 
   [junit4] 7f29e4029000-7f29e8000000 ---p 00000000 00:00 0 
   [junit4] 7f29e8000000-7f29e8021000 rw-p 00000000 00:00 0 
   [junit4] 7f29e8021000-7f29ec000000 ---p 00000000 00:00 0 
   [junit4] 7f29ec000000-7f29ec021000 rw-p 00000000 00:00 0 
   [junit4] 7f29ec021000-7f29f0000000 ---p 00000000 00:00 0 
   [junit4] 7f29f0000000-7f29f0021000 rw-p 00000000 00:00 0 
   [junit4] 7f29f0021000-7f29f4000000 ---p 00000000 00:00 0 
   [junit4] 7f29f4000000-7f29f44ba000 rw-p 00000000 00:00 0 
   [junit4] 7f29f44ba000-7f29f8000000 ---p 00000000 00:00 0 
   [junit4] 7f29f8000000-7f29f8021000 rw-p 00000000 00:00 0 
   [junit4] 7f29f8021000-7f29fc000000 ---p 00000000 00:00 0 
   [junit4] 7f29fc000000-7f29fc021000 rw-p 00000000 00:00 0 
   [junit4] 7f29fc021000-7f2a00000000 ---p 00000000 00:00 0 
   [junit4] 7f2a00000000-7f2a00027000 rw-p 00000000 00:00 0 
   [junit4] 7f2a00027000-7f2a04000000 ---p 00000000 00:00 0 
   [junit4] 7f2a04000000-7f2a04021000 rw-p 00000000 00:00 0 
   [junit4] 7f2a04021000-7f2a08000000 ---p 00000000 00:00 0 
   [junit4] 7f2a08000000-7f2a08021000 rw-p 00000000 00:00 0 
   [junit4] 7f2a08021000-7f2a0c000000 ---p 00000000 00:00 0 
   [junit4] 7f2a0c000000-7f2a0dc65000 rw-p 00000000 00:00 0 
   [junit4] 7f2a0dc65000-7f2a10000000 ---p 00000000 00:00 0 
   [junit4] 7f2a10000000-7f2a10676000 rw-p 00000000 00:00 0 
   [junit4] 7f2a10676000-7f2a14000000 ---p 00000000 00:00 0 
   [junit4] 7f2a14000000-7f2a15fd3000 rw-p 00000000 00:00 0 
   [junit4] 7f2a15fd3000-7f2a18000000 ---p 00000000 00:00 0 
   [junit4] 7f2a18000000-7f2a1bbf1000 rw-p 00000000 00:00 0 
   [junit4] 7f2a1bbf1000-7f2a1c000000 ---p 00000000 00:00 0 
   [junit4] 7f2a1c000000-7f2a1c021000 rw-p 00000000 00:00 0 
   [junit4] 7f2a1c021000-7f2a20000000 ---p 00000000 00:00 0 
   [junit4] 7f2a218a3000-7f2a218b8000 r-xp 00000000 09:01 46243942                   /lib/x86_64-linux-gnu/libgcc_s.so.1
   [junit4] 7f2a218b8000-7f2a21ab7000 ---p 00015000 09:01 46243942                   /lib/x86_64-linux-gnu/libgcc_s.so.1
   [junit4] 7f2a21ab7000-7f2a21ab8000 r--p 00014000 09:01 46243942                   /lib/x86_64-linux-gnu/libgcc_s.so.1
   [junit4] 7f2a21ab8000-7f2a21ab9000 rw-p 00015000 09:01 46243942                   /lib/x86_64-linux-gnu/libgcc_s.so.1
   [junit4] 7f2a21aca000-7f2a21b0a000 rw-p 00000000 00:00 0 
   [junit4] 7f2a21b0a000-7f2a21cca000 ---p 00000000 00:00 0 
   [junit4] 7f2a21cca000-7f2a21eca000 rw-p 00000000 00:00 0 
   [junit4] 7f2a21eca000-7f2a21ecd000 ---p 00000000 00:00 0 
   [junit4] 7f2a21ecd000-7f2a21fcb000 rw-p 00000000 00:00 0 
   [junit4] 7f2a21fcb000-7f2a21fce000 ---p 00000000 00:00 0 
   [junit4] 7f2a21fce000-7f2a220cc000 rw-p 00000000 00:00 0 
   [junit4] 7f2a220cc000-7f2a220cf000 ---p 00000000 00:00 0 
   [junit4] 7f2a220cf000-7f2a221cd000 rw-p 00000000 00:00 0 
   [junit4] 7f2a221cd000-7f2a221d0000 ---p 00000000 00:00 0 
   [junit4] 7f2a221d0000-7f2a222ce000 rw-p 00000000 00:00 0 
   [junit4] 7f2a222ce000-7f2a222d1000 ---p 00000000 00:00 0 
   [junit4] 7f2a222d1000-7f2a223cf000 rw-p 00000000 00:00 0 
   [junit4] 7f2a223cf000-7f2a223d2000 ---p 00000000 00:00 0 
   [junit4] 7f2a223d2000-7f2a224d0000 rw-p 00000000 00:00 0 
   [junit4] 7f2a224d0000-7f2a224d3000 ---p 00000000 00:00 0 
   [junit4] 7f2a224d3000-7f2a225d1000 rw-p 00000000 00:00 0 
   [junit4] 7f2a225d1000-7f2a225d4000 ---p 00000000 00:00 0 
   [junit4] 7f2a225d4000-7f2a228d2000 rw-p 00000000 00:00 0 
   [junit4] 7f2a228d2000-7f2a22ad2000 rw-p 00000000 00:00 0 
   [junit4] 7f2a22ad2000-7f2a22cd2000 rw-p 00000000 00:00 0 
   [junit4] 7f2a22cd2000-7f2a22ce3000 r-xp 00000000 09:01 21922566                   /var/lib/jenkins/tools/java/64bit/jdk1.8.0_40-ea-b20/jre/lib/amd64/libnio.so
   [junit4] 7f2a22ce3000-7f2a22ee2000 ---p 00011000 09:01 21922566                   /var/lib/jenkins/tools/java/64bit/jdk1.8.0_40-ea-b20/jre/lib/amd64/libnio.so
   [junit4] 7f2a22ee2000-7f2a22ee3000 rw-p 00010000 09:01 21922566                   /var/lib/jenkins/tools/java/64bit/jdk1.8.0_40-ea-b20/jre/lib/amd64/libnio.so
   [junit4] 7f2a22ee3000-7f2a22ee6000 ---p 00000000 00:00 0 
   [junit4] 7f2a22ee6000-7f2a22fe4000 rw-p 00000000 00:00 0                          [stack:3672]
   [junit4] 7f2a22fe4000-7f2a22fe7000 ---p 00000000 00:00 0 
   [junit4] 7f2a22fe7000-7f2a230e5000 rw-p 00000000 00:00 0                          [stack:3671]
   [junit4] 7f2a230e5000-7f2a230fd000 r-xp 00000000 09:01 46244038                   /lib/x86_64-linux-gnu/libresolv-2.15.so
   [junit4] 7f2a230fd000-7f2a232fd000 ---p 00018000 09:01 46244038                   /lib/x86_64-linux-gnu/libresolv-2.15.so
   [junit4] 7f2a232fd000-7f2a232fe000 r--p 00018000 09:01 46244038                   /lib/x86_64-linux-gnu/libresolv-2.15.so
   [junit4] 7f2a232fe000-7f2a232ff000 rw-p 00019000 09:01 46244038                   /lib/x86_64-linux-gnu/libresolv-2.15.so
   [junit4] 7f2a232ff000-7f2a23301000 rw-p 00000000 00:00 0 
   [junit4] 7f2a23301000-7f2a23308000 r-xp 00000000 09:01 46244238                   /lib/x86_64-linux-gnu/libnss_dns-2.15.so
   [junit4] 7f2a23308000-7f2a23507000 ---p 00007000 09:01 46244238                   /lib/x86_64-linux-gnu/libnss_dns-2.15.so
   [junit4] 7f2a23507000-7f2a23508000 r--p 00006000 09:01 46244238                   /lib/x86_64-linux-gnu/libnss_dns-2.15.so
   [junit4] 7f2a23508000-7f2a23509000 rw-p 00007000 09:01 46244238                   /lib/x86_64-linux-gnu/libnss_dns-2.15.so
   [junit4] 7f2a23519000-7f2a2351a000 rw-p 00000000 00:00 0 
   [junit4] 7f2a2351a000-7f2a23522000 r-xp 00000000 09:01 21922513                   /var/lib/jenkins/tools/java/64bit/jdk1.8.0_40-ea-b20/jre/lib/amd64/libmanagement.so
   [junit4] 7f2a23522000-7f2a23722000 ---p 00008000 09:01 21922513                   /var/lib/jenkins/tools/java/64bit/jdk1.8.0_40-ea-b20/jre/lib/amd64/libmanagement.so
   [junit4] 7f2a23722000-7f2a23723000 rw-p 00008000 09:01 21922513                   /var/lib/jenkins/tools/java/64bit/jdk1.8.0_40-ea-b20/jre/lib/amd64/libmanagement.so
   [junit4] 7f2a23723000-7f2a23726000 ---p 00000000 00:00 0 
   [junit4] 7f2a23726000-7f2a23824000 rw-p 00000000 00:00 0                          [stack:3630]
   [junit4] 7f2a23824000-7f2a2384c000 r--s 00109000 09:01 21653544                   /var/lib/jenkins/.ivy2/cache/com.carrotsearch.randomizedtesting/junit4-ant/jars/junit4-ant-2.1.9.jar
   [junit4] 7f2a2384c000-7f2a238c5000 r--s 010e7000 09:01 21907508                   /var/lib/jenkins/tools/java/64bit/jdk1.8.0_40-ea-b20/lib/tools.jar
   [junit4] 7f2a238c5000-7f2a238c6000 r--s 00001000 09:01 22405694                   /var/lib/jenkins/tools/hudson.tasks.Ant_AntInstallation/ANT_1.8.2/lib/ant-antlr.jar
   [junit4] 7f2a238c6000-7f2a238c8000 r--s 00001000 09:01 22405693                   /var/lib/jenkins/tools/hudson.tasks.Ant_AntInstallation/ANT_1.8.2/lib/ant-apache-bcel.jar
   [junit4] 7f2a238c8000-7f2a238e6000 r--s 001bb000 09:01 22405691                   /var/lib/jenkins/tools/hudson.tasks.Ant_AntInstallation/ANT_1.8.2/lib/ant.jar
   [junit4] 7f2a238e6000-7f2a238e7000 r--s 00001000 09:01 22405690                   /var/lib/jenkins/tools/hudson.tasks.Ant_AntInstallation/ANT_1.8.2/lib/ant-junit4.jar
   [junit4] 7f2a238e7000-7f2a238e8000 r--s 00000000 09:01 22405688                   /var/lib/jenkins/tools/hudson.tasks.Ant_AntInstallation/ANT_1.8.2/lib/ant-apache-regexp.jar
   [junit4] 7f2a238e8000-7f2a238e9000 r--s 00002000 09:01 22405687                   /var/lib/jenkins/tools/hudson.tasks.Ant_AntInstallation/ANT_1.8.2/lib/ant-netrexx.jar
   [junit4] 7f2a238e9000-7f2a238eb000 r--s 00001000 09:01 22405686                   /var/lib/jenkins/tools/hudson.tasks.Ant_AntInstallation/ANT_1.8.2/lib/ant-jdepend.jar
   [junit4] 7f2a238eb000-7f2a238ec000 r--s 00000000 09:01 22405685                   /var/lib/jenkins/tools/hudson.tasks.Ant_AntInstallation/ANT_1.8.2/lib/ant-apache-bsf.jar
   [junit4] 7f2a238ec000-7f2a238ee000 r--s 00013000 09:01 22405682                   /var/lib/jenkins/tools/hudson.tasks.Ant_AntInstallation/ANT_1.8.2/lib/ant-commons-net.jar
   [junit4] 7f2a238ee000-7f2a238ef000 r--s 00009000 09:01 22405676                   /var/lib/jenkins/tools/hudson.tasks.Ant_AntInstallation/ANT_1.8.2/lib/ant-jsch.jar
   [junit4] 7f2a238ef000-7f2a238f1000 r--s 00017000 09:01 22405674                   /var/lib/jenkins/tools/hudson.tasks.Ant_AntInstallation/ANT_1.8.2/lib/ant-junit.jar
   [junit4] 7f2a238f1000-7f2a238f2000 r--s 00000000 09:01 22405669                   /var/lib/jenkins/tools/hudson.tasks.Ant_AntInstallation/ANT_1.8.2/lib/ant-apache-log4j.jar
   [junit4] 7f2a238f2000-7f2a238f3000 r--s 00000000 09:01 22405666                   /var/lib/jenkins/tools/hudson.tasks.Ant_AntInstallation/ANT_1.8.2/lib/ant-commons-logging.jar
   [junit4] 7f2a238f3000-7f2a238f4000 r--s 00003000 09:01 22405665                   /var/lib/jenkins/tools/hudson.tasks.Ant_AntInstallation/ANT_1.8.2/lib/ant-testutil.jar
   [junit4] 7f2a238f4000-7f2a238f5000 r--s 00000000 09:01 22405660                   /var/lib/jenkins/tools/hudson.tasks.Ant_AntInstallation/ANT_1.8.2/lib/ant-apache-resolver.jar
   [junit4] 7f2a238f5000-7f2a238f6000 r--s 00001000 09:01 22405659                   /var/lib/jenkins/tools/hudson.tasks.Ant_AntInstallation/ANT_1.8.2/lib/ant-javamail.jar
   [junit4] 7f2a238f6000-7f2a238f7000 r--s 00000000 09:01 22405657                   /var/lib/jenkins/tools/hudson.tasks.Ant_AntInstallation/ANT_1.8.2/lib/ant-apache-xalan2.jar
   [junit4] 7f2a238f7000-7f2a238f9000 r--s 00008000 09:01 22405653                   /var/lib/jenkins/tools/hudson.tasks.Ant_AntInstallation/ANT_1.8.2/lib/ant-apache-oro.jar
   [junit4] 7f2a238f9000-7f2a238fa000 ---p 00000000 00:00 0 
   [junit4] 7f2a238fa000-7f2a239fa000 rw-p 00000000 00:00 0                          [stack:3628]
   [junit4] 7f2a239fa000-7f2a239fd000 ---p 00000000 00:00 0 
   [junit4] 7f2a239fd000-7f2a23afb000 rw-p 00000000 00:00 0                          [stack:3627]
   [junit4] 7f2a23afb000-7f2a23afe000 ---p 00000000 00:00 0 
   [junit4] 7f2a23afe000-7f2a23bfc000 rw-p 00000000 00:00 0                          [stack:3626]
   [junit4] 7f2a23bfc000-7f2a23bff000 ---p 00000000 00:00 0 
   [junit4] 7f2a23bff000-7f2a23cfd000 rw-p 00000000 00:00 0                          [stack:3625]
   [junit4] 7f2a23cfd000-7f2a23d00000 ---p 00000000 00:00 0 
   [junit4] 7f2a23d00000-7f2a23dfe000 rw-p 00000000 00:00 0                          [stack:3624]
   [junit4] 7f2a23dfe000-7f2a23e01000 ---p 00000000 00:00 0 
   [junit4] 7f2a23e01000-7f2a23eff000 rw-p 00000000 00:00 0                          [stack:3623]
   [junit4] 7f2a23eff000-7f2a23f02000 ---p 00000000 00:00 0 
   [junit4] 7f2a23f02000-7f2a24000000 rw-p 00000000 00:00 0                          [stack:3616]
   [junit4] 7f2a24000000-7f2a24021000 rw-p 00000000 00:00 0 
   [junit4] 7f2a24021000-7f2a28000000 ---p 00000000 00:00 0 
   [junit4] 7f2a28000000-7f2a28021000 rw-p 00000000 00:00 0 
   [junit4] 7f2a28021000-7f2a2c000000 ---p 00000000 00:00 0 
   [junit4] 7f2a2c000000-7f2a2c037000 rw-p 00000000 00:00 0 
   [junit4] 7f2a2c037000-7f2a30000000 ---p 00000000 00:00 0 
   [junit4] 7f2a30000000-7f2a30021000 rw-p 00000000 00:00 0 
   [junit4] 7f2a30021000-7f2a34000000 ---p 00000000 00:00 0 
   [junit4] 7f2a34000000-7f2a34021000 rw-p 00000000 00:00 0 
   [junit4] 7f2a34021000-7f2a38000000 ---p 00000000 00:00 0 
   [junit4] 7f2a38000000-7f2a38021000 rw-p 00000000 00:00 0 
   [junit4] 7f2a38021000-7f2a3c000000 ---p 00000000 00:00 0 
   [junit4] 7f2a3c000000-7f2a3c021000 rw-p 00000000 00:00 0 
   [junit4] 7f2a3c021000-7f2a40000000 ---p 00000000 00:00 0 
   [junit4] 7f2a40000000-7f2a47e00000 rw-p 00000000 00:00 0 
   [junit4] 7f2a47e00000-7f2a60000000 ---p 00000000 00:00 0 
   [junit4] 7f2a60000000-7f2a60021000 rw-p 00000000 00:00 0 
   [junit4] 7f2a60021000-7f2a64000000 ---p 00000000 00:00 0 
   [junit4] 7f2a64000000-7f2a64002000 r--s 00004000 09:01 22405649                   /var/lib/jenkins/tools/hudson.tasks.Ant_AntInstallation/ANT_1.8.2/lib/ant-jai.jar
   [junit4] 7f2a64002000-7f2a64017000 r--s 00116000 09:01 21652884                   /var/lib/jenkins/.ant/lib/ivy-2.3.0.jar
   [junit4] 7f2a64017000-7f2a64019000 r--s 00002000 09:01 22405652                   /var/lib/jenkins/tools/hudson.tasks.Ant_AntInstallation/ANT_1.8.2/lib/ant-launcher.jar
   [junit4] 7f2a64019000-7f2a6401f000 r--s 0002f000 09:01 21653545                   /var/lib/jenkins/.ivy2/cache/com.carrotsearch.randomizedtesting/randomizedtesting-runner/jars/randomizedtesting-runner-2.1.9.jar
   [junit4] 7f2a6401f000-7f2a64082000 r--s 00a3a000 09:01 21653038                   /var/lib/jenkins/.ivy2/cache/com.ibm.icu/icu4j/jars/icu4j-54.1.jar
   [junit4] 7f2a64082000-7f2a64091000 r--s 00152000 08:21 802488                     /mnt/ssd/jenkins/workspace/Lucene-Solr-trunk-Linux/lucene/build/analysis/common/lucene-analyzers-common-6.0.0-SNAPSHOT.jar
   [junit4] 7f2a64091000-7f2a64094000 ---p 00000000 00:00 0 
   [junit4] 7f2a64094000-7f2a64313000 rw-p 00000000 00:00 0                          [stack:3615]
   [junit4] 7f2a64313000-7f2a64329000 r-xp 00000000 09:01 21922512                   /var/lib/jenkins/tools/java/64bit/jdk1.8.0_40-ea-b20/jre/lib/amd64/libnet.so
   [junit4] 7f2a64329000-7f2a64529000 ---p 00016000 09:01 21922512                   /var/lib/jenkins/tools/java/64bit/jdk1.8.0_40-ea-b20/jre/lib/amd64/libnet.so
   [junit4] 7f2a64529000-7f2a6452a000 rw-p 00016000 09:01 21922512                   /var/lib/jenkins/tools/java/64bit/jdk1.8.0_40-ea-b20/jre/lib/amd64/libnet.so
   [junit4] 7f2a6452a000-7f2a646b3000 r--p 00000000 09:01 7439259                    /usr/lib/locale/locale-archive
   [junit4] 7f2a646b3000-7f2a646b6000 ---p 00000000 00:00 0 
   [junit4] 7f2a646b6000-7f2a647b4000 rw-p 00000000 00:00 0                          [stack:3611]
   [junit4] 7f2a647b4000-7f2a647b7000 ---p 00000000 00:00 0 
   [junit4] 7f2a647b7000-7f2a648b5000 rw-p 00000000 00:00 0                          [stack:3610]
   [junit4] 7f2a648b5000-7f2a648b6000 ---p 00000000 00:00 0 
   [junit4] 7f2a648b6000-7f2a64a05000 rw-p 00000000 00:00 0                          [stack:3609]
   [junit4] 7f2a64a05000-7f2a64bdb000 r--s 03cd3000 09:01 21922274                   /var/lib/jenkins/tools/java/64bit/jdk1.8.0_40-ea-b20/jre/lib/rt.jar
   [junit4] 7f2a64bdb000-7f2a654d4000 rw-p 00000000 00:00 0 
   [junit4] 7f2a654d4000-7f2a67cfd000 rw-p 00000000 00:00 0 
   [junit4] 7f2a67cfd000-7f2a67cfe000 ---p 00000000 00:00 0 
   [junit4] 7f2a67cfe000-7f2a67dfe000 rw-p 00000000 00:00 0                          [stack:3605]
   [junit4] 7f2a67dfe000-7f2a67dff000 ---p 00000000 00:00 0 
   [junit4] 7f2a67dff000-7f2a67eff000 rw-p 00000000 00:00 0                          [stack:3604]
   [junit4] 7f2a67eff000-7f2a67f00000 ---p 00000000 00:00 0 
   [junit4] 7f2a67f00000-7f2a68000000 rw-p 00000000 00:00 0                          [stack:3585]
   [junit4] 7f2a68000000-7f2a68021000 rw-p 00000000 00:00 0 
   [junit4] 7f2a68021000-7f2a6c000000 ---p 00000000 00:00 0 
   [junit4] 7f2a6c000000-7f2a6c021000 rw-p 00000000 00:00 0 
   [junit4] 7f2a6c021000-7f2a70000000 ---p 00000000 00:00 0 
   [junit4] 7f2a70000000-7f2a70021000 rw-p 00000000 00:00 0 
   [junit4] 7f2a70021000-7f2a74000000 ---p 00000000 00:00 0 
   [junit4] 7f2a74000000-7f2a74021000 rw-p 00000000 00:00 0 
   [junit4] 7f2a74021000-7f2a78000000 ---p 00000000 00:00 0 
   [junit4] 7f2a78000000-7f2a78021000 rw-p 00000000 00:00 0 
   [junit4] 7f2a78021000-7f2a7c000000 ---p 00000000 00:00 0 
   [junit4] 7f2a7c000000-7f2a7c021000 rw-p 00000000 00:00 0 
   [junit4] 7f2a7c021000-7f2a80000000 ---p 00000000 00:00 0 
   [junit4] 7f2a80000000-7f2a80021000 rw-p 00000000 00:00 0 
   [junit4] 7f2a80021000-7f2a84000000 ---p 00000000 00:00 0 
   [junit4] 7f2a84000000-7f2a84021000 rw-p 00000000 00:00 0 
   [junit4] 7f2a84021000-7f2a88000000 ---p 00000000 00:00 0 
   [junit4] 7f2a88000000-7f2a88021000 rw-p 00000000 00:00 0 
   [junit4] 7f2a88021000-7f2a8c000000 ---p 00000000 00:00 0 
   [junit4] 7f2a8c000000-7f2a8c021000 rw-p 00000000 00:00 0 
   [junit4] 7f2a8c021000-7f2a90000000 ---p 00000000 00:00 0 
   [junit4] 7f2a90000000-7f2a90021000 rw-p 00000000 00:00 0 
   [junit4] 7f2a90021000-7f2a94000000 ---p 00000000 00:00 0 
   [junit4] 7f2a94000000-7f2a94021000 rw-p 00000000 00:00 0 
   [junit4] 7f2a94021000-7f2a98000000 ---p 00000000 00:00 0 
   [junit4] 7f2a98000000-7f2a98021000 rw-p 00000000 00:00 0 
   [junit4] 7f2a98021000-7f2a9c000000 ---p 00000000 00:00 0 
   [junit4] 7f2a9c000000-7f2a9c021000 rw-p 00000000 00:00 0 
   [junit4] 7f2a9c021000-7f2aa0000000 ---p 00000000 00:00 0 
   [junit4] 7f2aa0000000-7f2aa0021000 rw-p 00000000 00:00 0 
   [junit4] 7f2aa0021000-7f2aa4000000 ---p 00000000 00:00 0 
   [junit4] 7f2aa4000000-7f2aa4021000 rw-p 00000000 00:00 0 
   [junit4] 7f2aa4021000-7f2aa8000000 ---p 00000000 00:00 0 
   [junit4] 7f2aa8000000-7f2aa81f8000 rw-p 00000000 00:00 0 
   [junit4] 7f2aa81f8000-7f2aa8800000 ---p 00000000 00:00 0 
   [junit4] 7f2aa8800000-7f2aa89f8000 rw-p 00000000 00:00 0 
   [junit4] 7f2aa89f8000-7f2aa9000000 ---p 00000000 00:00 0 
   [junit4] 7f2aa9000000-7f2aa9980000 rwxp 00000000 00:00 0 
   [junit4] 7f2aa9980000-7f2ab8000000 ---p 00000000 00:00 0 
   [junit4] 7f2ab8000000-7f2ab8691000 rw-p 00000000 00:00 0 
   [junit4] 7f2ab8691000-7f2abc000000 ---p 00000000 00:00 0 
   [junit4] 7f2abc000000-7f2abc001000 r--s 00001000 09:01 22405655                   /var/lib/jenkins/tools/hudson.tasks.Ant_AntInstallation/ANT_1.8.2/lib/ant-jmf.jar
   [junit4] 7f2abc001000-7f2abc061000 rw-p 00000000 00:00 0 
   [junit4] 7f2abc061000-7f2abc122000 ---p 00000000 00:00 0 
   [junit4] 7f2abc122000-7f2abc161000 rw-p 00000000 00:00 0 
   [junit4] 7f2abc161000-7f2abc222000 ---p 00000000 00:00 0 
   [junit4] 7f2abc222000-7f2abc261000 rw-p 00000000 00:00 0 
   [junit4] 7f2abc261000-7f2abc322000 ---p 00000000 00:00 0 
   [junit4] 7f2abc322000-7f2abc323000 ---p 00000000 00:00 0 
   [junit4] 7f2abc323000-7f2abc423000 rw-p 00000000 00:00 0                          [stack:3584]
   [junit4] 7f2abc423000-7f2abc424000 ---p 00000000 00:00 0 
   [junit4] 7f2abc424000-7f2abc524000 rw-p 00000000 00:00 0                          [stack:3583]
   [junit4] 7f2abc524000-7f2abc525000 ---p 00000000 00:00 0 
   [junit4] 7f2abc525000-7f2abc625000 rw-p 00000000 00:00 0                          [stack:3582]
   [junit4] 7f2abc625000-7f2abc626000 ---p 00000000 00:00 0 
   [junit4] 7f2abc626000-7f2abc726000 rw-p 00000000 00:00 0                          [stack:3580]
   [junit4] 7f2abc726000-7f2abc727000 ---p 00000000 00:00 0 
   [junit4] 7f2abc727000-7f2abc827000 rw-p 00000000 00:00 0                          [stack:3578]
   [junit4] 7f2abc827000-7f2abc828000 ---p 00000000 00:00 0 
   [junit4] 7f2abc828000-7f2abc928000 rw-p 00000000 00:00 0                          [stack:3577]
   [junit4] 7f2abc928000-7f2abc929000 ---p 00000000 00:00 0 
   [junit4] 7f2abc929000-7f2abca29000 rw-p 00000000 00:00 0                          [stack:3576]
   [junit4] 7f2abca29000-7f2abca2a000 ---p 00000000 00:00 0 
   [junit4] 7f2abca2a000-7f2abcb2a000 rw-p 00000000 00:00 0                          [stack:3575]
   [junit4] 7f2abcb2a000-7f2abcb2b000 ---p 00000000 00:00 0 
   [junit4] 7f2abcb2b000-7f2abd433000 rw-p 00000000 00:00 0                          [stack:3574]
   [junit4] 7f2abd433000-7f2abd434000 ---p 00000000 00:00 0 
   [junit4] 7f2abd434000-7f2abd534000 rw-p 00000000 00:00 0                          [stack:3573]
   [junit4] 7f2abd534000-7f2abd535000 ---p 00000000 00:00 0 
   [junit4] 7f2abd535000-7f2abd635000 rw-p 00000000 00:00 0                          [stack:3572]
   [junit4] 7f2abd635000-7f2abd636000 ---p 00000000 00:00 0 
   [junit4] 7f2abd636000-7f2abd736000 rw-p 00000000 00:00 0                          [stack:3571]
   [junit4] 7f2abd736000-7f2abd737000 ---p 00000000 00:00 0 
   [junit4] 7f2abd737000-7f2abd837000 rw-p 00000000 00:00 0                          [stack:3570]
   [junit4] 7f2abd837000-7f2abd838000 ---p 00000000 00:00 0 
   [junit4] 7f2abd838000-7f2abd938000 rw-p 00000000 00:00 0                          [stack:3569]
   [junit4] 7f2abd938000-7f2abd939000 ---p 00000000 00:00 0 
   [junit4] 7f2abd939000-7f2abda39000 rw-p 00000000 00:00 0                          [stack:3568]
   [junit4] 7f2abda39000-7f2abda3a000 ---p 00000000 00:00 0 
   [junit4] 7f2abda3a000-7f2abdb3a000 rw-p 00000000 00:00 0                          [stack:3567]
   [junit4] 7f2abdb3a000-7f2abdb3b000 ---p 00000000 00:00 0 
   [junit4] 7f2abdb3b000-7f2abdc61000 rw-p 00000000 00:00 0                          [stack:3566]
   [junit4] 7f2abdc61000-7f2abdffb000 ---p 00000000 00:00 0 
   [junit4] 7f2abdffb000-7f2abe015000 r-xp 00000000 09:01 21922533                   /var/lib/jenkins/tools/java/64bit/jdk1.8.0_40-ea-b20/jre/lib/amd64/libzip.so
   [junit4] 7f2abe015000-7f2abe215000 ---p 0001a000 09:01 21922533                   /var/lib/jenkins/tools/java/64bit/jdk1.8.0_40-ea-b20/jre/lib/amd64/libzip.so
   [junit4] 7f2abe215000-7f2abe216000 rw-p 0001a000 09:01 21922533                   /var/lib/jenkins/tools/java/64bit/jdk1.8.0_40-ea-b20/jre/lib/amd64/libzip.so
   [junit4] 7f2abe216000-7f2abe222000 r-xp 00000000 09:01 46244029                   /lib/x86_64-linux-gnu/libnss_files-2.15.so
   [junit4] 7f2abe222000-7f2abe421000 ---p 0000c000 09:01 46244029                   /lib/x86_64-linux-gnu/libnss_files-2.15.so
   [junit4] 7f2abe421000-7f2abe422000 r--p 0000b000 09:01 46244029                   /lib/x86_64-linux-gnu/libnss_files-2.15.so
   [junit4] 7f2abe422000-7f2abe423000 rw-p 0000c000 09:01 46244029                   /lib/x86_64-linux-gnu/libnss_files-2.15.so
   [junit4] 7f2abe423000-7f2abe42d000 r-xp 00000000 09:01 46244081                   /lib/x86_64-linux-gnu/libnss_nis-2.15.so
   [junit4] 7f2abe42d000-7f2abe62d000 ---p 0000a000 09:01 46244081                   /lib/x86_64-linux-gnu/libnss_nis-2.15.so
   [junit4] 7f2abe62d000-7f2abe62e000 r--p 0000a000 09:01 46244081                   /lib/x86_64-linux-gnu/libnss_nis-2.15.so
   [junit4] 7f2abe62e000-7f2abe62f000 rw-p 0000b000 09:01 46244081                   /lib/x86_64-linux-gnu/libnss_nis-2.15.so
   [junit4] 7f2abe62f000-7f2abe646000 r-xp 00000000 09:01 46244025                   /lib/x86_64-linux-gnu/libnsl-2.15.so
   [junit4] 7f2abe646000-7f2abe845000 ---p 00017000 09:01 46244025                   /lib/x86_64-linux-gnu/libnsl-2.15.so
   [junit4] 7f2abe845000-7f2abe846000 r--p 00016000 09:01 46244025                   /lib/x86_64-linux-gnu/libnsl-2.15.so
   [junit4] 7f2abe846000-7f2abe847000 rw-p 00017000 09:01 46244025                   /lib/x86_64-linux-gnu/libnsl-2.15.so
   [junit4] 7f2abe847000-7f2abe849000 rw-p 00000000 00:00 0 
   [junit4] 7f2abe849000-7f2abe851000 r-xp 00000000 09:01 46244073                   /lib/x86_64-linux-gnu/libnss_compat-2.15.so
   [junit4] 7f2abe851000-7f2abea50000 ---p 00008000 09:01 46244073                   /lib/x86_64-linux-gnu/libnss_compat-2.15.so
   [junit4] 7f2abea50000-7f2abea51000 r--p 00007000 09:01 46244073                   /lib/x86_64-linux-gnu/libnss_compat-2.15.so
   [junit4] 7f2abea51000-7f2abea52000 rw-p 00008000 09:01 46244073                   /lib/x86_64-linux-gnu/libnss_compat-2.15.so
   [junit4] 7f2abea52000-7f2abea7c000 r-xp 00000000 09:01 21922525                   /var/lib/jenkins/tools/java/64bit/jdk1.8.0_40-ea-b20/jre/lib/amd64/libjava.so
   [junit4] 7f2abea7c000-7f2abec7c000 ---p 0002a000 09:01 21922525                   /var/lib/jenkins/tools/java/64bit/jdk1.8.0_40-ea-b20/jre/lib/amd64/libjava.so
   [junit4] 7f2abec7c000-7f2abec7e000 rw-p 0002a000 09:01 21922525                   /var/lib/jenkins/tools/java/64bit/jdk1.8.0_40-ea-b20/jre/lib/amd64/libjava.so
   [junit4] 7f2abec7e000-7f2abec8b000 r-xp 00000000 09:01 21922516                   /var/lib/jenkins/tools/java/64bit/jdk1.8.0_40-ea-b20/jre/lib/amd64/libverify.so
   [junit4] 7f2abec8b000-7f2abee8b000 ---p 0000d000 09:01 21922516                   /var/lib/jenkins/tools/java/64bit/jdk1.8.0_40-ea-b20/jre/lib/amd64/libverify.so
   [junit4] 7f2abee8b000-7f2abee8d000 rw-p 0000d000 09:01 21922516                   /var/lib/jenkins/tools/java/64bit/jdk1.8.0_40-ea-b20/jre/lib/amd64/libverify.so
   [junit4] 7f2abee8d000-7f2abee94000 r-xp 00000000 09:01 46244018                   /lib/x86_64-linux-gnu/librt-2.15.so
   [junit4] 7f2abee94000-7f2abf093000 ---p 00007000 09:01 46244018                   /lib/x86_64-linux-gnu/librt-2.15.so
   [junit4] 7f2abf093000-7f2abf094000 r--p 00006000 09:01 46244018                   /lib/x86_64-linux-gnu/librt-2.15.so
   [junit4] 7f2abf094000-7f2abf095000 rw-p 00007000 09:01 46244018                   /lib/x86_64-linux-gnu/librt-2.15.so
   [junit4] 7f2abf095000-7f2abf190000 r-xp 00000000 09:01 46244067                   /lib/x86_64-linux-gnu/libm-2.15.so
   [junit4] 7f2abf190000-7f2abf38f000 ---p 000fb000 09:01 46244067                   /lib/x86_64-linux-gnu/libm-2.15.so
   [junit4] 7f2abf38f000-7f2abf390000 r--p 000fa000 09:01 46244067                   /lib/x86_64-linux-gnu/libm-2.15.so
   [junit4] 7f2abf390000-7f2abf391000 rw-p 000fb000 09:01 46244067                   /lib/x86_64-linux-gnu/libm-2.15.so
   [junit4] 7f2abf391000-7f2ac003d000 r-xp 00000000 09:01 21922531                   /var/lib/jenkins/tools/java/64bit/jdk1.8.0_40-ea-b20/jre/lib/amd64/server/libjvm.so
   [junit4] 7f2ac003d000-7f2ac023d000 ---p 00cac000 09:01 21922531                   /var/lib/jenkins/tools/java/64bit/jdk1.8.0_40-ea-b20/jre/lib/amd64/server/libjvm.so
   [junit4] 7f2ac023d000-7f2ac0314000 rw-p 00cac000 09:01 21922531                   /var/lib/jenkins/tools/java/64bit/jdk1.8.0_40-ea-b20/jre/lib/amd64/server/libjvm.so
   [junit4] 7f2ac0314000-7f2ac0358000 rw-p 00000000 00:00 0 
   [junit4] 7f2ac0358000-7f2ac050d000 r-xp 00000000 09:01 46244035                   /lib/x86_64-linux-gnu/libc-2.15.so
   [junit4] 7f2ac050d000-7f2ac070c000 ---p 001b5000 09:01 46244035                   /lib/x86_64-linux-gnu/libc-2.15.so
   [junit4] 7f2ac070c000-7f2ac0710000 r--p 001b4000 09:01 46244035                   /lib/x86_64-linux-gnu/libc-2.15.so
   [junit4] 7f2ac0710000-7f2ac0712000 rw-p 001b8000 09:01 46244035                   /lib/x86_64-linux-gnu/libc-2.15.so
   [junit4] 7f2ac0712000-7f2ac0717000 rw-p 00000000 00:00 0 
   [junit4] 7f2ac0717000-7f2ac0719000 r-xp 00000000 09:01 46244240                   /lib/x86_64-linux-gnu/libdl-2.15.so
   [junit4] 7f2ac0719000-7f2ac0919000 ---p 00002000 09:01 46244240                   /lib/x86_64-linux-gnu/libdl-2.15.so
   [junit4] 7f2ac0919000-7f2ac091a000 r--p 00002000 09:01 46244240                   /lib/x86_64-linux-gnu/libdl-2.15.so
   [junit4] 7f2ac091a000-7f2ac091b000 rw-p 00003000 09:01 46244240                   /lib/x86_64-linux-gnu/libdl-2.15.so
   [junit4] 7f2ac091b000-7f2ac0930000 r-xp 00000000 09:01 21922562                   /var/lib/jenkins/tools/java/64bit/jdk1.8.0_40-ea-b20/jre/lib/amd64/jli/libjli.so
   [junit4] 7f2ac0930000-7f2ac0b30000 ---p 00015000 09:01 21922562                   /var/lib/jenkins/tools/java/64bit/jdk1.8.0_40-ea-b20/jre/lib/amd64/jli/libjli.so
   [junit4] 7f2ac0b30000-7f2ac0b31000 rw-p 00015000 09:01 21922562                   /var/lib/jenkins/tools/java/64bit/jdk1.8.0_40-ea-b20/jre/lib/amd64/jli/libjli.so
   [junit4] 7f2ac0b31000-7f2ac0b49000 r-xp 00000000 09:01 46244001                   /lib/x86_64-linux-gnu/libpthread-2.15.so
   [junit4] 7f2ac0b49000-7f2ac0d48000 ---p 00018000 09:01 46244001                   /lib/x86_64-linux-gnu/libpthread-2.15.so
   [junit4] 7f2ac0d48000-7f2ac0d49000 r--p 00017000 09:01 46244001                   /lib/x86_64-linux-gnu/libpthread-2.15.so
   [junit4] 7f2ac0d49000-7f2ac0d4a000 rw-p 00018000 09:01 46244001                   /lib/x86_64-linux-gnu/libpthread-2.15.so
   [junit4] 7f2ac0d4a000-7f2ac0d4e000 rw-p 00000000 00:00 0 
   [junit4] 7f2ac0d4e000-7f2ac0d70000 r-xp 00000000 09:01 46243994                   /lib/x86_64-linux-gnu/ld-2.15.so
   [junit4] 7f2ac0d70000-7f2ac0d71000 r--s 00001000 09:01 22405650                   /var/lib/jenkins/tools/hudson.tasks.Ant_AntInstallation/ANT_1.8.2/lib/ant-swing.jar
   [junit4] 7f2ac0d71000-7f2ac0e58000 rw-p 00000000 00:00 0 
   [junit4] 7f2ac0e58000-7f2ac0e5b000 ---p 00000000 00:00 0 
   [junit4] 7f2ac0e5b000-7f2ac0f5d000 rw-p 00000000 00:00 0                          [stack:3564]
   [junit4] 7f2ac0f5d000-7f2ac0f64000 r--s 00037000 09:01 21653088                   /var/lib/jenkins/.ivy2/cache/junit/junit/jars/junit-4.10.jar
   [junit4] 7f2ac0f64000-7f2ac0f6c000 rw-s 00000000 09:01 36626455                   /tmp/hsperfdata_jenkins/3554
   [junit4] 7f2ac0f6c000-7f2ac0f6d000 rw-p 00000000 00:00 0 
   [junit4] 7f2ac0f6d000-7f2ac0f6e000 ---p 00000000 00:00 0 
   [junit4] 7f2ac0f6e000-7f2ac0f70000 rw-p 00000000 00:00 0 
   [junit4] 7f2ac0f70000-7f2ac0f71000 r--p 00022000 09:01 46243994                   /lib/x86_64-linux-gnu/ld-2.15.so
   [junit4] 7f2ac0f71000-7f2ac0f73000 rw-p 00023000 09:01 46243994                   /lib/x86_64-linux-gnu/ld-2.15.so
   [junit4] 7fffa1da1000-7fffa1dc3000 rw-p 00000000 00:00 0                          [stack]
   [junit4] 7fffa1dfe000-7fffa1e00000 r-xp 00000000 00:00 0                          [vdso]
   [junit4] ffffffffff600000-ffffffffff601000 r-xp 00000000 00:00 0                  [vsyscall]
   [junit4] <<< JVM J0: EOF ----

[...truncated 20 lines...]
   [junit4] ERROR: JVM J0 ended with an exception, command line: /var/lib/jenkins/tools/java/64bit/jdk1.8.0_40-ea-b20/jre/bin/java -XX:-UseCompressedOops -XX:+UseG1GC -XX:+HeapDumpOnOutOfMemoryError -XX:HeapDumpPath=/mnt/ssd/jenkins/workspace/Lucene-Solr-trunk-Linux/heapdumps -ea -esa -Dtests.prefix=tests -Dtests.seed=D115DAD323C9F29C -Xmx512M -Dtests.iters= -Dtests.verbose=false -Dtests.infostream=false -Dtests.codec=random -Dtests.postingsformat=random -Dtests.docvaluesformat=random -Dtests.locale=random -Dtests.timezone=random -Dtests.directory=random -Dtests.linedocsfile=europarl.lines.txt.gz -Dtests.luceneMatchVersion=6.0.0 -Dtests.cleanthreads=perMethod -Djava.util.logging.config.file=/mnt/ssd/jenkins/workspace/Lucene-Solr-trunk-Linux/lucene/tools/junit4/logging.properties -Dtests.nightly=false -Dtests.weekly=false -Dtests.monster=false -Dtests.slow=true -Dtests.asserts=true -Dtests.multiplier=3 -DtempDir=./temp -Djava.io.tmpdir=./temp -Djunit4.tempDir=/mnt/ssd/jenkins/workspace/Lucene-Solr-trunk-Linux/lucene/build/analysis/icu/test/temp -Dclover.db.dir=/mnt/ssd/jenkins/workspace/Lucene-Solr-trunk-Linux/lucene/build/clover/db -Djava.security.policy=/mnt/ssd/jenkins/workspace/Lucene-Solr-trunk-Linux/lucene/tools/junit4/tests.policy -Dtests.LUCENE_VERSION=6.0.0 -Djetty.testMode=1 -Djetty.insecurerandom=1 -Dsolr.directoryFactory=org.apache.solr.core.MockDirectoryFactory -Djava.awt.headless=true -Djdk.map.althashing.threshold=0 -Dtests.leaveTemporary=false -Dtests.filterstacks=true -Dtests.disableHdfs=true -Djava.security.manager=org.apache.lucene.util.TestSecurityManager -Dfile.encoding=UTF-8 -classpath /mnt/ssd/jenkins/workspace/Lucene-Solr-trunk-Linux/lucene/build/analysis/icu/classes/test:/mnt/ssd/jenkins/workspace/Lucene-Solr-trunk-Linux/lucene/build/test-framework/classes/java:/mnt/ssd/jenkins/workspace/Lucene-Solr-trunk-Linux/lucene/build/codecs/classes/java:/mnt/ssd/jenkins/workspace/Lucene-Solr-trunk-Linux/lucene/build/analysis/common/lucene-analyzers-common-6.0.0-SNAPSHOT.jar:/mnt/ssd/jenkins/workspace/Lucene-Solr-trunk-Linux/lucene/analysis/icu/lib/icu4j-54.1.jar:/mnt/ssd/jenkins/workspace/Lucene-Solr-trunk-Linux/lucene/build/core/classes/java:/mnt/ssd/jenkins/workspace/Lucene-Solr-trunk-Linux/lucene/test-framework/lib/junit-4.10.jar:/mnt/ssd/jenkins/workspace/Lucene-Solr-trunk-Linux/lucene/test-framework/lib/randomizedtesting-runner-2.1.9.jar:/mnt/ssd/jenkins/workspace/Lucene-Solr-trunk-Linux/lucene/build/analysis/icu/classes/java:/var/lib/jenkins/tools/hudson.tasks.Ant_AntInstallation/ANT_1.8.2/lib/ant-launcher.jar:/var/lib/jenkins/.ant/lib/ivy-2.3.0.jar:/var/lib/jenkins/tools/hudson.tasks.Ant_AntInstallation/ANT_1.8.2/lib/ant-jai.jar:/var/lib/jenkins/tools/hudson.tasks.Ant_AntInstallation/ANT_1.8.2/lib/ant-swing.jar:/var/lib/jenkins/tools/hudson.tasks.Ant_AntInstallation/ANT_1.8.2/lib/ant-apache-oro.jar:/var/lib/jenkins/tools/hudson.tasks.Ant_AntInstallation/ANT_1.8.2/lib/ant-jmf.jar:/var/lib/jenkins/tools/hudson.tasks.Ant_AntInstallation/ANT_1.8.2/lib/ant-apache-xalan2.jar:/var/lib/jenkins/tools/hudson.tasks.Ant_AntInstallation/ANT_1.8.2/lib/ant-javamail.jar:/var/lib/jenkins/tools/hudson.tasks.Ant_AntInstallation/ANT_1.8.2/lib/ant-apache-resolver.jar:/var/lib/jenkins/tools/hudson.tasks.Ant_AntInstallation/ANT_1.8.2/lib/ant-testutil.jar:/var/lib/jenkins/tools/hudson.tasks.Ant_AntInstallation/ANT_1.8.2/lib/ant-commons-logging.jar:/var/lib/jenkins/tools/hudson.tasks.Ant_AntInstallation/ANT_1.8.2/lib/ant-apache-log4j.jar:/var/lib/jenkins/tools/hudson.tasks.Ant_AntInstallation/ANT_1.8.2/lib/ant-junit.jar:/var/lib/jenkins/tools/hudson.tasks.Ant_AntInstallation/ANT_1.8.2/lib/ant-jsch.jar:/var/lib/jenkins/tools/hudson.tasks.Ant_AntInstallation/ANT_1.8.2/lib/ant-commons-net.jar:/var/lib/jenkins/tools/hudson.tasks.Ant_AntInstallation/ANT_1.8.2/lib/ant-apache-bsf.jar:/var/lib/jenkins/tools/hudson.tasks.Ant_AntInstallation/ANT_1.8.2/lib/ant-jdepend.jar:/var/lib/jenkins/tools/hudson.tasks.Ant_AntInstallation/ANT_1.8.2/lib/ant-netrexx.jar:/var/lib/jenkins/tools/hudson.tasks.Ant_AntInstallation/ANT_1.8.2/lib/ant-apache-regexp.jar:/var/lib/jenkins/tools/hudson.tasks.Ant_AntInstallation/ANT_1.8.2/lib/ant-junit4.jar:/var/lib/jenkins/tools/hudson.tasks.Ant_AntInstallation/ANT_1.8.2/lib/ant.jar:/var/lib/jenkins/tools/hudson.tasks.Ant_AntInstallation/ANT_1.8.2/lib/ant-apache-bcel.jar:/var/lib/jenkins/tools/hudson.tasks.Ant_AntInstallation/ANT_1.8.2/lib/ant-antlr.jar:/var/lib/jenkins/tools/java/64bit/jdk1.8.0_40-ea-b20/lib/tools.jar:/var/lib/jenkins/.ivy2/cache/com.carrotsearch.randomizedtesting/junit4-ant/jars/junit4-ant-2.1.9.jar com.carrotsearch.ant.tasks.junit4.slave.SlaveMainSafe -eventsfile /mnt/ssd/jenkins/workspace/Lucene-Solr-trunk-Linux/lucene/build/analysis/icu/test/temp/junit4-J0-20150114_044045_599.events @/mnt/ssd/jenkins/workspace/Lucene-Solr-trunk-Linux/lucene/build/analysis/icu/test/temp/junit4-J0-20150114_044045_599.suites
   [junit4] ERROR: JVM J0 ended with an exception: Forked process returned with error code: 134. Very likely a JVM crash.  Process output piped in logs above.
   [junit4] 	at com.carrotsearch.ant.tasks.junit4.JUnit4.executeSlave(JUnit4.java:1481)
   [junit4] 	at com.carrotsearch.ant.tasks.junit4.JUnit4.access$000(JUnit4.java:133)
   [junit4] 	at com.carrotsearch.ant.tasks.junit4.JUnit4$2.call(JUnit4.java:964)
   [junit4] 	at com.carrotsearch.ant.tasks.junit4.JUnit4$2.call(JUnit4.java:961)
   [junit4] 	at java.util.concurrent.FutureTask.run(FutureTask.java:266)
   [junit4] 	at java.util.concurrent.ThreadPoolExecutor.runWorker(ThreadPoolExecutor.java:1142)
   [junit4] 	at java.util.concurrent.ThreadPoolExecutor$Worker.run(ThreadPoolExecutor.java:617)
   [junit4] 	at java.lang.Thread.run(Thread.java:745)

BUILD FAILED
/mnt/ssd/jenkins/workspace/Lucene-Solr-trunk-Linux/build.xml:519: The following error occurred while executing this line:
/mnt/ssd/jenkins/workspace/Lucene-Solr-trunk-Linux/build.xml:467: The following error occurred while executing this line:
/mnt/ssd/jenkins/workspace/Lucene-Solr-trunk-Linux/build.xml:61: The following error occurred while executing this line:
/mnt/ssd/jenkins/workspace/Lucene-Solr-trunk-Linux/extra-targets.xml:39: The following error occurred while executing this line:
/mnt/ssd/jenkins/workspace/Lucene-Solr-trunk-Linux/lucene/build.xml:456: The following error occurred while executing this line:
/mnt/ssd/jenkins/workspace/Lucene-Solr-trunk-Linux/lucene/common-build.xml:2069: The following error occurred while executing this line:
/mnt/ssd/jenkins/workspace/Lucene-Solr-trunk-Linux/lucene/analysis/build.xml:106: The following error occurred while executing this line:
/mnt/ssd/jenkins/workspace/Lucene-Solr-trunk-Linux/lucene/analysis/build.xml:38: The following error occurred while executing this line:
/mnt/ssd/jenkins/workspace/Lucene-Solr-trunk-Linux/lucene/module-build.xml:58: The following error occurred while executing this line:
/mnt/ssd/jenkins/workspace/Lucene-Solr-trunk-Linux/lucene/common-build.xml:1348: The following error occurred while executing this line:
/mnt/ssd/jenkins/workspace/Lucene-Solr-trunk-Linux/lucene/common-build.xml:956: At least one slave process threw an exception, first: Forked process returned with error code: 134. Very likely a JVM crash.  Process output piped in logs above.

Total time: 15 minutes 17 seconds
Build step 'Invoke Ant' marked build as failure
[description-setter] Description set: Java: 64bit/jdk1.8.0_40-ea-b20 -XX:-UseCompressedOops -XX:+UseG1GC
Archiving artifacts
Recording test results
Email was triggered for: Failure - Any
Sending email for trigger: Failure - Any



[JENKINS] Lucene-Solr-trunk-Linux (32bit/jdk1.8.0_40-ea-b20) - Build # 11596 - Still Failing!

Posted by Policeman Jenkins Server <je...@thetaphi.de>.
Build: http://jenkins.thetaphi.de/job/Lucene-Solr-trunk-Linux/11596/
Java: 32bit/jdk1.8.0_40-ea-b20 -server -XX:+UseParallelGC

1 tests failed.
FAILED:  org.apache.solr.handler.TestBlobHandler.testDistribSearch

Error Message:
{responseHeader={status=0, QTime=1}, response={numFound=0, start=0, docs=[]}}

Stack Trace:
java.lang.AssertionError: {responseHeader={status=0, QTime=1}, response={numFound=0, start=0, docs=[]}}
	at __randomizedtesting.SeedInfo.seed([5EF763CB5B0D5D17:DF11EDD32C523D2B]:0)
	at org.junit.Assert.fail(Assert.java:93)
	at org.junit.Assert.assertTrue(Assert.java:43)
	at org.apache.solr.handler.TestBlobHandler.doBlobHandlerTest(TestBlobHandler.java:96)
	at org.apache.solr.handler.TestBlobHandler.doTest(TestBlobHandler.java:200)
	at org.apache.solr.BaseDistributedSearchTestCase.testDistribSearch(BaseDistributedSearchTestCase.java:868)
	at sun.reflect.NativeMethodAccessorImpl.invoke0(Native Method)
	at sun.reflect.NativeMethodAccessorImpl.invoke(NativeMethodAccessorImpl.java:62)
	at sun.reflect.DelegatingMethodAccessorImpl.invoke(DelegatingMethodAccessorImpl.java:43)
	at java.lang.reflect.Method.invoke(Method.java:497)
	at com.carrotsearch.randomizedtesting.RandomizedRunner.invoke(RandomizedRunner.java:1618)
	at com.carrotsearch.randomizedtesting.RandomizedRunner$6.evaluate(RandomizedRunner.java:827)
	at com.carrotsearch.randomizedtesting.RandomizedRunner$7.evaluate(RandomizedRunner.java:863)
	at com.carrotsearch.randomizedtesting.RandomizedRunner$8.evaluate(RandomizedRunner.java:877)
	at com.carrotsearch.randomizedtesting.rules.SystemPropertiesRestoreRule$1.evaluate(SystemPropertiesRestoreRule.java:53)
	at org.apache.lucene.util.TestRuleSetupTeardownChained$1.evaluate(TestRuleSetupTeardownChained.java:50)
	at org.apache.lucene.util.AbstractBeforeAfterRule$1.evaluate(AbstractBeforeAfterRule.java:46)
	at com.carrotsearch.randomizedtesting.rules.SystemPropertiesInvariantRule$1.evaluate(SystemPropertiesInvariantRule.java:55)
	at org.apache.lucene.util.TestRuleThreadAndTestName$1.evaluate(TestRuleThreadAndTestName.java:49)
	at org.apache.lucene.util.TestRuleIgnoreAfterMaxFailures$1.evaluate(TestRuleIgnoreAfterMaxFailures.java:65)
	at org.apache.lucene.util.TestRuleMarkFailure$1.evaluate(TestRuleMarkFailure.java:48)
	at com.carrotsearch.randomizedtesting.rules.StatementAdapter.evaluate(StatementAdapter.java:36)
	at com.carrotsearch.randomizedtesting.ThreadLeakControl$StatementRunner.run(ThreadLeakControl.java:365)
	at com.carrotsearch.randomizedtesting.ThreadLeakControl.forkTimeoutingTask(ThreadLeakControl.java:798)
	at com.carrotsearch.randomizedtesting.ThreadLeakControl$3.evaluate(ThreadLeakControl.java:458)
	at com.carrotsearch.randomizedtesting.RandomizedRunner.runSingleTest(RandomizedRunner.java:836)
	at com.carrotsearch.randomizedtesting.RandomizedRunner$3.evaluate(RandomizedRunner.java:738)
	at com.carrotsearch.randomizedtesting.RandomizedRunner$4.evaluate(RandomizedRunner.java:772)
	at com.carrotsearch.randomizedtesting.RandomizedRunner$5.evaluate(RandomizedRunner.java:783)
	at com.carrotsearch.randomizedtesting.rules.StatementAdapter.evaluate(StatementAdapter.java:36)
	at com.carrotsearch.randomizedtesting.rules.SystemPropertiesRestoreRule$1.evaluate(SystemPropertiesRestoreRule.java:53)
	at org.apache.lucene.util.AbstractBeforeAfterRule$1.evaluate(AbstractBeforeAfterRule.java:46)
	at org.apache.lucene.util.TestRuleStoreClassName$1.evaluate(TestRuleStoreClassName.java:42)
	at com.carrotsearch.randomizedtesting.rules.SystemPropertiesInvariantRule$1.evaluate(SystemPropertiesInvariantRule.java:55)
	at com.carrotsearch.randomizedtesting.rules.NoShadowingOrOverridesOnMethodsRule$1.evaluate(NoShadowingOrOverridesOnMethodsRule.java:39)
	at com.carrotsearch.randomizedtesting.rules.NoShadowingOrOverridesOnMethodsRule$1.evaluate(NoShadowingOrOverridesOnMethodsRule.java:39)
	at com.carrotsearch.randomizedtesting.rules.StatementAdapter.evaluate(StatementAdapter.java:36)
	at com.carrotsearch.randomizedtesting.rules.StatementAdapter.evaluate(StatementAdapter.java:36)
	at com.carrotsearch.randomizedtesting.rules.StatementAdapter.evaluate(StatementAdapter.java:36)
	at org.apache.lucene.util.TestRuleAssertionsRequired$1.evaluate(TestRuleAssertionsRequired.java:54)
	at org.apache.lucene.util.TestRuleMarkFailure$1.evaluate(TestRuleMarkFailure.java:48)
	at org.apache.lucene.util.TestRuleIgnoreAfterMaxFailures$1.evaluate(TestRuleIgnoreAfterMaxFailures.java:65)
	at org.apache.lucene.util.TestRuleIgnoreTestSuites$1.evaluate(TestRuleIgnoreTestSuites.java:55)
	at com.carrotsearch.randomizedtesting.rules.StatementAdapter.evaluate(StatementAdapter.java:36)
	at com.carrotsearch.randomizedtesting.ThreadLeakControl$StatementRunner.run(ThreadLeakControl.java:365)
	at java.lang.Thread.run(Thread.java:745)




Build Log:
[...truncated 8965 lines...]
   [junit4] Suite: org.apache.solr.handler.TestBlobHandler
   [junit4]   2> Creating dataDir: /mnt/ssd/jenkins/workspace/Lucene-Solr-trunk-Linux/solr/build/solr-core/test/J0/temp/solr.handler.TestBlobHandler 5EF763CB5B0D5D17-001/init-core-data-001
   [junit4]   2> 447780 T2727 oas.SolrTestCaseJ4.buildSSLConfig Randomized ssl (false) and clientAuth (false)
   [junit4]   2> 447781 T2727 oas.BaseDistributedSearchTestCase.initHostContext Setting hostContext system property: /rs/g
   [junit4]   2> 447783 T2727 oas.SolrTestCaseJ4.setUp ###Starting testDistribSearch
   [junit4]   2> 447784 T2727 oasc.ZkTestServer.run STARTING ZK TEST SERVER
   [junit4]   1> client port:0.0.0.0/0.0.0.0:0
   [junit4]   2> 447784 T2728 oasc.ZkTestServer$ZKServerMain.runFromConfig Starting server
   [junit4]   2> 447884 T2727 oasc.ZkTestServer.run start zk server on port:43345
   [junit4]   2> 447885 T2727 oascc.SolrZkClient.createZkCredentialsToAddAutomatically Using default ZkCredentialsProvider
   [junit4]   2> 447886 T2727 oascc.ConnectionManager.waitForConnected Waiting for client to connect to ZooKeeper
   [junit4]   2> 447890 T2735 oascc.ConnectionManager.process Watcher org.apache.solr.common.cloud.ConnectionManager@d25010 name:ZooKeeperConnection Watcher:127.0.0.1:43345 got event WatchedEvent state:SyncConnected type:None path:null path:null type:None
   [junit4]   2> 447890 T2727 oascc.ConnectionManager.waitForConnected Client is connected to ZooKeeper
   [junit4]   2> 447891 T2727 oascc.SolrZkClient.createZkACLProvider Using default ZkACLProvider
   [junit4]   2> 447891 T2727 oascc.SolrZkClient.makePath makePath: /solr
   [junit4]   2> 447896 T2727 oascc.SolrZkClient.createZkCredentialsToAddAutomatically Using default ZkCredentialsProvider
   [junit4]   2> 447896 T2727 oascc.ConnectionManager.waitForConnected Waiting for client to connect to ZooKeeper
   [junit4]   2> 447897 T2738 oascc.ConnectionManager.process Watcher org.apache.solr.common.cloud.ConnectionManager@1d3d6a4 name:ZooKeeperConnection Watcher:127.0.0.1:43345/solr got event WatchedEvent state:SyncConnected type:None path:null path:null type:None
   [junit4]   2> 447898 T2727 oascc.ConnectionManager.waitForConnected Client is connected to ZooKeeper
   [junit4]   2> 447898 T2727 oascc.SolrZkClient.createZkACLProvider Using default ZkACLProvider
   [junit4]   2> 447899 T2727 oascc.SolrZkClient.makePath makePath: /collections/collection1
   [junit4]   2> 447902 T2727 oascc.SolrZkClient.makePath makePath: /collections/collection1/shards
   [junit4]   2> 447905 T2727 oascc.SolrZkClient.makePath makePath: /collections/control_collection
   [junit4]   2> 447907 T2727 oascc.SolrZkClient.makePath makePath: /collections/control_collection/shards
   [junit4]   2> 447909 T2727 oasc.AbstractZkTestCase.putConfig put /mnt/ssd/jenkins/workspace/Lucene-Solr-trunk-Linux/solr/core/src/test-files/solr/collection1/conf/solrconfig-tlog.xml to /configs/conf1/solrconfig.xml
   [junit4]   2> 447910 T2727 oascc.SolrZkClient.makePath makePath: /configs/conf1/solrconfig.xml
   [junit4]   2> 447914 T2727 oasc.AbstractZkTestCase.putConfig put /mnt/ssd/jenkins/workspace/Lucene-Solr-trunk-Linux/solr/core/src/test-files/solr/collection1/conf/schema.xml to /configs/conf1/schema.xml
   [junit4]   2> 447915 T2727 oascc.SolrZkClient.makePath makePath: /configs/conf1/schema.xml
   [junit4]   2> 447918 T2727 oasc.AbstractZkTestCase.putConfig put /mnt/ssd/jenkins/workspace/Lucene-Solr-trunk-Linux/solr/core/src/test-files/solr/collection1/conf/solrconfig.snippet.randomindexconfig.xml to /configs/conf1/solrconfig.snippet.randomindexconfig.xml
   [junit4]   2> 447919 T2727 oascc.SolrZkClient.makePath makePath: /configs/conf1/solrconfig.snippet.randomindexconfig.xml
   [junit4]   2> 447922 T2727 oasc.AbstractZkTestCase.putConfig put /mnt/ssd/jenkins/workspace/Lucene-Solr-trunk-Linux/solr/core/src/test-files/solr/collection1/conf/stopwords.txt to /configs/conf1/stopwords.txt
   [junit4]   2> 447922 T2727 oascc.SolrZkClient.makePath makePath: /configs/conf1/stopwords.txt
   [junit4]   2> 447925 T2727 oasc.AbstractZkTestCase.putConfig put /mnt/ssd/jenkins/workspace/Lucene-Solr-trunk-Linux/solr/core/src/test-files/solr/collection1/conf/protwords.txt to /configs/conf1/protwords.txt
   [junit4]   2> 447926 T2727 oascc.SolrZkClient.makePath makePath: /configs/conf1/protwords.txt
   [junit4]   2> 447929 T2727 oasc.AbstractZkTestCase.putConfig put /mnt/ssd/jenkins/workspace/Lucene-Solr-trunk-Linux/solr/core/src/test-files/solr/collection1/conf/currency.xml to /configs/conf1/currency.xml
   [junit4]   2> 447929 T2727 oascc.SolrZkClient.makePath makePath: /configs/conf1/currency.xml
   [junit4]   2> 447933 T2727 oasc.AbstractZkTestCase.putConfig put /mnt/ssd/jenkins/workspace/Lucene-Solr-trunk-Linux/solr/core/src/test-files/solr/collection1/conf/enumsConfig.xml to /configs/conf1/enumsConfig.xml
   [junit4]   2> 447933 T2727 oascc.SolrZkClient.makePath makePath: /configs/conf1/enumsConfig.xml
   [junit4]   2> 447936 T2727 oasc.AbstractZkTestCase.putConfig put /mnt/ssd/jenkins/workspace/Lucene-Solr-trunk-Linux/solr/core/src/test-files/solr/collection1/conf/open-exchange-rates.json to /configs/conf1/open-exchange-rates.json
   [junit4]   2> 447937 T2727 oascc.SolrZkClient.makePath makePath: /configs/conf1/open-exchange-rates.json
   [junit4]   2> 447940 T2727 oasc.AbstractZkTestCase.putConfig put /mnt/ssd/jenkins/workspace/Lucene-Solr-trunk-Linux/solr/core/src/test-files/solr/collection1/conf/mapping-ISOLatin1Accent.txt to /configs/conf1/mapping-ISOLatin1Accent.txt
   [junit4]   2> 447940 T2727 oascc.SolrZkClient.makePath makePath: /configs/conf1/mapping-ISOLatin1Accent.txt
   [junit4]   2> 447943 T2727 oasc.AbstractZkTestCase.putConfig put /mnt/ssd/jenkins/workspace/Lucene-Solr-trunk-Linux/solr/core/src/test-files/solr/collection1/conf/old_synonyms.txt to /configs/conf1/old_synonyms.txt
   [junit4]   2> 447944 T2727 oascc.SolrZkClient.makePath makePath: /configs/conf1/old_synonyms.txt
   [junit4]   2> 447947 T2727 oasc.AbstractZkTestCase.putConfig put /mnt/ssd/jenkins/workspace/Lucene-Solr-trunk-Linux/solr/core/src/test-files/solr/collection1/conf/synonyms.txt to /configs/conf1/synonyms.txt
   [junit4]   2> 447947 T2727 oascc.SolrZkClient.makePath makePath: /configs/conf1/synonyms.txt
   [junit4]   2> 448193 T2727 oejs.Server.doStart jetty-9.2.6.v20141205
   [junit4]   2> 448194 T2727 oejsh.ContextHandler.doStart Started o.e.j.s.ServletContextHandler@a3c1f3{/rs/g,null,AVAILABLE}
   [junit4]   2> 448206 T2727 oejs.AbstractConnector.doStart Started ServerConnector@cb1abc{HTTP/1.1}{127.0.0.1:?????}
   [junit4]   2> 448206 T2727 oejs.Server.doStart Started @??????ms
   [junit4]   2> 448207 T2727 oass.SolrDispatchFilter.init SolrDispatchFilter.init()sun.misc.Launcher$AppClassLoader@e2f2a
   [junit4]   2> 448207 T2727 oasc.SolrResourceLoader.locateSolrHome JNDI not configured for solr (NoInitialContextEx)
   [junit4]   2> 448208 T2727 oasc.SolrResourceLoader.locateSolrHome using system property solr.solr.home: /mnt/ssd/jenkins/workspace/Lucene-Solr-trunk-Linux/solr/build/solr-core/test/J0/temp/solr.handler.TestBlobHandler 5EF763CB5B0D5D17-001/tempDir-002
   [junit4]   2> 448208 T2727 oasc.SolrResourceLoader.<init> new SolrResourceLoader for directory: '/mnt/ssd/jenkins/workspace/Lucene-Solr-trunk-Linux/solr/build/solr-core/test/J0/temp/solr.handler.TestBlobHandler 5EF763CB5B0D5D17-001/tempDir-002/'
   [junit4]   2> 448220 T2727 oasc.ConfigSolr.fromFile Loading container configuration from /mnt/ssd/jenkins/workspace/Lucene-Solr-trunk-Linux/solr/build/solr-core/test/J0/temp/solr.handler.TestBlobHandler 5EF763CB5B0D5D17-001/tempDir-002/solr.xml
   [junit4]   2> 448228 T2727 oasc.CoreContainer.<init> New CoreContainer 20804062
   [junit4]   2> 448228 T2727 oasc.CoreContainer.load Loading cores into CoreContainer [instanceDir=/mnt/ssd/jenkins/workspace/Lucene-Solr-trunk-Linux/solr/build/solr-core/test/J0/temp/solr.handler.TestBlobHandler 5EF763CB5B0D5D17-001/tempDir-002/]
   [junit4]   2> 448228 T2727 oashc.HttpShardHandlerFactory.getParameter Setting socketTimeout to: 90000
   [junit4]   2> 448229 T2727 oashc.HttpShardHandlerFactory.getParameter Setting urlScheme to: 
   [junit4]   2> 448229 T2727 oashc.HttpShardHandlerFactory.getParameter Setting connTimeout to: 15000
   [junit4]   2> 448229 T2727 oashc.HttpShardHandlerFactory.getParameter Setting maxConnectionsPerHost to: 20
   [junit4]   2> 448230 T2727 oashc.HttpShardHandlerFactory.getParameter Setting maxConnections to: 10000
   [junit4]   2> 448230 T2727 oashc.HttpShardHandlerFactory.getParameter Setting corePoolSize to: 0
   [junit4]   2> 448230 T2727 oashc.HttpShardHandlerFactory.getParameter Setting maximumPoolSize to: 2147483647
   [junit4]   2> 448231 T2727 oashc.HttpShardHandlerFactory.getParameter Setting maxThreadIdleTime to: 5
   [junit4]   2> 448231 T2727 oashc.HttpShardHandlerFactory.getParameter Setting sizeOfQueue to: -1
   [junit4]   2> 448231 T2727 oashc.HttpShardHandlerFactory.getParameter Setting fairnessPolicy to: false
   [junit4]   2> 448232 T2727 oasu.UpdateShardHandler.<init> Creating UpdateShardHandler HTTP client with params: socketTimeout=340000&connTimeout=45000&retry=false
   [junit4]   2> 448232 T2727 oasl.LogWatcher.createWatcher SLF4J impl is org.slf4j.impl.Log4jLoggerFactory
   [junit4]   2> 448232 T2727 oasl.LogWatcher.newRegisteredLogWatcher Registering Log Listener [Log4j (org.slf4j.impl.Log4jLoggerFactory)]
   [junit4]   2> 448233 T2727 oasc.CoreContainer.load Host Name: 127.0.0.1
   [junit4]   2> 448233 T2727 oasc.ZkContainer.initZooKeeper Zookeeper client=127.0.0.1:43345/solr
   [junit4]   2> 448233 T2727 oasc.ZkController.checkChrootPath zkHost includes chroot
   [junit4]   2> 448234 T2727 oascc.SolrZkClient.createZkCredentialsToAddAutomatically Using default ZkCredentialsProvider
   [junit4]   2> 448235 T2727 oascc.ConnectionManager.waitForConnected Waiting for client to connect to ZooKeeper
   [junit4]   2> 448236 T2752 oascc.ConnectionManager.process Watcher org.apache.solr.common.cloud.ConnectionManager@17c4c08 name:ZooKeeperConnection Watcher:127.0.0.1:43345 got event WatchedEvent state:SyncConnected type:None path:null path:null type:None
   [junit4]   2> 448237 T2727 oascc.ConnectionManager.waitForConnected Client is connected to ZooKeeper
   [junit4]   2> 448238 T2727 oascc.SolrZkClient.createZkACLProvider Using default ZkACLProvider
   [junit4]   2> 448240 T2727 oascc.ConnectionManager.waitForConnected Waiting for client to connect to ZooKeeper
   [junit4]   2> 448241 T2755 oascc.ConnectionManager.process Watcher org.apache.solr.common.cloud.ConnectionManager@1f4b878 name:ZooKeeperConnection Watcher:127.0.0.1:43345/solr got event WatchedEvent state:SyncConnected type:None path:null path:null type:None
   [junit4]   2> 448242 T2727 oascc.ConnectionManager.waitForConnected Client is connected to ZooKeeper
   [junit4]   2> 448244 T2727 oascc.SolrZkClient.makePath makePath: /overseer/queue
   [junit4]   2> 448247 T2727 oascc.SolrZkClient.makePath makePath: /overseer/collection-queue-work
   [junit4]   2> 448248 T2727 oascc.SolrZkClient.makePath makePath: /overseer/collection-map-running
   [junit4]   2> 448251 T2727 oascc.SolrZkClient.makePath makePath: /overseer/collection-map-completed
   [junit4]   2> 448253 T2727 oascc.SolrZkClient.makePath makePath: /overseer/collection-map-failure
   [junit4]   2> 448256 T2727 oascc.SolrZkClient.makePath makePath: /live_nodes
   [junit4]   2> 448257 T2727 oasc.ZkController.createEphemeralLiveNode Register node as live in ZooKeeper:/live_nodes/127.0.0.1:56467_rs%2Fg
   [junit4]   2> 448258 T2727 oascc.SolrZkClient.makePath makePath: /live_nodes/127.0.0.1:56467_rs%2Fg
   [junit4]   2> 448261 T2727 oascc.SolrZkClient.makePath makePath: /overseer_elect
   [junit4]   2> 448263 T2727 oascc.SolrZkClient.makePath makePath: /overseer_elect/election
   [junit4]   2> 448265 T2727 oasc.Overseer.close Overseer (id=null) closing
   [junit4]   2> 448267 T2727 oasc.OverseerElectionContext.runLeaderProcess I am going to be the leader 127.0.0.1:56467_rs%2Fg
   [junit4]   2> 448268 T2727 oascc.SolrZkClient.makePath makePath: /overseer_elect/leader
   [junit4]   2> 448270 T2727 oasc.Overseer.start Overseer (id=93139940905189379-127.0.0.1:56467_rs%2Fg-n_0000000000) starting
   [junit4]   2> 448273 T2727 oascc.SolrZkClient.makePath makePath: /overseer/queue-work
   [junit4]   2> 448281 T2727 oasc.OverseerAutoReplicaFailoverThread.<init> Starting OverseerAutoReplicaFailoverThread autoReplicaFailoverWorkLoopDelay=10000 autoReplicaFailoverWaitAfterExpiration=30000 autoReplicaFailoverBadNodeExpiration=60000
   [junit4]   2> 448282 T2757 oasc.OverseerCollectionProcessor.run Process current queue of collection creations
   [junit4]   2> 448283 T2727 oascc.SolrZkClient.makePath makePath: /clusterstate.json
   [junit4]   2> 448285 T2727 oascc.SolrZkClient.makePath makePath: /aliases.json
   [junit4]   2> 448286 T2727 oascc.ZkStateReader.createClusterStateWatchersAndUpdate Updating cluster state from ZooKeeper... 
   [junit4]   2> 448289 T2756 oasc.Overseer$ClusterStateUpdater.run Starting to work on the main queue
   [junit4]   2> 448290 T2759 oasc.ZkController.publish publishing core=collection1 state=down collection=control_collection
   [junit4]   2> 448290 T2759 oasc.ZkController.publish numShards not found on descriptor - reading it from system property
   [junit4]   2> 448291 T2755 oasc.DistributedQueue$LatchWatcher.process NodeChildrenChanged fired on path /overseer/queue state SyncConnected
   [junit4]   2> 448291 T2759 oasc.ZkController.waitForCoreNodeName look for our core node name
   [junit4]   2> 448292 T2756 oasc.Overseer$ClusterStateUpdater.run processMessage: queueSize: 0, message = {
   [junit4]   2> 	  "core":"collection1",
   [junit4]   2> 	  "roles":null,
   [junit4]   2> 	  "base_url":"http://127.0.0.1:56467/rs/g",
   [junit4]   2> 	  "node_name":"127.0.0.1:56467_rs%2Fg",
   [junit4]   2> 	  "numShards":"1",
   [junit4]   2> 	  "state":"down",
   [junit4]   2> 	  "shard":null,
   [junit4]   2> 	  "collection":"control_collection",
   [junit4]   2> 	  "operation":"state"} current state version: 0
   [junit4]   2> 448293 T2756 oasco.ReplicaMutator.updateState Update state numShards=1 message={
   [junit4]   2> 	  "core":"collection1",
   [junit4]   2> 	  "roles":null,
   [junit4]   2> 	  "base_url":"http://127.0.0.1:56467/rs/g",
   [junit4]   2> 	  "node_name":"127.0.0.1:56467_rs%2Fg",
   [junit4]   2> 	  "numShards":"1",
   [junit4]   2> 	  "state":"down",
   [junit4]   2> 	  "shard":null,
   [junit4]   2> 	  "collection":"control_collection",
   [junit4]   2> 	  "operation":"state"}
   [junit4]   2> 448293 T2756 oasco.ClusterStateMutator.createCollection building a new cName: control_collection
   [junit4]   2> 448293 T2756 oasco.ReplicaMutator.updateState Assigning new node to shard shard=shard1
   [junit4]   2> 448294 T2755 oascc.ZkStateReader$2.process A cluster state change: WatchedEvent state:SyncConnected type:NodeDataChanged path:/clusterstate.json, has occurred - updating... (live nodes size: 1)
   [junit4]   2> 449291 T2759 oasc.ZkController.waitForShardId waiting to find shard id in clusterstate for collection1
   [junit4]   2> 449292 T2759 oasc.ZkController.createCollectionZkNode Check for collection zkNode:control_collection
   [junit4]   2> 449292 T2759 oasc.ZkController.createCollectionZkNode Collection zkNode exists
   [junit4]   2> 449292 T2759 oascc.ZkStateReader.readConfigName Load collection config from:/collections/control_collection
   [junit4]   2> 449293 T2759 oascc.ZkStateReader.readConfigName path=/collections/control_collection configName=conf1 specified config exists in ZooKeeper
   [junit4]   2> 449293 T2759 oasc.SolrResourceLoader.<init> new SolrResourceLoader for directory: '/mnt/ssd/jenkins/workspace/Lucene-Solr-trunk-Linux/solr/build/solr-core/test/J0/temp/solr.handler.TestBlobHandler 5EF763CB5B0D5D17-001/tempDir-002/collection1/'
   [junit4]   2> 449294 T2759 oasc.SolrResourceLoader.replaceClassLoader Adding 'file:/mnt/ssd/jenkins/workspace/Lucene-Solr-trunk-Linux/solr/build/solr-core/test/J0/temp/solr.handler.TestBlobHandler%205EF763CB5B0D5D17-001/tempDir-002/collection1/lib/.svn/' to classloader
   [junit4]   2> 449294 T2759 oasc.SolrResourceLoader.replaceClassLoader Adding 'file:/mnt/ssd/jenkins/workspace/Lucene-Solr-trunk-Linux/solr/build/solr-core/test/J0/temp/solr.handler.TestBlobHandler%205EF763CB5B0D5D17-001/tempDir-002/collection1/lib/classes/' to classloader
   [junit4]   2> 449294 T2759 oasc.SolrResourceLoader.replaceClassLoader Adding 'file:/mnt/ssd/jenkins/workspace/Lucene-Solr-trunk-Linux/solr/build/solr-core/test/J0/temp/solr.handler.TestBlobHandler%205EF763CB5B0D5D17-001/tempDir-002/collection1/lib/README' to classloader
   [junit4]   2> 449304 T2759 oasc.ZkController.watchZKConfDir watch zkdir /configs/conf1
   [junit4]   2> 449306 T2759 oasc.Config.<init> loaded config solrconfig.xml with version 0 
   [junit4]   2> 449310 T2759 oasc.SolrConfig.refreshRequestParams current version of requestparams : -1
   [junit4]   2> 449313 T2759 oasc.SolrConfig.<init> Using Lucene MatchVersion: 6.0.0
   [junit4]   2> 449320 T2759 oasc.SolrConfig.<init> Loaded SolrConfig: solrconfig.xml
   [junit4]   2> 449321 T2759 oass.IndexSchema.readSchema Reading Solr Schema from /configs/conf1/schema.xml
   [junit4]   2> 449324 T2759 oass.IndexSchema.readSchema [collection1] Schema name=test
   [junit4]   2> 449409 T2759 oass.OpenExchangeRatesOrgProvider.init Initialized with rates=open-exchange-rates.json, refreshInterval=1440.
   [junit4]   2> 449413 T2759 oass.IndexSchema.readSchema default search field in schema is text
   [junit4]   2> 449414 T2759 oass.IndexSchema.readSchema unique key field: id
   [junit4]   2> 449421 T2759 oass.FileExchangeRateProvider.reload Reloading exchange rates from file currency.xml
   [junit4]   2> 449423 T2759 oass.FileExchangeRateProvider.reload Reloading exchange rates from file currency.xml
   [junit4]   2> 449424 T2759 oass.OpenExchangeRatesOrgProvider.reload Reloading exchange rates from open-exchange-rates.json
   [junit4]   2> 449424 T2759 oass.OpenExchangeRatesOrgProvider$OpenExchangeRates.<init> WARN Unknown key IMPORTANT NOTE
   [junit4]   2> 449425 T2759 oass.OpenExchangeRatesOrgProvider$OpenExchangeRates.<init> WARN Expected key, got STRING
   [junit4]   2> 449425 T2759 oass.OpenExchangeRatesOrgProvider.reload Reloading exchange rates from open-exchange-rates.json
   [junit4]   2> 449425 T2759 oass.OpenExchangeRatesOrgProvider$OpenExchangeRates.<init> WARN Unknown key IMPORTANT NOTE
   [junit4]   2> 449425 T2759 oass.OpenExchangeRatesOrgProvider$OpenExchangeRates.<init> WARN Expected key, got STRING
   [junit4]   2> 449425 T2759 oasc.CoreContainer.create Creating SolrCore 'collection1' using configuration from collection control_collection
   [junit4]   2> 449426 T2759 oasc.SolrCore.initDirectoryFactory org.apache.solr.core.MockDirectoryFactory
   [junit4]   2> 449426 T2759 oasc.SolrCore.<init> [collection1] Opening new SolrCore at /mnt/ssd/jenkins/workspace/Lucene-Solr-trunk-Linux/solr/build/solr-core/test/J0/temp/solr.handler.TestBlobHandler 5EF763CB5B0D5D17-001/tempDir-002/collection1/, dataDir=/mnt/ssd/jenkins/workspace/Lucene-Solr-trunk-Linux/solr/build/solr-core/test/J0/temp/solr.handler.TestBlobHandler 5EF763CB5B0D5D17-001/tempDir-001/control/data/
   [junit4]   2> 449426 T2759 oasc.JmxMonitoredMap.<init> JMX monitoring is enabled. Adding Solr mbeans to JMX Server: com.sun.jmx.mbeanserver.JmxMBeanServer@c4919b
   [junit4]   2> 449427 T2759 oasc.CachingDirectoryFactory.get return new directory for /mnt/ssd/jenkins/workspace/Lucene-Solr-trunk-Linux/solr/build/solr-core/test/J0/temp/solr.handler.TestBlobHandler 5EF763CB5B0D5D17-001/tempDir-001/control/data
   [junit4]   2> 449427 T2759 oasc.SolrCore.getNewIndexDir New index directory detected: old=null new=/mnt/ssd/jenkins/workspace/Lucene-Solr-trunk-Linux/solr/build/solr-core/test/J0/temp/solr.handler.TestBlobHandler 5EF763CB5B0D5D17-001/tempDir-001/control/data/index/
   [junit4]   2> 449427 T2759 oasc.SolrCore.initIndex WARN [collection1] Solr index directory '/mnt/ssd/jenkins/workspace/Lucene-Solr-trunk-Linux/solr/build/solr-core/test/J0/temp/solr.handler.TestBlobHandler 5EF763CB5B0D5D17-001/tempDir-001/control/data/index' doesn't exist. Creating new index...
   [junit4]   2> 449427 T2759 oasc.CachingDirectoryFactory.get return new directory for /mnt/ssd/jenkins/workspace/Lucene-Solr-trunk-Linux/solr/build/solr-core/test/J0/temp/solr.handler.TestBlobHandler 5EF763CB5B0D5D17-001/tempDir-001/control/data/index
   [junit4]   2> 449427 T2759 oasu.RandomMergePolicy.<init> RandomMergePolicy wrapping class org.apache.lucene.index.TieredMergePolicy: [TieredMergePolicy: maxMergeAtOnce=33, maxMergeAtOnceExplicit=24, maxMergedSegmentMB=10.1513671875, floorSegmentMB=1.48828125, forceMergeDeletesPctAllowed=24.487759081372538, segmentsPerTier=37.0, maxCFSSegmentSizeMB=8.796093022207999E12, noCFSRatio=0.0
   [junit4]   2> 449428 T2759 oasc.SolrDeletionPolicy.onCommit SolrDeletionPolicy.onCommit: commits: num=1
   [junit4]   2> 		commit{dir=MockDirectoryWrapper(RAMDirectory@64400 lockFactory=org.apache.lucene.store.SingleInstanceLockFactory@b1615),segFN=segments_1,generation=1}
   [junit4]   2> 449428 T2759 oasc.SolrDeletionPolicy.updateCommits newest commit generation = 1
   [junit4]   2> 449430 T2759 oasup.UpdateRequestProcessorChain.init creating updateRequestProcessorChain "nodistrib"
   [junit4]   2> 449430 T2759 oasup.UpdateRequestProcessorChain.init creating updateRequestProcessorChain "dedupe"
   [junit4]   2> 449430 T2759 oasup.UpdateRequestProcessorChain.init inserting DistributedUpdateProcessorFactory into updateRequestProcessorChain "dedupe"
   [junit4]   2> 449430 T2759 oasup.UpdateRequestProcessorChain.init creating updateRequestProcessorChain "stored_sig"
   [junit4]   2> 449430 T2759 oasup.UpdateRequestProcessorChain.init inserting DistributedUpdateProcessorFactory into updateRequestProcessorChain "stored_sig"
   [junit4]   2> 449431 T2759 oasup.UpdateRequestProcessorChain.init creating updateRequestProcessorChain "distrib-dup-test-chain-explicit"
   [junit4]   2> 449431 T2759 oasup.UpdateRequestProcessorChain.init creating updateRequestProcessorChain "distrib-dup-test-chain-implicit"
   [junit4]   2> 449431 T2759 oasup.UpdateRequestProcessorChain.init inserting DistributedUpdateProcessorFactory into updateRequestProcessorChain "distrib-dup-test-chain-implicit"
   [junit4]   2> 449431 T2759 oasc.SolrCore.loadUpdateProcessorChains no updateRequestProcessorChain defined as default, creating implicit default
   [junit4]   2> 449431 T2759 oasc.RequestHandlers.initHandlersFromConfig created /update: org.apache.solr.handler.UpdateRequestHandler
   [junit4]   2> 449432 T2759 oasc.RequestHandlers.initHandlersFromConfig created /update/json: org.apache.solr.handler.UpdateRequestHandler
   [junit4]   2> 449432 T2759 oasc.RequestHandlers.initHandlersFromConfig created /update/csv: org.apache.solr.handler.UpdateRequestHandler
   [junit4]   2> 449432 T2759 oasc.RequestHandlers.initHandlersFromConfig created /update/json/docs: org.apache.solr.handler.UpdateRequestHandler
   [junit4]   2> 449432 T2759 oasc.RequestHandlers.initHandlersFromConfig created /config: org.apache.solr.handler.SolrConfigHandler
   [junit4]   2> 449432 T2759 oasc.RequestHandlers.initHandlersFromConfig created /schema: org.apache.solr.handler.SchemaHandler
   [junit4]   2> 449433 T2759 oasc.RequestHandlers.initHandlersFromConfig created /replication: org.apache.solr.handler.ReplicationHandler
   [junit4]   2> 449433 T2759 oasc.RequestHandlers.initHandlersFromConfig created /get: org.apache.solr.handler.RealTimeGetHandler
   [junit4]   2> 449433 T2759 oasc.RequestHandlers.initHandlersFromConfig created /admin/luke: org.apache.solr.handler.admin.LukeRequestHandler
   [junit4]   2> 449434 T2759 oasc.RequestHandlers.initHandlersFromConfig created /admin/system: org.apache.solr.handler.admin.SystemInfoHandler
   [junit4]   2> 449434 T2759 oasc.RequestHandlers.initHandlersFromConfig created /admin/mbeans: org.apache.solr.handler.admin.SolrInfoMBeanHandler
   [junit4]   2> 449435 T2759 oasc.RequestHandlers.initHandlersFromConfig created /admin/plugins: org.apache.solr.handler.admin.PluginInfoHandler
   [junit4]   2> 449435 T2759 oasc.RequestHandlers.initHandlersFromConfig created /admin/threads: org.apache.solr.handler.admin.ThreadDumpHandler
   [junit4]   2> 449435 T2759 oasc.RequestHandlers.initHandlersFromConfig created /admin/properties: org.apache.solr.handler.admin.PropertiesRequestHandler
   [junit4]   2> 449435 T2759 oasc.RequestHandlers.initHandlersFromConfig created /admin/logging: org.apache.solr.handler.admin.LoggingHandler
   [junit4]   2> 449436 T2759 oasc.RequestHandlers.initHandlersFromConfig created /admin/ping: org.apache.solr.handler.PingRequestHandler
   [junit4]   2> 449436 T2759 oasc.RequestHandlers.initHandlersFromConfig created standard: solr.StandardRequestHandler
   [junit4]   2> 449436 T2759 oasc.RequestHandlers.initHandlersFromConfig created /admin/file: solr.admin.ShowFileRequestHandler
   [junit4]   2> 449437 T2759 oashl.XMLLoader.init xsltCacheLifetimeSeconds=60
   [junit4]   2> 449438 T2759 oashl.XMLLoader.init xsltCacheLifetimeSeconds=60
   [junit4]   2> 449439 T2759 oashl.XMLLoader.init xsltCacheLifetimeSeconds=60
   [junit4]   2> 449439 T2759 oashl.XMLLoader.init xsltCacheLifetimeSeconds=60
   [junit4]   2> 449440 T2759 oasc.SolrCore.initStatsCache Using default statsCache cache: org.apache.solr.search.stats.LocalStatsCache
   [junit4]   2> 449441 T2759 oasu.CommitTracker.<init> Hard AutoCommit: disabled
   [junit4]   2> 449441 T2759 oasu.CommitTracker.<init> Soft AutoCommit: disabled
   [junit4]   2> 449441 T2759 oasu.RandomMergePolicy.<init> RandomMergePolicy wrapping class org.apache.lucene.index.TieredMergePolicy: [TieredMergePolicy: maxMergeAtOnce=11, maxMergeAtOnceExplicit=32, maxMergedSegmentMB=62.810546875, floorSegmentMB=0.6259765625, forceMergeDeletesPctAllowed=15.573053182320015, segmentsPerTier=17.0, maxCFSSegmentSizeMB=8.796093022207999E12, noCFSRatio=1.0
   [junit4]   2> 449441 T2759 oasc.SolrDeletionPolicy.onInit SolrDeletionPolicy.onInit: commits: num=1
   [junit4]   2> 		commit{dir=MockDirectoryWrapper(RAMDirectory@64400 lockFactory=org.apache.lucene.store.SingleInstanceLockFactory@b1615),segFN=segments_1,generation=1}
   [junit4]   2> 449442 T2759 oasc.SolrDeletionPolicy.updateCommits newest commit generation = 1
   [junit4]   2> 449442 T2759 oass.SolrIndexSearcher.<init> Opening Searcher@1e5cfc6[collection1] main
   [junit4]   2> 449442 T2759 oascc.ZkStateReader.readConfigName Load collection config from:/collections/control_collection
   [junit4]   2> 449443 T2759 oascc.ZkStateReader.readConfigName path=/collections/control_collection configName=conf1 specified config exists in ZooKeeper
   [junit4]   2> 449443 T2759 oasr.ManagedResourceStorage.newStorageIO Setting up ZooKeeper-based storage for the RestManager with znodeBase: /configs/conf1
   [junit4]   2> 449443 T2759 oasr.ManagedResourceStorage$ZooKeeperStorageIO.configure Configured ZooKeeperStorageIO with znodeBase: /configs/conf1
   [junit4]   2> 449443 T2759 oasr.RestManager.init Initializing RestManager with initArgs: {}
   [junit4]   2> 449444 T2759 oasr.ManagedResourceStorage.load Reading _rest_managed.json using ZooKeeperStorageIO:path=/configs/conf1
   [junit4]   2> 449444 T2759 oasr.ManagedResourceStorage$ZooKeeperStorageIO.openInputStream No data found for znode /configs/conf1/_rest_managed.json
   [junit4]   2> 449444 T2759 oasr.ManagedResourceStorage.load Loaded null at path _rest_managed.json using ZooKeeperStorageIO:path=/configs/conf1
   [junit4]   2> 449444 T2759 oasr.RestManager.init Initializing 0 registered ManagedResources
   [junit4]   2> 449444 T2759 oash.ReplicationHandler.inform Commits will be reserved for  10000
   [junit4]   2> 449445 T2759 oasc.CoreContainer.registerCore registering core: collection1
   [junit4]   2> 449445 T2760 oasc.SolrCore.registerSearcher [collection1] Registered new searcher Searcher@1e5cfc6[collection1] main{ExitableDirectoryReader(UninvertingDirectoryReader())}
   [junit4]   2> 449445 T2763 oasc.ZkController.register Register replica - core:collection1 address:http://127.0.0.1:56467/rs/g collection:control_collection shard:shard1
   [junit4]   2> 449446 T2727 oass.SolrDispatchFilter.init user.dir=/mnt/ssd/jenkins/workspace/Lucene-Solr-trunk-Linux/solr/build/solr-core/test/J0
   [junit4]   2> 449446 T2763 oascc.SolrZkClient.makePath makePath: /collections/control_collection/leader_elect/shard1/election
   [junit4]   2> 449446 T2727 oass.SolrDispatchFilter.init SolrDispatchFilter.init() done
   [junit4]   2> 449447 T2727 oascc.SolrZkClient.createZkCredentialsToAddAutomatically Using default ZkCredentialsProvider
   [junit4]   2> 449447 T2727 oascc.ConnectionManager.waitForConnected Waiting for client to connect to ZooKeeper
   [junit4]   2> 449448 T2766 oascc.ConnectionManager.process Watcher org.apache.solr.common.cloud.ConnectionManager@42cbe5 name:ZooKeeperConnection Watcher:127.0.0.1:43345/solr got event WatchedEvent state:SyncConnected type:None path:null path:null type:None
   [junit4]   2> 449448 T2727 oascc.ConnectionManager.waitForConnected Client is connected to ZooKeeper
   [junit4]   2> 449449 T2763 oasc.ShardLeaderElectionContext.runLeaderProcess Running the leader process for shard shard1
   [junit4]   2> 449449 T2727 oascc.SolrZkClient.createZkACLProvider Using default ZkACLProvider
   [junit4]   2> 449450 T2755 oasc.DistributedQueue$LatchWatcher.process NodeChildrenChanged fired on path /overseer/queue state SyncConnected
   [junit4]   2> 449450 T2727 oascc.ZkStateReader.createClusterStateWatchersAndUpdate Updating cluster state from ZooKeeper... 
   [junit4]   2> 449450 T2763 oasc.ShardLeaderElectionContext.waitForReplicasToComeUp Enough replicas found to continue.
   [junit4]   2> 449450 T2763 oasc.ShardLeaderElectionContext.runLeaderProcess I may be the new leader - try and sync
   [junit4]   2> 449450 T2756 oasc.Overseer$ClusterStateUpdater.run processMessage: queueSize: 1, message = {
   [junit4]   2> 	  "operation":"leader",
   [junit4]   2> 	  "shard":"shard1",
   [junit4]   2> 	  "collection":"control_collection"} current state version: 1
   [junit4]   2> ASYNC  NEW_CORE C432 name=collection1 org.apache.solr.core.SolrCore@1c6b446 url=http://127.0.0.1:56467/rs/g/collection1 node=127.0.0.1:56467_rs%2Fg C432_STATE=coll:control_collection core:collection1 props:{core=collection1, base_url=http://127.0.0.1:56467/rs/g, node_name=127.0.0.1:56467_rs%2Fg, state=down}
   [junit4]   2> 449450 T2763 C432 P56467 oasc.SyncStrategy.sync Sync replicas to http://127.0.0.1:56467/rs/g/collection1/
   [junit4]   2> 449451 T2763 C432 P56467 oasc.SyncStrategy.syncReplicas Sync Success - now sync replicas to me
   [junit4]   2> 449451 T2763 C432 P56467 oasc.SyncStrategy.syncToMe http://127.0.0.1:56467/rs/g/collection1/ has no replicas
   [junit4]   2> 449451 T2763 oasc.ShardLeaderElectionContext.runLeaderProcess I am the new leader: http://127.0.0.1:56467/rs/g/collection1/ shard1
   [junit4]   2> 449451 T2763 oascc.SolrZkClient.makePath makePath: /collections/control_collection/leaders/shard1
   [junit4]   2> 449452 T2727 oasc.ChaosMonkey.monkeyLog monkey: init - expire sessions:false cause connection loss:false
   [junit4]   2> 449452 T2727 oasc.AbstractFullDistribZkTestBase.createJettys Creating collection1 with stateFormat=2
   [junit4]   2> 449452 T2727 oascc.SolrZkClient.createZkCredentialsToAddAutomatically Using default ZkCredentialsProvider
   [junit4]   2> 449453 T2727 oascc.ConnectionManager.waitForConnected Waiting for client to connect to ZooKeeper
   [junit4]   2> 449454 T2769 oascc.ConnectionManager.process Watcher org.apache.solr.common.cloud.ConnectionManager@107ef20 name:ZooKeeperConnection Watcher:127.0.0.1:43345/solr got event WatchedEvent state:SyncConnected type:None path:null path:null type:None
   [junit4]   2> 449454 T2755 oasc.DistributedQueue$LatchWatcher.process NodeChildrenChanged fired on path /overseer/queue state SyncConnected
   [junit4]   2> 449454 T2727 oascc.ConnectionManager.waitForConnected Client is connected to ZooKeeper
   [junit4]   2> 449454 T2756 oasc.Overseer$ClusterStateUpdater.run processMessage: queueSize: 1, message = {
   [junit4]   2> 	  "operation":"leader",
   [junit4]   2> 	  "shard":"shard1",
   [junit4]   2> 	  "collection":"control_collection",
   [junit4]   2> 	  "base_url":"http://127.0.0.1:56467/rs/g",
   [junit4]   2> 	  "core":"collection1",
   [junit4]   2> 	  "state":"active"} current state version: 1
   [junit4]   2> 449454 T2727 oascc.SolrZkClient.createZkACLProvider Using default ZkACLProvider
   [junit4]   2> 449456 T2756 oasc.Overseer$ClusterStateUpdater.run processMessage: queueSize: 1, message = {
   [junit4]   2> 	  "operation":"create",
   [junit4]   2> 	  "name":"collection1",
   [junit4]   2> 	  "numShards":"2",
   [junit4]   2> 	  "stateFormat":2} current state version: 1
   [junit4]   2> 449456 T2756 oasco.ClusterStateMutator.createCollection building a new cName: collection1
   [junit4]   2> 449456 T2755 oascc.ZkStateReader$2.process A cluster state change: WatchedEvent state:SyncConnected type:NodeDataChanged path:/clusterstate.json, has occurred - updating... (live nodes size: 1)
   [junit4]   2> 449456 T2766 oascc.ZkStateReader$2.process A cluster state change: WatchedEvent state:SyncConnected type:NodeDataChanged path:/clusterstate.json, has occurred - updating... (live nodes size: 1)
   [junit4]   2> 449459 T2770 oasc.DistributedQueue$LatchWatcher.process NodeChildrenChanged fired on path /overseer/queue state SyncConnected
   [junit4]   2> 449459 T2756 oasco.ZkStateWriter.writePendingUpdates going to create_collection /collections/collection1/state.json
   [junit4]   2> 449460 T2766 oascc.ZkStateReader$2.process A cluster state change: WatchedEvent state:SyncConnected type:NodeDataChanged path:/clusterstate.json, has occurred - updating... (live nodes size: 1)
   [junit4]   2> 449504 T2763 oasc.ZkController.register We are http://127.0.0.1:56467/rs/g/collection1/ and leader is http://127.0.0.1:56467/rs/g/collection1/
   [junit4]   2> 449505 T2763 oasc.ZkController.register No LogReplay needed for core=collection1 baseURL=http://127.0.0.1:56467/rs/g
   [junit4]   2> 449505 T2763 oasc.ZkController.checkRecovery I am the leader, no recovery necessary
   [junit4]   2> 449505 T2763 oasc.ZkController.publish publishing core=collection1 state=active collection=control_collection
   [junit4]   2> 449505 T2763 oasc.ZkController.publish numShards not found on descriptor - reading it from system property
   [junit4]   2> 449506 T2755 oasc.DistributedQueue$LatchWatcher.process NodeChildrenChanged fired on path /overseer/queue state SyncConnected
   [junit4]   2> 449507 T2756 oasc.Overseer$ClusterStateUpdater.run processMessage: queueSize: 1, message = {
   [junit4]   2> 	  "core":"collection1",
   [junit4]   2> 	  "core_node_name":"core_node1",
   [junit4]   2> 	  "roles":null,
   [junit4]   2> 	  "base_url":"http://127.0.0.1:56467/rs/g",
   [junit4]   2> 	  "node_name":"127.0.0.1:56467_rs%2Fg",
   [junit4]   2> 	  "numShards":"2",
   [junit4]   2> 	  "state":"active",
   [junit4]   2> 	  "shard":"shard1",
   [junit4]   2> 	  "collection":"control_collection",
   [junit4]   2> 	  "operation":"state"} current state version: 3
   [junit4]   2> 449508 T2756 oasco.ReplicaMutator.updateState Update state numShards=2 message={
   [junit4]   2> 	  "core":"collection1",
   [junit4]   2> 	  "core_node_name":"core_node1",
   [junit4]   2> 	  "roles":null,
   [junit4]   2> 	  "base_url":"http://127.0.0.1:56467/rs/g",
   [junit4]   2> 	  "node_name":"127.0.0.1:56467_rs%2Fg",
   [junit4]   2> 	  "numShards":"2",
   [junit4]   2> 	  "state":"active",
   [junit4]   2> 	  "shard":"shard1",
   [junit4]   2> 	  "collection":"control_collection",
   [junit4]   2> 	  "operation":"state"}
   [junit4]   2> 449610 T2755 oascc.ZkStateReader$2.process A cluster state change: WatchedEvent state:SyncConnected type:NodeDataChanged path:/clusterstate.json, has occurred - updating... (live nodes size: 1)
   [junit4]   2> 449610 T2766 oascc.ZkStateReader$2.process A cluster state change: WatchedEvent state:SyncConnected type:NodeDataChanged path:/clusterstate.json, has occurred - updating... (live nodes size: 1)
   [junit4]   2> 449699 T2727 oasc.AbstractFullDistribZkTestBase.createJettys create jetty 1
   [junit4]   2> 449700 T2727 oejs.Server.doStart jetty-9.2.6.v20141205
   [junit4]   2> 449701 T2727 oejsh.ContextHandler.doStart Started o.e.j.s.ServletContextHandler@1d7b016{/rs/g,null,AVAILABLE}
   [junit4]   2> 449702 T2727 oejs.AbstractConnector.doStart Started ServerConnector@1ac1836{HTTP/1.1}{127.0.0.1:?????}
   [junit4]   2> 449702 T2727 oejs.Server.doStart Started @??????ms
   [junit4]   2> 449703 T2727 oass.SolrDispatchFilter.init SolrDispatchFilter.init()sun.misc.Launcher$AppClassLoader@e2f2a
   [junit4]   2> 449703 T2727 oasc.SolrResourceLoader.locateSolrHome JNDI not configured for solr (NoInitialContextEx)
   [junit4]   2> 449703 T2727 oasc.SolrResourceLoader.locateSolrHome using system property solr.solr.home: ../../../../../../../../../../mnt/ssd/jenkins/workspace/Lucene-Solr-trunk-Linux/solr/build/solr-core/test/J0/temp/solr.handler.TestBlobHandler 5EF763CB5B0D5D17-001/tempDir-003
   [junit4]   2> 449704 T2727 oasc.SolrResourceLoader.<init> new SolrResourceLoader for directory: '../../../../../../../../../../mnt/ssd/jenkins/workspace/Lucene-Solr-trunk-Linux/solr/build/solr-core/test/J0/temp/solr.handler.TestBlobHandler 5EF763CB5B0D5D17-001/tempDir-003/'
   [junit4]   2> 449714 T2727 oasc.ConfigSolr.fromFile Loading container configuration from /mnt/ssd/jenkins/workspace/Lucene-Solr-trunk-Linux/solr/build/solr-core/test/J0/../../../../../../../../../../mnt/ssd/jenkins/workspace/Lucene-Solr-trunk-Linux/solr/build/solr-core/test/J0/temp/solr.handler.TestBlobHandler 5EF763CB5B0D5D17-001/tempDir-003/solr.xml
   [junit4]   2> 449720 T2727 oasc.CoreContainer.<init> New CoreContainer 801115
   [junit4]   2> 449721 T2727 oasc.CoreContainer.load Loading cores into CoreContainer [instanceDir=../../../../../../../../../../mnt/ssd/jenkins/workspace/Lucene-Solr-trunk-Linux/solr/build/solr-core/test/J0/temp/solr.handler.TestBlobHandler 5EF763CB5B0D5D17-001/tempDir-003/]
   [junit4]   2> 449721 T2727 oashc.HttpShardHandlerFactory.getParameter Setting socketTimeout to: 90000
   [junit4]   2> 449721 T2727 oashc.HttpShardHandlerFactory.getParameter Setting urlScheme to: 
   [junit4]   2> 449721 T2727 oashc.HttpShardHandlerFactory.getParameter Setting connTimeout to: 15000
   [junit4]   2> 449722 T2727 oashc.HttpShardHandlerFactory.getParameter Setting maxConnectionsPerHost to: 20
   [junit4]   2> 449722 T2727 oashc.HttpShardHandlerFactory.getParameter Setting maxConnections to: 10000
   [junit4]   2> 449722 T2727 oashc.HttpShardHandlerFactory.getParameter Setting corePoolSize to: 0
   [junit4]   2> 449722 T2727 oashc.HttpShardHandlerFactory.getParameter Setting maximumPoolSize to: 2147483647
   [junit4]   2> 449723 T2727 oashc.HttpShardHandlerFactory.getParameter Setting maxThreadIdleTime to: 5
   [junit4]   2> 449723 T2727 oashc.HttpShardHandlerFactory.getParameter Setting sizeOfQueue to: -1
   [junit4]   2> 449723 T2727 oashc.HttpShardHandlerFactory.getParameter Setting fairnessPolicy to: false
   [junit4]   2> 449724 T2727 oasu.UpdateShardHandler.<init> Creating UpdateShardHandler HTTP client with params: socketTimeout=340000&connTimeout=45000&retry=false
   [junit4]   2> 449724 T2727 oasl.LogWatcher.createWatcher SLF4J impl is org.slf4j.impl.Log4jLoggerFactory
   [junit4]   2> 449724 T2727 oasl.LogWatcher.newRegisteredLogWatcher Registering Log Listener [Log4j (org.slf4j.impl.Log4jLoggerFactory)]
   [junit4]   2> 449724 T2727 oasc.CoreContainer.load Host Name: 127.0.0.1
   [junit4]   2> 449725 T2727 oasc.ZkContainer.initZooKeeper Zookeeper client=127.0.0.1:43345/solr
   [junit4]   2> 449725 T2727 oasc.ZkController.checkChrootPath zkHost includes chroot
   [junit4]   2> 449725 T2727 oascc.SolrZkClient.createZkCredentialsToAddAutomatically Using default ZkCredentialsProvider
   [junit4]   2> 449726 T2727 oascc.ConnectionManager.waitForConnected Waiting for client to connect to ZooKeeper
   [junit4]   2> 449727 T2784 oascc.ConnectionManager.process Watcher org.apache.solr.common.cloud.ConnectionManager@1b652d7 name:ZooKeeperConnection Watcher:127.0.0.1:43345 got event WatchedEvent state:SyncConnected type:None path:null path:null type:None
   [junit4]   2> 449728 T2727 oascc.ConnectionManager.waitForConnected Client is connected to ZooKeeper
   [junit4]   2> 449728 T2727 oascc.SolrZkClient.createZkACLProvider Using default ZkACLProvider
   [junit4]   2> 449730 T2727 oascc.ConnectionManager.waitForConnected Waiting for client to connect to ZooKeeper
   [junit4]   2> 449731 T2787 oascc.ConnectionManager.process Watcher org.apache.solr.common.cloud.ConnectionManager@1f6b361 name:ZooKeeperConnection Watcher:127.0.0.1:43345/solr got event WatchedEvent state:SyncConnected type:None path:null path:null type:None
   [junit4]   2> 449731 T2727 oascc.ConnectionManager.waitForConnected Client is connected to ZooKeeper
   [junit4]   2> 449736 T2727 oascc.ZkStateReader.createClusterStateWatchersAndUpdate Updating cluster state from ZooKeeper... 
   [junit4]   2> 450741 T2727 oasc.ZkController.createEphemeralLiveNode Register node as live in ZooKeeper:/live_nodes/127.0.0.1:48510_rs%2Fg
   [junit4]   2> 450742 T2727 oascc.SolrZkClient.makePath makePath: /live_nodes/127.0.0.1:48510_rs%2Fg
   [junit4]   2> 450746 T2727 oasc.Overseer.close Overseer (id=null) closing
   [junit4]   2> 450751 T2788 oasc.ZkController.publish publishing core=collection1 state=down collection=collection1
   [junit4]   2> 450751 T2788 oasc.ZkController.publish numShards not found on descriptor - reading it from system property
   [junit4]   2> 450753 T2755 oasc.DistributedQueue$LatchWatcher.process NodeChildrenChanged fired on path /overseer/queue state SyncConnected
   [junit4]   2> 450753 T2788 oasc.ZkController.preRegister Registering watch for external collection collection1
   [junit4]   2> 450753 T2788 oascc.ZkStateReader.addZkWatch addZkWatch collection1
   [junit4]   2> 450753 T2756 oasc.Overseer$ClusterStateUpdater.run processMessage: queueSize: 1, message = {
   [junit4]   2> 	  "core":"collection1",
   [junit4]   2> 	  "roles":null,
   [junit4]   2> 	  "base_url":"http://127.0.0.1:48510/rs/g",
   [junit4]   2> 	  "node_name":"127.0.0.1:48510_rs%2Fg",
   [junit4]   2> 	  "numShards":"2",
   [junit4]   2> 	  "state":"down",
   [junit4]   2> 	  "shard":null,
   [junit4]   2> 	  "collection":"collection1",
   [junit4]   2> 	  "operation":"state"} current state version: 4
   [junit4]   2> 450754 T2788 oascc.ZkStateReader.addZkWatch Updating collection state at /collections/collection1/state.json from ZooKeeper... 
   [junit4]   2> 450754 T2756 oasco.ReplicaMutator.updateState Update state numShards=2 message={
   [junit4]   2> 	  "core":"collection1",
   [junit4]   2> 	  "roles":null,
   [junit4]   2> 	  "base_url":"http://127.0.0.1:48510/rs/g",
   [junit4]   2> 	  "node_name":"127.0.0.1:48510_rs%2Fg",
   [junit4]   2> 	  "numShards":"2",
   [junit4]   2> 	  "state":"down",
   [junit4]   2> 	  "shard":null,
   [junit4]   2> 	  "collection":"collection1",
   [junit4]   2> 	  "operation":"state"}
   [junit4]   2> 450755 T2756 oasco.ReplicaMutator.updateState Collection already exists with numShards=2
   [junit4]   2> 450755 T2756 oasco.ReplicaMutator.updateState Assigning new node to shard shard=shard2
   [junit4]   2> 450755 T2788 oascc.ZkStateReader.updateWatchedCollection Updating data for collection1 to ver 0 
   [junit4]   2> 450755 T2788 oasc.ZkController.waitForCoreNodeName look for our core node name
   [junit4]   2> 450858 T2756 oasco.ZkStateWriter.writePendingUpdates going to update_collection /collections/collection1/state.json version: 0
   [junit4]   2> 450858 T2787 oascc.ZkStateReader$7.process A cluster state change: WatchedEvent state:SyncConnected type:NodeDataChanged path:/collections/collection1/state.json, has occurred - updating... 
   [junit4]   2> 450859 T2787 oascc.ZkStateReader.updateWatchedCollection Updating data for collection1 to ver 1 
   [junit4]   2> 451756 T2788 oasc.ZkController.waitForShardId waiting to find shard id in clusterstate for collection1
   [junit4]   2> 451756 T2788 oasc.ZkController.createCollectionZkNode Check for collection zkNode:collection1
   [junit4]   2> 451757 T2788 oasc.ZkController.createCollectionZkNode Collection zkNode exists
   [junit4]   2> 451757 T2788 oascc.ZkStateReader.readConfigName Load collection config from:/collections/collection1
   [junit4]   2> 451758 T2788 oascc.ZkStateReader.readConfigName path=/collections/collection1 configName=conf1 specified config exists in ZooKeeper
   [junit4]   2> 451758 T2788 oasc.SolrResourceLoader.<init> new SolrResourceLoader for directory: '../../../../../../../../../../mnt/ssd/jenkins/workspace/Lucene-Solr-trunk-Linux/solr/build/solr-core/test/J0/temp/solr.handler.TestBlobHandler 5EF763CB5B0D5D17-001/tempDir-003/collection1/'
   [junit4]   2> 451758 T2788 oasc.SolrResourceLoader.replaceClassLoader Adding 'file:/mnt/ssd/jenkins/workspace/Lucene-Solr-trunk-Linux/solr/build/solr-core/test/J0/temp/solr.handler.TestBlobHandler%205EF763CB5B0D5D17-001/tempDir-003/collection1/lib/.svn/' to classloader
   [junit4]   2> 451759 T2788 oasc.SolrResourceLoader.replaceClassLoader Adding 'file:/mnt/ssd/jenkins/workspace/Lucene-Solr-trunk-Linux/solr/build/solr-core/test/J0/temp/solr.handler.TestBlobHandler%205EF763CB5B0D5D17-001/tempDir-003/collection1/lib/classes/' to classloader
   [junit4]   2> 451759 T2788 oasc.SolrResourceLoader.replaceClassLoader Adding 'file:/mnt/ssd/jenkins/workspace/Lucene-Solr-trunk-Linux/solr/build/solr-core/test/J0/temp/solr.handler.TestBlobHandler%205EF763CB5B0D5D17-001/tempDir-003/collection1/lib/README' to classloader
   [junit4]   2> 451774 T2788 oasc.ZkController.watchZKConfDir watch zkdir /configs/conf1
   [junit4]   2> 451776 T2788 oasc.Config.<init> loaded config solrconfig.xml with version 0 
   [junit4]   2> 451780 T2788 oasc.SolrConfig.refreshRequestParams current version of requestparams : -1
   [junit4]   2> 451784 T2788 oasc.SolrConfig.<init> Using Lucene MatchVersion: 6.0.0
   [junit4]   2> 451793 T2788 oasc.SolrConfig.<init> Loaded SolrConfig: solrconfig.xml
   [junit4]   2> 451794 T2788 oass.IndexSchema.readSchema Reading Solr Schema from /configs/conf1/schema.xml
   [junit4]   2> 451797 T2788 oass.IndexSchema.readSchema [collection1] Schema name=test
   [junit4]   2> 451887 T2788 oass.OpenExchangeRatesOrgProvider.init Initialized with rates=open-exchange-rates.json, refreshInterval=1440.
   [junit4]   2> 451890 T2788 oass.IndexSchema.readSchema default search field in schema is text
   [junit4]   2> 451891 T2788 oass.IndexSchema.readSchema unique key field: id
   [junit4]   2> 451898 T2788 oass.FileExchangeRateProvider.reload Reloading exchange rates from file currency.xml
   [junit4]   2> 451899 T2788 oass.FileExchangeRateProvider.reload Reloading exchange rates from file currency.xml
   [junit4]   2> 451901 T2788 oass.OpenExchangeRatesOrgProvider.reload Reloading exchange rates from open-exchange-rates.json
   [junit4]   2> 451901 T2788 oass.OpenExchangeRatesOrgProvider$OpenExchangeRates.<init> WARN Unknown key IMPORTANT NOTE
   [junit4]   2> 451902 T2788 oass.OpenExchangeRatesOrgProvider$OpenExchangeRates.<init> WARN Expected key, got STRING
   [junit4]   2> 451902 T2788 oass.OpenExchangeRatesOrgProvider.reload Reloading exchange rates from open-exchange-rates.json
   [junit4]   2> 451903 T2788 oass.OpenExchangeRatesOrgProvider$OpenExchangeRates.<init> WARN Unknown key IMPORTANT NOTE
   [junit4]   2> 451903 T2788 oass.OpenExchangeRatesOrgProvider$OpenExchangeRates.<init> WARN Expected key, got STRING
   [junit4]   2> 451903 T2788 oasc.CoreContainer.create Creating SolrCore 'collection1' using configuration from collection collection1
   [junit4]   2> 451903 T2788 oasc.SolrCore.initDirectoryFactory org.apache.solr.core.MockDirectoryFactory
   [junit4]   2> 451904 T2788 oasc.SolrCore.<init> [collection1] Opening new SolrCore at ../../../../../../../../../../mnt/ssd/jenkins/workspace/Lucene-Solr-trunk-Linux/solr/build/solr-core/test/J0/temp/solr.handler.TestBlobHandler 5EF763CB5B0D5D17-001/tempDir-003/collection1/, dataDir=/mnt/ssd/jenkins/workspace/Lucene-Solr-trunk-Linux/solr/build/solr-core/test/J0/temp/solr.handler.TestBlobHandler 5EF763CB5B0D5D17-001/tempDir-001/jetty1/
   [junit4]   2> 451904 T2788 oasc.JmxMonitoredMap.<init> JMX monitoring is enabled. Adding Solr mbeans to JMX Server: com.sun.jmx.mbeanserver.JmxMBeanServer@c4919b
   [junit4]   2> 451904 T2788 oasc.CachingDirectoryFactory.get return new directory for /mnt/ssd/jenkins/workspace/Lucene-Solr-trunk-Linux/solr/build/solr-core/test/J0/temp/solr.handler.TestBlobHandler 5EF763CB5B0D5D17-001/tempDir-001/jetty1
   [junit4]   2> 451904 T2788 oasc.SolrCore.getNewIndexDir New index directory detected: old=null new=/mnt/ssd/jenkins/workspace/Lucene-Solr-trunk-Linux/solr/build/solr-core/test/J0/temp/solr.handler.TestBlobHandler 5EF763CB5B0D5D17-001/tempDir-001/jetty1/index/
   [junit4]   2> 451905 T2788 oasc.SolrCore.initIndex WARN [collection1] Solr index directory '/mnt/ssd/jenkins/workspace/Lucene-Solr-trunk-Linux/solr/build/solr-core/test/J0/temp/solr.handler.TestBlobHandler 5EF763CB5B0D5D17-001/tempDir-001/jetty1/index' doesn't exist. Creating new index...
   [junit4]   2> 451905 T2788 oasc.CachingDirectoryFactory.get return new directory for /mnt/ssd/jenkins/workspace/Lucene-Solr-trunk-Linux/solr/build/solr-core/test/J0/temp/solr.handler.TestBlobHandler 5EF763CB5B0D5D17-001/tempDir-001/jetty1/index
   [junit4]   2> 451905 T2788 oasu.RandomMergePolicy.<init> RandomMergePolicy wrapping class org.apache.lucene.index.TieredMergePolicy: [TieredMergePolicy: maxMergeAtOnce=33, maxMergeAtOnceExplicit=24, maxMergedSegmentMB=10.1513671875, floorSegmentMB=1.48828125, forceMergeDeletesPctAllowed=24.487759081372538, segmentsPerTier=37.0, maxCFSSegmentSizeMB=8.796093022207999E12, noCFSRatio=0.0
   [junit4]   2> 451906 T2788 oasc.SolrDeletionPolicy.onCommit SolrDeletionPolicy.onCommit: commits: num=1
   [junit4]   2> 		commit{dir=MockDirectoryWrapper(RAMDirectory@1ef9811 lockFactory=org.apache.lucene.store.SingleInstanceLockFactory@d73df4),segFN=segments_1,generation=1}
   [junit4]   2> 451906 T2788 oasc.SolrDeletionPolicy.updateCommits newest commit generation = 1
   [junit4]   2> 451908 T2788 oasup.UpdateRequestProcessorChain.init creating updateRequestProcessorChain "nodistrib"
   [junit4]   2> 451908 T2788 oasup.UpdateRequestProcessorChain.init creating updateRequestProcessorChain "dedupe"
   [junit4]   2> 451908 T2788 oasup.UpdateRequestProcessorChain.init inserting DistributedUpdateProcessorFactory into updateRequestProcessorChain "dedupe"
   [junit4]   2> 451908 T2788 oasup.UpdateRequestProcessorChain.init creating updateRequestProcessorChain "stored_sig"
   [junit4]   2> 451908 T2788 oasup.UpdateRequestProcessorChain.init inserting DistributedUpdateProcessorFactory into updateRequestProcessorChain "stored_sig"
   [junit4]   2> 451908 T2788 oasup.UpdateRequestProcessorChain.init creating updateRequestProcessorChain "distrib-dup-test-chain-explicit"
   [junit4]   2> 451909 T2788 oasup.UpdateRequestProcessorChain.init creating updateRequestProcessorChain "distrib-dup-test-chain-implicit"
   [junit4]   2> 451909 T2788 oasup.UpdateRequestProcessorChain.init inserting DistributedUpdateProcessorFactory into updateRequestProcessorChain "distrib-dup-test-chain-implicit"
   [junit4]   2> 451909 T2788 oasc.SolrCore.loadUpdateProcessorChains no updateRequestProcessorChain defined as default, creating implicit default
   [junit4]   2> 451909 T2788 oasc.RequestHandlers.initHandlersFromConfig created /update: org.apache.solr.handler.UpdateRequestHandler
   [junit4]   2> 451909 T2788 oasc.RequestHandlers.initHandlersFromConfig created /update/json: org.apache.solr.handler.UpdateRequestHandler
   [junit4]   2> 451910 T2788 oasc.RequestHandlers.initHandlersFromConfig created /update/csv: org.apache.solr.handler.UpdateRequestHandler
   [junit4]   2> 451910 T2788 oasc.RequestHandlers.initHandlersFromConfig created /update/json/docs: org.apache.solr.handler.UpdateRequestHandler
   [junit4]   2> 451910 T2788 oasc.RequestHandlers.initHandlersFromConfig created /config: org.apache.solr.handler.SolrConfigHandler
   [junit4]   2> 451910 T2788 oasc.RequestHandlers.initHandlersFromConfig created /schema: org.apache.solr.handler.SchemaHandler
   [junit4]   2> 451911 T2788 oasc.RequestHandlers.initHandlersFromConfig created /replication: org.apache.solr.handler.ReplicationHandler
   [junit4]   2> 451911 T2788 oasc.RequestHandlers.initHandlersFromConfig created /get: org.apache.solr.handler.RealTimeGetHandler
   [junit4]   2> 451911 T2788 oasc.RequestHandlers.initHandlersFromConfig created /admin/luke: org.apache.solr.handler.admin.LukeRequestHandler
   [junit4]   2> 451912 T2788 oasc.RequestHandlers.initHandlersFromConfig created /admin/system: org.apache.solr.handler.admin.SystemInfoHandler
   [junit4]   2> 451912 T2788 oasc.RequestHandlers.initHandlersFromConfig created /admin/mbeans: org.apache.solr.handler.admin.SolrInfoMBeanHandler
   [junit4]   2> 451912 T2788 oasc.RequestHandlers.initHandlersFromConfig created /admin/plugins: org.apache.solr.handler.admin.PluginInfoHandler
   [junit4]   2> 451913 T2788 oasc.RequestHandlers.initHandlersFromConfig created /admin/threads: org.apache.solr.handler.admin.ThreadDumpHandler
   [junit4]   2> 451913 T2788 oasc.RequestHandlers.initHandlersFromConfig created /admin/properties: org.apache.solr.handler.admin.PropertiesRequestHandler
   [junit4]   2> 451913 T2788 oasc.RequestHandlers.initHandlersFromConfig created /admin/logging: org.apache.solr.handler.admin.LoggingHandler
   [junit4]   2> 451913 T2788 oasc.RequestHandlers.initHandlersFromConfig created /admin/ping: org.apache.solr.handler.PingRequestHandler
   [junit4]   2> 451914 T2788 oasc.RequestHandlers.initHandlersFromConfig created standard: solr.StandardRequestHandler
   [junit4]   2> 451914 T2788 oasc.RequestHandlers.initHandlersFromConfig created /admin/file: solr.admin.ShowFileRequestHandler
   [junit4]   2> 451915 T2788 oashl.XMLLoader.init xsltCacheLifetimeSeconds=60
   [junit4]   2> 451916 T2788 oashl.XMLLoader.init xsltCacheLifetimeSeconds=60
   [junit4]   2> 451917 T2788 oashl.XMLLoader.init xsltCacheLifetimeSeconds=60
   [junit4]   2> 451917 T2788 oashl.XMLLoader.init xsltCacheLifetimeSeconds=60
   [junit4]   2> 451918 T2788 oasc.SolrCore.initStatsCache Using default statsCache cache: org.apache.solr.search.stats.LocalStatsCache
   [junit4]   2> 451918 T2788 oasu.CommitTracker.<init> Hard AutoCommit: disabled
   [junit4]   2> 451919 T2788 oasu.CommitTracker.<init> Soft AutoCommit: disabled
   [junit4]   2> 451919 T2788 oasu.RandomMergePolicy.<init> RandomMergePolicy wrapping class org.apache.lucene.index.TieredMergePolicy: [TieredMergePolicy: maxMergeAtOnce=11, maxMergeAtOnceExplicit=32, maxMergedSegmentMB=62.810546875, floorSegmentMB=0.6259765625, forceMergeDeletesPctAllowed=15.573053182320015, segmentsPerTier=17.0, maxCFSSegmentSizeMB=8.796093022207999E12, noCFSRatio=1.0
   [junit4]   2> 451919 T2788 oasc.SolrDeletionPolicy.onInit SolrDeletionPolicy.onInit: commits: num=1
   [junit4]   2> 		commit{dir=MockDirectoryWrapper(RAMDirectory@1ef9811 lockFactory=org.apache.lucene.store.SingleInstanceLockFactory@d73df4),segFN=segments_1,generation=1}
   [junit4]   2> 451920 T2788 oasc.SolrDeletionPolicy.updateCommits newest commit generation = 1
   [junit4]   2> 451920 T2788 oass.SolrIndexSearcher.<init> Opening Searcher@fc10c1[collection1] main
   [junit4]   2> 451920 T2788 oascc.ZkStateReader.readConfigName Load collection config from:/collections/collection1
   [junit4]   2> 451921 T2788 oascc.ZkStateReader.readConfigName path=/collections/collection1 configName=conf1 specified config exists in ZooKeeper
   [junit4]   2> 451921 T2788 oasr.ManagedResourceStorage.newStorageIO Setting up ZooKeeper-based storage for the RestManager with znodeBase: /configs/conf1
   [junit4]   2> 451921 T2788 oasr.ManagedResourceStorage$ZooKeeperStorageIO.configure Configured ZooKeeperStorageIO with znodeBase: /configs/conf1
   [junit4]   2> 451921 T2788 oasr.RestManager.init Initializing RestManager with initArgs: {}
   [junit4]   2> 451921 T2788 oasr.ManagedResourceStorage.load Reading _rest_managed.json using ZooKeeperStorageIO:path=/configs/conf1
   [junit4]   2> 451922 T2788 oasr.ManagedResourceStorage$ZooKeeperStorageIO.openInputStream No data found for znode /configs/conf1/_rest_managed.json
   [junit4]   2> 451922 T2788 oasr.ManagedResourceStorage.load Loaded null at path _rest_managed.json using ZooKeeperStorageIO:path=/configs/conf1
   [junit4]   2> 451922 T2788 oasr.RestManager.init Initializing 0 registered ManagedResources
   [junit4]   2> 451922 T2788 oash.ReplicationHandler.inform Commits will be reserved for  10000
   [junit4]   2> 451923 T2789 oasc.SolrCore.registerSearcher [collection1] Registered new searcher Searcher@fc10c1[collection1] main{ExitableDirectoryReader(UninvertingDirectoryReader())}
   [junit4]   2> 451923 T2788 oasc.CoreContainer.registerCore registering core: collection1
   [junit4]   2> 451923 T2792 oasc.ZkController.register Register replica - core:collection1 address:http://127.0.0.1:48510/rs/g collection:collection1 shard:shard2
   [junit4]   2> 451924 T2727 oass.SolrDispatchFilter.init user.dir=/mnt/ssd/jenkins/workspace/Lucene-Solr-trunk-Linux/solr/build/solr-core/test/J0
   [junit4]   2> 451924 T2727 oass.SolrDispatchFilter.init SolrDispatchFilter.init() done
   [junit4]   2> 451924 T2792 oascc.SolrZkClient.makePath makePath: /collections/collection1/leader_elect/shard2/election
   [junit4]   2> 451927 T2792 oasc.ShardLeaderElectionContext.runLeaderProcess Running the leader process for shard shard2
   [junit4]   2> 451928 T2755 oasc.DistributedQueue$LatchWatcher.process NodeChildrenChanged fired on path /overseer/queue state SyncConnected
   [junit4]   2> 451928 T2792 oasc.ShardLeaderElectionContext.waitForReplicasToComeUp Enough replicas found to continue.
   [junit4]   2> 451928 T2792 oasc.ShardLeaderElectionContext.runLeaderProcess I may be the new leader - try and sync
   [junit4]   2> ASYNC  NEW_CORE C433 name=collection1 org.apache.solr.core.SolrCore@b3c82c url=http://127.0.0.1:48510/rs/g/collection1 node=127.0.0.1:48510_rs%2Fg C433_STATE=coll:collection1 core:collection1 props:{core=collection1, base_url=http://127.0.0.1:48510/rs/g, node_name=127.0.0.1:48510_rs%2Fg, state=down}
   [junit4]   2> 451928 T2792 C433 P48510 oasc.SyncStrategy.sync Sync replicas to http://127.0.0.1:48510/rs/g/collection1/
   [junit4]   2> 451928 T2756 oasc.Overseer$ClusterStateUpdater.run processMessage: queueSize: 1, message = {
   [junit4]   2> 	  "operation":"leader",
   [junit4]   2> 	  "shard":"shard2",
   [junit4]   2> 	  "collection":"collection1"} current state version: 4
   [junit4]   2> 451928 T2792 C433 P48510 oasc.SyncStrategy.syncReplicas Sync Success - now sync replicas to me
   [junit4]   2> 451929 T2792 C433 P48510 oasc.SyncStrategy.syncToMe http://127.0.0.1:48510/rs/g/collection1/ has no replicas
   [junit4]   2> 451929 T2792 oasc.ShardLeaderElectionContext.runLeaderProcess I am the new leader: http://127.0.0.1:48510/rs/g/collection1/ shard2
   [junit4]   2> 451929 T2792 oascc.SolrZkClient.makePath makePath: /collections/collection1/leaders/shard2
   [junit4]   2> 451929 T2756 oasco.ZkStateWriter.writePendingUpdates going to update_collection /collections/collection1/state.json version: 1
   [junit4]   2> 451930 T2787 oascc.ZkStateReader$7.process A cluster state change: WatchedEvent state:SyncConnected type:NodeDataChanged path:/collections/collection1/state.json, has occurred - updating... 
   [junit4]   2> 451930 T2787 oascc.ZkStateReader.updateWatchedCollection Updating data for collection1 to ver 2 
   [junit4]   2> 451931 T2756 oasc.Overseer$ClusterStateUpdater.run processMessage: queueSize: 1, message = {
   [junit4]   2> 	  "operation":"leader",
   [junit4]   2> 	  "shard":"shard2",
   [junit4]   2> 	  "collection":"collection1",
   [junit4]   2> 	  "base_url":"http://127.0.0.1:48510/rs/g",
   [junit4]   2> 	  "core":"collection1",
   [junit4]   2> 	  "state":"active"} current state version: 4
   [junit4]   2> 451932 T2756 oasco.ZkStateWriter.writePendingUpdates going to update_collection /collections/collection1/state.json version: 2
   [junit4]   2> 451933 T2787 oascc.ZkStateReader$7.process A cluster state change: WatchedEvent state:SyncConnected type:NodeDataChanged path:/collections/collection1/state.json, has occurred - updating... 
   [junit4]   2> 451933 T2787 oascc.ZkStateReader.updateWatchedCollection Updating data for collection1 to ver 3 
   [junit4]   2> 451934 T2755 oasc.DistributedQueue$LatchWatcher.process NodeChildrenChanged fired on path /overseer/queue state SyncConnected
   [junit4]   2> 451982 T2792 oasc.ZkController.register We are http://127.0.0.1:48510/rs/g/collection1/ and leader is http://127.0.0.1:48510/rs/g/collection1/
   [junit4]   2> 451982 T2792 oasc.ZkController.register No LogReplay needed for core=collection1 baseURL=http://127.0.0.1:48510/rs/g
   [junit4]   2> 451982 T2792 oasc.ZkController.checkRecovery I am the leader, no recovery necessary
   [junit4]   2> 451982 T2792 oasc.ZkController.publish publishing core=collection1 state=active collection=collection1
   [junit4]   2> 451982 T2792 oasc.ZkController.publish numShards not found on descriptor - reading it from system property
   [junit4]   2> 451983 T2755 oasc.DistributedQueue$LatchWatcher.process NodeChildrenChanged fired on path /overseer/queue state SyncConnected
   [junit4]   2> 451984 T2756 oasc.Overseer$ClusterStateUpdater.run processMessage: queueSize: 1, message = {
   [junit4]   2> 	  "core":"collection1",
   [junit4]   2> 	  "core_node_name":"core_node1",
   [junit4]   2> 	  "roles":null,
   [junit4]   2> 	  "base_url":"http://127.0.0.1:48510/rs/g",
   [junit4]   2> 	  "node_name":"127.0.0.1:48510_rs%2Fg",
   [junit4]   2> 	  "numShards":"2",
   [junit4]   2> 	  "state":"active",
   [junit4]   2> 	  "shard":"shard2",
   [junit4]   2> 	  "collection":"collection1",
   [junit4]   2> 	  "operation":"state"} current state version: 4
   [junit4]   2> 451985 T2756 oasco.ReplicaMutator.updateState Update state numShards=2 message={
   [junit4]   2> 	  "core":"collection1",
   [junit4]   2> 	  "core_node_name":"core_node1",
   [junit4]   2> 	  "roles":null,
   [junit4]   2> 	  "base_url":"http://127.0.0.1:48510/rs/g",
   [junit4]   2> 	  "node_name":"127.0.0.1:48510_rs%2Fg",
   [junit4]   2> 	  "numShards":"2",
   [junit4]   2> 	  "state":"active",
   [junit4]   2> 	  "shard":"shard2",
   [junit4]   2> 	  "collection":"collection1",
   [junit4]   2> 	  "operation":"state"}
   [junit4]   2> 451986 T2756 oasco.ZkStateWriter.writePendingUpdates going to update_collection /collections/collection1/state.json version: 3
   [junit4]   2> 451986 T2792 oascc.ZkStateReader.updateWatchedCollection Updating data for collection1 to ver 3 
   [junit4]   2> 451986 T2787 oascc.ZkStateReader$7.process A cluster state change: WatchedEvent state:SyncConnected type:NodeDataChanged path:/collections/collection1/state.json, has occurred - updating... 
   [junit4]   2> 451986 T2787 oascc.ZkStateReader.updateWatchedCollection Updating data for collection1 to ver 4 
   [junit4]   2> 452163 T2727 oasc.AbstractFullDistribZkTestBase.createJettys create jetty 2
   [junit4]   2> 452164 T2727 oejs.Server.doStart jetty-9.2.6.v20141205
   [junit4]   2> 452166 T2727 oejsh.ContextHandler.doStart Started o.e.j.s.ServletContextHandler@5148b6{/rs/g,null,AVAILABLE}
   [junit4]   2> 452166 T2727 oejs.AbstractConnector.doStart Started ServerConnector@b9c841{HTTP/1.1}{127.0.0.1:?????}
   [junit4]   2> 452167 T2727 oejs.Server.doStart Started @??????ms
   [junit4]   2> 452167 T2727 oass.SolrDispatchFilter.init SolrDispatchFilter.init()sun.misc.Launcher$AppClassLoader@e2f2a
   [junit4]   2> 452167 T2727 oasc.SolrResourceLoader.locateSolrHome JNDI not configured for solr (NoInitialContextEx)
   [junit4]   2> 452168 T2727 oasc.SolrResourceLoader.locateSolrHome using system property solr.solr.home: /mnt/ssd/jenkins/workspace/Lucene-Solr-trunk-Linux/solr/build/solr-core/test/J0/temp/solr.handler.TestBlobHandler 5EF763CB5B0D5D17-001/tempDir-004
   [junit4]   2> 452168 T2727 oasc.SolrResourceLoader.<init> new SolrResourceLoader for directory: '/mnt/ssd/jenkins/workspace/Lucene-Solr-trunk-Linux/solr/build/solr-core/test/J0/temp/solr.handler.TestBlobHandler 5EF763CB5B0D5D17-001/tempDir-004/'
   [junit4]   2> 452179 T2727 oasc.ConfigSolr.fromFile Loading container configuration from /mnt/ssd/jenkins/workspace/Lucene-Solr-trunk-Linux/solr/build/solr-core/test/J0/temp/solr.handler.TestBlobHandler 5EF763CB5B0D5D17-001/tempDir-004/solr.xml
   [junit4]   2> 452185 T2727 oasc.CoreContainer.<init> New CoreContainer 25074324
   [junit4]   2> 452185 T2727 oasc.CoreContainer.load Loading cores into CoreContainer [instanceDir=/mnt/ssd/jenkins/workspace/Lucene-Solr-trunk-Linux/solr/build/solr-core/test/J0/temp/solr.handler.TestBlobHandler 5EF763CB5B0D5D17-001/tempDir-004/]
   [junit4]   2> 452185 T2727 oashc.HttpShardHandlerFactory.getParameter Setting socketTimeout to: 90000
   [junit4]   2> 452186 T2727 oashc.HttpShardHandlerFactory.getParameter Setting urlScheme to: 
   [junit4]   2> 452186 T2727 oashc.HttpShardHandlerFactory.getParameter Setting connTimeout to: 15000
   [junit4]   2> 452186 T2727 oashc.HttpShardHandlerFactory.getParameter Setting maxConnectionsPerHost to: 20
   [junit4]   2> 452186 T2727 oashc.HttpShardHandlerFactory.getParameter Setting maxConnections to: 10000
   [junit4]   2> 452187 T2727 oashc.HttpShardHandlerFactory.getParameter Setting corePoolSize to: 0
   [junit4]   2> 452187 T2727 oashc.HttpShardHandlerFactory.getParameter Setting maximumPoolSize to: 2147483647
   [junit4]   2> 452187 T2727 oashc.HttpShardHandlerFactory.getParameter Setting maxThreadIdleTime to: 5
   [junit4]   2> 452187 T2727 oashc.HttpShardHandlerFactory.getParameter Setting sizeOfQueue to: -1
   [junit4]   2> 452188 T2727 oashc.HttpShardHandlerFactory.getParameter Setting fairnessPolicy to: false
   [junit4]   2> 452188 T2727 oasu.UpdateShardHandler.<init> Creating UpdateShardHandler HTTP client with params: socketTimeout=340000&connTimeout=45000&retry=false
   [junit4]   2> 452188 T2727 oasl.LogWatcher.createWatcher SLF4J impl is org.slf4j.impl.Log4jLoggerFactory
   [junit4]   2> 452189 T2727 oasl.LogWatcher.newRegisteredLogWatcher Registering Log Listener [Log4j (org.slf4j.impl.Log4jLoggerFactory)]
   [junit4]   2> 452189 T2727 oasc.CoreContainer.load Host Name: 127.0.0.1
   [junit4]   2> 452189 T2727 oasc.ZkContainer.initZooKeeper Zookeeper client=127.0.0.1:43345/solr
   [junit4]   2> 452189 T2727 oasc.ZkController.checkChrootPath zkHost includes chroot
   [junit4]   2> 452190 T2727 oascc.SolrZkClient.createZkCredentialsToAddAutomatically Using default ZkCredentialsProvider
   [junit4]   2> 452190 T2727 oascc.ConnectionManager.waitForConnected Waiting for client to connect to ZooKeeper
   [junit4]   2> 452191 T2806 oascc.ConnectionManager.process Watcher org.apache.solr.common.cloud.ConnectionManager@5cf491 name:ZooKeeperConnection Watcher:127.0.0.1:43345 got event WatchedEvent state:SyncConnected type:None path:null path:null type:None
   [junit4]   2> 452192 T2727 oascc.ConnectionManager.waitForConnected Client is connected to ZooKeeper
   [junit4]   2> 452193 T2727 oascc.SolrZkClient.createZkACLProvider Using default ZkACLProvider
   [junit4]   2> 452194 T2727 oascc.ConnectionManager.waitForConnected Waiting for client to connect to ZooKeeper
   [junit4]   2> 452194 T2809 oascc.ConnectionManager.process Watcher org.apache.solr.common.cloud.ConnectionManager@1258ce6 name:ZooKeeperConnection Watcher:127.0.0.1:43345/solr got event WatchedEvent state:SyncConnected type:None path:null path:null type:None
   [junit4]   2> 452195 T2727 oascc.ConnectionManager.waitForConnected Client is connected to ZooKeeper
   [junit4]   2> 452200 T2727 oascc.ZkStateReader.createClusterStateWatchersAndUpdate Updating cluster state from ZooKeeper... 
   [junit4]   2> 453206 T2727 oasc.ZkController.createEphemeralLiveNode Register node as live in ZooKeeper:/live_nodes/127.0.0.1:51142_rs%2Fg
   [junit4]   2> 453208 T2727 oascc.SolrZkClient.makePath makePath: /live_nodes/127.0.0.1:51142_rs%2Fg
   [junit4]   2> 453214 T2727 oasc.Overseer.close Overseer (id=null) closing
   [junit4]   2> 453221 T2810 oasc.ZkController.publish publishing core=collection1 state=down collection=collection1
   [junit4]   2> 453222 T2810 oasc.ZkController.publish numShards not found on descriptor - reading it from system property
   [junit4]   2> 453224 T2755 oasc.DistributedQueue$LatchWatcher.process NodeChildrenChanged fired on path /overseer/queue state SyncConnected
   [junit4]   2> 453224 T2810 oasc.ZkController.preRegister Registering watch for external collection collection1
   [junit4]   2> 453225 T2810 oascc.ZkStateReader.addZkWatch addZkWatch collection1
   [junit4]   2> 453225 T2756 oasc.Overseer$ClusterStateUpdater.run processMessage: queueSize: 1, message = {
   [junit4]   2> 	  "core":"collection1",
   [junit4]   2> 	  "roles":null,
   [junit4]   2> 	  "base_url":"http://127.0.0.1:51142/rs/g",
   [junit4]   2> 	  "node_name":"127.0.0.1:51142_rs%2Fg",
   [junit4]   2> 	  "numShards":"2",
   [junit4]   2> 	  "state":"down",
   [junit4]   2> 	  "shard":null,
   [junit4]   2> 	  "collection":"collection1",
   [junit4]   2> 	  "operation":"state"} current state version: 4
   [junit4]   2> 453225 T2810 oascc.ZkStateReader.addZkWatch Updating collection state at /collections/collection1/state.json from ZooKeeper... 
   [junit4]   2> 453225 T2756 oasco.ReplicaMutator.updateState Update state numShards=2 message={
   [junit4]   2> 	  "core":"collection1",
   [junit4]   2> 	  "roles":null,
   [junit4]   2> 	  "base_url":"http://127.0.0.1:51142/rs/g",
   [junit4]   2> 	  "node_name":"127.0.0.1:51142_rs%2Fg",
   [junit4]   2> 	  "numShards":"2",
   [junit4]   2> 	  "state":"down",
   [junit4]   2> 	  "shard":null,
   [junit4]   2> 	  "collection":"collection1",
   [junit4]   2> 	  "operation":"state"}
   [junit4]   2> 453226 T2756 oasco.ReplicaMutator.updateState Collection already exists with numShards=2
   [junit4]   2> 453226 T2756 oasco.ReplicaMutator.updateState Assigning new node to shard shard=shard1
   [junit4]   2> 453226 T2810 oascc.ZkStateReader.updateWatchedCollection Updating data for collection1 to ver 4 
   [junit4]   2> 453227 T2810 oasc.ZkController.waitForCoreNodeName look for our core node name
   [junit4]   2> 453227 T2756 oasco.ZkStateWriter.writePendingUpdates going to update_collection /collections/collection1/state.json version: 4
   [junit4]   2> 453228 T2787 oascc.ZkStateReader$7.process A cluster state change: WatchedEvent state:SyncConnected type:NodeDataChanged path:/collections/collection1/state.json, has occurred - updating... 
   [junit4]   2> 453228 T2809 oascc.ZkStateReader$7.process A cluster state change: WatchedEvent state:SyncConnected type:NodeDataChanged path:/collections/collection1/state.json, has occurred - updating... 
   [junit4]   2> 453229 T2787 oascc.ZkStateReader.updateWatchedCollection Updating data for collection1 to ver 5 
   [junit4]   2> 453229 T2809 oascc.ZkStateReader.updateWatchedCollection Updating data for collection1 to ver 5 
   [junit4]   2> 454227 T2810 oasc.ZkController.waitForShardId waiting to find shard id in clusterstate for collection1
   [junit4]   2> 454228 T2810 oasc.ZkController.createCollectionZkNode Check for collection zkNode:collection1
   [junit4]   2> 454228 T2810 oasc.ZkController.createCollectionZkNode Collection zkNode exists
   [junit4]   2> 454229 T2810 oascc.ZkStateReader.readConfigName Load collection config from:/collections/collection1
   [junit4]   2> 454229 T2810 oascc.ZkStateReader.readConfigName path=/collections/collection1 configName=conf1 specified config exists in ZooKeeper
   [junit4]   2> 454230 T2810 oasc.SolrResourceLoader.<init> new SolrResourceLoader for directory: '/mnt/ssd/jenkins/workspace/Lucene-Solr-trunk-Linux/solr/build/solr-core/test/J0/temp/solr.handler.TestBlobHandler 5EF763CB5B0D5D17-001/tempDir-004/collection1/'
   [junit4]   2> 454230 T2810 oasc.SolrResourceLoader.replaceClassLoader Adding 'file:/mnt/ssd/jenkins/workspace/Lucene-Solr-trunk-Linux/solr/build/solr-core/test/J0/temp/solr.handler.TestBlobHandler%205EF763CB5B0D5D17-001/tempDir-004/collection1/lib/.svn/' to classloader
   [junit4]   2> 454231 T2810 oasc.SolrResourceLoader.replaceClassLoader Adding 'file:/mnt/ssd/jenkins/workspace/Lucene-Solr-trunk-Linux/solr/build/solr-core/test/J0/temp/solr.handler.TestBlobHandler%205EF763CB5B0D5D17-001/tempDir-004/collection1/lib/classes/' to classloader
   [junit4]   2> 454231 T2810 oasc.SolrResourceLoader.replaceClassLoader Adding 'file:/mnt/ssd/jenkins/workspace/Lucene-Solr-trunk-Linux/solr/build/solr-core/test/J0/temp/solr.handler.TestBlobHandler%205EF763CB5B0D5D17-001/tempDir-004/collection1/lib/README' to classloader
   [junit4]   2> 454245 T2810 oasc.ZkController.watchZKConfDir watch zkdir /configs/conf1
   [junit4]   2> 454246 T2810 oasc.Config.<init> loaded config solrconfig.xml with version 0 
   [junit4]   2> 454251 T2810 oasc.SolrConfig.refreshRequestParams current version of requestparams : -1
   [junit4]   2> 454255 T2810 oasc.SolrConfig.<init> Using Lucene MatchVersion: 6.0.0
   [junit4]   2> 454271 T2810 oasc.SolrConfig.<init> Loaded SolrConfig: solrconfig.xml
   [junit4]   2> 454273 T2810 oass.IndexSchema.readSchema Reading Solr Schema from /configs/conf1/schema.xml
   [junit4]   2> 454277 T2810 oass.IndexSchema.readSchema [collection1] Schema name=test
   [junit4]   2> 454361 T2810 oass.OpenExchangeRatesOrgProvider.init Initialized with rates=open-exchange-rates.json, refreshInterval=1440.
   [junit4]   2> 454364 T2810 oass.IndexSchema.readSchema default search field in schema is text
   [junit4]   2> 454366 T2810 oass.IndexSchema.readSchema unique key field: id
   [junit4]   2> 454372 T2810 oass.FileExchangeRateProvider.reload Reloading exchange rates from file currency.xml
   [junit4]   2> 454374 T2810 oass.FileExchangeRateProvider.reload Reloading exchange rates from file currency.xml
   [junit4]   2> 454376 T2810 oass.OpenExchangeRatesOrgProvider.reload Reloading exchange rates from open-exchange-rates.json
   [junit4]   2> 454376 T2810 oass.OpenExchangeRatesOrgProvider$OpenExchangeRates.<init> WARN Unknown key IMPORTANT NOTE
   [junit4]   2> 454377 T2810 oass.OpenExchangeRatesOrgProvider$OpenExchangeRates.<init> WARN Expected key, got STRING
   [junit4]   2> 454377 T2810 oass.OpenExchangeRatesOrgProvider.reload Reloading exchange rates from open-exchange-rates.json
   [junit4]   2> 454378 T2810 oass.OpenExchangeRatesOrgProvider$OpenExchangeRates.<init> WARN Unknown key IMPORTANT NOTE
   [junit4]   2> 454378 T2810 oass.OpenExchangeRatesOrgProvider$OpenExchangeRates.<init> WARN Expected key, got STRING
   [junit4]   2> 454378 T2810 oasc.CoreContainer.create Creating SolrCore 'collection1' using configuration from collection collection1
   [junit4]   2> 454378 T2810 oasc.SolrCore.initDirectoryFactory org.apache.solr.core.MockDirectoryFactory
   [junit4]   2> 454379 T2810 oasc.SolrCore.<init> [collection1] Opening new SolrCore at /mnt/ssd/jenkins/workspace/Lucene-Solr-trunk-Linux/solr/build/solr-core/test/J0/temp/solr.handler.TestBlobHandler 5EF763CB5B0D5D17-001/tempDir-004/collection1/, dataDir=/mnt/ssd/jenkins/workspace/Lucene-Solr-trunk-Linux/solr/build/solr-core/test/J0/temp/solr.handler.TestBlobHandler 5EF763CB5B0D5D17-001/tempDir-001/jetty2/
   [junit4]   2> 454379 T2810 oasc.JmxMonitoredMap.<init> JMX monitoring is enabled. Adding Solr mbeans to JMX Server: com.sun.jmx.mbeanserver.JmxMBeanServer@c4919b
   [junit4]   2> 454380 T2810 oasc.CachingDirectoryFactory.get return new directory for /mnt/ssd/jenkins/workspace/Lucene-Solr-trunk-Linux/solr/build/solr-core/test/J0/temp/solr.handler.TestBlobHandler 5EF763CB5B0D5D17-001/tempDir-001/jetty2
   [junit4]   2> 454380 T2810 oasc.SolrCore.getNewIndexDir New index directory detected: old=null new=/mnt/ssd/jenkins/workspace/Lucene-Solr-trunk-Linux/solr/build/solr-core/test/J0/temp/solr.handler.TestBlobHandler 5EF763CB5B0D5D17-001/tempDir-001/jetty2/index/
   [junit4]   2> 454380 T2810 oasc.SolrCore.initIndex WARN [collection1] Solr index directory '/mnt/ssd/jenkins/workspace/Lucene-Solr-trunk-Linux/solr/build/solr-core/test/J0/temp/solr.handler.TestBlobHandler 5EF763CB5B0D5D17-001/tempDir-001/jetty2/index' doesn't exist. Creating new index...
   [junit4]   2> 454380 T2810 oasc.CachingDirectoryFactory.get return new directory for /mnt/ssd/jenkins/workspace/Lucene-Solr-trunk-Linux/solr/build/solr-core/test/J0/temp/solr.handler.TestBlobHandler 5EF763CB5B0D5D17-001/tempDir-001/jetty2/index
   [junit4]   2> 454380 T2810 oasu.RandomMergePolicy.<init> RandomMergePolicy wrapping class org.apache.lucene.index.TieredMergePolicy: [TieredMergePolicy: maxMergeAtOnce=33, maxMergeAtOnceExplicit=24, maxMergedSegmentMB=10.1513671875, floorSegmentMB=1.48828125, forceMergeDeletesPctAllowed=24.487759081372538, segmentsPerTier=37.0, maxCFSSegmentSizeMB=8.796093022207999E12, noCFSRatio=0.0
   [junit4]   2> 454381 T2810 oasc.SolrDeletionPolicy.onCommit SolrDeletionPolicy.onCommit: commits: num=1
   [junit4]   2> 		commit{dir=MockDirectoryWrapper(RAMDirectory@139c307 lockFactory=org.apache.lucene.store.SingleInstanceLockFactory@dd2120),segFN=segments_1,generation=1}
   [junit4]   2> 454381 T2810 oasc.SolrDeletionPolicy.updateCommits newest commit generation = 1
   [junit4]   2> 454383 T2810 oasup.UpdateRequestProcessorChain.init creating updateRequestProcessorChain "nodistrib"
   [junit4]   2> 454383 T2810 oasup.UpdateRequestProcessorChain.init creating updateRequestProcessorChain "dedupe"
   [junit4]   2> 454383 T2810 oasup.UpdateRequestProcessorChain.init inserting DistributedUpdateProcessorFactory into updateRequestProcessorChain "dedupe"
   [junit4]   2> 454384 T2810 oasup.UpdateRequestProcessorChain.init creating updateRequestProcessorChain "stored_sig"
   [junit4]   2> 454384 T2810 oasup.UpdateRequestProcessorChain.init inserting DistributedUpdateProcessorFactory into updateRequestProcessorChain "stored_sig"
   [junit4]   2> 454384 T2810 oasup.UpdateRequestProcessorChain.init creating updateRequestProcessorChain "distrib-dup-test-chain-explicit"
   [junit4]   2> 454384 T2810 oasup.UpdateRequestProcessorChain.init creating updateRequestProcessorChain "distrib-dup-test-chain-implicit"
   [junit4]   2> 454384 T2810 oasup.UpdateRequestProcessorChain.init inserting DistributedUpdateProcessorFactory into updateRequestProcessorChain "distrib-dup-test-chain-implicit"
   [junit4]   2> 454384 T2810 oasc.SolrCore.loadUpdateProcessorChains no updateRequestProcessorChain defined as default, creating implicit default
   [junit4]   2> 454385 T2810 oasc.RequestHandlers.initHandlersFromConfig created /update: org.apache.solr.handler.UpdateRequestHandler
   [junit4]   2> 454385 T2810 oasc.RequestHandlers.initHandlersFromConfig created /update/json: org.apache.solr.handler.UpdateRequestHandler
   [junit4]   2> 454385 T2810 oasc.RequestHandlers.initHandlersFromConfig created /update/csv: org.apache.solr.handler.UpdateRequestHandler
   [junit4]   2> 454385 T2810 oasc.RequestHandlers.initHandlersFromConfig created /update/json/docs: org.apache.solr.handler.UpdateRequestHandler
   [junit4]   2> 454386 T2810 oasc.RequestHandlers.initHandlersFromConfig created /config: org.apache.solr.handler.SolrConfigHandler
   [junit4]   2> 454386 T2810 oasc.RequestHandlers.initHandlersFromConfig created /schema: org.apache.solr.handler.SchemaHandler
   [junit4]   2> 454386 T2810 oasc.RequestHandlers.initHandlersFromConfig created /replication: org.apache.solr.handler.ReplicationHandler
   [junit4]   2> 454387 T2810 oasc.RequestHandlers.initHandlersFromConfig created /get: org.apache.solr.handler.RealTimeGetHandler
   [junit4]   2> 454387 T2810 oasc.RequestHandlers.initHandlersFromConfig created /admin/luke: org.apache.solr.handler.admin.LukeRequestHandler
   [junit4]   2> 454387 T2810 oasc.RequestHandlers.initHandlersFromConfig created /admin/system: org.apache.solr.handler.admin.SystemInfoHandler
   [junit4]   2> 454388 T2810 oasc.RequestHandlers.initHandlersFromConfig created /admin/mbeans: org.apache.solr.handler.admin.SolrInfoMBeanHandler
   [junit4]   2> 454388 T2810 oasc.RequestHandlers.initHandlersFromConfig created /admin/plugins: org.apache.solr.handler.admin.PluginInfoHandler
   [junit4]   2> 454388 T2810 oasc.RequestHandlers.initHandlersFromConfig created /admin/threads: org.apache.solr.handler.admin.ThreadDumpHandler
   [junit4]   2> 454389 T2810 oasc.RequestHandlers.initHandlersFromConfig created /admin/properties: org.apache.solr.handler.admin.PropertiesRequestHandler
   [junit4]   2> 454389 T2810 oasc.RequestHandlers.initHandlersFromConfig created /admin/logging: org.apache.solr.handler.admin.LoggingHandler
   [junit4]   2> 454389 T2810 oasc.RequestHandlers.initHandlersFromConfig created /admin/ping: org.apache.solr.handler.PingRequestHandler
   [junit4]   2> 454389 T2810 oasc.RequestHandlers.initHandlersFromConfig created standard: solr.StandardRequestHandler
   [junit4]   2> 454390 T2810 oasc.RequestHandlers.initHandlersFromConfig created /admin/file: solr.admin.ShowFileRequestHandler
   [junit4]   2> 454391 T2810 oashl.XMLLoader.init xsltCacheLifetimeSeconds=60
   [junit4]   2> 454392 T2810 oashl.XMLLoader.init xsltCacheLifetimeSeconds=60
   [junit4]   2> 454392 T2810 oashl.XMLLoader.init xsltCacheLifetimeSeconds=60
   [junit4]   2> 454393 T2810 oashl.XMLLoader.init xsltCacheLifetimeSeconds=60
   [junit4]   2> 454393 T2810 oasc.SolrCore.initStatsCache Using default statsCache cache: org.apache.solr.search.stats.LocalStatsCache
   [junit4]   2> 454394 T2810 oasu.CommitTracker.<init> Hard AutoCommit: disabled
   [junit4]   2> 454394 T2810 oasu.CommitTracker.<init> Soft AutoCommit: disabled
   [junit4]   2> 454395 T2810 oasu.RandomMergePolicy.<init> RandomMergePolicy wrapping class org.apache.lucene.index.TieredMergePolicy: [TieredMergePolicy: maxMergeAtOnce=11, maxMergeAtOnceExplicit=32, maxMergedSegmentMB=62.810546875, floorSegmentMB=0.6259765625, forceMergeDeletesPctAllowed=15.573053182320015, segmentsPerTier=17.0, maxCFSSegmentSizeMB=8.796093022207999E12, noCFSRatio=1.0
   [junit4]   2> 454395 T2810 oasc.SolrDeletionPolicy.onInit SolrDeletionPolicy.onInit: commits: num=1
   [junit4]   2> 		commit{dir=MockDirectoryWrapper(RAMDirectory@139c307 lockFactory=org.apache.lucene.store.SingleInstanceLockFactory@dd2120),segFN=segments_1,generation=1}
   [junit4]   2> 454395 T2810 oasc.SolrDeletionPolicy.updateCommits newest commit generation = 1
   [junit4]   2> 454395 T2810 oass.SolrIndexSearcher.<init> Opening Searcher@1e21044[collection1] main
   [junit4]   2> 454396 T2810 oascc.ZkStateReader.readConfigName Load collection config from:/collections/collection1
   [junit4]   2> 454396 T2810 oascc.ZkStateReader.readConfigName path=/collections/collection1 configName=conf1 specified config exists in ZooKeeper
   [junit4]   2> 454396 T2810 oasr.ManagedResourceStorage.newStorageIO Setting up ZooKeeper-based storage for the RestManager with znodeBase: /configs/conf1
   [junit4]   2> 454397 T2810 oasr.ManagedResourceStorage$ZooKeeperStorageIO.configure Configured ZooKeeperStorageIO with znodeBase: /configs/conf1
   [junit4]   2> 454397 T2810 oasr.RestManager.init Initializing RestManager with initArgs: {}
   [junit4]   2> 454397 T2810 oasr.ManagedResourceStorage.load Reading _rest_managed.json using ZooKeeperStorageIO:path=/configs/conf1
   [junit4]   2> 454397 T2810 oasr.ManagedResourceStorage$ZooKeeperStorageIO.openInputStream No data found for znode /configs/conf1/_rest_managed.json
   [junit4]   2> 454398 T2810 oasr.ManagedResourceStorage.load Loaded null at path _rest_managed.json using ZooKeeperStorageIO:path=/configs/conf1
   [junit4]   2> 454398 T2810 oasr.RestManager.init Initializing 0 registered ManagedResources
   [junit4]   2> 454398 T2810 oash.ReplicationHandler.inform Commits will be reserved for  10000
   [junit4]   2> 454398 T2811 oasc.SolrCore.registerSearcher [collection1] Registered new searcher Searcher@1e21044[collection1] main{ExitableDirectoryReader(UninvertingDirectoryReader())}
   [junit4]   2> 454399 T2810 oasc.CoreContainer.registerCore registering core: collection1
   [junit4]   2> 454399 T2814 oasc.ZkController.register Register replica - core:collection1 address:http://127.0.0.1:51142/rs/g collection:collection1 shard:s

[...truncated too long message...]

loseIndexWriter closing IndexWriter with IndexWriterCloser
   [junit4]   2> 469075 T2727 oasc.SolrCore.closeSearcher [collection1] Closing main searcher on request.
   [junit4]   2> 469077 T2902 oasc.OverseerAutoReplicaFailoverThread.<init> Starting OverseerAutoReplicaFailoverThread autoReplicaFailoverWorkLoopDelay=10000 autoReplicaFailoverWaitAfterExpiration=30000 autoReplicaFailoverBadNodeExpiration=60000
   [junit4]   2> 469078 T2911 oasc.OverseerCollectionProcessor.run Process current queue of collection creations
   [junit4]   2> 469078 T2910 oasc.Overseer$ClusterStateUpdater.run Starting to work on the main queue
   [junit4]   2> 469082 T2910 oascc.ZkStateReader.updateWatchedCollection Updating data for collection1 to ver 21 
   [junit4]   2> 469082 T2910 oasc.Overseer$ClusterStateUpdater.run processMessage: queueSize: 0, message = {
   [junit4]   2> 	  "core":"collection1",
   [junit4]   2> 	  "core_node_name":"core_node4",
   [junit4]   2> 	  "roles":null,
   [junit4]   2> 	  "base_url":"http://127.0.0.1:49347/rs/g",
   [junit4]   2> 	  "node_name":"127.0.0.1:49347_rs%2Fg",
   [junit4]   2> 	  "numShards":"2",
   [junit4]   2> 	  "state":"down",
   [junit4]   2> 	  "shard":"shard1",
   [junit4]   2> 	  "collection":"collection1",
   [junit4]   2> 	  "operation":"state"} current state version: 15
   [junit4]   2> 469083 T2910 oasco.ReplicaMutator.updateState Update state numShards=2 message={
   [junit4]   2> 	  "core":"collection1",
   [junit4]   2> 	  "core_node_name":"core_node4",
   [junit4]   2> 	  "roles":null,
   [junit4]   2> 	  "base_url":"http://127.0.0.1:49347/rs/g",
   [junit4]   2> 	  "node_name":"127.0.0.1:49347_rs%2Fg",
   [junit4]   2> 	  "numShards":"2",
   [junit4]   2> 	  "state":"down",
   [junit4]   2> 	  "shard":"shard1",
   [junit4]   2> 	  "collection":"collection1",
   [junit4]   2> 	  "operation":"state"}
   [junit4]   2> 469084 T2910 oasco.ZkStateWriter.writePendingUpdates going to update_collection /collections/collection1/state.json version: 21
   [junit4]   2> 469084 T2902 oascc.ZkStateReader$7.process A cluster state change: WatchedEvent state:SyncConnected type:NodeDataChanged path:/collections/collection1/state.json, has occurred - updating... 
   [junit4]   2> 469086 T2856 oasc.DistributedQueue$LatchWatcher.process NodeChildrenChanged fired on path /overseer/queue state SyncConnected
   [junit4]   2> 469087 T2902 oascc.ZkStateReader.updateWatchedCollection Updating data for collection1 to ver 22 
   [junit4]   2> 469090 T2727 oasc.CachingDirectoryFactory.close Closing MockDirectoryFactory - 2 directories currently being tracked
   [junit4]   2> 469090 T2727 oasc.CachingDirectoryFactory.closeCacheValue looking to close /mnt/ssd/jenkins/workspace/Lucene-Solr-trunk-Linux/solr/build/solr-core/test/J0/temp/solr.handler.TestBlobHandler 5EF763CB5B0D5D17-001/tempDir-001/jetty4/index [CachedDir<<refCount=0;path=/mnt/ssd/jenkins/workspace/Lucene-Solr-trunk-Linux/solr/build/solr-core/test/J0/temp/solr.handler.TestBlobHandler 5EF763CB5B0D5D17-001/tempDir-001/jetty4/index;done=false>>]
   [junit4]   2> 469091 T2727 oasc.CachingDirectoryFactory.close Closing directory: /mnt/ssd/jenkins/workspace/Lucene-Solr-trunk-Linux/solr/build/solr-core/test/J0/temp/solr.handler.TestBlobHandler 5EF763CB5B0D5D17-001/tempDir-001/jetty4/index
   [junit4]   2> 469091 T2727 oasc.CachingDirectoryFactory.closeCacheValue looking to close /mnt/ssd/jenkins/workspace/Lucene-Solr-trunk-Linux/solr/build/solr-core/test/J0/temp/solr.handler.TestBlobHandler 5EF763CB5B0D5D17-001/tempDir-001/jetty4 [CachedDir<<refCount=0;path=/mnt/ssd/jenkins/workspace/Lucene-Solr-trunk-Linux/solr/build/solr-core/test/J0/temp/solr.handler.TestBlobHandler 5EF763CB5B0D5D17-001/tempDir-001/jetty4;done=false>>]
   [junit4]   2> 469092 T2727 oasc.CachingDirectoryFactory.close Closing directory: /mnt/ssd/jenkins/workspace/Lucene-Solr-trunk-Linux/solr/build/solr-core/test/J0/temp/solr.handler.TestBlobHandler 5EF763CB5B0D5D17-001/tempDir-001/jetty4
   [junit4]   2> 469092 T2727 oasc.Overseer.close Overseer (id=93139940905189389-127.0.0.1:49347_rs%2Fg-n_0000000004) closing
   [junit4]   2> 469093 T2910 oasc.Overseer$ClusterStateUpdater.run Overseer Loop exiting : 127.0.0.1:49347_rs%2Fg
   [junit4]   2> 470594 T2902 oascc.ZkStateReader$3.process WARN ZooKeeper watch triggered, but Solr cannot talk to ZK
   [junit4]   2> 470596 T2727 oejs.AbstractConnector.doStop Stopped ServerConnector@13362e8{HTTP/1.1}{127.0.0.1:?}
   [junit4]   2> 470597 T2727 oejsh.ContextHandler.doStop Stopped o.e.j.s.ServletContextHandler@d612f4{/rs/g,null,UNAVAILABLE}
   [junit4]   2> 470598 T2727 oas.SolrTestCaseJ4.tearDown ###Ending testDistribSearch
   [junit4]   2> 470599 T2727 oasc.ZkTestServer.send4LetterWord connecting to 127.0.0.1:43345 43345
   [junit4]   2> 471015 T2728 oasc.ZkTestServer.send4LetterWord connecting to 127.0.0.1:43345 43345
   [junit4]   2> 471017 T2728 oasc.ZkTestServer$ZKServerMain.runFromConfig WARN Watch limit violations: 
   [junit4]   2> 	Maximum concurrent create/delete watches above limit:
   [junit4]   2> 	
   [junit4]   2> 		6	/solr/aliases.json
   [junit4]   2> 		6	/solr/clusterstate.json
   [junit4]   2> 		5	/solr/configs/conf1
   [junit4]   2> 		4	/solr/collections/collection1/state.json
   [junit4]   2> 		2	/solr/configs/.system
   [junit4]   2> 	
   [junit4]   2> 	Maximum concurrent children watches above limit:
   [junit4]   2> 	
   [junit4]   2> 		6	/solr/live_nodes
   [junit4]   2> 		5	/solr/overseer/queue
   [junit4]   2> 		5	/solr/overseer/collection-queue-work
   [junit4]   2> 	
   [junit4]   2> NOTE: reproduce with: ant test  -Dtestcase=TestBlobHandler -Dtests.method=testDistribSearch -Dtests.seed=5EF763CB5B0D5D17 -Dtests.multiplier=3 -Dtests.slow=true -Dtests.locale=th_TH_TH_#u-nu-thai -Dtests.timezone=America/Cayman -Dtests.asserts=true -Dtests.file.encoding=ISO-8859-1
   [junit4] FAILURE 23.3s J0 | TestBlobHandler.testDistribSearch <<<
   [junit4]    > Throwable #1: java.lang.AssertionError: {responseHeader={status=0, QTime=1}, response={numFound=0, start=0, docs=[]}}
   [junit4]    > 	at __randomizedtesting.SeedInfo.seed([5EF763CB5B0D5D17:DF11EDD32C523D2B]:0)
   [junit4]    > 	at org.apache.solr.handler.TestBlobHandler.doBlobHandlerTest(TestBlobHandler.java:96)
   [junit4]    > 	at org.apache.solr.handler.TestBlobHandler.doTest(TestBlobHandler.java:200)
   [junit4]    > 	at org.apache.solr.BaseDistributedSearchTestCase.testDistribSearch(BaseDistributedSearchTestCase.java:868)
   [junit4]    > 	at java.lang.Thread.run(Thread.java:745)
   [junit4]   2> 471038 T2727 oas.SolrTestCaseJ4.deleteCore ###deleteCore
   [junit4]   2> NOTE: leaving temporary files on disk at: /mnt/ssd/jenkins/workspace/Lucene-Solr-trunk-Linux/solr/build/solr-core/test/J0/temp/solr.handler.TestBlobHandler 5EF763CB5B0D5D17-001
   [junit4]   2> 23263 T2726 ccr.ThreadLeakControl.checkThreadLeaks WARNING Will linger awaiting termination of 1 leaked thread(s).
   [junit4]   2> NOTE: test params are: codec=Asserting(Lucene50): {blobName=BlockTreeOrds(blocksize=128), size=PostingsFormat(name=Direct), _version_=PostingsFormat(name=Memory doPackFST= true), id=FSTOrd50, version=BlockTreeOrds(blocksize=128), md5=PostingsFormat(name=Memory doPackFST= true), timestamp=PostingsFormat(name=Memory doPackFST= true)}, docValues:{}, sim=RandomSimilarityProvider(queryNorm=false,coord=no): {}, locale=th_TH_TH_#u-nu-thai, timezone=America/Cayman
   [junit4]   2> NOTE: Linux 3.13.0-43-generic i386/Oracle Corporation 1.8.0_40-ea (32-bit)/cpus=8,threads=1,free=220979152,total=298582016
   [junit4]   2> NOTE: All tests run in this JVM: [DistributedQueryElevationComponentTest, TestRandomDVFaceting, TestBinaryResponseWriter, CoreAdminRequestStatusTest, TestSimpleQParserPlugin, RecoveryZkTest, HdfsChaosMonkeySafeLeaderTest, RollingRestartTest, SyncSliceTest, TestImplicitCoreProperties, TestAtomicUpdateErrorCases, RequestHandlersTest, TestSolrQueryParserResource, SuggesterTest, TestCSVLoader, AsyncMigrateRouteKeyTest, IgnoreCommitOptimizeUpdateProcessorFactoryTest, TestArbitraryIndexDir, TestLMDirichletSimilarityFactory, ZkControllerTest, PreAnalyzedFieldTest, TestDistributedSearch, TestSearcherReuse, TestShortCircuitedRequests, DocumentAnalysisRequestHandlerTest, SimpleFacetsTest, DeleteInactiveReplicaTest, TestOmitPositions, SuggestComponentTest, TestPartialUpdateDeduplication, CustomCollectionTest, PathHierarchyTokenizerFactoryTest, LeaderElectionTest, DistributedSuggestComponentTest, SystemInfoHandlerTest, TestBlobHandler]
   [junit4] Completed on J0 in 23.54s, 1 test, 1 failure <<< FAILURES!

[...truncated 1153 lines...]
BUILD FAILED
/mnt/ssd/jenkins/workspace/Lucene-Solr-trunk-Linux/build.xml:519: The following error occurred while executing this line:
/mnt/ssd/jenkins/workspace/Lucene-Solr-trunk-Linux/build.xml:467: The following error occurred while executing this line:
/mnt/ssd/jenkins/workspace/Lucene-Solr-trunk-Linux/build.xml:61: The following error occurred while executing this line:
/mnt/ssd/jenkins/workspace/Lucene-Solr-trunk-Linux/extra-targets.xml:39: The following error occurred while executing this line:
/mnt/ssd/jenkins/workspace/Lucene-Solr-trunk-Linux/solr/build.xml:187: The following error occurred while executing this line:
/mnt/ssd/jenkins/workspace/Lucene-Solr-trunk-Linux/solr/common-build.xml:510: The following error occurred while executing this line:
/mnt/ssd/jenkins/workspace/Lucene-Solr-trunk-Linux/lucene/common-build.xml:1348: The following error occurred while executing this line:
/mnt/ssd/jenkins/workspace/Lucene-Solr-trunk-Linux/lucene/common-build.xml:956: There were test failures: 463 suites, 1870 tests, 1 failure, 47 ignored (21 assumptions)

Total time: 62 minutes 57 seconds
Build step 'Invoke Ant' marked build as failure
[description-setter] Description set: Java: 32bit/jdk1.8.0_40-ea-b20 -server -XX:+UseParallelGC
Archiving artifacts
Recording test results
Email was triggered for: Failure - Any
Sending email for trigger: Failure - Any