You are viewing a plain text version of this content. The canonical link for it is here.
Posted to builds@beam.apache.org by Apache Jenkins Server <je...@builds.apache.org> on 2022/02/18 00:26:27 UTC
Build failed in Jenkins: beam_PreCommit_Website_Cron #5007
See <https://ci-beam.apache.org/job/beam_PreCommit_Website_Cron/5007/display/redirect?page=changes>
Changes:
[Pablo Estrada] Simplify README for new users
[mmack] [BEAM-13563] Introducing common AWS ClientBuilderFactory to unify
[laraschmidt] Fix final allowskew error to properly handle a large allowedSkew
[noreply] [BEAM-13946] Add get_dummies(), a non-deferred column operation on
------------------------------------------
Started by timer
Running as SYSTEM
[EnvInject] - Loading node environment variables.
Building remotely on apache-beam-jenkins-12 (beam) in workspace /home/jenkins/jenkins-slave/workspace/beam_PreCommit_Website_Cron
The recommended git tool is: NONE
No credentials specified
Wiping out workspace first.
Cloning the remote Git repository
Cloning repository https://github.com/apache/beam.git
> git init /home/jenkins/jenkins-slave/workspace/beam_PreCommit_Website_Cron/src # timeout=10
Fetching upstream changes from https://github.com/apache/beam.git
> git --version # timeout=10
> git --version # 'git version 2.25.1'
> git fetch --tags --force --progress -- https://github.com/apache/beam.git +refs/heads/*:refs/remotes/origin/* # timeout=10
> git config remote.origin.url https://github.com/apache/beam.git # timeout=10
> git config --add remote.origin.fetch +refs/heads/*:refs/remotes/origin/* # timeout=10
> git config remote.origin.url https://github.com/apache/beam.git # timeout=10
Fetching upstream changes from https://github.com/apache/beam.git
> git fetch --tags --force --progress -- https://github.com/apache/beam.git +refs/heads/*:refs/remotes/origin/* +refs/pull/${ghprbPullId}/*:refs/remotes/origin/pr/${ghprbPullId}/* # timeout=10
> git rev-parse origin/master^{commit} # timeout=10
Checking out Revision c1525a49e5d713904ed0563144c039445fdd2093 (origin/master)
> git config core.sparsecheckout # timeout=10
> git checkout -f c1525a49e5d713904ed0563144c039445fdd2093 # timeout=10
Commit message: "Merge pull request #16814 from Simplify README for new users"
> git rev-list --no-walk 87dba3ac72c2785fcff505d0e03b84ce39bea8e9 # timeout=10
No emails were triggered.
[EnvInject] - Executing scripts and injecting environment variables after the SCM step.
[EnvInject] - Injecting as environment variables the properties content
SPARK_LOCAL_IP=127.0.0.1
SETUPTOOLS_USE_DISTUTILS=stdlib
[EnvInject] - Variables injected successfully.
[Gradle] - Launching build.
[src] $ /home/jenkins/jenkins-slave/workspace/beam_PreCommit_Website_Cron/src/gradlew --continue --max-workers=12 -Dorg.gradle.jvmargs=-Xms2g -Dorg.gradle.jvmargs=-Xmx4g -Dorg.gradle.vfs.watch=false -Pdocker-pull-licenses :websitePreCommit
Starting a Gradle Daemon, 3 busy Daemons could not be reused, use --status for details
Configuration on demand is an incubating feature.
> Task :buildSrc:compileJava NO-SOURCE
> Task :buildSrc:compileGroovy FROM-CACHE
> Task :buildSrc:pluginDescriptors
> Task :buildSrc:processResources
> Task :buildSrc:classes
> Task :buildSrc:jar
> Task :buildSrc:assemble
> Task :buildSrc:spotlessGroovy FROM-CACHE
> Task :buildSrc:spotlessGroovyCheck UP-TO-DATE
> Task :buildSrc:spotlessGroovyGradle FROM-CACHE
> Task :buildSrc:spotlessGroovyGradleCheck UP-TO-DATE
> Task :buildSrc:spotlessCheck UP-TO-DATE
> Task :buildSrc:pluginUnderTestMetadata
> Task :buildSrc:compileTestJava NO-SOURCE
> Task :buildSrc:compileTestGroovy NO-SOURCE
> Task :buildSrc:processTestResources NO-SOURCE
> Task :buildSrc:testClasses UP-TO-DATE
> Task :buildSrc:test NO-SOURCE
> Task :buildSrc:validatePlugins FROM-CACHE
> Task :buildSrc:check UP-TO-DATE
> Task :buildSrc:build
> Task :website:buildDockerImage
Sending build context to Docker daemon 52.44MB
Step 1/8 : FROM debian:stretch-slim
---> ed2f93606030
Step 2/8 : SHELL ["/bin/bash", "-o", "pipefail", "-e", "-u", "-x", "-c"]
---> Using cache
---> a13bcaa39328
Step 3/8 : ENV DEBIAN_FRONTEND=noninteractive LANGUAGE=C.UTF-8 LANG=C.UTF-8 LC_ALL=C.UTF-8 LC_CTYPE=C.UTF-8 LC_MESSAGES=C.UTF-8
---> Using cache
---> d2e241e06313
Step 4/8 : RUN apt-get update && apt-get install -y --no-install-recommends ca-certificates curl git gnupg2 gosu lynx && apt-get autoremove -yqq --purge && apt-get clean && rm -rf /var/lib/apt/lists/*
---> Using cache
---> 84df7342096e
Step 5/8 : RUN curl -sL https://deb.nodesource.com/setup_10.x | bash - && apt-get update && apt-get install -y --no-install-recommends nodejs && apt-get autoremove -yqq --purge && apt-get clean && rm -rf /var/lib/apt/lists/*
---> Using cache
---> 1f1ead36b4ca
Step 6/8 : RUN curl -sS https://dl.yarnpkg.com/debian/pubkey.gpg | apt-key add - && echo "deb https://dl.yarnpkg.com/debian/ stable main" | tee /etc/apt/sources.list.d/yarn.list && apt-get update && apt-get install -y --no-install-recommends yarn && apt-get autoremove -yqq --purge && apt-get clean && rm -rf /var/lib/apt/lists/*
---> Using cache
---> d23830fc3949
Step 7/8 : RUN HUGOHOME="$(mktemp -d)" && export HUGOHOME && curl -sL https://github.com/gohugoio/hugo/releases/download/v0.68.3/hugo_extended_0.68.3_Linux-64bit.tar.gz > "${HUGOHOME}/hugo.tar.gz" && tar -xzvf "${HUGOHOME}/hugo.tar.gz" hugo && mv hugo /usr/local/bin/hugo && chmod +x /usr/local/bin/hugo && rm -r "${HUGOHOME}"
---> Using cache
---> 94a6e3c58afb
Step 8/8 : WORKDIR /opt/
---> Using cache
---> ed5954ce2a8f
Successfully built ed5954ce2a8f
Successfully tagged beam-website:latest
> Task :website:createDockerContainer
> Task :website:startDockerContainer
b1ba92105a91fa106b12f9684cb0839afc37980de45a098ace42886b6d6d550a
> Task :website:setupDockerContainer
> Task :website:installDependencies
yarn install v1.22.17
warning Skipping preferred cache folder "/.cache/yarn" because it is not writable.
warning Selected the next writable cache folder in the list, will be "/tmp/.yarn-cache-1017".
[1/4] Resolving packages...
[2/4] Fetching packages...
[3/4] Linking dependencies...
[4/4] Building fresh packages...
Done in 3.51s.
> Task :website:initGitSubmodules
Submodule '.github/actions/cancel-workflow-runs' (https://github.com/potiuk/cancel-workflow-runs) registered for path '.github/actions/cancel-workflow-runs'
Submodule '.github/actions/github-push-action' (https://github.com/ad-m/github-push-action) registered for path '.github/actions/github-push-action'
Submodule '.github/actions/gradle-command-action' (https://github.com/eskatos/gradle-command-action) registered for path '.github/actions/gradle-command-action'
Submodule 'website/www/site/themes/docsy' (https://github.com/google/docsy.git) registered for path 'website/www/site/themes/docsy'
Cloning into '/opt/.github/actions/cancel-workflow-runs'...
Cloning into '/opt/.github/actions/github-push-action'...
Cloning into '/opt/.github/actions/gradle-command-action'...
Cloning into '/opt/website/www/site/themes/docsy'...
Submodule path '.github/actions/cancel-workflow-runs': checked out '953e057dc81d3458935a18d1184c386b0f6b5738'
Submodule path '.github/actions/github-push-action': checked out '057a6ba835d986bfe495dd476a6c4db1d5f9503c'
Submodule path '.github/actions/gradle-command-action': checked out '90ccf054e6b9905f30f98c938bce4c6acd323b6b'
Submodule path 'website/www/site/themes/docsy': checked out '8b786354829536454688df1e63b9cad792f68562'
Submodule 'assets/vendor/Font-Awesome' (https://github.com/FortAwesome/Font-Awesome.git) registered for path 'website/www/site/themes/docsy/assets/vendor/Font-Awesome'
Submodule 'assets/vendor/bootstrap' (https://github.com/twbs/bootstrap.git) registered for path 'website/www/site/themes/docsy/assets/vendor/bootstrap'
Cloning into '/opt/website/www/site/themes/docsy/assets/vendor/Font-Awesome'...
Cloning into '/opt/website/www/site/themes/docsy/assets/vendor/bootstrap'...
Submodule path 'website/www/site/themes/docsy/assets/vendor/Font-Awesome': checked out '538a5bc4cf7989821d052e3ff919e2bead07021c'
Submodule path 'website/www/site/themes/docsy/assets/vendor/bootstrap': checked out '3b558734382ce58b51e5fc676453bfd53bba9201'
> Task :website:buildCodeSamples
yarn run v1.22.17
warning Skipping preferred cache folder "/.cache/yarn" because it is not writable.
warning Selected the next writable cache folder in the list, will be "/tmp/.yarn-cache-1017".
$ ./build_code_samples.sh
warning Cannot find a suitable global folder. Tried these: "/usr/local, /.yarn"
Working directory: /opt/website/www
Dist directory: ./site/code_samples
mkdir: created directory './site/code_samples'
Done in 0.78s.
> Task :website:buildLocalWebsite
yarn run v1.22.17
warning Skipping preferred cache folder "/.cache/yarn" because it is not writable.
warning Selected the next writable cache folder in the list, will be "/tmp/.yarn-cache-1017".
$ cross-env HUGO_ENV=production hugo --minify -d ../dist -s site -v -d /opt/build/website/generated-local-content --config /opt/website/www/site/config.toml
warning Cannot find a suitable global folder. Tried these: "/usr/local, /.yarn"
INFO 2022/02/18 00:18:47 Using config file:
Building sites … INFO 2022/02/18 00:18:47 syncing static files to /opt/build/website/generated-local-content/
INFO 2022/02/18 00:18:51 postcss: use config file /opt/website/www/site/themes/docsy/postcss.config.js
Replace Autoprefixer browsers option to Browserslist config.
Use browserslist key in package.json or .browserslistrc file.
Using browsers option can cause errors. Browserslist config
can be used for Babel, Autoprefixer, postcss-normalize and other tools.
If you really need to use option, rename it to overrideBrowserslist.
Learn more at:
https://github.com/browserslist/browserslist#readme
https://twitter.com/browserslist
Browserslist: caniuse-lite is outdated. Please run:
npx browserslist@latest --update-db
Why you should do it regularly:
https://github.com/browserslist/browserslist#browsers-data-updating
| EN
-------------------+------
Pages | 362
Paginator pages | 0
Non-page files | 0
Static files | 278
Processed images | 0
Aliases | 132
Sitemaps | 1
Cleaned | 0
Total in 10977 ms
Done in 12.27s.
> Task :website:testWebsite
/usr/bin/lynx
Working directory: /opt/website/www
Dist directory: /opt/build/website/generated-local-content
Found 457 HTML files.
Searching links.
Found 46667 links including 2102 unique external links.
Checking links.
[=> ] 1 / 2102 [=> ] 2 / 2102 [=> ] 3 / 2102 [=> ] 4 / 2102 [=> ] 5 / 2102 curl: (22) The requested URL returned error: 403 Forbidden
http://jstorm.io/
[=> ] 6 / 2102 curl: (22) The requested URL returned error: 403 Forbidden
http://jstorm.io/QuickStart/Deploy/index.html
[=> ] 7 / 2102 [=> ] 8 / 2102 [=> ] 9 / 2102 [=> ] 10 / 2102 [=> ] 11 / 2102 [=> ] 12 / 2102 [=> ] 13 / 2102 [=> ] 14 / 2102 [=> ] 15 / 2102 [=> ] 16 / 2102 [=> ] 17 / 2102 [=> ] 18 / 2102 [=> ] 19 / 2102 [=> ] 20 / 2102 [=> ] 21 / 2102 [=> ] 22 / 2102 [=> ] 23 / 2102 [=> ] 24 / 2102 [=> ] 25 / 2102 [=> ] 26 / 2102 [=> ] 27 / 2102 [=> ] 28 / 2102 [=> ] 29 / 2102 [=> ] 30 / 2102 [=> ] 31 / 2102 [=> ] 32 / 2102 [=> ] 33 / 2102 [=> ] 34 / 2102 [=> ] 35 / 2102 [=> ] 36 / 2102 [=> ] 37 / 2102 [=> ] 38 / 2102 [=> ] 39 / 2102 [=> ] 40 / 2102 [=> ] 41 / 2102 [=> ] 42 / 2102 [=> ] 43 / 2102 [==> ] 44 / 2102 [==> ] 45 / 2102 [==> ] 46 / 2102 [==> ] 47 / 2102 [==> ] 48 / 2102 [==> ] 49 / 2102 [==> ] 50 / 2102 [==> ] 51 / 2102 [==> ] 52 / 2102 [==> ] 53 / 2102 [==> ] 54 / 2102 [==> ] 55 / 2102 [==> ] 56 / 2102 [==> ] 57 / 2102 [==> ] 58 / 2102 [==> ] 59 / 2102 [==> ] 60 / 2102 [==> ] 61 / 2102 [==> ] 62 / 2102 [==> ] 63 / 2102 [==> ] 64 / 2102 [==> ] 65 / 2102 [==> ] 66 / 2102 [==> ] 67 / 2102 [==> ] 68 / 2102 [==> ] 69 / 2102 [==> ] 70 / 2102 [==> ] 71 / 2102 [==> ] 72 / 2102 [==> ] 73 / 2102 [==> ] 74 / 2102 [==> ] 75 / 2102 [==> ] 76 / 2102 [==> ] 77 / 2102 [==> ] 78 / 2102 [==> ] 79 / 2102 [==> ] 80 / 2102 [==> ] 81 / 2102 [==> ] 82 / 2102 [==> ] 83 / 2102 [==> ] 84 / 2102 [==> ] 85 / 2102 [===> ] 86 / 2102 [===> ] 87 / 2102 [===> ] 88 / 2102 [===> ] 89 / 2102 [===> ] 90 / 2102 [===> ] 91 / 2102 [===> ] 92 / 2102 [===> ] 93 / 2102 [===> ] 94 / 2102 [===> ] 95 / 2102 [===> ] 96 / 2102 [===> ] 97 / 2102 [===> ] 98 / 2102 [===> ] 99 / 2102 [===> ] 100 / 2102 [===> ] 101 / 2102 [===> ] 102 / 2102 [===> ] 103 / 2102 [===> ] 104 / 2102 [===> ] 105 / 2102 [===> ] 106 / 2102 [===> ] 107 / 2102 [===> ] 108 / 2102 [===> ] 109 / 2102 [===> ] 110 / 2102 [===> ] 111 / 2102 [===> ] 112 / 2102 [===> ] 113 / 2102 [===> ] 114 / 2102 [===> ] 115 / 2102 [===> ] 116 / 2102 [===> ] 117 / 2102 [===> ] 118 / 2102 [===> ] 119 / 2102 [===> ] 120 / 2102 [===> ] 121 / 2102 [===> ] 122 / 2102 [===> ] 123 / 2102 [===> ] 124 / 2102 [===> ] 125 / 2102 [===> ] 126 / 2102 [===> ] 127 / 2102 [====> ] 128 / 2102 [====> ] 129 / 2102 [====> ] 130 / 2102 [====> ] 131 / 2102 [====> ] 132 / 2102 [====> ] 133 / 2102 [====> ] 134 / 2102 [====> ] 135 / 2102 [====> ] 136 / 2102 [====> ] 137 / 2102 [====> ] 138 / 2102 [====> ] 139 / 2102 [====> ] 140 / 2102 [====> ] 141 / 2102 [====> ] 142 / 2102 [====> ] 143 / 2102 [====> ] 144 / 2102 curl: (22) The requested URL returned error: 999
https://be.linkedin.com/in/mattcasters
[====> ] 145 / 2102 [====> ] 146 / 2102 [====> ] 147 / 2102 [====> ] 148 / 2102 [====> ] 149 / 2102 [====> ] 150 / 2102 [====> ] 151 / 2102 [====> ] 152 / 2102 [====> ] 153 / 2102 [====> ] 154 / 2102 [====> ] 155 / 2102 [====> ] 156 / 2102 [====> ] 157 / 2102 [====> ] 158 / 2102 [====> ] 159 / 2102 [====> ] 160 / 2102 [====> ] 161 / 2102 [====> ] 162 / 2102 [====> ] 163 / 2102 [====> ] 164 / 2102 [====> ] 165 / 2102 [====> ] 166 / 2102 [====> ] 167 / 2102 [====> ] 168 / 2102 [====> ] 169 / 2102 [=====> ] 170 / 2102 [=====> ] 171 / 2102 [=====> ] 172 / 2102 [=====> ] 173 / 2102 [=====> ] 174 / 2102 [=====> ] 175 / 2102 [=====> ] 176 / 2102 [=====> ] 177 / 2102 [=====> ] 178 / 2102 [=====> ] 179 / 2102 [=====> ] 180 / 2102 [=====> ] 181 / 2102 [=====> ] 182 / 2102 [=====> ] 183 / 2102 [=====> ] 184 / 2102 [=====> ] 185 / 2102 [=====> ] 186 / 2102 [=====> ] 187 / 2102 [=====> ] 188 / 2102 [=====> ] 189 / 2102 [=====> ] 190 / 2102 [=====> ] 191 / 2102 [=====> ] 192 / 2102 [=====> ] 193 / 2102 [=====> ] 194 / 2102 [=====> ] 195 / 2102 [=====> ] 196 / 2102 [=====> ] 197 / 2102 [=====> ] 198 / 2102 [=====> ] 199 / 2102 [=====> ] 200 / 2102 [=====> ] 201 / 2102 [=====> ] 202 / 2102 [=====> ] 203 / 2102 [=====> ] 204 / 2102 [=====> ] 205 / 2102 [=====> ] 206 / 2102 [=====> ] 207 / 2102 [=====> ] 208 / 2102 [=====> ] 209 / 2102 [=====> ] 210 / 2102 [=====> ] 211 / 2102 [======> ] 212 / 2102 [======> ] 213 / 2102 [======> ] 214 / 2102 [======> ] 215 / 2102 [======> ] 216 / 2102 [======> ] 217 / 2102 [======> ] 218 / 2102 [======> ] 219 / 2102 [======> ] 220 / 2102 [======> ] 221 / 2102 [======> ] 222 / 2102 [======> ] 223 / 2102 [======> ] 224 / 2102 [======> ] 225 / 2102 [======> ] 226 / 2102 [======> ] 227 / 2102 [======> ] 228 / 2102 [======> ] 229 / 2102 [======> ] 230 / 2102 [======> ] 231 / 2102 [======> ] 232 / 2102 [======> ] 233 / 2102 [======> ] 234 / 2102 [======> ] 235 / 2102 [======> ] 236 / 2102 [======> ] 237 / 2102 [======> ] 238 / 2102 [======> ] 239 / 2102 [======> ] 240 / 2102 [======> ] 241 / 2102 [======> ] 242 / 2102 [======> ] 243 / 2102 [======> ] 244 / 2102 [======> ] 245 / 2102 [======> ] 246 / 2102 [======> ] 247 / 2102 [======> ] 248 / 2102 [======> ] 249 / 2102 [======> ] 250 / 2102 [======> ] 251 / 2102 [======> ] 252 / 2102 [======> ] 253 / 2102 [=======> ] 254 / 2102 [=======> ] 255 / 2102 [=======> ] 256 / 2102 [=======> ] 257 / 2102 [=======> ] 258 / 2102 [=======> ] 259 / 2102 [=======> ] 260 / 2102 [=======> ] 261 / 2102 [=======> ] 262 / 2102 [=======> ] 263 / 2102 [=======> ] 264 / 2102 [=======> ] 265 / 2102 [=======> ] 266 / 2102 [=======> ] 267 / 2102 [=======> ] 268 / 2102 [=======> ] 269 / 2102 [=======> ] 270 / 2102 [=======> ] 271 / 2102 [=======> ] 272 / 2102 [=======> ] 273 / 2102 [=======> ] 274 / 2102 [=======> ] 275 / 2102 [=======> ] 276 / 2102 [=======> ] 277 / 2102 [=======> ] 278 / 2102 [=======> ] 279 / 2102 [=======> ] 280 / 2102 [=======> ] 281 / 2102 [=======> ] 282 / 2102 [=======> ] 283 / 2102 [=======> ] 284 / 2102 [=======> ] 285 / 2102 [=======> ] 286 / 2102 [=======> ] 287 / 2102 [=======> ] 288 / 2102 [=======> ] 289 / 2102 [=======> ] 290 / 2102 [=======> ] 291 / 2102 [=======> ] 292 / 2102 [=======> ] 293 / 2102 [=======> ] 294 / 2102 [=======> ] 295 / 2102 [========> ] 296 / 2102 [========> ] 297 / 2102 [========> ] 298 / 2102 [========> ] 299 / 2102 [========> ] 300 / 2102 [========> ] 301 / 2102 [========> ] 302 / 2102 [========> ] 303 / 2102 [========> ] 304 / 2102 [========> ] 305 / 2102 [========> ] 306 / 2102 [========> ] 307 / 2102 [========> ] 308 / 2102 [========> ] 309 / 2102 [========> ] 310 / 2102 [========> ] 311 / 2102 [========> ] 312 / 2102 [========> ] 313 / 2102 [========> ] 314 / 2102 [========> ] 315 / 2102 [========> ] 316 / 2102 [========> ] 317 / 2102 [========> ] 318 / 2102 [========> ] 319 / 2102 [========> ] 320 / 2102 [========> ] 321 / 2102 [========> ] 322 / 2102 [========> ] 323 / 2102 [========> ] 324 / 2102 [========> ] 325 / 2102 [========> ] 326 / 2102 [========> ] 327 / 2102 [========> ] 328 / 2102 [========> ] 329 / 2102 [========> ] 330 / 2102 [========> ] 331 / 2102 [========> ] 332 / 2102 [========> ] 333 / 2102 [========> ] 334 / 2102 [========> ] 335 / 2102 [========> ] 336 / 2102 [========> ] 337 / 2102 [=========> ] 338 / 2102 [=========> ] 339 / 2102 [=========> ] 340 / 2102 [=========> ] 341 / 2102 [=========> ] 342 / 2102 [=========> ] 343 / 2102 [=========> ] 344 / 2102 [=========> ] 345 / 2102 [=========> ] 346 / 2102 [=========> ] 347 / 2102 [=========> ] 348 / 2102 [=========> ] 349 / 2102 [=========> ] 350 / 2102 [=========> ] 351 / 2102 [=========> ] 352 / 2102 [=========> ] 353 / 2102 [=========> ] 354 / 2102 [=========> ] 355 / 2102 [=========> ] 356 / 2102 [=========> ] 357 / 2102 [=========> ] 358 / 2102 [=========> ] 359 / 2102 [=========> ] 360 / 2102 [=========> ] 361 / 2102 [=========> ] 362 / 2102 [=========> ] 363 / 2102 [=========> ] 364 / 2102 [=========> ] 365 / 2102 [=========> ] 366 / 2102 [=========> ] 367 / 2102 [=========> ] 368 / 2102 [=========> ] 369 / 2102 [=========> ] 370 / 2102 [=========> ] 371 / 2102 [=========> ] 372 / 2102 [=========> ] 373 / 2102 [=========> ] 374 / 2102 [=========> ] 375 / 2102 [=========> ] 376 / 2102 [=========> ] 377 / 2102 [=========> ] 378 / 2102 [=========> ] 379 / 2102 [==========> ] 380 / 2102 [==========> ] 381 / 2102 [==========> ] 382 / 2102 [==========> ] 383 / 2102 [==========> ] 384 / 2102 [==========> ] 385 / 2102 [==========> ] 386 / 2102 [==========> ] 387 / 2102 [==========> ] 388 / 2102 [==========> ] 389 / 2102 [==========> ] 390 / 2102 [==========> ] 391 / 2102 [==========> ] 392 / 2102 [==========> ] 393 / 2102 [==========> ] 394 / 2102 [==========> ] 395 / 2102 [==========> ] 396 / 2102 [==========> ] 397 / 2102 [==========> ] 398 / 2102 [==========> ] 399 / 2102 [==========> ] 400 / 2102 [==========> ] 401 / 2102 [==========> ] 402 / 2102 [==========> ] 403 / 2102 [==========> ] 404 / 2102 [==========> ] 405 / 2102 curl: (22) The requested URL returned error: 404
https://beam.apache.org/releases/pydoc/2.36.0/apache_beam.testing.util.html#apache_beam.testing.util.assert_that
[==========> ] 406 / 2102 [==========> ] 407 / 2102 [==========> ] 408 / 2102 [==========> ] 409 / 2102 [==========> ] 410 / 2102 [==========> ] 411 / 2102 [==========> ] 412 / 2102 [==========> ] 413 / 2102 [==========> ] 414 / 2102 [==========> ] 415 / 2102 [==========> ] 416 / 2102 [==========> ] 417 / 2102 [==========> ] 418 / 2102 [==========> ] 419 / 2102 [==========> ] 420 / 2102 [==========> ] 421 / 2102 [===========> ] 422 / 2102 [===========> ] 423 / 2102 [===========> ] 424 / 2102 [===========> ] 425 / 2102 [===========> ] 426 / 2102 [===========> ] 427 / 2102 [===========> ] 428 / 2102 [===========> ] 429 / 2102 [===========> ] 430 / 2102 [===========> ] 431 / 2102 [===========> ] 432 / 2102 [===========> ] 433 / 2102 [===========> ] 434 / 2102 [===========> ] 435 / 2102 [===========> ] 436 / 2102 [===========> ] 437 / 2102 [===========> ] 438 / 2102 [===========> ] 439 / 2102 [===========> ] 440 / 2102 [===========> ] 441 / 2102 [===========> ] 442 / 2102 [===========> ] 443 / 2102 [===========> ] 444 / 2102 [===========> ] 445 / 2102 [===========> ] 446 / 2102 [===========> ] 447 / 2102 [===========> ] 448 / 2102 [===========> ] 449 / 2102 [===========> ] 450 / 2102 [===========> ] 451 / 2102 [===========> ] 452 / 2102 [===========> ] 453 / 2102 [===========> ] 454 / 2102 [===========> ] 455 / 2102 [===========> ] 456 / 2102 [===========> ] 457 / 2102 [===========> ] 458 / 2102 [===========> ] 459 / 2102 [===========> ] 460 / 2102 [===========> ] 461 / 2102 [===========> ] 462 / 2102 [===========> ] 463 / 2102 [============> ] 464 / 2102 [============> ] 465 / 2102 [============> ] 466 / 2102 [============> ] 467 / 2102 [============> ] 468 / 2102 [============> ] 469 / 2102 [============> ] 470 / 2102 [============> ] 471 / 2102 [============> ] 472 / 2102 [============> ] 473 / 2102 [============> ] 474 / 2102 [============> ] 475 / 2102 [============> ] 476 / 2102 [============> ] 477 / 2102 [============> ] 478 / 2102 [============> ] 479 / 2102 [============> ] 480 / 2102 [============> ] 481 / 2102 [============> ] 482 / 2102 [============> ] 483 / 2102 [============> ] 484 / 2102 [============> ] 485 / 2102 [============> ] 486 / 2102 [============> ] 487 / 2102 [============> ] 488 / 2102 [============> ] 489 / 2102 [============> ] 490 / 2102 [============> ] 491 / 2102 [============> ] 492 / 2102 [============> ] 493 / 2102 [============> ] 494 / 2102 [============> ] 495 / 2102 [============> ] 496 / 2102 [============> ] 497 / 2102 [============> ] 498 / 2102 [============> ] 499 / 2102 [============> ] 500 / 2102 [============> ] 501 / 2102 [============> ] 502 / 2102 [============> ] 503 / 2102 [============> ] 504 / 2102 [============> ] 505 / 2102 [=============> ] 506 / 2102 [=============> ] 507 / 2102 [=============> ] 508 / 2102 [=============> ] 509 / 2102 [=============> ] 510 / 2102 [=============> ] 511 / 2102 [=============> ] 512 / 2102 [=============> ] 513 / 2102 [=============> ] 514 / 2102 [=============> ] 515 / 2102 [=============> ] 516 / 2102 [=============> ] 517 / 2102 [=============> ] 518 / 2102 [=============> ] 519 / 2102 [=============> ] 520 / 2102 [=============> ] 521 / 2102 [=============> ] 522 / 2102 [=============> ] 523 / 2102 [=============> ] 524 / 2102 [=============> ] 525 / 2102 [=============> ] 526 / 2102 [=============> ] 527 / 2102 [=============> ] 528 / 2102 [=============> ] 529 / 2102 [=============> ] 530 / 2102 [=============> ] 531 / 2102 [=============> ] 532 / 2102 [=============> ] 533 / 2102 [=============> ] 534 / 2102 [=============> ] 535 / 2102 [=============> ] 536 / 2102 [=============> ] 537 / 2102 [=============> ] 538 / 2102 [=============> ] 539 / 2102 [=============> ] 540 / 2102 [=============> ] 541 / 2102 [=============> ] 542 / 2102 [=============> ] 543 / 2102 [=============> ] 544 / 2102 [=============> ] 545 / 2102 [=============> ] 546 / 2102 [=============> ] 547 / 2102 [==============> ] 548 / 2102 [==============> ] 549 / 2102 [==============> ] 550 / 2102 [==============> ] 551 / 2102 [==============> ] 552 / 2102 [==============> ] 553 / 2102 [==============> ] 554 / 2102 [==============> ] 555 / 2102 FATAL: command execution failed
java.io.IOException: Backing channel 'apache-beam-jenkins-12' is disconnected.
at hudson.remoting.RemoteInvocationHandler.channelOrFail(RemoteInvocationHandler.java:216)
at hudson.remoting.RemoteInvocationHandler.invoke(RemoteInvocationHandler.java:286)
at com.sun.proxy.$Proxy126.isAlive(Unknown Source)
at hudson.Launcher$RemoteLauncher$ProcImpl.isAlive(Launcher.java:1213)
at hudson.Launcher$RemoteLauncher$ProcImpl.join(Launcher.java:1205)
at hudson.Launcher$ProcStarter.join(Launcher.java:522)
at hudson.plugins.gradle.Gradle.perform(Gradle.java:317)
at hudson.tasks.BuildStepMonitor$1.perform(BuildStepMonitor.java:20)
at hudson.model.AbstractBuild$AbstractBuildExecution.perform(AbstractBuild.java:806)
at hudson.model.Build$BuildExecution.build(Build.java:198)
at hudson.model.Build$BuildExecution.doRun(Build.java:163)
at hudson.model.AbstractBuild$AbstractBuildExecution.run(AbstractBuild.java:514)
at hudson.model.Run.execute(Run.java:1888)
at hudson.model.FreeStyleBuild.run(FreeStyleBuild.java:43)
at hudson.model.ResourceController.execute(ResourceController.java:99)
at hudson.model.Executor.run(Executor.java:432)
Caused by: java.io.IOException: Unexpected termination of the channel
at hudson.remoting.SynchronousCommandTransport$ReaderThread.run(SynchronousCommandTransport.java:75)
Caused by: java.io.EOFException
at java.io.ObjectInputStream$PeekInputStream.readFully(ObjectInputStream.java:2799)
at java.io.ObjectInputStream$BlockDataInputStream.readShort(ObjectInputStream.java:3274)
at java.io.ObjectInputStream.readStreamHeader(ObjectInputStream.java:934)
at java.io.ObjectInputStream.<init>(ObjectInputStream.java:396)
at hudson.remoting.ObjectInputStreamEx.<init>(ObjectInputStreamEx.java:49)
at hudson.remoting.Command.readFrom(Command.java:142)
at hudson.remoting.Command.readFrom(Command.java:128)
at hudson.remoting.AbstractSynchronousByteArrayCommandTransport.read(AbstractSynchronousByteArrayCommandTransport.java:35)
at hudson.remoting.SynchronousCommandTransport$ReaderThread.run(SynchronousCommandTransport.java:61)
Build step 'Invoke Gradle script' changed build result to FAILURE
Build step 'Invoke Gradle script' marked build as failure
ERROR: apache-beam-jenkins-12 is offline; cannot locate jdk_1.8_latest
---------------------------------------------------------------------
To unsubscribe, e-mail: builds-unsubscribe@beam.apache.org
For additional commands, e-mail: builds-help@beam.apache.org