You are viewing a plain text version of this content. The canonical link for it is here.
Posted to oak-dev@jackrabbit.apache.org by Apache Jenkins Server <je...@builds.apache.org> on 2017/04/20 09:10:35 UTC

BUILD FAILURE: Jackrabbit Oak - Build # 196 - Still Failing

The Apache Jenkins build system has built Jackrabbit Oak (build #196)

Status: Still Failing

Check console output at https://builds.apache.org/job/Jackrabbit%20Oak/196/ to view the results.

Changes:
[mduerig] OAK-6106: Excessive memory usage by the caches segment references
Test case

 

Test results:
No tests ran.

BUILD FAILURE: Jackrabbit Oak - Build # 201 - Still Failing

Posted by Apache Jenkins Server <je...@builds.apache.org>.
The Apache Jenkins build system has built Jackrabbit Oak (build #201)

Status: Still Failing

Check console output at https://builds.apache.org/job/Jackrabbit%20Oak/201/ to view the results.

Changes:
No changes
 

Test results:
No tests ran.

BUILD FAILURE: Jackrabbit Oak - Build # 200 - Still Failing

Posted by Apache Jenkins Server <je...@builds.apache.org>.
The Apache Jenkins build system has built Jackrabbit Oak (build #200)

Status: Still Failing

Check console output at https://builds.apache.org/job/Jackrabbit%20Oak/200/ to view the results.

Changes:
No changes
 

Test results:
No tests ran.

BUILD FAILURE: Jackrabbit Oak - Build # 199 - Still Failing

Posted by Apache Jenkins Server <je...@builds.apache.org>.
The Apache Jenkins build system has built Jackrabbit Oak (build #199)

Status: Still Failing

Check console output at https://builds.apache.org/job/Jackrabbit%20Oak/199/ to view the results.

Changes:
No changes
 

Test results:
No tests ran.

BUILD FAILURE: Jackrabbit Oak - Build # 198 - Still Failing

Posted by Apache Jenkins Server <je...@builds.apache.org>.
The Apache Jenkins build system has built Jackrabbit Oak (build #198)

Status: Still Failing

Check console output at https://builds.apache.org/job/Jackrabbit%20Oak/198/ to view the results.

Changes:
[reschke] OAK-6098: update maven plugins

maven-assembly-plugin

 

Test results:
No tests ran.

BUILD FAILURE: Jackrabbit Oak - Build # 197 - Still Failing

Posted by Apache Jenkins Server <je...@builds.apache.org>.
The Apache Jenkins build system has built Jackrabbit Oak (build #197)

Status: Still Failing

Check console output at https://builds.apache.org/job/Jackrabbit%20Oak/197/ to view the results.

Changes:
[angela] minor improvement to oak-commons-run: add private constructor to utilities and remove unused imports

 

Test results:
No tests ran.