You are viewing a plain text version of this content. The canonical link for it is here.
Posted to notifications@maven.apache.org by Hudson <Hu...@sonatype.org> on 2008/07/25 00:36:05 UTC
Build failed in Hudson: Maven-Plugins » Maven Site Plugin #91
See http://ci.sonatype.org/job/Maven-Plugins/org.apache.maven.plugins$maven-site-plugin/91/changes
------------------------------------------
[INFO] ------------------------------------------------------------------------
[INFO] Building Maven Site Plugin
[INFO] task-segment: [clean, deploy]
[INFO] ------------------------------------------------------------------------
[INFO] [clean:clean]
[INFO] Deleting directory http://ci.sonatype.org/job/Maven-Plugins/org.apache.maven.plugins$maven-site-plugin/ws/target
[INFO] [plugin:helpmojo {execution: generated-helpmojo}]
[INFO] Using 2 extractors.
[INFO] Applying extractor for language: java
[INFO] Extractor for language: java found 7 mojo descriptors.
[INFO] Applying extractor for language: bsh
[INFO] Extractor for language: bsh found 0 mojo descriptors.
[INFO] [plugin:descriptor]
[INFO] Using 2 extractors.
[INFO] Applying extractor for language: java
[INFO] Extractor for language: java found 8 mojo descriptors.
[INFO] Applying extractor for language: bsh
[INFO] Extractor for language: bsh found 0 mojo descriptors.
[INFO] [remote-resources:process {execution: default}]
[INFO] [resources:resources]
[INFO] Using default encoding to copy filtered resources.
[INFO] [compiler:compile]
[INFO] Compiling 45 source files to http://ci.sonatype.org/job/Maven-Plugins/org.apache.maven.plugins$maven-site-plugin/ws/target/classes
[INFO] [resources:testResources]
[INFO] Using default encoding to copy filtered resources.
[INFO] [compiler:testCompile]
[INFO] Compiling 3 source files to http://ci.sonatype.org/job/Maven-Plugins/org.apache.maven.plugins$maven-site-plugin/ws/target/test-classes
[INFO] [surefire:test]
[INFO] Surefire report directory: http://ci.sonatype.org/job/Maven-Plugins/org.apache.maven.plugins$maven-site-plugin/ws/target/surefire-reports
-------------------------------------------------------
T E S T S
-------------------------------------------------------
Running org.apache.maven.plugins.site.SiteMojoTest
Tests run: 1, Failures: 0, Errors: 0, Skipped: 0, Time elapsed: 0.941 sec
Running org.apache.maven.plugins.site.SiteDeployMojoTest
Tests run: 11, Failures: 0, Errors: 0, Skipped: 0, Time elapsed: 0.028 sec
Results :
Tests run: 12, Failures: 0, Errors: 0, Skipped: 0
[HUDSON] Recording test results
[INFO] [jar:jar]
[INFO] Building jar: http://ci.sonatype.org/job/Maven-Plugins/org.apache.maven.plugins$maven-site-plugin/ws/target/maven-site-plugin-2.0-beta-8-SNAPSHOT.jar
[INFO] [plugin:addPluginArtifactMetadata]
[INFO] [invoker:install {execution: integration-test}]
[INFO] Installing http://ci.sonatype.org/job/Maven-Plugins/org.apache.maven.plugins$maven-site-plugin/ws/pom.xml to http://ci.sonatype.org/job/Maven-Plugins/org.apache.maven.plugins$maven-site-plugin/ws/target/local-repo/org/apache/maven/plugins/maven-site-plugin/2.0-beta-8-SNAPSHOT/maven-site-plugin-2.0-beta-8-SNAPSHOT.pom
[INFO] Installing http://ci.sonatype.org/job/Maven-Plugins/org.apache.maven.plugins$maven-site-plugin/ws/target/maven-site-plugin-2.0-beta-8-SNAPSHOT.jar to http://ci.sonatype.org/job/Maven-Plugins/org.apache.maven.plugins$maven-site-plugin/ws/target/local-repo/org/apache/maven/plugins/maven-site-plugin/2.0-beta-8-SNAPSHOT/maven-site-plugin-2.0-beta-8-SNAPSHOT.jar
[INFO] [invoker:run {execution: integration-test}]
[WARNING] File encoding has not been set, using platform encoding ANSI_X3.4-1968, i.e. build is platform dependent!
[INFO] Building: MSITE-265/pom.xml
[INFO] ...FAILED[code=1]. See http://ci.sonatype.org/job/Maven-Plugins/org.apache.maven.plugins$maven-site-plugin/ws/src/it/MSITE-265/build.log for details.
[INFO]
---------------------------------------
Execution Summary:
Builds Passing: 0
Builds Failing: 1
---------------------------------------
The following builds failed:
* MSITE-265/pom.xml
[HUDSON] Archiving http://ci.sonatype.org/job/Maven-Plugins/org.apache.maven.plugins$maven-site-plugin/ws/pom.xml to /home/j2ee-hudson/.hudson/jobs/Maven-Plugins/modules/org.apache.maven.plugins$maven-site-plugin/builds/2008-07-24_16-48-30/archive/org.apache.maven.plugins/maven-site-plugin/2.0-beta-8-SNAPSHOT/pom.xml
[HUDSON] Archiving http://ci.sonatype.org/job/Maven-Plugins/org.apache.maven.plugins$maven-site-plugin/ws/target/maven-site-plugin-2.0-beta-8-SNAPSHOT.jar to /home/j2ee-hudson/.hudson/jobs/Maven-Plugins/modules/org.apache.maven.plugins$maven-site-plugin/builds/2008-07-24_16-48-30/archive/org.apache.maven.plugins/maven-site-plugin/2.0-beta-8-SNAPSHOT/maven-site-plugin-2.0-beta-8-SNAPSHOT.jar
Build failed in Hudson: Maven-Plugins » Maven Site Plugin #93
Posted by Hudson <Hu...@sonatype.org>.
See http://ci.sonatype.org/job/Maven-Plugins/org.apache.maven.plugins$maven-site-plugin/93/changes
------------------------------------------
[INFO] ------------------------------------------------------------------------
[INFO] Building Maven Site Plugin
[INFO] task-segment: [clean, deploy]
[INFO] ------------------------------------------------------------------------
[INFO] [clean:clean]
[INFO] Deleting directory http://ci.sonatype.org/job/Maven-Plugins/org.apache.maven.plugins$maven-site-plugin/ws/target
[INFO] [plugin:helpmojo {execution: generated-helpmojo}]
[INFO] Using 2 extractors.
[INFO] Applying extractor for language: java
[INFO] Extractor for language: java found 7 mojo descriptors.
[INFO] Applying extractor for language: bsh
[INFO] Extractor for language: bsh found 0 mojo descriptors.
[INFO] [plugin:descriptor]
[INFO] Using 2 extractors.
[INFO] Applying extractor for language: java
[INFO] Extractor for language: java found 8 mojo descriptors.
[INFO] Applying extractor for language: bsh
[INFO] Extractor for language: bsh found 0 mojo descriptors.
[INFO] [remote-resources:process {execution: default}]
[INFO] [resources:resources]
[INFO] Using default encoding to copy filtered resources.
[INFO] [compiler:compile]
[INFO] Compiling 45 source files to http://ci.sonatype.org/job/Maven-Plugins/org.apache.maven.plugins$maven-site-plugin/ws/target/classes
[INFO] [resources:testResources]
[INFO] Using default encoding to copy filtered resources.
[INFO] [compiler:testCompile]
[INFO] Compiling 3 source files to http://ci.sonatype.org/job/Maven-Plugins/org.apache.maven.plugins$maven-site-plugin/ws/target/test-classes
[INFO] [surefire:test]
[INFO] Surefire report directory: http://ci.sonatype.org/job/Maven-Plugins/org.apache.maven.plugins$maven-site-plugin/ws/target/surefire-reports
-------------------------------------------------------
T E S T S
-------------------------------------------------------
Running org.apache.maven.plugins.site.SiteMojoTest
Tests run: 1, Failures: 0, Errors: 0, Skipped: 0, Time elapsed: 0.931 sec
Running org.apache.maven.plugins.site.SiteDeployMojoTest
Tests run: 11, Failures: 0, Errors: 0, Skipped: 0, Time elapsed: 0.028 sec
Results :
Tests run: 12, Failures: 0, Errors: 0, Skipped: 0
[HUDSON] Recording test results
[INFO] [jar:jar]
[INFO] Building jar: http://ci.sonatype.org/job/Maven-Plugins/org.apache.maven.plugins$maven-site-plugin/ws/target/maven-site-plugin-2.0-beta-8-SNAPSHOT.jar
[INFO] [plugin:addPluginArtifactMetadata]
[INFO] [invoker:install {execution: integration-test}]
[INFO] Installing http://ci.sonatype.org/job/Maven-Plugins/org.apache.maven.plugins$maven-site-plugin/ws/pom.xml to http://ci.sonatype.org/job/Maven-Plugins/org.apache.maven.plugins$maven-site-plugin/ws/target/local-repo/org/apache/maven/plugins/maven-site-plugin/2.0-beta-8-SNAPSHOT/maven-site-plugin-2.0-beta-8-SNAPSHOT.pom
[INFO] Installing http://ci.sonatype.org/job/Maven-Plugins/org.apache.maven.plugins$maven-site-plugin/ws/target/maven-site-plugin-2.0-beta-8-SNAPSHOT.jar to http://ci.sonatype.org/job/Maven-Plugins/org.apache.maven.plugins$maven-site-plugin/ws/target/local-repo/org/apache/maven/plugins/maven-site-plugin/2.0-beta-8-SNAPSHOT/maven-site-plugin-2.0-beta-8-SNAPSHOT.jar
[INFO] [invoker:run {execution: integration-test}]
[WARNING] File encoding has not been set, using platform encoding ANSI_X3.4-1968, i.e. build is platform dependent!
[INFO] Building: MSITE-265/pom.xml
[INFO] ...FAILED[code=1]. See http://ci.sonatype.org/job/Maven-Plugins/org.apache.maven.plugins$maven-site-plugin/ws/src/it/MSITE-265/build.log for details.
[INFO]
---------------------------------------
Execution Summary:
Builds Passing: 0
Builds Failing: 1
---------------------------------------
The following builds failed:
* MSITE-265/pom.xml
[HUDSON] Archiving http://ci.sonatype.org/job/Maven-Plugins/org.apache.maven.plugins$maven-site-plugin/ws/pom.xml to /home/j2ee-hudson/.hudson/jobs/Maven-Plugins/modules/org.apache.maven.plugins$maven-site-plugin/builds/2008-07-24_19-31-30/archive/org.apache.maven.plugins/maven-site-plugin/2.0-beta-8-SNAPSHOT/pom.xml
[HUDSON] Archiving http://ci.sonatype.org/job/Maven-Plugins/org.apache.maven.plugins$maven-site-plugin/ws/target/maven-site-plugin-2.0-beta-8-SNAPSHOT.jar to /home/j2ee-hudson/.hudson/jobs/Maven-Plugins/modules/org.apache.maven.plugins$maven-site-plugin/builds/2008-07-24_19-31-30/archive/org.apache.maven.plugins/maven-site-plugin/2.0-beta-8-SNAPSHOT/maven-site-plugin-2.0-beta-8-SNAPSHOT.jar
Build failed in Hudson: Maven-Plugins » Maven Site Plugin #92
Posted by Hudson <Hu...@sonatype.org>.
See http://ci.sonatype.org/job/Maven-Plugins/org.apache.maven.plugins$maven-site-plugin/92/changes
------------------------------------------
[INFO] ------------------------------------------------------------------------
[INFO] Building Maven Site Plugin
[INFO] task-segment: [clean, deploy]
[INFO] ------------------------------------------------------------------------
[INFO] [clean:clean]
[INFO] Deleting directory http://ci.sonatype.org/job/Maven-Plugins/org.apache.maven.plugins$maven-site-plugin/ws/target
[INFO] [plugin:helpmojo {execution: generated-helpmojo}]
[INFO] Using 2 extractors.
[INFO] Applying extractor for language: java
[INFO] Extractor for language: java found 7 mojo descriptors.
[INFO] Applying extractor for language: bsh
[INFO] Extractor for language: bsh found 0 mojo descriptors.
[INFO] [plugin:descriptor]
[INFO] Using 2 extractors.
[INFO] Applying extractor for language: java
[INFO] Extractor for language: java found 8 mojo descriptors.
[INFO] Applying extractor for language: bsh
[INFO] Extractor for language: bsh found 0 mojo descriptors.
[INFO] [remote-resources:process {execution: default}]
[INFO] [resources:resources]
[INFO] Using default encoding to copy filtered resources.
[INFO] [compiler:compile]
[INFO] Compiling 45 source files to http://ci.sonatype.org/job/Maven-Plugins/org.apache.maven.plugins$maven-site-plugin/ws/target/classes
[INFO] [resources:testResources]
[INFO] Using default encoding to copy filtered resources.
[INFO] [compiler:testCompile]
[INFO] Compiling 3 source files to http://ci.sonatype.org/job/Maven-Plugins/org.apache.maven.plugins$maven-site-plugin/ws/target/test-classes
[INFO] [surefire:test]
[INFO] Surefire report directory: http://ci.sonatype.org/job/Maven-Plugins/org.apache.maven.plugins$maven-site-plugin/ws/target/surefire-reports
-------------------------------------------------------
T E S T S
-------------------------------------------------------
Running org.apache.maven.plugins.site.SiteMojoTest
Tests run: 1, Failures: 0, Errors: 0, Skipped: 0, Time elapsed: 0.931 sec
Running org.apache.maven.plugins.site.SiteDeployMojoTest
Tests run: 11, Failures: 0, Errors: 0, Skipped: 0, Time elapsed: 0.029 sec
Results :
Tests run: 12, Failures: 0, Errors: 0, Skipped: 0
[HUDSON] Recording test results
[INFO] [jar:jar]
[INFO] Building jar: http://ci.sonatype.org/job/Maven-Plugins/org.apache.maven.plugins$maven-site-plugin/ws/target/maven-site-plugin-2.0-beta-8-SNAPSHOT.jar
[INFO] [plugin:addPluginArtifactMetadata]
[INFO] [invoker:install {execution: integration-test}]
[INFO] Installing http://ci.sonatype.org/job/Maven-Plugins/org.apache.maven.plugins$maven-site-plugin/ws/pom.xml to http://ci.sonatype.org/job/Maven-Plugins/org.apache.maven.plugins$maven-site-plugin/ws/target/local-repo/org/apache/maven/plugins/maven-site-plugin/2.0-beta-8-SNAPSHOT/maven-site-plugin-2.0-beta-8-SNAPSHOT.pom
[INFO] Installing http://ci.sonatype.org/job/Maven-Plugins/org.apache.maven.plugins$maven-site-plugin/ws/target/maven-site-plugin-2.0-beta-8-SNAPSHOT.jar to http://ci.sonatype.org/job/Maven-Plugins/org.apache.maven.plugins$maven-site-plugin/ws/target/local-repo/org/apache/maven/plugins/maven-site-plugin/2.0-beta-8-SNAPSHOT/maven-site-plugin-2.0-beta-8-SNAPSHOT.jar
[INFO] [invoker:run {execution: integration-test}]
[WARNING] File encoding has not been set, using platform encoding ANSI_X3.4-1968, i.e. build is platform dependent!
[INFO] Building: MSITE-265/pom.xml
[INFO] ...FAILED[code=1]. See http://ci.sonatype.org/job/Maven-Plugins/org.apache.maven.plugins$maven-site-plugin/ws/src/it/MSITE-265/build.log for details.
[INFO]
---------------------------------------
Execution Summary:
Builds Passing: 0
Builds Failing: 1
---------------------------------------
The following builds failed:
* MSITE-265/pom.xml
[HUDSON] Archiving http://ci.sonatype.org/job/Maven-Plugins/org.apache.maven.plugins$maven-site-plugin/ws/pom.xml to /home/j2ee-hudson/.hudson/jobs/Maven-Plugins/modules/org.apache.maven.plugins$maven-site-plugin/builds/2008-07-24_18-35-52/archive/org.apache.maven.plugins/maven-site-plugin/2.0-beta-8-SNAPSHOT/pom.xml
[HUDSON] Archiving http://ci.sonatype.org/job/Maven-Plugins/org.apache.maven.plugins$maven-site-plugin/ws/target/maven-site-plugin-2.0-beta-8-SNAPSHOT.jar to /home/j2ee-hudson/.hudson/jobs/Maven-Plugins/modules/org.apache.maven.plugins$maven-site-plugin/builds/2008-07-24_18-35-52/archive/org.apache.maven.plugins/maven-site-plugin/2.0-beta-8-SNAPSHOT/maven-site-plugin-2.0-beta-8-SNAPSHOT.jar