You are viewing a plain text version of this content. The canonical link for it is here.
Posted to dev@geode.apache.org by Apache Jenkins Server <je...@builds.apache.org> on 2017/10/30 19:47:48 UTC
Build failed in Jenkins: Geode-nightly #999
See <https://builds.apache.org/job/Geode-nightly/999/display/redirect>
------------------------------------------
[...truncated 126.23 KB...]
org.apache.shiro.authz.UnauthorizedException: Subject does not have permission [DATA:READ:testRegion:key3]
7654 tests completed, 1 failed, 509 skipped
:geode-core:distributedTest FAILED
:geode-core:integrationTest
:geode-cq:assemble
:geode-cq:compileTestJavaNote: Some input files use or override a deprecated API.
Note: Recompile with -Xlint:deprecation for details.
Note: Some input files use unchecked or unsafe operations.
Note: Recompile with -Xlint:unchecked for details.
:geode-cq:processTestResources
:geode-cq:testClasses
:geode-cq:checkMissedTests
:geode-cq:spotlessJavaCheck
:geode-cq:spotlessCheck
:geode-cq:test
:geode-cq:check
:geode-cq:build
:geode-cq:distributedTest
:geode-cq:integrationTest
:geode-json:assemble
:geode-json:compileTestJava NO-SOURCE
:geode-json:processTestResources
:geode-json:testClasses
:geode-json:checkMissedTests NO-SOURCE
:geode-json:spotlessJavaCheck
:geode-json:spotlessCheck
:geode-json:test NO-SOURCE
:geode-json:check
:geode-json:build
:geode-json:distributedTest NO-SOURCE
:geode-json:integrationTest NO-SOURCE
:geode-junit:javadoc
:geode-junit:javadocJar
:geode-junit:sourcesJar
:geode-junit:signArchives SKIPPED
:geode-junit:assemble
:geode-junit:compileTestJavaNote: <https://builds.apache.org/job/Geode-nightly/ws/geode-junit/src/test/java/org/apache/geode/test/compiler/JarBuilderTest.java> uses or overrides a deprecated API.
Note: Recompile with -Xlint:deprecation for details.
Note: <https://builds.apache.org/job/Geode-nightly/ws/geode-junit/src/test/java/org/apache/geode/test/compiler/ClassNameExtractorTest.java> uses unchecked or unsafe operations.
Note: Recompile with -Xlint:unchecked for details.
:geode-junit:processTestResources
:geode-junit:testClasses
:geode-junit:checkMissedTests
:geode-junit:spotlessJavaCheck
:geode-junit:spotlessCheck
:geode-junit:test
:geode-junit:check
:geode-junit:build
:geode-junit:distributedTest
:geode-junit:integrationTest
:geode-lucene:assemble
:geode-lucene:compileTestJavaNote: Some input files use or override a deprecated API.
Note: Recompile with -Xlint:deprecation for details.
Note: Some input files use unchecked or unsafe operations.
Note: Recompile with -Xlint:unchecked for details.
:geode-lucene:processTestResources
:geode-lucene:testClasses
:geode-lucene:checkMissedTests
:geode-lucene:spotlessJavaCheck
:geode-lucene:spotlessCheck
:geode-lucene:test
:geode-lucene:check
:geode-lucene:build
:geode-lucene:distributedTest
:geode-lucene:integrationTest
:geode-old-client-support:assemble
:geode-old-client-support:compileTestJavaNote: <https://builds.apache.org/job/Geode-nightly/ws/geode-old-client-support/src/test/java/com/gemstone/gemfire/cache/execute/FunctionExceptionTest.java> uses or overrides a deprecated API.
Note: Recompile with -Xlint:deprecation for details.
:geode-old-client-support:processTestResources NO-SOURCE
:geode-old-client-support:testClasses
:geode-old-client-support:checkMissedTests
:geode-old-client-support:spotlessJavaCheck
:geode-old-client-support:spotlessCheck
:geode-old-client-support:test
:geode-old-client-support:check
:geode-old-client-support:build
:geode-old-client-support:distributedTest
:geode-old-client-support:integrationTest
:geode-old-versions:distributedTest NO-SOURCE
:geode-old-versions:integrationTest NO-SOURCE
:geode-protobuf:assemble
:geode-protobuf:extractIncludeTestProto
:geode-protobuf:extractTestProto UP-TO-DATE
:geode-protobuf:generateTestProto NO-SOURCE
:geode-protobuf:compileTestJavaNote: Some input files use or override a deprecated API.
Note: Recompile with -Xlint:deprecation for details.
Note: Some input files use unchecked or unsafe operations.
Note: Recompile with -Xlint:unchecked for details.
:geode-protobuf:processTestResources
:geode-protobuf:testClasses
:geode-protobuf:checkMissedTests
:geode-protobuf:spotlessJavaCheck
:geode-protobuf:spotlessCheck
:geode-protobuf:test
:geode-protobuf:check
:geode-protobuf:build
:geode-protobuf:distributedTest
:geode-protobuf:integrationTest
:geode-pulse:assemble
:geode-pulse:compileTestJavaNote: Some input files use or override a deprecated API.
Note: Recompile with -Xlint:deprecation for details.
Note: <https://builds.apache.org/job/Geode-nightly/ws/geode-pulse/src/test/java/org/apache/geode/tools/pulse/controllers/PulseControllerJUnitTest.java> uses unchecked or unsafe operations.
Note: Recompile with -Xlint:unchecked for details.
:geode-pulse:processTestResources
:geode-pulse:testClasses
:geode-pulse:checkMissedTests
:geode-pulse:spotlessJavaCheck
:geode-pulse:spotlessCheck
:geode-pulse:test
:geode-pulse:check
:geode-pulse:build
:geode-pulse:distributedTest
:geode-pulse:integrationTest
:geode-rebalancer:assemble
:geode-rebalancer:compileTestJava
:geode-rebalancer:processTestResources NO-SOURCE
:geode-rebalancer:testClasses
:geode-rebalancer:checkMissedTests
:geode-rebalancer:spotlessJavaCheck
:geode-rebalancer:spotlessCheck
:geode-rebalancer:test
:geode-rebalancer:check
:geode-rebalancer:build
:geode-rebalancer:distributedTest
:geode-rebalancer:integrationTest
:geode-wan:assemble
:geode-wan:compileTestJavaNote: Some input files use or override a deprecated API.
Note: Recompile with -Xlint:deprecation for details.
Note: Some input files use unchecked or unsafe operations.
Note: Recompile with -Xlint:unchecked for details.
:geode-wan:processTestResources
:geode-wan:testClasses
:geode-wan:checkMissedTests
:geode-wan:spotlessJavaCheck
:geode-wan:spotlessCheck
:geode-wan:test
:geode-wan:check
:geode-wan:build
:geode-wan:distributedTest
:geode-wan:integrationTest
:geode-web:assemble
:geode-web:compileTestJavaNote: Some input files use or override a deprecated API.
Note: Recompile with -Xlint:deprecation for details.
:geode-web:processTestResources NO-SOURCE
:geode-web:testClasses
:geode-web:checkMissedTests
:geode-web:spotlessJavaCheck
:geode-web:spotlessCheck
:geode-web:test
:geode-web:check
:geode-web:build
:geode-web:distributedTest
:geode-web:integrationTest
:geode-web-api:assemble
:geode-web-api:compileTestJava
:geode-web-api:processTestResources NO-SOURCE
:geode-web-api:testClasses
:geode-web-api:checkMissedTests
:geode-web-api:spotlessJavaCheck
:geode-web-api:spotlessCheck
:geode-web-api:test
:geode-web-api:check
:geode-web-api:build
:geode-web-api:distributedTest
:geode-web-api:integrationTest
:combineReports
All test reports at <https://builds.apache.org/job/Geode-nightly/ws/build/reports/combined>
:extensions/geode-modules:precheckin
:extensions/geode-modules-assembly:precheckin
:extensions/geode-modules-session:precheckin
:extensions/geode-modules-session-internal:precheckin
:extensions/geode-modules-tomcat7:precheckin
:extensions/geode-modules-tomcat8:precheckin
:extensions/session-testing-war:precheckin
:geode-assembly:precheckin
:geode-benchmarks:precheckin
:geode-client-protocol:precheckin
:geode-common:precheckin
:geode-concurrency-test:precheckin
:geode-cq:precheckin
:geode-json:precheckin
:geode-junit:precheckin
:geode-lucene:precheckin
:geode-old-client-support:precheckin
:geode-old-versions:precheckin
:geode-protobuf:precheckin
:geode-pulse:precheckin
:geode-rebalancer:precheckin
:geode-wan:precheckin
:geode-web:precheckin
:geode-web-api:precheckin
:compileJava NO-SOURCE
:processResources NO-SOURCE
:classes UP-TO-DATE
:jar
:uploadArchives
:extensions/geode-modules:uploadArchives SKIPPED
:extensions/geode-modules-assembly:uploadArchives
:extensions/geode-modules-session:uploadArchives SKIPPED
:extensions/geode-modules-session-internal:uploadArchives SKIPPED
:extensions/geode-modules-tomcat7:uploadArchives SKIPPED
:extensions/geode-modules-tomcat8:uploadArchives SKIPPED
:extensions/session-testing-war:uploadArchives SKIPPED
:geode-assembly:uploadArchives
:geode-benchmarks:uploadArchives SKIPPED
:geode-client-protocol:uploadArchives
:geode-common:uploadArchives
:geode-concurrency-test:uploadArchives
:geode-core:uploadArchives
:geode-cq:uploadArchives
:geode-json:uploadArchives
:geode-junit:uploadArchives
:geode-lucene:uploadArchives
:geode-old-client-support:uploadArchives
:geode-old-versions:uploadArchives SKIPPED
:geode-protobuf:uploadArchives
:geode-pulse:uploadArchives
:geode-rebalancer:uploadArchives
:geode-wan:uploadArchives
:geode-web:uploadArchives
:geode-web-api:uploadArchives
FAILURE: Build failed with an exception.
* What went wrong:
Execution failed for task ':geode-core:distributedTest'.
> There were failing tests. See the report at: file://<https://builds.apache.org/job/Geode-nightly/ws/geode-core/build/reports/distributedTest/index.html>
* Try:
Run with --stacktrace option to get the stack trace. Run with --info or --debug option to get more log output.
BUILD FAILED
Total time: 16 hrs 2 mins 36.483 secs
Build step 'Invoke Gradle script' changed build result to FAILURE
Build step 'Invoke Gradle script' marked build as failure
Archiving artifacts
[Fast Archiver] Compressed 336.22 MB of artifacts by 36.9% relative to #996
Recording test results
Not sending mail to unregistered user github@nakomis.com
Build failed in Jenkins: Geode-nightly #1004
Posted by Apache Jenkins Server <je...@builds.apache.org>.
See <https://builds.apache.org/job/Geode-nightly/1004/display/redirect>
------------------------------------------
[...truncated 142.70 KB...]
:geode-core:distributedTest
:geode-core:integrationTest
:geode-cq:assemble
:geode-cq:compileTestJavaNote: Some input files use or override a deprecated API.
Note: Recompile with -Xlint:deprecation for details.
Note: Some input files use unchecked or unsafe operations.
Note: Recompile with -Xlint:unchecked for details.
:geode-cq:processTestResources
:geode-cq:testClasses
:geode-cq:checkMissedTests
:geode-cq:spotlessJavaCheck
:geode-cq:spotlessCheck
:geode-cq:test
:geode-cq:check
:geode-cq:build
:geode-cq:distributedTest
:geode-cq:integrationTest
:geode-json:assemble
:geode-json:compileTestJava NO-SOURCE
:geode-json:processTestResources
:geode-json:testClasses
:geode-json:checkMissedTests NO-SOURCE
:geode-json:spotlessJavaCheck
:geode-json:spotlessCheck
:geode-json:test NO-SOURCE
:geode-json:check
:geode-json:build
:geode-json:distributedTest NO-SOURCE
:geode-json:integrationTest NO-SOURCE
:geode-junit:javadoc
:geode-junit:javadocJar
:geode-junit:sourcesJar
:geode-junit:signArchives SKIPPED
:geode-junit:assemble
:geode-junit:compileTestJavaNote: <https://builds.apache.org/job/Geode-nightly/ws/geode-junit/src/test/java/org/apache/geode/test/compiler/JarBuilderTest.java> uses or overrides a deprecated API.
Note: Recompile with -Xlint:deprecation for details.
Note: <https://builds.apache.org/job/Geode-nightly/ws/geode-junit/src/test/java/org/apache/geode/test/compiler/ClassNameExtractorTest.java> uses unchecked or unsafe operations.
Note: Recompile with -Xlint:unchecked for details.
:geode-junit:processTestResources
:geode-junit:testClasses
:geode-junit:checkMissedTests
:geode-junit:spotlessJavaCheck
:geode-junit:spotlessCheck
:geode-junit:test
:geode-junit:check
:geode-junit:build
:geode-junit:distributedTest
:geode-junit:integrationTest
:geode-lucene:assemble
:geode-lucene:compileTestJavaNote: Some input files use or override a deprecated API.
Note: Recompile with -Xlint:deprecation for details.
Note: Some input files use unchecked or unsafe operations.
Note: Recompile with -Xlint:unchecked for details.
:geode-lucene:processTestResources
:geode-lucene:testClasses
:geode-lucene:checkMissedTests
:geode-lucene:spotlessJavaCheck
:geode-lucene:spotlessCheck
:geode-lucene:test
:geode-lucene:check
:geode-lucene:build
:geode-lucene:distributedTest
:geode-lucene:integrationTest
:geode-old-client-support:assemble
:geode-old-client-support:compileTestJavaNote: <https://builds.apache.org/job/Geode-nightly/ws/geode-old-client-support/src/test/java/com/gemstone/gemfire/cache/execute/FunctionExceptionTest.java> uses or overrides a deprecated API.
Note: Recompile with -Xlint:deprecation for details.
:geode-old-client-support:processTestResources NO-SOURCE
:geode-old-client-support:testClasses
:geode-old-client-support:checkMissedTests
:geode-old-client-support:spotlessJavaCheck
:geode-old-client-support:spotlessCheck
:geode-old-client-support:test
:geode-old-client-support:check
:geode-old-client-support:build
:geode-old-client-support:distributedTest
:geode-old-client-support:integrationTest
:geode-old-versions:distributedTest NO-SOURCE
:geode-old-versions:integrationTest NO-SOURCE
:geode-protobuf:assemble
:geode-protobuf:extractIncludeTestProto
:geode-protobuf:extractTestProto UP-TO-DATE
:geode-protobuf:generateTestProto NO-SOURCE
:geode-protobuf:compileTestJavaNote: Some input files use or override a deprecated API.
Note: Recompile with -Xlint:deprecation for details.
Note: Some input files use unchecked or unsafe operations.
Note: Recompile with -Xlint:unchecked for details.
:geode-protobuf:processTestResources
:geode-protobuf:testClasses
:geode-protobuf:checkMissedTests
:geode-protobuf:spotlessJavaCheck
:geode-protobuf:spotlessCheck
:geode-protobuf:test
:geode-protobuf:check
:geode-protobuf:build
:geode-protobuf:distributedTest
:geode-protobuf:integrationTest
:geode-pulse:assemble
:geode-pulse:compileTestJavaNote: Some input files use or override a deprecated API.
Note: Recompile with -Xlint:deprecation for details.
Note: <https://builds.apache.org/job/Geode-nightly/ws/geode-pulse/src/test/java/org/apache/geode/tools/pulse/controllers/PulseControllerJUnitTest.java> uses unchecked or unsafe operations.
Note: Recompile with -Xlint:unchecked for details.
:geode-pulse:processTestResources
:geode-pulse:testClasses
:geode-pulse:checkMissedTests
:geode-pulse:spotlessJavaCheck
:geode-pulse:spotlessCheck
:geode-pulse:test
:geode-pulse:check
:geode-pulse:build
:geode-pulse:distributedTest
:geode-pulse:integrationTest
:geode-rebalancer:assemble
:geode-rebalancer:compileTestJava
:geode-rebalancer:processTestResources NO-SOURCE
:geode-rebalancer:testClasses
:geode-rebalancer:checkMissedTests
:geode-rebalancer:spotlessJavaCheck
:geode-rebalancer:spotlessCheck
:geode-rebalancer:test
:geode-rebalancer:check
:geode-rebalancer:build
:geode-rebalancer:distributedTest
:geode-rebalancer:integrationTest
:geode-wan:assemble
:geode-wan:compileTestJavaNote: Some input files use or override a deprecated API.
Note: Recompile with -Xlint:deprecation for details.
Note: Some input files use unchecked or unsafe operations.
Note: Recompile with -Xlint:unchecked for details.
:geode-wan:processTestResources
:geode-wan:testClasses
:geode-wan:checkMissedTests
:geode-wan:spotlessJavaCheck
:geode-wan:spotlessCheck
:geode-wan:test
:geode-wan:check
:geode-wan:build
:geode-wan:distributedTest
:geode-wan:integrationTest
:geode-web:assemble
:geode-web:compileTestJavaNote: Some input files use or override a deprecated API.
Note: Recompile with -Xlint:deprecation for details.
:geode-web:processTestResources NO-SOURCE
:geode-web:testClasses
:geode-web:checkMissedTests
:geode-web:spotlessJavaCheck
:geode-web:spotlessCheck
:geode-web:test
:geode-web:check
:geode-web:build
:geode-web:distributedTest
:geode-web:integrationTest
:geode-web-api:assemble
:geode-web-api:compileTestJava
:geode-web-api:processTestResources NO-SOURCE
:geode-web-api:testClasses
:geode-web-api:checkMissedTests
:geode-web-api:spotlessJavaCheck
:geode-web-api:spotlessCheck
:geode-web-api:test
:geode-web-api:check
:geode-web-api:build
:geode-web-api:distributedTest
:geode-web-api:integrationTest
:combineReports
All test reports at <https://builds.apache.org/job/Geode-nightly/ws/build/reports/combined>
:extensions/geode-modules:precheckin
:extensions/geode-modules-assembly:precheckin
:extensions/geode-modules-session:precheckin
:extensions/geode-modules-session-internal:precheckin
:extensions/geode-modules-tomcat7:precheckin
:extensions/geode-modules-tomcat8:precheckin
:extensions/session-testing-war:precheckin
:geode-benchmarks:precheckin
:geode-client-protocol:precheckin
:geode-common:precheckin
:geode-concurrency-test:precheckin
:geode-core:precheckin
:geode-cq:precheckin
:geode-json:precheckin
:geode-junit:precheckin
:geode-lucene:precheckin
:geode-old-client-support:precheckin
:geode-old-versions:precheckin
:geode-protobuf:precheckin
:geode-pulse:precheckin
:geode-rebalancer:precheckin
:geode-wan:precheckin
:geode-web:precheckin
:geode-web-api:precheckin
:compileJava NO-SOURCE
:processResources NO-SOURCE
:classes UP-TO-DATE
:jar
:uploadArchives
:extensions/geode-modules:uploadArchives SKIPPED
:extensions/geode-modules-assembly:uploadArchives SKIPPED
:extensions/geode-modules-session:uploadArchives SKIPPED
:extensions/geode-modules-session-internal:uploadArchives SKIPPED
:extensions/geode-modules-tomcat7:uploadArchives SKIPPED
:extensions/geode-modules-tomcat8:uploadArchives SKIPPED
:extensions/session-testing-war:uploadArchives SKIPPED
:geode-assembly:uploadArchives
:geode-benchmarks:uploadArchives SKIPPED
:geode-client-protocol:uploadArchives
:geode-common:uploadArchives
:geode-concurrency-test:uploadArchives
:geode-core:uploadArchives
:geode-cq:uploadArchives
:geode-json:uploadArchives
:geode-junit:uploadArchives
:geode-lucene:uploadArchives
:geode-old-client-support:uploadArchives
:geode-old-versions:uploadArchives SKIPPED
:geode-protobuf:uploadArchives
:geode-pulse:uploadArchives
:geode-rebalancer:uploadArchives
:geode-wan:uploadArchives
:geode-web:uploadArchives
:geode-web-api:uploadArchives
FAILURE: Build failed with an exception.
* What went wrong:
Execution failed for task ':geode-assembly:distributedTest'.
> There were failing tests. See the report at: file://<https://builds.apache.org/job/Geode-nightly/ws/geode-assembly/build/reports/distributedTest/index.html>
* Try:
Run with --stacktrace option to get the stack trace. Run with --info or --debug option to get more log output.
BUILD FAILED
Total time: 18 hrs 10 mins 3.821 secs
Build step 'Invoke Gradle script' changed build result to FAILURE
Build step 'Invoke Gradle script' marked build as failure
Archiving artifacts
[Fast Archiver] Compressed 336.38 MB of artifacts by 37.8% relative to #996
Recording test results
Not sending mail to unregistered user github@nakomis.com
Not sending mail to unregistered user kohlmu-pivotal@users.noreply.github.com
Not sending mail to unregistered user metatype@users.noreply.github.com
Not sending mail to unregistered user jdeppe@gopivotal.com
Build failed in Jenkins: Geode-nightly #1003
Posted by Apache Jenkins Server <je...@builds.apache.org>.
See <https://builds.apache.org/job/Geode-nightly/1003/display/redirect?page=changes>
Changes:
[github] GEODE-3947: add the necessary dependency in geode-dependency.jar (#1010)
[github] GEODE-3870: clean up region entry classes (#989)
[dbarnes] User Guide: fixed typo in the ‘configuring’ section
[lgallinat] GEODE-3940: Revert "GEODE-3801: Use hardlinks for backup oplog files
[dbarnes] User Guide: Fixed a typo in Basic Config/Data Regions/Region Management
------------------------------------------
[...truncated 152.17 KB...]
:geode-junit:checkMissedTests
:geode-junit:spotlessJavaCheck
:geode-junit:spotlessCheck
:geode-junit:test
:geode-junit:check
:geode-junit:build
:geode-junit:distributedTest
:geode-junit:integrationTest
:geode-lucene:assemble
:geode-lucene:compileTestJavaNote: Some input files use or override a deprecated API.
Note: Recompile with -Xlint:deprecation for details.
Note: Some input files use unchecked or unsafe operations.
Note: Recompile with -Xlint:unchecked for details.
:geode-lucene:processTestResources
:geode-lucene:testClasses
:geode-lucene:checkMissedTests
:geode-lucene:spotlessJavaCheck
:geode-lucene:spotlessCheck
:geode-lucene:test
:geode-lucene:check
:geode-lucene:build
:geode-lucene:distributedTest
:geode-lucene:integrationTest
:geode-old-client-support:assemble
:geode-old-client-support:compileTestJavaNote: <https://builds.apache.org/job/Geode-nightly/ws/geode-old-client-support/src/test/java/com/gemstone/gemfire/cache/execute/FunctionExceptionTest.java> uses or overrides a deprecated API.
Note: Recompile with -Xlint:deprecation for details.
:geode-old-client-support:processTestResources NO-SOURCE
:geode-old-client-support:testClasses
:geode-old-client-support:checkMissedTests
:geode-old-client-support:spotlessJavaCheck
:geode-old-client-support:spotlessCheck
:geode-old-client-support:test
:geode-old-client-support:check
:geode-old-client-support:build
:geode-old-client-support:distributedTest
:geode-old-client-support:integrationTest
:geode-old-versions:distributedTest NO-SOURCE
:geode-old-versions:integrationTest NO-SOURCE
:geode-protobuf:assemble
:geode-protobuf:extractIncludeTestProto
:geode-protobuf:extractTestProto UP-TO-DATE
:geode-protobuf:generateTestProto NO-SOURCE
:geode-protobuf:compileTestJavaNote: Some input files use or override a deprecated API.
Note: Recompile with -Xlint:deprecation for details.
Note: Some input files use unchecked or unsafe operations.
Note: Recompile with -Xlint:unchecked for details.
:geode-protobuf:processTestResources
:geode-protobuf:testClasses
:geode-protobuf:checkMissedTests
:geode-protobuf:spotlessJavaCheck
:geode-protobuf:spotlessCheck
:geode-protobuf:test
:geode-protobuf:check
:geode-protobuf:build
:geode-protobuf:distributedTest
:geode-protobuf:integrationTest
:geode-pulse:assemble
:geode-pulse:compileTestJavaNote: Some input files use or override a deprecated API.
Note: Recompile with -Xlint:deprecation for details.
Note: <https://builds.apache.org/job/Geode-nightly/ws/geode-pulse/src/test/java/org/apache/geode/tools/pulse/controllers/PulseControllerJUnitTest.java> uses unchecked or unsafe operations.
Note: Recompile with -Xlint:unchecked for details.
:geode-pulse:processTestResources
:geode-pulse:testClasses
:geode-pulse:checkMissedTests
:geode-pulse:spotlessJavaCheck
:geode-pulse:spotlessCheck
:geode-pulse:test
:geode-pulse:check
:geode-pulse:build
:geode-pulse:distributedTest
:geode-pulse:integrationTest
:geode-rebalancer:assemble
:geode-rebalancer:compileTestJava
:geode-rebalancer:processTestResources NO-SOURCE
:geode-rebalancer:testClasses
:geode-rebalancer:checkMissedTests
:geode-rebalancer:spotlessJavaCheck
:geode-rebalancer:spotlessCheck
:geode-rebalancer:test
:geode-rebalancer:check
:geode-rebalancer:build
:geode-rebalancer:distributedTest
:geode-rebalancer:integrationTest
:geode-wan:assemble
:geode-wan:compileTestJavaNote: Some input files use or override a deprecated API.
Note: Recompile with -Xlint:deprecation for details.
Note: Some input files use unchecked or unsafe operations.
Note: Recompile with -Xlint:unchecked for details.
:geode-wan:processTestResources
:geode-wan:testClasses
:geode-wan:checkMissedTests
:geode-wan:spotlessJavaCheck
:geode-wan:spotlessCheck
:geode-wan:test
:geode-wan:check
:geode-wan:build
:geode-wan:distributedTest
:geode-wan:integrationTest
:geode-web:assemble
:geode-web:compileTestJavaNote: Some input files use or override a deprecated API.
Note: Recompile with -Xlint:deprecation for details.
:geode-web:processTestResources NO-SOURCE
:geode-web:testClasses
:geode-web:checkMissedTests
:geode-web:spotlessJavaCheck
:geode-web:spotlessCheck
:geode-web:test
:geode-web:check
:geode-web:build
:geode-web:distributedTest
org.apache.geode.management.internal.cli.commands.ConnectCommandWithSSLTest > connectWithNoSSL FAILED
java.lang.AssertionError:
Expecting:
<"[34m _________________________ __
/ _____/ ______/ ______/ /____/ /
/ / __/ /___ /_____ / _____ /
/ /__/ / ____/ _____/ / / / /
/______/_/ /______/_/ /_/ 1.4.0-SNAPSHOT
[0m
[36mMonitor and Manage Apache Geode[0m
Connecting to Locator at [host=localhost, port=37891] ..
Connection reset
">
to contain:
<"trying to connect a non-SSL-enabled client to an SSL-enabled locator">
at org.apache.geode.management.internal.cli.commands.ConnectCommandWithSSLTest.connectWithNoSSL(ConnectCommandWithSSLTest.java:181)
90 tests completed, 1 failed
:geode-web:distributedTest FAILED
:geode-web:integrationTest
:geode-web-api:assemble
:geode-web-api:compileTestJava
:geode-web-api:processTestResources NO-SOURCE
:geode-web-api:testClasses
:geode-web-api:checkMissedTests
:geode-web-api:spotlessJavaCheck
:geode-web-api:spotlessCheck
:geode-web-api:test
:geode-web-api:check
:geode-web-api:build
:geode-web-api:distributedTest
:geode-web-api:integrationTest
:combineReports
All test reports at <https://builds.apache.org/job/Geode-nightly/ws/build/reports/combined>
:extensions/geode-modules:precheckin
:extensions/geode-modules-assembly:precheckin
:extensions/geode-modules-session:precheckin
:extensions/geode-modules-session-internal:precheckin
:extensions/geode-modules-tomcat7:precheckin
:extensions/geode-modules-tomcat8:precheckin
:extensions/session-testing-war:precheckin
:geode-benchmarks:precheckin
:geode-client-protocol:precheckin
:geode-common:precheckin
:geode-concurrency-test:precheckin
:geode-cq:precheckin
:geode-json:precheckin
:geode-junit:precheckin
:geode-lucene:precheckin
:geode-old-client-support:precheckin
:geode-old-versions:precheckin
:geode-protobuf:precheckin
:geode-pulse:precheckin
:geode-rebalancer:precheckin
:geode-wan:precheckin
:geode-web-api:precheckin
:compileJava NO-SOURCE
:processResources NO-SOURCE
:classes UP-TO-DATE
:jar
:uploadArchives
:extensions/geode-modules:uploadArchives SKIPPED
:extensions/geode-modules-assembly:uploadArchives SKIPPED
:extensions/geode-modules-session:uploadArchives SKIPPED
:extensions/geode-modules-session-internal:uploadArchives SKIPPED
:extensions/geode-modules-tomcat7:uploadArchives SKIPPED
:extensions/geode-modules-tomcat8:uploadArchives SKIPPED
:extensions/session-testing-war:uploadArchives SKIPPED
:geode-assembly:uploadArchives
:geode-benchmarks:uploadArchives SKIPPED
:geode-client-protocol:uploadArchives
:geode-common:uploadArchives
:geode-concurrency-test:uploadArchives
:geode-core:uploadArchives
:geode-cq:uploadArchives
:geode-json:uploadArchives
:geode-junit:uploadArchives
:geode-lucene:uploadArchives
:geode-old-client-support:uploadArchives
:geode-old-versions:uploadArchives SKIPPED
:geode-protobuf:uploadArchives
:geode-pulse:uploadArchives
:geode-rebalancer:uploadArchives
:geode-wan:uploadArchives
:geode-web:uploadArchives
:geode-web-api:uploadArchives
FAILURE: Build completed with 3 failures.
1: Task failed with an exception.
-----------
* What went wrong:
Execution failed for task ':geode-assembly:distributedTest'.
> There were failing tests. See the report at: file://<https://builds.apache.org/job/Geode-nightly/ws/geode-assembly/build/reports/distributedTest/index.html>
* Try:
Run with --stacktrace option to get the stack trace. Run with --info or --debug option to get more log output.
==============================================================================
2: Task failed with an exception.
-----------
* What went wrong:
Execution failed for task ':geode-core:distributedTest'.
> There were failing tests. See the report at: file://<https://builds.apache.org/job/Geode-nightly/ws/geode-core/build/reports/distributedTest/index.html>
* Try:
Run with --stacktrace option to get the stack trace. Run with --info or --debug option to get more log output.
==============================================================================
3: Task failed with an exception.
-----------
* What went wrong:
Execution failed for task ':geode-web:distributedTest'.
> There were failing tests. See the report at: file://<https://builds.apache.org/job/Geode-nightly/ws/geode-web/build/reports/distributedTest/index.html>
* Try:
Run with --stacktrace option to get the stack trace. Run with --info or --debug option to get more log output.
==============================================================================
BUILD FAILED
Total time: 18 hrs 1 mins 35.074 secs
Build step 'Invoke Gradle script' changed build result to FAILURE
Build step 'Invoke Gradle script' marked build as failure
Archiving artifacts
[Fast Archiver] Compressed 336.37 MB of artifacts by 43.2% relative to #996
Recording test results
Not sending mail to unregistered user github@nakomis.com
Not sending mail to unregistered user kohlmu-pivotal@users.noreply.github.com
Not sending mail to unregistered user metatype@users.noreply.github.com
Not sending mail to unregistered user jdeppe@gopivotal.com
Build failed in Jenkins: Geode-nightly #1002
Posted by Apache Jenkins Server <je...@builds.apache.org>.
See <https://builds.apache.org/job/Geode-nightly/1002/display/redirect?page=changes>
Changes:
[github] GEODE-3778: mark tests flaky (#1004)
[github] GEODE-3936: remove ThreadUtil (#998)
[jdeppe] Add files necessary for Concourse CI infrastructure. (#1006)
[jdeppe] Fix up branches. GEODE-3942 (#1008)
[kohlmu-pivotal] GEODE-3637: Moved client queue initialization into the
[kohlmu-pivotal] GEODE-3637: Amended AcceptorImpl.java to use a Connection pool that
[gosullivan] GEODE-3895: Add Handshake/Message version byte (#1001)
[metatype] Fix version number in email subject.
[gosullivan] GEODE-3895: fixup: Add exceptions to excludedClasses.txt
[github] GEODE-3941: Pulse issues when SecurityManager is enabled (#1007)
------------------------------------------
[...truncated 143.03 KB...]
:geode-core:distributedTest
:geode-core:integrationTest
:geode-cq:assemble
:geode-cq:compileTestJavaNote: Some input files use or override a deprecated API.
Note: Recompile with -Xlint:deprecation for details.
Note: Some input files use unchecked or unsafe operations.
Note: Recompile with -Xlint:unchecked for details.
:geode-cq:processTestResources
:geode-cq:testClasses
:geode-cq:checkMissedTests
:geode-cq:spotlessJavaCheck
:geode-cq:spotlessCheck
:geode-cq:test
:geode-cq:check
:geode-cq:build
:geode-cq:distributedTest
:geode-cq:integrationTest
:geode-json:assemble
:geode-json:compileTestJava NO-SOURCE
:geode-json:processTestResources
:geode-json:testClasses
:geode-json:checkMissedTests NO-SOURCE
:geode-json:spotlessJavaCheck
:geode-json:spotlessCheck
:geode-json:test NO-SOURCE
:geode-json:check
:geode-json:build
:geode-json:distributedTest NO-SOURCE
:geode-json:integrationTest NO-SOURCE
:geode-junit:javadoc
:geode-junit:javadocJar
:geode-junit:sourcesJar
:geode-junit:signArchives SKIPPED
:geode-junit:assemble
:geode-junit:compileTestJavaNote: <https://builds.apache.org/job/Geode-nightly/ws/geode-junit/src/test/java/org/apache/geode/test/compiler/JarBuilderTest.java> uses or overrides a deprecated API.
Note: Recompile with -Xlint:deprecation for details.
Note: <https://builds.apache.org/job/Geode-nightly/ws/geode-junit/src/test/java/org/apache/geode/test/compiler/ClassNameExtractorTest.java> uses unchecked or unsafe operations.
Note: Recompile with -Xlint:unchecked for details.
:geode-junit:processTestResources
:geode-junit:testClasses
:geode-junit:checkMissedTests
:geode-junit:spotlessJavaCheck
:geode-junit:spotlessCheck
:geode-junit:test
:geode-junit:check
:geode-junit:build
:geode-junit:distributedTest
:geode-junit:integrationTest
:geode-lucene:assemble
:geode-lucene:compileTestJavaNote: Some input files use or override a deprecated API.
Note: Recompile with -Xlint:deprecation for details.
Note: Some input files use unchecked or unsafe operations.
Note: Recompile with -Xlint:unchecked for details.
:geode-lucene:processTestResources
:geode-lucene:testClasses
:geode-lucene:checkMissedTests
:geode-lucene:spotlessJavaCheck
:geode-lucene:spotlessCheck
:geode-lucene:test
:geode-lucene:check
:geode-lucene:build
:geode-lucene:distributedTest
:geode-lucene:integrationTest
:geode-old-client-support:assemble
:geode-old-client-support:compileTestJavaNote: <https://builds.apache.org/job/Geode-nightly/ws/geode-old-client-support/src/test/java/com/gemstone/gemfire/cache/execute/FunctionExceptionTest.java> uses or overrides a deprecated API.
Note: Recompile with -Xlint:deprecation for details.
:geode-old-client-support:processTestResources NO-SOURCE
:geode-old-client-support:testClasses
:geode-old-client-support:checkMissedTests
:geode-old-client-support:spotlessJavaCheck
:geode-old-client-support:spotlessCheck
:geode-old-client-support:test
:geode-old-client-support:check
:geode-old-client-support:build
:geode-old-client-support:distributedTest
:geode-old-client-support:integrationTest
:geode-old-versions:distributedTest NO-SOURCE
:geode-old-versions:integrationTest NO-SOURCE
:geode-protobuf:assemble
:geode-protobuf:extractIncludeTestProto
:geode-protobuf:extractTestProto UP-TO-DATE
:geode-protobuf:generateTestProto NO-SOURCE
:geode-protobuf:compileTestJavaNote: Some input files use or override a deprecated API.
Note: Recompile with -Xlint:deprecation for details.
Note: Some input files use unchecked or unsafe operations.
Note: Recompile with -Xlint:unchecked for details.
:geode-protobuf:processTestResources
:geode-protobuf:testClasses
:geode-protobuf:checkMissedTests
:geode-protobuf:spotlessJavaCheck
:geode-protobuf:spotlessCheck
:geode-protobuf:test
:geode-protobuf:check
:geode-protobuf:build
:geode-protobuf:distributedTest
:geode-protobuf:integrationTest
:geode-pulse:assemble
:geode-pulse:compileTestJavaNote: Some input files use or override a deprecated API.
Note: Recompile with -Xlint:deprecation for details.
Note: <https://builds.apache.org/job/Geode-nightly/ws/geode-pulse/src/test/java/org/apache/geode/tools/pulse/controllers/PulseControllerJUnitTest.java> uses unchecked or unsafe operations.
Note: Recompile with -Xlint:unchecked for details.
:geode-pulse:processTestResources
:geode-pulse:testClasses
:geode-pulse:checkMissedTests
:geode-pulse:spotlessJavaCheck
:geode-pulse:spotlessCheck
:geode-pulse:test
:geode-pulse:check
:geode-pulse:build
:geode-pulse:distributedTest
:geode-pulse:integrationTest
:geode-rebalancer:assemble
:geode-rebalancer:compileTestJava
:geode-rebalancer:processTestResources NO-SOURCE
:geode-rebalancer:testClasses
:geode-rebalancer:checkMissedTests
:geode-rebalancer:spotlessJavaCheck
:geode-rebalancer:spotlessCheck
:geode-rebalancer:test
:geode-rebalancer:check
:geode-rebalancer:build
:geode-rebalancer:distributedTest
:geode-rebalancer:integrationTest
:geode-wan:assemble
:geode-wan:compileTestJavaNote: Some input files use or override a deprecated API.
Note: Recompile with -Xlint:deprecation for details.
Note: Some input files use unchecked or unsafe operations.
Note: Recompile with -Xlint:unchecked for details.
:geode-wan:processTestResources
:geode-wan:testClasses
:geode-wan:checkMissedTests
:geode-wan:spotlessJavaCheck
:geode-wan:spotlessCheck
:geode-wan:test
:geode-wan:check
:geode-wan:build
:geode-wan:distributedTest
:geode-wan:integrationTest
:geode-web:assemble
:geode-web:compileTestJavaNote: Some input files use or override a deprecated API.
Note: Recompile with -Xlint:deprecation for details.
:geode-web:processTestResources NO-SOURCE
:geode-web:testClasses
:geode-web:checkMissedTests
:geode-web:spotlessJavaCheck
:geode-web:spotlessCheck
:geode-web:test
:geode-web:check
:geode-web:build
:geode-web:distributedTest
:geode-web:integrationTest
:geode-web-api:assemble
:geode-web-api:compileTestJava
:geode-web-api:processTestResources NO-SOURCE
:geode-web-api:testClasses
:geode-web-api:checkMissedTests
:geode-web-api:spotlessJavaCheck
:geode-web-api:spotlessCheck
:geode-web-api:test
:geode-web-api:check
:geode-web-api:build
:geode-web-api:distributedTest
:geode-web-api:integrationTest
:combineReports
All test reports at <https://builds.apache.org/job/Geode-nightly/ws/build/reports/combined>
:extensions/geode-modules:precheckin
:extensions/geode-modules-assembly:precheckin
:extensions/geode-modules-session:precheckin
:extensions/geode-modules-session-internal:precheckin
:extensions/geode-modules-tomcat7:precheckin
:extensions/geode-modules-tomcat8:precheckin
:extensions/session-testing-war:precheckin
:geode-benchmarks:precheckin
:geode-client-protocol:precheckin
:geode-common:precheckin
:geode-concurrency-test:precheckin
:geode-core:precheckin
:geode-cq:precheckin
:geode-json:precheckin
:geode-junit:precheckin
:geode-lucene:precheckin
:geode-old-client-support:precheckin
:geode-old-versions:precheckin
:geode-protobuf:precheckin
:geode-pulse:precheckin
:geode-rebalancer:precheckin
:geode-wan:precheckin
:geode-web:precheckin
:geode-web-api:precheckin
:compileJava NO-SOURCE
:processResources NO-SOURCE
:classes UP-TO-DATE
:jar
:uploadArchives
:extensions/geode-modules:uploadArchives SKIPPED
:extensions/geode-modules-assembly:uploadArchives SKIPPED
:extensions/geode-modules-session:uploadArchives SKIPPED
:extensions/geode-modules-session-internal:uploadArchives SKIPPED
:extensions/geode-modules-tomcat7:uploadArchives SKIPPED
:extensions/geode-modules-tomcat8:uploadArchives SKIPPED
:extensions/session-testing-war:uploadArchives SKIPPED
:geode-assembly:uploadArchives
:geode-benchmarks:uploadArchives SKIPPED
:geode-client-protocol:uploadArchives
:geode-common:uploadArchives
:geode-concurrency-test:uploadArchives
:geode-core:uploadArchives
:geode-cq:uploadArchives
:geode-json:uploadArchives
:geode-junit:uploadArchives
:geode-lucene:uploadArchives
:geode-old-client-support:uploadArchives
:geode-old-versions:uploadArchives SKIPPED
:geode-protobuf:uploadArchives
:geode-pulse:uploadArchives
:geode-rebalancer:uploadArchives
:geode-wan:uploadArchives
:geode-web:uploadArchives
:geode-web-api:uploadArchives
FAILURE: Build failed with an exception.
* What went wrong:
Execution failed for task ':geode-assembly:distributedTest'.
> There were failing tests. See the report at: file://<https://builds.apache.org/job/Geode-nightly/ws/geode-assembly/build/reports/distributedTest/index.html>
* Try:
Run with --stacktrace option to get the stack trace. Run with --info or --debug option to get more log output.
BUILD FAILED
Total time: 17 hrs 11 mins 21.482 secs
Build step 'Invoke Gradle script' changed build result to FAILURE
Build step 'Invoke Gradle script' marked build as failure
Archiving artifacts
[Fast Archiver] Compressed 336.31 MB of artifacts by 37.8% relative to #996
Recording test results
Not sending mail to unregistered user github@nakomis.com
Not sending mail to unregistered user kohlmu-pivotal@users.noreply.github.com
Not sending mail to unregistered user metatype@users.noreply.github.com
Not sending mail to unregistered user jdeppe@gopivotal.com
Build failed in Jenkins: Geode-nightly #1001
Posted by Apache Jenkins Server <je...@builds.apache.org>.
See <https://builds.apache.org/job/Geode-nightly/1001/display/redirect>
------------------------------------------
Started by timer
[EnvInject] - Loading node environment variables.
Building remotely on H12 (couchdbtest Hadoop xenial) in workspace <https://builds.apache.org/job/Geode-nightly/ws/>
> git rev-parse --is-inside-work-tree # timeout=10
Fetching changes from the remote Git repository
> git config remote.origin.url https://github.com/apache/geode.git # timeout=10
Fetching upstream changes from https://github.com/apache/geode.git
> git --version # timeout=10
> git fetch --tags --progress https://github.com/apache/geode.git +refs/heads/*:refs/remotes/origin/*
> git rev-parse refs/remotes/origin/develop^{commit} # timeout=10
> git rev-parse refs/remotes/origin/origin/develop^{commit} # timeout=10
Checking out Revision 8f3d052f851a4aeb0d1ed9548cb52849c2c1c7e3 (refs/remotes/origin/develop)
> git config core.sparsecheckout # timeout=10
> git checkout -f 8f3d052f851a4aeb0d1ed9548cb52849c2c1c7e3
> git branch -a -v --no-abbrev # timeout=10
> git branch -D develop # timeout=10
> git checkout -b develop 8f3d052f851a4aeb0d1ed9548cb52849c2c1c7e3
java.lang.NoClassDefFoundError: hudson.model.Computer
at org.jenkinsci.plugins.gitclient.AbstractGitAPIImpl.withRepository(AbstractGitAPIImpl.java:29)
at org.jenkinsci.plugins.gitclient.CliGitAPIImpl.withRepository(CliGitAPIImpl.java:71)
at sun.reflect.NativeMethodAccessorImpl.invoke0(Native Method)
at sun.reflect.NativeMethodAccessorImpl.invoke(NativeMethodAccessorImpl.java:62)
at sun.reflect.DelegatingMethodAccessorImpl.invoke(DelegatingMethodAccessorImpl.java:43)
at java.lang.reflect.Method.invoke(Method.java:498)
at hudson.remoting.RemoteInvocationHandler$RPCRequest.perform(RemoteInvocationHandler.java:896)
at hudson.remoting.RemoteInvocationHandler$RPCRequest.call(RemoteInvocationHandler.java:870)
at hudson.remoting.RemoteInvocationHandler$RPCRequest.call(RemoteInvocationHandler.java:829)
at hudson.remoting.UserRequest.perform(UserRequest.java:181)
at hudson.remoting.UserRequest.perform(UserRequest.java:52)
at hudson.remoting.Request$2.run(Request.java:336)
at hudson.remoting.InterceptingExecutorService$1.call(InterceptingExecutorService.java:68)
at java.util.concurrent.FutureTask.run(FutureTask.java:266)
at java.util.concurrent.ThreadPoolExecutor.runWorker(ThreadPoolExecutor.java:1142)
at java.util.concurrent.ThreadPoolExecutor$Worker.run(ThreadPoolExecutor.java:617)
at java.lang.Thread.run(Thread.java:748)
at ......remote call to H12(Native Method)
at hudson.remoting.Channel.attachCallSiteStackTrace(Channel.java:1554)
at hudson.remoting.UserResponse.retrieve(UserRequest.java:281)
at hudson.remoting.Channel.call(Channel.java:839)
Caused: java.io.IOException: Remote call on H12 failed
at hudson.remoting.Channel.call(Channel.java:847)
at hudson.remoting.RemoteInvocationHandler.invoke(RemoteInvocationHandler.java:257)
at com.sun.proxy.$Proxy109.withRepository(Unknown Source)
at org.jenkinsci.plugins.gitclient.RemoteGitImpl.withRepository(RemoteGitImpl.java:235)
at hudson.plugins.git.GitSCM.printCommitMessageToLog(GitSCM.java:1208)
at hudson.plugins.git.GitSCM.checkout(GitSCM.java:1181)
at hudson.scm.SCM.checkout(SCM.java:495)
at hudson.model.AbstractProject.checkout(AbstractProject.java:1212)
at hudson.model.AbstractBuild$AbstractBuildExecution.defaultCheckout(AbstractBuild.java:566)
at jenkins.scm.SCMCheckoutStrategy.checkout(SCMCheckoutStrategy.java:86)
at hudson.model.AbstractBuild$AbstractBuildExecution.run(AbstractBuild.java:491)
at hudson.model.Run.execute(Run.java:1737)
at hudson.model.FreeStyleBuild.run(FreeStyleBuild.java:43)
at hudson.model.ResourceController.execute(ResourceController.java:97)
at hudson.model.Executor.run(Executor.java:419)
Retrying after 10 seconds
> git rev-parse --is-inside-work-tree # timeout=10
Fetching changes from the remote Git repository
> git config remote.origin.url https://github.com/apache/geode.git # timeout=10
Fetching upstream changes from https://github.com/apache/geode.git
> git --version # timeout=10
> git fetch --tags --progress https://github.com/apache/geode.git +refs/heads/*:refs/remotes/origin/*
> git rev-parse refs/remotes/origin/develop^{commit} # timeout=10
> git rev-parse refs/remotes/origin/origin/develop^{commit} # timeout=10
Checking out Revision 8f3d052f851a4aeb0d1ed9548cb52849c2c1c7e3 (refs/remotes/origin/develop)
> git config core.sparsecheckout # timeout=10
> git checkout -f 8f3d052f851a4aeb0d1ed9548cb52849c2c1c7e3
> git branch -a -v --no-abbrev # timeout=10
> git branch -D develop # timeout=10
> git checkout -b develop 8f3d052f851a4aeb0d1ed9548cb52849c2c1c7e3
java.lang.NoClassDefFoundError: hudson.model.Computer
at org.jenkinsci.plugins.gitclient.AbstractGitAPIImpl.withRepository(AbstractGitAPIImpl.java:29)
at org.jenkinsci.plugins.gitclient.CliGitAPIImpl.withRepository(CliGitAPIImpl.java:71)
at sun.reflect.NativeMethodAccessorImpl.invoke0(Native Method)
at sun.reflect.NativeMethodAccessorImpl.invoke(NativeMethodAccessorImpl.java:62)
at sun.reflect.DelegatingMethodAccessorImpl.invoke(DelegatingMethodAccessorImpl.java:43)
at java.lang.reflect.Method.invoke(Method.java:498)
at hudson.remoting.RemoteInvocationHandler$RPCRequest.perform(RemoteInvocationHandler.java:896)
at hudson.remoting.RemoteInvocationHandler$RPCRequest.call(RemoteInvocationHandler.java:870)
at hudson.remoting.RemoteInvocationHandler$RPCRequest.call(RemoteInvocationHandler.java:829)
at hudson.remoting.UserRequest.perform(UserRequest.java:181)
at hudson.remoting.UserRequest.perform(UserRequest.java:52)
at hudson.remoting.Request$2.run(Request.java:336)
at hudson.remoting.InterceptingExecutorService$1.call(InterceptingExecutorService.java:68)
at java.util.concurrent.FutureTask.run(FutureTask.java:266)
at java.util.concurrent.ThreadPoolExecutor.runWorker(ThreadPoolExecutor.java:1142)
at java.util.concurrent.ThreadPoolExecutor$Worker.run(ThreadPoolExecutor.java:617)
at java.lang.Thread.run(Thread.java:748)
at ......remote call to H12(Native Method)
at hudson.remoting.Channel.attachCallSiteStackTrace(Channel.java:1554)
at hudson.remoting.UserResponse.retrieve(UserRequest.java:281)
at hudson.remoting.Channel.call(Channel.java:839)
Caused: java.io.IOException: Remote call on H12 failed
at hudson.remoting.Channel.call(Channel.java:847)
at hudson.remoting.RemoteInvocationHandler.invoke(RemoteInvocationHandler.java:257)
at com.sun.proxy.$Proxy109.withRepository(Unknown Source)
at org.jenkinsci.plugins.gitclient.RemoteGitImpl.withRepository(RemoteGitImpl.java:235)
at hudson.plugins.git.GitSCM.printCommitMessageToLog(GitSCM.java:1208)
at hudson.plugins.git.GitSCM.checkout(GitSCM.java:1181)
at hudson.scm.SCM.checkout(SCM.java:495)
at hudson.model.AbstractProject.checkout(AbstractProject.java:1212)
at hudson.model.AbstractBuild$AbstractBuildExecution.defaultCheckout(AbstractBuild.java:566)
at jenkins.scm.SCMCheckoutStrategy.checkout(SCMCheckoutStrategy.java:86)
at hudson.model.AbstractBuild$AbstractBuildExecution.run(AbstractBuild.java:491)
at hudson.model.Run.execute(Run.java:1737)
at hudson.model.FreeStyleBuild.run(FreeStyleBuild.java:43)
at hudson.model.ResourceController.execute(ResourceController.java:97)
at hudson.model.Executor.run(Executor.java:419)
Retrying after 10 seconds
> git rev-parse --is-inside-work-tree # timeout=10
Fetching changes from the remote Git repository
> git config remote.origin.url https://github.com/apache/geode.git # timeout=10
Fetching upstream changes from https://github.com/apache/geode.git
> git --version # timeout=10
> git fetch --tags --progress https://github.com/apache/geode.git +refs/heads/*:refs/remotes/origin/*
> git rev-parse refs/remotes/origin/develop^{commit} # timeout=10
> git rev-parse refs/remotes/origin/origin/develop^{commit} # timeout=10
Checking out Revision 8f3d052f851a4aeb0d1ed9548cb52849c2c1c7e3 (refs/remotes/origin/develop)
> git config core.sparsecheckout # timeout=10
> git checkout -f 8f3d052f851a4aeb0d1ed9548cb52849c2c1c7e3
> git branch -a -v --no-abbrev # timeout=10
> git branch -D develop # timeout=10
> git checkout -b develop 8f3d052f851a4aeb0d1ed9548cb52849c2c1c7e3
java.lang.NoClassDefFoundError: hudson.model.Computer
at org.jenkinsci.plugins.gitclient.AbstractGitAPIImpl.withRepository(AbstractGitAPIImpl.java:29)
at org.jenkinsci.plugins.gitclient.CliGitAPIImpl.withRepository(CliGitAPIImpl.java:71)
at sun.reflect.NativeMethodAccessorImpl.invoke0(Native Method)
at sun.reflect.NativeMethodAccessorImpl.invoke(NativeMethodAccessorImpl.java:62)
at sun.reflect.DelegatingMethodAccessorImpl.invoke(DelegatingMethodAccessorImpl.java:43)
at java.lang.reflect.Method.invoke(Method.java:498)
at hudson.remoting.RemoteInvocationHandler$RPCRequest.perform(RemoteInvocationHandler.java:896)
at hudson.remoting.RemoteInvocationHandler$RPCRequest.call(RemoteInvocationHandler.java:870)
at hudson.remoting.RemoteInvocationHandler$RPCRequest.call(RemoteInvocationHandler.java:829)
at hudson.remoting.UserRequest.perform(UserRequest.java:181)
at hudson.remoting.UserRequest.perform(UserRequest.java:52)
at hudson.remoting.Request$2.run(Request.java:336)
at hudson.remoting.InterceptingExecutorService$1.call(InterceptingExecutorService.java:68)
at java.util.concurrent.FutureTask.run(FutureTask.java:266)
at java.util.concurrent.ThreadPoolExecutor.runWorker(ThreadPoolExecutor.java:1142)
at java.util.concurrent.ThreadPoolExecutor$Worker.run(ThreadPoolExecutor.java:617)
at java.lang.Thread.run(Thread.java:748)
at ......remote call to H12(Native Method)
at hudson.remoting.Channel.attachCallSiteStackTrace(Channel.java:1554)
at hudson.remoting.UserResponse.retrieve(UserRequest.java:281)
at hudson.remoting.Channel.call(Channel.java:839)
Caused: java.io.IOException: Remote call on H12 failed
at hudson.remoting.Channel.call(Channel.java:847)
at hudson.remoting.RemoteInvocationHandler.invoke(RemoteInvocationHandler.java:257)
at com.sun.proxy.$Proxy109.withRepository(Unknown Source)
at org.jenkinsci.plugins.gitclient.RemoteGitImpl.withRepository(RemoteGitImpl.java:235)
at hudson.plugins.git.GitSCM.printCommitMessageToLog(GitSCM.java:1208)
at hudson.plugins.git.GitSCM.checkout(GitSCM.java:1181)
at hudson.scm.SCM.checkout(SCM.java:495)
at hudson.model.AbstractProject.checkout(AbstractProject.java:1212)
at hudson.model.AbstractBuild$AbstractBuildExecution.defaultCheckout(AbstractBuild.java:566)
at jenkins.scm.SCMCheckoutStrategy.checkout(SCMCheckoutStrategy.java:86)
at hudson.model.AbstractBuild$AbstractBuildExecution.run(AbstractBuild.java:491)
at hudson.model.Run.execute(Run.java:1737)
at hudson.model.FreeStyleBuild.run(FreeStyleBuild.java:43)
at hudson.model.ResourceController.execute(ResourceController.java:97)
at hudson.model.Executor.run(Executor.java:419)
Archiving artifacts
[Fast Archiver] Compressed 336.22 MB of artifacts by 36.9% relative to #996
Recording test results
ERROR: Step ?Publish JUnit test result report? failed: Test reports were found but none of them are new. Did tests run?
For example, <https://builds.apache.org/job/Geode-nightly/ws/extensions/geode-modules-session/build/test-results/integrationTest/TEST-org.apache.geode.modules.session.installer.InstallerJUnitTest.xml> is 2 days 23 hr old
Not sending mail to unregistered user kohlmu-pivotal@users.noreply.github.com
Not sending mail to unregistered user github@nakomis.com
Build failed in Jenkins: Geode-nightly #1000
Posted by Apache Jenkins Server <je...@builds.apache.org>.
See <https://builds.apache.org/job/Geode-nightly/1000/display/redirect?page=changes>
Changes:
[sbawaskar] Removed SNAPSHOT from releaseType
[sbawaskar] Fixing gradle script to: - have the correct name for signing the
[jstewart] GEODE-3859: Simplify API for reading output from a GfshScript
[github] GEODE-3902: Correct region used by test (#993)
[sbawaskar] Add instructions for pushing "latest" docker image
[sbawaskar] Updating Dockerfile - for release 1.3.0 - removing references to
[kohlmu-pivotal] GEODE-3861: Mark ClientHealthMonistorSelectorJUnitTest as flaky.
[github] GEODE-1897: Add eviction option to create region (#969)
[github] GEODE-3919: Changed test to wait for the appropriate queue size since
------------------------------------------
[...truncated 4.43 KB...]
centos 7 196e0ce0c9fb 6 weeks ago 197MB
ubuntu 14.04 dea1945146b9 6 weeks ago 188MB
apachegeode/geode-build latest 5b8ba62c92f0 2 months ago 741MB
+ docker info
Containers: 0
Running: 0
Paused: 0
Stopped: 0
Images: 49
Server Version: 17.05.0-ce
Storage Driver: aufs
Root Dir: /var/lib/docker/aufs
Backing Filesystem: extfs
Dirs: 46
Dirperm1 Supported: true
Logging Driver: json-file
Cgroup Driver: cgroupfs
Plugins:
Volume: local
Network: bridge host macvlan null overlay
Swarm: inactive
Runtimes: runc
Default Runtime: runc
Init Binary: docker-init
containerd version: 9048e5e50717ea4497b757314bad98ea3763c145
runc version: 9c2d8d184e5da67c95d601382adf14862e4f2228
init version: 949e6fa
Security Options:
apparmor
seccomp
Profile: default
Kernel Version: 4.4.0-64-generic
Operating System: Ubuntu 16.04.3 LTS
OSType: linux
Architecture: x86_64
CPUs: 24
Total Memory: 94.37GiB
Name: asf916.gq1.ygridcore.net
ID: 6OBF:PILF:R6ZZ:UNY4:WRS6:ZATJ:D27Y:FS2J:HPVQ:JL4V:NRV7:HPFK
Docker Root Dir: /var/lib/docker
Debug Mode (client): false
Debug Mode (server): false
Username: whiskbot
Registry: https://index.docker.io/v1/
Experimental: false
Insecure Registries:
127.0.0.0/8
Live Restore Enabled: false
WARNING: No swap limit support
[Gradle] - Launching build.
[Geode-nightly] $ <https://builds.apache.org/job/Geode-nightly/ws/gradlew> --no-daemon -PparallelDunit_disabled -PdunitParallelForks=2 -PdunitDockerImage=apachegeode/geode-build clean precheckin distTar distZip uploadArchives -xflakyTest
Downloading https://services.gradle.org/distributions/gradle-3.5.1-bin.zip
.................................................................................................................................................................................................................................................................................................................................................................................................................................................................................................................................................................................................................................................................................................................................................................................................................................................................................................................................................................................................................................................................................................................................................................................................................................................................................................................................................................................................................................................................................................................................................................................................................................................................................................................................................................................................................................................................................................................................................................................................................................................................................................................................................................................................................................................................................................................................................................................................................................................................................................................................................................................................................................................................................................................................................................................................................................................................................................................................................................................................................................................................................................................................................................................................................................................................................................................................................................................................................................................................................................................................................................................................................................................................................................................................................................................................................
Unzipping <https://builds.apache.org/job/Geode-nightly/ws/wrapper/dists/gradle-3.5.1-bin/5aglzaqc99i3lll5iwkbm96su/gradle-3.5.1-bin.zip> to <https://builds.apache.org/job/Geode-nightly/ws/wrapper/dists/gradle-3.5.1-bin/5aglzaqc99i3lll5iwkbm96su>
Set executable permissions for: <https://builds.apache.org/job/Geode-nightly/ws/wrapper/dists/gradle-3.5.1-bin/5aglzaqc99i3lll5iwkbm96su/gradle-3.5.1/bin/gradle>
To honour the JVM settings for this build a new JVM will be forked. Please consider using the daemon: https://docs.gradle.org/3.5.1/userguide/gradle_daemon.html.
Daemon will be stopped at the end of the build stopping after processing
Generating JAR file 'gradle-api-3.5.1.jar'
Download https://repo1.maven.org/maven2/org/apache/mina/mina-core/2.0.14/mina-core-2.0.14.pom
Download https://repo1.maven.org/maven2/org/apache/mina/mina-parent/2.0.14/mina-parent-2.0.14.pom
Download https://repo1.maven.org/maven2/org/apache/mina/mina-core/2.0.14/mina-core-2.0.14.jar
:buildSrc:clean UP-TO-DATE
:buildSrc:compileJava NO-SOURCE
:buildSrc:compileGroovy
:buildSrc:processResources NO-SOURCE
:buildSrc:classes
:buildSrc:jar
:buildSrc:assemble
:buildSrc:compileTestJava NO-SOURCE
:buildSrc:compileTestGroovy NO-SOURCE
:buildSrc:processTestResources NO-SOURCE
:buildSrc:testClasses UP-TO-DATE
:buildSrc:test NO-SOURCE
:buildSrc:check UP-TO-DATE
:buildSrc:build
Download https://plugins.gradle.org/m2/gradle/plugin/org/nosphere/apache/creadur-rat-gradle/0.2.0/creadur-rat-gradle-0.2.0.pom
Download https://plugins.gradle.org/m2/com/bmuschko/gradle-nexus-plugin/2.3.1/gradle-nexus-plugin-2.3.1.pom
Download https://plugins.gradle.org/m2/org/sonarsource/scanner/gradle/sonarqube-gradle-plugin/2.0.1/sonarqube-gradle-plugin-2.0.1.pom
Download https://plugins.gradle.org/m2/com/diffplug/gradle/spotless/spotless/2.2.0/spotless-2.2.0.pom
Download https://plugins.gradle.org/m2/me/champeau/gradle/jmh-gradle-plugin/0.3.1/jmh-gradle-plugin-0.3.1.pom
Download https://plugins.gradle.org/m2/com/pedjak/gradle/plugins/dockerized-test/0.5.4/dockerized-test-0.5.4.pom
Download https://plugins.gradle.org/m2/gradle/plugin/com/github/upthewaterspout/jpfgradle/jpfgradle/0.3/jpfgradle-0.3.pom
Download https://plugins.gradle.org/m2/org/sonarsource/scanner/api/sonar-scanner-api/2.6/sonar-scanner-api-2.6.pom
Download https://plugins.gradle.org/m2/org/sonarsource/scanner/api/sonar-scanner-api-parent/2.6/sonar-scanner-api-parent-2.6.pom
Download https://plugins.gradle.org/m2/org/sonarsource/parent/parent/31/parent-31.pom
Download https://plugins.gradle.org/m2/com/diffplug/durian/durian-core/1.2.0/durian-core-1.2.0.pom
Download https://plugins.gradle.org/m2/com/diffplug/durian/durian-io/1.2.0/durian-io-1.2.0.pom
Download https://plugins.gradle.org/m2/com/diffplug/freshmark/freshmark/1.3.1/freshmark-1.3.1.pom
Download https://plugins.gradle.org/m2/org/eclipse/jgit/org.eclipse.jgit/4.4.1.201607150455-r/org.eclipse.jgit-4.4.1.201607150455-r.pom
Download https://plugins.gradle.org/m2/org/eclipse/jgit/org.eclipse.jgit-parent/4.4.1.201607150455-r/org.eclipse.jgit-parent-4.4.1.201607150455-r.pom
Download https://plugins.gradle.org/m2/com/github/docker-java/docker-java/3.0.6/docker-java-3.0.6.pom
Download https://plugins.gradle.org/m2/com/diffplug/durian/durian-collect/1.2.0/durian-collect-1.2.0.pom
Download https://plugins.gradle.org/m2/com/diffplug/jscriptbox/jscriptbox/3.0.0/jscriptbox-3.0.0.pom
Download https://plugins.gradle.org/m2/args4j/args4j/2.33/args4j-2.33.pom
Download https://plugins.gradle.org/m2/args4j/args4j-site/2.33/args4j-site-2.33.pom
Download https://plugins.gradle.org/m2/org/kohsuke/pom/14/pom-14.pom
Download https://plugins.gradle.org/m2/com/jcraft/jsch/0.1.53/jsch-0.1.53.pom
Download https://plugins.gradle.org/m2/com/fasterxml/jackson/jaxrs/jackson-jaxrs-json-provider/2.6.4/jackson-jaxrs-json-provider-2.6.4.pom
Download https://plugins.gradle.org/m2/com/fasterxml/jackson/jaxrs/jackson-jaxrs-providers/2.6.4/jackson-jaxrs-providers-2.6.4.pom
Download https://plugins.gradle.org/m2/org/glassfish/jersey/connectors/jersey-apache-connector/2.23.1/jersey-apache-connector-2.23.1.pom
Download https://plugins.gradle.org/m2/org/glassfish/jersey/connectors/project/2.23.1/project-2.23.1.pom
Download https://plugins.gradle.org/m2/org/glassfish/jersey/project/2.23.1/project-2.23.1.pom
Download https://plugins.gradle.org/m2/org/glassfish/jersey/core/jersey-client/2.23.1/jersey-client-2.23.1.pom
Download https://plugins.gradle.org/m2/com/kohlschutter/junixsocket/junixsocket-common/2.0.4/junixsocket-common-2.0.4.pom
Download https://plugins.gradle.org/m2/com/kohlschutter/junixsocket/junixsocket-parent/2.0.4/junixsocket-parent-2.0.4.pom
Download https://plugins.gradle.org/m2/com/kohlschutter/kohlschutter-parent/1.1/kohlschutter-parent-1.1.pom
Download https://plugins.gradle.org/m2/com/kohlschutter/junixsocket/junixsocket-native-common/2.0.4/junixsocket-native-common-2.0.4.pom
Download https://plugins.gradle.org/m2/io/netty/netty-codec-http/4.1.3.Final/netty-codec-http-4.1.3.Final.pom
Download https://plugins.gradle.org/m2/io/netty/netty-parent/4.1.3.Final/netty-parent-4.1.3.Final.pom
Download https://plugins.gradle.org/m2/io/netty/netty-handler/4.1.3.Final/netty-handler-4.1.3.Final.pom
Download https://plugins.gradle.org/m2/io/netty/netty-handler-proxy/4.1.3.Final/netty-handler-proxy-4.1.3.Final.pom
Download https://plugins.gradle.org/m2/io/netty/netty-transport-native-epoll/4.1.3.Final/netty-transport-native-epoll-4.1.3.Final.pom
Download https://plugins.gradle.org/m2/com/fasterxml/jackson/jaxrs/jackson-jaxrs-base/2.6.4/jackson-jaxrs-base-2.6.4.pom
Download https://plugins.gradle.org/m2/com/fasterxml/jackson/core/jackson-core/2.6.4/jackson-core-2.6.4.pom
Download https://plugins.gradle.org/m2/com/fasterxml/jackson/core/jackson-databind/2.6.4/jackson-databind-2.6.4.pom
Download https://plugins.gradle.org/m2/com/fasterxml/jackson/module/jackson-module-jaxb-annotations/2.6.4/jackson-module-jaxb-annotations-2.6.4.pom
Download https://plugins.gradle.org/m2/org/glassfish/jersey/core/jersey-common/2.23.1/jersey-common-2.23.1.pom
Download https://plugins.gradle.org/m2/org/scijava/native-lib-loader/2.0.2/native-lib-loader-2.0.2.pom
Download https://plugins.gradle.org/m2/org/scijava/pom-scijava/3.1/pom-scijava-3.1.pom
Download https://plugins.gradle.org/m2/io/netty/netty-codec/4.1.3.Final/netty-codec-4.1.3.Final.pom
Download https://plugins.gradle.org/m2/io/netty/netty-buffer/4.1.3.Final/netty-buffer-4.1.3.Final.pom
Download https://plugins.gradle.org/m2/io/netty/netty-transport/4.1.3.Final/netty-transport-4.1.3.Final.pom
Download https://plugins.gradle.org/m2/io/netty/netty-codec-socks/4.1.3.Final/netty-codec-socks-4.1.3.Final.pom
Download https://plugins.gradle.org/m2/io/netty/netty-common/4.1.3.Final/netty-common-4.1.3.Final.pom
Download https://plugins.gradle.org/m2/org/glassfish/jersey/bundles/repackaged/jersey-guava/2.23.1/jersey-guava-2.23.1.pom
Download https://plugins.gradle.org/m2/org/glassfish/jersey/bundles/repackaged/project/2.23.1/project-2.23.1.pom
Download https://plugins.gradle.org/m2/org/glassfish/jersey/bundles/project/2.23.1/project-2.23.1.pom
Download https://plugins.gradle.org/m2/io/netty/netty-resolver/4.1.3.Final/netty-resolver-4.1.3.Final.pom
Download https://plugins.gradle.org/m2/org/apache/httpcomponents/httpclient/4.5/httpclient-4.5.pom
Download https://plugins.gradle.org/m2/org/apache/httpcomponents/httpcomponents-client/4.5/httpcomponents-client-4.5.pom
Download https://plugins.gradle.org/m2/gradle/plugin/org/nosphere/apache/creadur-rat-gradle/0.2.0/creadur-rat-gradle-0.2.0.jar
Download https://plugins.gradle.org/m2/com/bmuschko/gradle-nexus-plugin/2.3.1/gradle-nexus-plugin-2.3.1.jar
Download https://plugins.gradle.org/m2/org/sonarsource/scanner/gradle/sonarqube-gradle-plugin/2.0.1/sonarqube-gradle-plugin-2.0.1.jar
Download https://plugins.gradle.org/m2/com/diffplug/gradle/spotless/spotless/2.2.0/spotless-2.2.0.jar
Download https://plugins.gradle.org/m2/me/champeau/gradle/jmh-gradle-plugin/0.3.1/jmh-gradle-plugin-0.3.1.jar
Download https://plugins.gradle.org/m2/com/pedjak/gradle/plugins/dockerized-test/0.5.4/dockerized-test-0.5.4.jar
Download https://plugins.gradle.org/m2/gradle/plugin/com/github/upthewaterspout/jpfgradle/jpfgradle/0.3/jpfgradle-0.3.jar
Download https://plugins.gradle.org/m2/org/sonarsource/scanner/api/sonar-scanner-api/2.6/sonar-scanner-api-2.6.jar
Download https://plugins.gradle.org/m2/com/diffplug/durian/durian-core/1.2.0/durian-core-1.2.0.jar
Download https://plugins.gradle.org/m2/com/diffplug/durian/durian-io/1.2.0/durian-io-1.2.0.jar
Download https://plugins.gradle.org/m2/com/diffplug/freshmark/freshmark/1.3.1/freshmark-1.3.1.jar
Download https://plugins.gradle.org/m2/org/eclipse/jgit/org.eclipse.jgit/4.4.1.201607150455-r/org.eclipse.jgit-4.4.1.201607150455-r.jar
Download https://plugins.gradle.org/m2/com/github/docker-java/docker-java/3.0.6/docker-java-3.0.6.jar
Download https://plugins.gradle.org/m2/com/diffplug/durian/durian-collect/1.2.0/durian-collect-1.2.0.jar
Download https://plugins.gradle.org/m2/com/diffplug/jscriptbox/jscriptbox/3.0.0/jscriptbox-3.0.0.jar
Download https://plugins.gradle.org/m2/args4j/args4j/2.33/args4j-2.33.jar
Download https://plugins.gradle.org/m2/com/jcraft/jsch/0.1.53/jsch-0.1.53.jar
Download https://plugins.gradle.org/m2/com/fasterxml/jackson/jaxrs/jackson-jaxrs-json-provider/2.6.4/jackson-jaxrs-json-provider-2.6.4.jar
Download https://plugins.gradle.org/m2/org/glassfish/jersey/connectors/jersey-apache-connector/2.23.1/jersey-apache-connector-2.23.1.jar
Download https://plugins.gradle.org/m2/org/glassfish/jersey/core/jersey-client/2.23.1/jersey-client-2.23.1.jar
Download https://plugins.gradle.org/m2/com/kohlschutter/junixsocket/junixsocket-common/2.0.4/junixsocket-common-2.0.4.jar
Download https://plugins.gradle.org/m2/com/kohlschutter/junixsocket/junixsocket-native-common/2.0.4/junixsocket-native-common-2.0.4.jar
Download https://plugins.gradle.org/m2/io/netty/netty-codec-http/4.1.3.Final/netty-codec-http-4.1.3.Final.jar
Download https://plugins.gradle.org/m2/io/netty/netty-handler/4.1.3.Final/netty-handler-4.1.3.Final.jar
Download https://plugins.gradle.org/m2/io/netty/netty-handler-proxy/4.1.3.Final/netty-handler-proxy-4.1.3.Final.jar
Download https://plugins.gradle.org/m2/io/netty/netty-transport-native-epoll/4.1.3.Final/netty-transport-native-epoll-4.1.3.Final-linux-x86_64.jar
Download https://plugins.gradle.org/m2/com/fasterxml/jackson/jaxrs/jackson-jaxrs-base/2.6.4/jackson-jaxrs-base-2.6.4.jar
Download https://plugins.gradle.org/m2/com/fasterxml/jackson/core/jackson-core/2.6.4/jackson-core-2.6.4.jar
Download https://plugins.gradle.org/m2/com/fasterxml/jackson/core/jackson-databind/2.6.4/jackson-databind-2.6.4.jar
Download https://plugins.gradle.org/m2/com/fasterxml/jackson/module/jackson-module-jaxb-annotations/2.6.4/jackson-module-jaxb-annotations-2.6.4.jar
Download https://plugins.gradle.org/m2/org/glassfish/jersey/core/jersey-common/2.23.1/jersey-common-2.23.1.jar
Download https://plugins.gradle.org/m2/org/scijava/native-lib-loader/2.0.2/native-lib-loader-2.0.2.jar
Download https://plugins.gradle.org/m2/io/netty/netty-codec/4.1.3.Final/netty-codec-4.1.3.Final.jar
Download https://plugins.gradle.org/m2/io/netty/netty-buffer/4.1.3.Final/netty-buffer-4.1.3.Final.jar
Download https://plugins.gradle.org/m2/io/netty/netty-transport/4.1.3.Final/netty-transport-4.1.3.Final.jar
Download https://plugins.gradle.org/m2/io/netty/netty-codec-socks/4.1.3.Final/netty-codec-socks-4.1.3.Final.jar
Download https://plugins.gradle.org/m2/io/netty/netty-common/4.1.3.Final/netty-common-4.1.3.Final.jar
Download https://plugins.gradle.org/m2/org/glassfish/jersey/bundles/repackaged/jersey-guava/2.23.1/jersey-guava-2.23.1.jar
Download https://plugins.gradle.org/m2/io/netty/netty-resolver/4.1.3.Final/netty-resolver-4.1.3.Final.jar
Download https://plugins.gradle.org/m2/org/apache/httpcomponents/httpclient/4.5/httpclient-4.5.jar
Download https://plugins.gradle.org/m2/org/ajoberstar/gradle-git/1.3.2/gradle-git-1.3.2.pom
Download https://plugins.gradle.org/m2/org/ajoberstar/grgit/1.4.1/grgit-1.4.1.pom
Download https://plugins.gradle.org/m2/com/github/zafarkhaja/java-semver/0.9.0/java-semver-0.9.0.pom
Download https://plugins.gradle.org/m2/org/eclipse/jgit/org.eclipse.jgit/4.0.1.201506240215-r/org.eclipse.jgit-4.0.1.201506240215-r.pom
Download https://plugins.gradle.org/m2/org/eclipse/jgit/org.eclipse.jgit-parent/4.0.1.201506240215-r/org.eclipse.jgit-parent-4.0.1.201506240215-r.pom
Download https://plugins.gradle.org/m2/org/eclipse/jgit/org.eclipse.jgit.ui/4.0.1.201506240215-r/org.eclipse.jgit.ui-4.0.1.201506240215-r.pom
Download https://plugins.gradle.org/m2/com/jcraft/jsch.agentproxy.jsch/0.0.9/jsch.agentproxy.jsch-0.0.9.pom
Download https://plugins.gradle.org/m2/com/jcraft/jsch.agentproxy/0.0.9/jsch.agentproxy-0.0.9.pom
Download https://plugins.gradle.org/m2/com/jcraft/jsch.agentproxy.pageant/0.0.9/jsch.agentproxy.pageant-0.0.9.pom
Download https://plugins.gradle.org/m2/com/jcraft/jsch.agentproxy.sshagent/0.0.9/jsch.agentproxy.sshagent-0.0.9.pom
Download https://plugins.gradle.org/m2/com/jcraft/jsch.agentproxy.usocket-jna/0.0.9/jsch.agentproxy.usocket-jna-0.0.9.pom
Download https://plugins.gradle.org/m2/com/jcraft/jsch.agentproxy.usocket-nc/0.0.9/jsch.agentproxy.usocket-nc-0.0.9.pom
Download https://plugins.gradle.org/m2/com/jcraft/jsch/0.1.51/jsch-0.1.51.pom
Download https://plugins.gradle.org/m2/com/jcraft/jsch.agentproxy.core/0.0.9/jsch.agentproxy.core-0.0.9.pom
Download https://plugins.gradle.org/m2/org/ajoberstar/gradle-git/1.3.2/gradle-git-1.3.2.jar
Download https://plugins.gradle.org/m2/org/ajoberstar/grgit/1.4.1/grgit-1.4.1.jar
Download https://plugins.gradle.org/m2/com/github/zafarkhaja/java-semver/0.9.0/java-semver-0.9.0.jar
Download https://plugins.gradle.org/m2/org/eclipse/jgit/org.eclipse.jgit/4.0.1.201506240215-r/org.eclipse.jgit-4.0.1.201506240215-r.jar
Download https://plugins.gradle.org/m2/org/eclipse/jgit/org.eclipse.jgit.ui/4.0.1.201506240215-r/org.eclipse.jgit.ui-4.0.1.201506240215-r.jar
Download https://plugins.gradle.org/m2/com/jcraft/jsch.agentproxy.jsch/0.0.9/jsch.agentproxy.jsch-0.0.9.jar
Download https://plugins.gradle.org/m2/com/jcraft/jsch.agentproxy.pageant/0.0.9/jsch.agentproxy.pageant-0.0.9.jar
Download https://plugins.gradle.org/m2/com/jcraft/jsch.agentproxy.sshagent/0.0.9/jsch.agentproxy.sshagent-0.0.9.jar
Download https://plugins.gradle.org/m2/com/jcraft/jsch.agentproxy.usocket-jna/0.0.9/jsch.agentproxy.usocket-jna-0.0.9.jar
Download https://plugins.gradle.org/m2/com/jcraft/jsch.agentproxy.usocket-nc/0.0.9/jsch.agentproxy.usocket-nc-0.0.9.jar
Download https://plugins.gradle.org/m2/com/jcraft/jsch/0.1.51/jsch-0.1.51.jar
Download https://plugins.gradle.org/m2/com/jcraft/jsch.agentproxy.core/0.0.9/jsch.agentproxy.core-0.0.9.jar
Download https://repo1.maven.org/maven2/org/apache/geode/apache-geode/1.2.0/apache-geode-1.2.0.pom
Download https://repo1.maven.org/maven2/org/apache/geode/apache-geode/1.2.0/apache-geode-1.2.0.zip
Download https://repo1.maven.org/maven2/com/google/protobuf/protobuf-gradle-plugin/0.8.1/protobuf-gradle-plugin-0.8.1.pom
Download https://repo1.maven.org/maven2/com/google/gradle/osdetector-gradle-plugin/1.4.0/osdetector-gradle-plugin-1.4.0.pom
Download https://repo1.maven.org/maven2/kr/motd/maven/os-maven-plugin/1.4.0.Final/os-maven-plugin-1.4.0.Final.pom
Download https://repo1.maven.org/maven2/com/google/protobuf/protobuf-gradle-plugin/0.8.1/protobuf-gradle-plugin-0.8.1.jar
Download https://repo1.maven.org/maven2/com/google/gradle/osdetector-gradle-plugin/1.4.0/osdetector-gradle-plugin-1.4.0.jar
Download https://repo1.maven.org/maven2/kr/motd/maven/os-maven-plugin/1.4.0.Final/os-maven-plugin-1.4.0.Final.jar
FAILURE: Build failed with an exception.
* What went wrong:
Failed to notify task execution graph listener.
> A GnuPG key ID is required for signing. Please set signing.keyId=xxxxxxxx in <USER_HOME>/.gradle/gradle.properties.
> A GnuPG key ID is required for signing. Please set signing.keyId=xxxxxxxx in <USER_HOME>/.gradle/gradle.properties.
> A GnuPG key ID is required for signing. Please set signing.keyId=xxxxxxxx in <USER_HOME>/.gradle/gradle.properties.
> A GnuPG key ID is required for signing. Please set signing.keyId=xxxxxxxx in <USER_HOME>/.gradle/gradle.properties.
> A GnuPG key ID is required for signing. Please set signing.keyId=xxxxxxxx in <USER_HOME>/.gradle/gradle.properties.
> A GnuPG key ID is required for signing. Please set signing.keyId=xxxxxxxx in <USER_HOME>/.gradle/gradle.properties.
> A GnuPG key ID is required for signing. Please set signing.keyId=xxxxxxxx in <USER_HOME>/.gradle/gradle.properties.
> A GnuPG key ID is required for signing. Please set signing.keyId=xxxxxxxx in <USER_HOME>/.gradle/gradle.properties.
> A GnuPG key ID is required for signing. Please set signing.keyId=xxxxxxxx in <USER_HOME>/.gradle/gradle.properties.
> A GnuPG key ID is required for signing. Please set signing.keyId=xxxxxxxx in <USER_HOME>/.gradle/gradle.properties.
> A GnuPG key ID is required for signing. Please set signing.keyId=xxxxxxxx in <USER_HOME>/.gradle/gradle.properties.
> A GnuPG key ID is required for signing. Please set signing.keyId=xxxxxxxx in <USER_HOME>/.gradle/gradle.properties.
> A GnuPG key ID is required for signing. Please set signing.keyId=xxxxxxxx in <USER_HOME>/.gradle/gradle.properties.
> A GnuPG key ID is required for signing. Please set signing.keyId=xxxxxxxx in <USER_HOME>/.gradle/gradle.properties.
> A GnuPG key ID is required for signing. Please set signing.keyId=xxxxxxxx in <USER_HOME>/.gradle/gradle.properties.
> A GnuPG key ID is required for signing. Please set signing.keyId=xxxxxxxx in <USER_HOME>/.gradle/gradle.properties.
> A GnuPG key ID is required for signing. Please set signing.keyId=xxxxxxxx in <USER_HOME>/.gradle/gradle.properties.
> A GnuPG key ID is required for signing. Please set signing.keyId=xxxxxxxx in <USER_HOME>/.gradle/gradle.properties.
> A GnuPG key ID is required for signing. Please set signing.keyId=xxxxxxxx in <USER_HOME>/.gradle/gradle.properties.
> A GnuPG key ID is required for signing. Please set signing.keyId=xxxxxxxx in <USER_HOME>/.gradle/gradle.properties.
> A GnuPG key ID is required for signing. Please set signing.keyId=xxxxxxxx in <USER_HOME>/.gradle/gradle.properties.
> A GnuPG key ID is required for signing. Please set signing.keyId=xxxxxxxx in <USER_HOME>/.gradle/gradle.properties.
> A GnuPG key ID is required for signing. Please set signing.keyId=xxxxxxxx in <USER_HOME>/.gradle/gradle.properties.
> A GnuPG key ID is required for signing. Please set signing.keyId=xxxxxxxx in <USER_HOME>/.gradle/gradle.properties.
> A GnuPG key ID is required for signing. Please set signing.keyId=xxxxxxxx in <USER_HOME>/.gradle/gradle.properties.
* Try:
Run with --stacktrace option to get the stack trace. Run with --info or --debug option to get more log output.
BUILD FAILED
Total time: 2 mins 21.45 secs
Build step 'Invoke Gradle script' changed build result to FAILURE
Build step 'Invoke Gradle script' marked build as failure
Archiving artifacts
Recording test results
ERROR: Step ?Publish JUnit test result report? failed: No test report files were found. Configuration error?
Not sending mail to unregistered user github@nakomis.com
Not sending mail to unregistered user kohlmu-pivotal@users.noreply.github.com