You are viewing a plain text version of this content. The canonical link for it is here.
Posted to dev@nutch.apache.org by Apache Jenkins Server <je...@builds.apache.org> on 2014/06/10 06:05:54 UTC

Build failed in Jenkins: Nutch-nutchgora #1037

See <https://builds.apache.org/job/Nutch-nutchgora/1037/>

------------------------------------------
[...truncated 3102 lines...]
init-plugin:

clean-lib:

resolve-default:
[ivy:resolve] :: loading settings :: file = <https://builds.apache.org/job/Nutch-nutchgora/ws/2.x/ivy/ivysettings.xml>

compile:

jar:

deps-test:

deploy:

copy-generated-lib:

deploy:
     [copy] Copying 1 file to <https://builds.apache.org/job/Nutch-nutchgora/ws/2.x/build/plugins/urlnormalizer-regex>

copy-generated-lib:
     [copy] Copying 1 file to <https://builds.apache.org/job/Nutch-nutchgora/ws/2.x/build/plugins/urlnormalizer-regex>

compile:

job:
      [jar] Building jar: <https://builds.apache.org/job/Nutch-nutchgora/ws/2.x/build/apache-nutch-2.3-SNAPSHOT.job>

resolve-test:
  [taskdef] Could not load definitions from resource org/sonar/ant/antlib.xml. It could not be found.

copy-libs:

compile-core-test:
    [javac] Compiling 34 source files to <https://builds.apache.org/job/Nutch-nutchgora/ws/2.x/build/test/classes>
    [javac] warning: [options] bootstrap class path not set in conjunction with -source 1.6
    [javac] 1 warning

test-core:
    [mkdir] Created dir: <https://builds.apache.org/job/Nutch-nutchgora/ws/2.x/build/test/data>
     [copy] Copying 90 files to <https://builds.apache.org/job/Nutch-nutchgora/ws/2.x/build/test/data>
     [copy] Copying 1 file to <https://builds.apache.org/job/Nutch-nutchgora/ws/2.x/build/test/classes>
     [copy] Copying 1 file to <https://builds.apache.org/job/Nutch-nutchgora/ws/2.x/build/test/classes>
     [copy] Copying 1 file to <https://builds.apache.org/job/Nutch-nutchgora/ws/2.x/build/test/classes>
     [copy] Copying 1 file to <https://builds.apache.org/job/Nutch-nutchgora/ws/2.x/build/test/classes>
     [copy] Copying 1 file to <https://builds.apache.org/job/Nutch-nutchgora/ws/2.x/build/test/classes>
     [copy] Copying 1 file to <https://builds.apache.org/job/Nutch-nutchgora/ws/2.x/build/test/classes>
    [junit] Running org.apache.nutch.api.TestAPI
    [junit] Tests run: 1, Failures: 0, Errors: 0, Time elapsed: 0.021 sec
    [junit] Running org.apache.nutch.crawl.TestAdaptiveFetchSchedule
    [junit] Tests run: 1, Failures: 0, Errors: 0, Time elapsed: 0.527 sec
    [junit] Running org.apache.nutch.crawl.TestGenerator
    [junit] Tests run: 0, Failures: 0, Errors: 0, Time elapsed: 0.011 sec
    [junit] Running org.apache.nutch.crawl.TestInjector
    [junit] Tests run: 0, Failures: 0, Errors: 0, Time elapsed: 0.012 sec
    [junit] Running org.apache.nutch.crawl.TestSignatureFactory
    [junit] Tests run: 1, Failures: 0, Errors: 0, Time elapsed: 0.248 sec
    [junit] Running org.apache.nutch.crawl.TestURLPartitioner
    [junit] Tests run: 7, Failures: 0, Errors: 0, Time elapsed: 1.63 sec
    [junit] Running org.apache.nutch.crawl.TestUrlWithScore
    [junit] Tests run: 4, Failures: 0, Errors: 0, Time elapsed: 0.12 sec
    [junit] Running org.apache.nutch.fetcher.TestFetcher
    [junit] Tests run: 1, Failures: 0, Errors: 0, Time elapsed: 0.958 sec
    [junit] Running org.apache.nutch.indexer.TestIndexingFilters
    [junit] Tests run: 3, Failures: 0, Errors: 0, Time elapsed: 0.885 sec
    [junit] Running org.apache.nutch.metadata.TestMetadata
    [junit] Tests run: 10, Failures: 0, Errors: 0, Time elapsed: 0.161 sec
    [junit] Running org.apache.nutch.metadata.TestSpellCheckedMetadata
    [junit] Tests run: 11, Failures: 0, Errors: 0, Time elapsed: 2.8 sec
    [junit] Running org.apache.nutch.net.TestURLFilters
    [junit] Tests run: 1, Failures: 0, Errors: 0, Time elapsed: 0.531 sec
    [junit] Running org.apache.nutch.net.TestURLNormalizers
    [junit] Tests run: 1, Failures: 0, Errors: 0, Time elapsed: 0.379 sec
    [junit] Running org.apache.nutch.parse.TestOutlinkExtractor
    [junit] Tests run: 3, Failures: 0, Errors: 0, Time elapsed: 0.052 sec
    [junit] Running org.apache.nutch.parse.TestParserFactory
    [junit] Tests run: 2, Failures: 0, Errors: 0, Time elapsed: 0.971 sec
    [junit] Running org.apache.nutch.plugin.TestPluginSystem
    [junit] Tests run: 7, Failures: 0, Errors: 0, Time elapsed: 1.06 sec
    [junit] Running org.apache.nutch.protocol.TestContent
    [junit] Tests run: 2, Failures: 0, Errors: 0, Time elapsed: 0.531 sec
    [junit] Running org.apache.nutch.protocol.TestProtocolFactory
    [junit] Tests run: 2, Failures: 0, Errors: 0, Time elapsed: 0.881 sec
    [junit] Running org.apache.nutch.storage.TestGoraStorage
    [junit] Tests run: 0, Failures: 0, Errors: 0, Time elapsed: 0.012 sec
    [junit] Running org.apache.nutch.util.TestEncodingDetector
    [junit] Tests run: 1, Failures: 0, Errors: 0, Time elapsed: 0.493 sec
    [junit] Running org.apache.nutch.util.TestGZIPUtils
    [junit] Tests run: 4, Failures: 0, Errors: 0, Time elapsed: 0.559 sec
    [junit] Running org.apache.nutch.util.TestNodeWalker
    [junit] Tests run: 1, Failures: 0, Errors: 0, Time elapsed: 0.217 sec
    [junit] Running org.apache.nutch.util.TestPrefixStringMatcher
    [junit] Tests run: 1, Failures: 0, Errors: 0, Time elapsed: 0.091 sec
    [junit] Running org.apache.nutch.util.TestStringUtil
    [junit] Tests run: 2, Failures: 0, Errors: 0, Time elapsed: 0.021 sec
    [junit] Running org.apache.nutch.util.TestSuffixStringMatcher
    [junit] Tests run: 1, Failures: 0, Errors: 0, Time elapsed: 0.087 sec
    [junit] Running org.apache.nutch.util.TestTableUtil
    [junit] Tests run: 2, Failures: 0, Errors: 0, Time elapsed: 0.048 sec
    [junit] Running org.apache.nutch.util.TestURLUtil
    [junit] Tests run: 7, Failures: 0, Errors: 0, Time elapsed: 0.738 sec

test-plugins:

test:

init:

init-plugin:

deps-jar:

clean-lib:

resolve-default:
[ivy:resolve] :: loading settings :: file = <https://builds.apache.org/job/Nutch-nutchgora/ws/2.x/ivy/ivysettings.xml>

compile:
     [echo] Compiling plugin: creativecommons

compile-test:
    [javac] Compiling 1 source file to <https://builds.apache.org/job/Nutch-nutchgora/ws/2.x/build/creativecommons/test>
    [javac] warning: [options] bootstrap class path not set in conjunction with -source 1.6
    [javac] 1 warning

jar:

deps-test:

init:

init-plugin:

clean-lib:

resolve-default:
[ivy:resolve] :: loading settings :: file = <https://builds.apache.org/job/Nutch-nutchgora/ws/2.x/ivy/ivysettings.xml>

compile:

jar:

deps-test:

deploy:

copy-generated-lib:

deploy:

copy-generated-lib:

test:
     [echo] Testing plugin: creativecommons
    [junit] Running org.creativecommons.nutch.TestCCParseFilter
    [junit] Tests run: 1, Failures: 0, Errors: 0, Time elapsed: 2.365 sec

init:

init-plugin:

deps-jar:

clean-lib:

resolve-default:
[ivy:resolve] :: loading settings :: file = <https://builds.apache.org/job/Nutch-nutchgora/ws/2.x/ivy/ivysettings.xml>

compile:
     [echo] Compiling plugin: parse-tika

compile-test:
    [javac] Compiling 7 source files to <https://builds.apache.org/job/Nutch-nutchgora/ws/2.x/build/parse-tika/test>
    [javac] warning: [options] bootstrap class path not set in conjunction with -source 1.6
    [javac] 1 warning

jar:

deps-test:

init:

init-plugin:

clean-lib:

resolve-default:
[ivy:resolve] :: loading settings :: file = <https://builds.apache.org/job/Nutch-nutchgora/ws/2.x/ivy/ivysettings.xml>

compile:

jar:

deps-test:

deploy:

copy-generated-lib:

init:

init-plugin:

deps-jar:

clean-lib:

resolve-default:
[ivy:resolve] :: loading settings :: file = <https://builds.apache.org/job/Nutch-nutchgora/ws/2.x/ivy/ivysettings.xml>

compile:
     [echo] Compiling plugin: protocol-file

jar:

deps-test:

deploy:

copy-generated-lib:

deploy:

copy-generated-lib:

test:
     [echo] Testing plugin: parse-tika
    [junit] Running org.apache.nutch.parse.tika.TestImageMetadata
    [junit] Tests run: 1, Failures: 0, Errors: 1, Time elapsed: 1.717 sec
    [junit] Test org.apache.nutch.parse.tika.TestImageMetadata FAILED
    [junit] Running org.apache.nutch.parse.tika.TestMSWordParser
    [junit] Tests run: 2, Failures: 0, Errors: 0, Time elapsed: 2.587 sec
    [junit] Running org.apache.nutch.parse.tika.TestOOParser
    [junit] Tests run: 1, Failures: 0, Errors: 0, Time elapsed: 2.116 sec
    [junit] Running org.apache.nutch.parse.tika.TestPdfParser
    [junit] Tests run: 1, Failures: 0, Errors: 0, Time elapsed: 3.102 sec
    [junit] Running org.apache.nutch.parse.tika.TestRSSParser
    [junit] Tests run: 1, Failures: 0, Errors: 0, Time elapsed: 2.034 sec
    [junit] Running org.apache.nutch.parse.tika.TestRTFParser
    [junit] Tests run: 1, Failures: 0, Errors: 0, Time elapsed: 2.425 sec

BUILD FAILED
<https://builds.apache.org/job/Nutch-nutchgora/ws/2.x/build.xml>:437: The following error occurred while executing this line:
<https://builds.apache.org/job/Nutch-nutchgora/ws/2.x/src/plugin/build.xml>:78: The following error occurred while executing this line:
<https://builds.apache.org/job/Nutch-nutchgora/ws/2.x/src/plugin/build-plugin.xml>:207: Tests failed!

Total time: 1 minute 25 seconds
Build step 'Invoke Ant' marked build as failure
Publishing Javadoc

Jenkins build is back to normal : Nutch-nutchgora #1049

Posted by Apache Jenkins Server <je...@builds.apache.org>.
See <https://builds.apache.org/job/Nutch-nutchgora/1049/changes>


Build failed in Jenkins: Nutch-nutchgora #1048

Posted by Apache Jenkins Server <je...@builds.apache.org>.
See <https://builds.apache.org/job/Nutch-nutchgora/1048/>

------------------------------------------
[...truncated 3126 lines...]
init-plugin:

clean-lib:

resolve-default:
[ivy:resolve] :: loading settings :: file = <https://builds.apache.org/job/Nutch-nutchgora/ws/2.x/ivy/ivysettings.xml>

compile:

jar:

deps-test:

deploy:

copy-generated-lib:

deploy:
     [copy] Copying 1 file to <https://builds.apache.org/job/Nutch-nutchgora/ws/2.x/build/plugins/urlnormalizer-regex>

copy-generated-lib:
     [copy] Copying 1 file to <https://builds.apache.org/job/Nutch-nutchgora/ws/2.x/build/plugins/urlnormalizer-regex>

compile:

job:
      [jar] Building jar: <https://builds.apache.org/job/Nutch-nutchgora/ws/2.x/build/apache-nutch-2.3-SNAPSHOT.job>

resolve-test:
  [taskdef] Could not load definitions from resource org/sonar/ant/antlib.xml. It could not be found.

copy-libs:

compile-core-test:
    [javac] Compiling 34 source files to <https://builds.apache.org/job/Nutch-nutchgora/ws/2.x/build/test/classes>
    [javac] warning: [options] bootstrap class path not set in conjunction with -source 1.6
    [javac] 1 warning

test-core:
    [mkdir] Created dir: <https://builds.apache.org/job/Nutch-nutchgora/ws/2.x/build/test/data>
     [copy] Copying 90 files to <https://builds.apache.org/job/Nutch-nutchgora/ws/2.x/build/test/data>
     [copy] Copying 1 file to <https://builds.apache.org/job/Nutch-nutchgora/ws/2.x/build/test/classes>
     [copy] Copying 1 file to <https://builds.apache.org/job/Nutch-nutchgora/ws/2.x/build/test/classes>
     [copy] Copying 1 file to <https://builds.apache.org/job/Nutch-nutchgora/ws/2.x/build/test/classes>
     [copy] Copying 1 file to <https://builds.apache.org/job/Nutch-nutchgora/ws/2.x/build/test/classes>
     [copy] Copying 1 file to <https://builds.apache.org/job/Nutch-nutchgora/ws/2.x/build/test/classes>
     [copy] Copying 1 file to <https://builds.apache.org/job/Nutch-nutchgora/ws/2.x/build/test/classes>
    [junit] Running org.apache.nutch.api.TestAPI
    [junit] Tests run: 1, Failures: 0, Errors: 0, Time elapsed: 0.021 sec
    [junit] Running org.apache.nutch.crawl.TestAdaptiveFetchSchedule
    [junit] Tests run: 1, Failures: 0, Errors: 0, Time elapsed: 0.528 sec
    [junit] Running org.apache.nutch.crawl.TestGenerator
    [junit] Tests run: 0, Failures: 0, Errors: 0, Time elapsed: 0.011 sec
    [junit] Running org.apache.nutch.crawl.TestInjector
    [junit] Tests run: 0, Failures: 0, Errors: 0, Time elapsed: 0.012 sec
    [junit] Running org.apache.nutch.crawl.TestSignatureFactory
    [junit] Tests run: 1, Failures: 0, Errors: 0, Time elapsed: 0.255 sec
    [junit] Running org.apache.nutch.crawl.TestURLPartitioner
    [junit] Tests run: 7, Failures: 0, Errors: 0, Time elapsed: 1.637 sec
    [junit] Running org.apache.nutch.crawl.TestUrlWithScore
    [junit] Tests run: 4, Failures: 0, Errors: 0, Time elapsed: 0.121 sec
    [junit] Running org.apache.nutch.fetcher.TestFetcher
    [junit] Tests run: 1, Failures: 0, Errors: 0, Time elapsed: 1.182 sec
    [junit] Running org.apache.nutch.indexer.TestIndexingFilters
    [junit] Tests run: 3, Failures: 0, Errors: 0, Time elapsed: 0.885 sec
    [junit] Running org.apache.nutch.metadata.TestMetadata
    [junit] Tests run: 10, Failures: 0, Errors: 0, Time elapsed: 0.118 sec
    [junit] Running org.apache.nutch.metadata.TestSpellCheckedMetadata
    [junit] Tests run: 11, Failures: 0, Errors: 0, Time elapsed: 3.036 sec
    [junit] Running org.apache.nutch.net.TestURLFilters
    [junit] Tests run: 1, Failures: 0, Errors: 0, Time elapsed: 0.533 sec
    [junit] Running org.apache.nutch.net.TestURLNormalizers
    [junit] Tests run: 1, Failures: 0, Errors: 0, Time elapsed: 0.377 sec
    [junit] Running org.apache.nutch.parse.TestOutlinkExtractor
    [junit] Tests run: 3, Failures: 0, Errors: 0, Time elapsed: 0.051 sec
    [junit] Running org.apache.nutch.parse.TestParserFactory
    [junit] Tests run: 2, Failures: 0, Errors: 0, Time elapsed: 1.013 sec
    [junit] Running org.apache.nutch.plugin.TestPluginSystem
    [junit] Tests run: 7, Failures: 0, Errors: 0, Time elapsed: 1.089 sec
    [junit] Running org.apache.nutch.protocol.TestContent
    [junit] Tests run: 2, Failures: 0, Errors: 0, Time elapsed: 0.548 sec
    [junit] Running org.apache.nutch.protocol.TestProtocolFactory
    [junit] Tests run: 2, Failures: 0, Errors: 0, Time elapsed: 0.883 sec
    [junit] Running org.apache.nutch.storage.TestGoraStorage
    [junit] Tests run: 0, Failures: 0, Errors: 0, Time elapsed: 0.012 sec
    [junit] Running org.apache.nutch.util.TestEncodingDetector
    [junit] Tests run: 1, Failures: 0, Errors: 0, Time elapsed: 1.389 sec
    [junit] Running org.apache.nutch.util.TestGZIPUtils
    [junit] Tests run: 4, Failures: 0, Errors: 0, Time elapsed: 0.563 sec
    [junit] Running org.apache.nutch.util.TestNodeWalker
    [junit] Tests run: 1, Failures: 0, Errors: 0, Time elapsed: 0.211 sec
    [junit] Running org.apache.nutch.util.TestPrefixStringMatcher
    [junit] Tests run: 1, Failures: 0, Errors: 0, Time elapsed: 0.087 sec
    [junit] Running org.apache.nutch.util.TestStringUtil
    [junit] Tests run: 2, Failures: 0, Errors: 0, Time elapsed: 0.022 sec
    [junit] Running org.apache.nutch.util.TestSuffixStringMatcher
    [junit] Tests run: 1, Failures: 0, Errors: 0, Time elapsed: 0.097 sec
    [junit] Running org.apache.nutch.util.TestTableUtil
    [junit] Tests run: 2, Failures: 0, Errors: 0, Time elapsed: 0.033 sec
    [junit] Running org.apache.nutch.util.TestURLUtil
    [junit] Tests run: 7, Failures: 0, Errors: 0, Time elapsed: 0.762 sec

test-plugins:

test:

init:

init-plugin:

deps-jar:

clean-lib:

resolve-default:
[ivy:resolve] :: loading settings :: file = <https://builds.apache.org/job/Nutch-nutchgora/ws/2.x/ivy/ivysettings.xml>

compile:
     [echo] Compiling plugin: creativecommons

compile-test:
    [javac] Compiling 1 source file to <https://builds.apache.org/job/Nutch-nutchgora/ws/2.x/build/creativecommons/test>
    [javac] warning: [options] bootstrap class path not set in conjunction with -source 1.6
    [javac] 1 warning

jar:

deps-test:

init:

init-plugin:

clean-lib:

resolve-default:
[ivy:resolve] :: loading settings :: file = <https://builds.apache.org/job/Nutch-nutchgora/ws/2.x/ivy/ivysettings.xml>

compile:

jar:

deps-test:

deploy:

copy-generated-lib:

deploy:

copy-generated-lib:

test:
     [echo] Testing plugin: creativecommons
    [junit] Running org.creativecommons.nutch.TestCCParseFilter
    [junit] Tests run: 1, Failures: 0, Errors: 0, Time elapsed: 2.323 sec

init:

init-plugin:

deps-jar:

clean-lib:

resolve-default:
[ivy:resolve] :: loading settings :: file = <https://builds.apache.org/job/Nutch-nutchgora/ws/2.x/ivy/ivysettings.xml>

compile:
     [echo] Compiling plugin: parse-tika

compile-test:
    [javac] Compiling 7 source files to <https://builds.apache.org/job/Nutch-nutchgora/ws/2.x/build/parse-tika/test>
    [javac] warning: [options] bootstrap class path not set in conjunction with -source 1.6
    [javac] 1 warning

jar:

deps-test:

init:

init-plugin:

clean-lib:

resolve-default:
[ivy:resolve] :: loading settings :: file = <https://builds.apache.org/job/Nutch-nutchgora/ws/2.x/ivy/ivysettings.xml>

compile:

jar:

deps-test:

deploy:

copy-generated-lib:

init:

init-plugin:

deps-jar:

clean-lib:

resolve-default:
[ivy:resolve] :: loading settings :: file = <https://builds.apache.org/job/Nutch-nutchgora/ws/2.x/ivy/ivysettings.xml>

compile:
     [echo] Compiling plugin: protocol-file

jar:

deps-test:

deploy:

copy-generated-lib:

deploy:

copy-generated-lib:

test:
     [echo] Testing plugin: parse-tika
    [junit] Running org.apache.nutch.parse.tika.TestImageMetadata
    [junit] Tests run: 1, Failures: 0, Errors: 1, Time elapsed: 1.864 sec
    [junit] Test org.apache.nutch.parse.tika.TestImageMetadata FAILED
    [junit] Running org.apache.nutch.parse.tika.TestMSWordParser
    [junit] Tests run: 2, Failures: 0, Errors: 0, Time elapsed: 2.493 sec
    [junit] Running org.apache.nutch.parse.tika.TestOOParser
    [junit] Tests run: 1, Failures: 0, Errors: 0, Time elapsed: 2.089 sec
    [junit] Running org.apache.nutch.parse.tika.TestPdfParser
    [junit] Tests run: 1, Failures: 0, Errors: 0, Time elapsed: 3.046 sec
    [junit] Running org.apache.nutch.parse.tika.TestRSSParser
    [junit] Tests run: 1, Failures: 0, Errors: 0, Time elapsed: 2.005 sec
    [junit] Running org.apache.nutch.parse.tika.TestRTFParser
    [junit] Tests run: 1, Failures: 0, Errors: 0, Time elapsed: 2.409 sec

BUILD FAILED
<https://builds.apache.org/job/Nutch-nutchgora/ws/2.x/build.xml>:448: The following error occurred while executing this line:
<https://builds.apache.org/job/Nutch-nutchgora/ws/2.x/src/plugin/build.xml>:78: The following error occurred while executing this line:
<https://builds.apache.org/job/Nutch-nutchgora/ws/2.x/src/plugin/build-plugin.xml>:207: Tests failed!

Total time: 1 minute 38 seconds
Build step 'Invoke Ant' marked build as failure
Publishing Javadoc

Build failed in Jenkins: Nutch-nutchgora #1047

Posted by Apache Jenkins Server <je...@builds.apache.org>.
See <https://builds.apache.org/job/Nutch-nutchgora/1047/>

------------------------------------------
[...truncated 3068 lines...]
init-plugin:

clean-lib:

resolve-default:
[ivy:resolve] :: loading settings :: file = <https://builds.apache.org/job/Nutch-nutchgora/ws/2.x/ivy/ivysettings.xml>

compile:

jar:

deps-test:

deploy:

copy-generated-lib:

deploy:
     [copy] Copying 1 file to <https://builds.apache.org/job/Nutch-nutchgora/ws/2.x/build/plugins/urlnormalizer-regex>

copy-generated-lib:
     [copy] Copying 1 file to <https://builds.apache.org/job/Nutch-nutchgora/ws/2.x/build/plugins/urlnormalizer-regex>

compile:

job:
      [jar] Building jar: <https://builds.apache.org/job/Nutch-nutchgora/ws/2.x/build/apache-nutch-2.3-SNAPSHOT.job>

resolve-test:
  [taskdef] Could not load definitions from resource org/sonar/ant/antlib.xml. It could not be found.

copy-libs:

compile-core-test:
    [javac] Compiling 34 source files to <https://builds.apache.org/job/Nutch-nutchgora/ws/2.x/build/test/classes>
    [javac] warning: [options] bootstrap class path not set in conjunction with -source 1.6
    [javac] 1 warning

test-core:
    [mkdir] Created dir: <https://builds.apache.org/job/Nutch-nutchgora/ws/2.x/build/test/data>
     [copy] Copying 90 files to <https://builds.apache.org/job/Nutch-nutchgora/ws/2.x/build/test/data>
     [copy] Copying 1 file to <https://builds.apache.org/job/Nutch-nutchgora/ws/2.x/build/test/classes>
     [copy] Copying 1 file to <https://builds.apache.org/job/Nutch-nutchgora/ws/2.x/build/test/classes>
     [copy] Copying 1 file to <https://builds.apache.org/job/Nutch-nutchgora/ws/2.x/build/test/classes>
     [copy] Copying 1 file to <https://builds.apache.org/job/Nutch-nutchgora/ws/2.x/build/test/classes>
     [copy] Copying 1 file to <https://builds.apache.org/job/Nutch-nutchgora/ws/2.x/build/test/classes>
     [copy] Copying 1 file to <https://builds.apache.org/job/Nutch-nutchgora/ws/2.x/build/test/classes>
    [junit] Running org.apache.nutch.api.TestAPI
    [junit] Tests run: 1, Failures: 0, Errors: 0, Time elapsed: 0.02 sec
    [junit] Running org.apache.nutch.crawl.TestAdaptiveFetchSchedule
    [junit] Tests run: 1, Failures: 0, Errors: 0, Time elapsed: 0.616 sec
    [junit] Running org.apache.nutch.crawl.TestGenerator
    [junit] Tests run: 0, Failures: 0, Errors: 0, Time elapsed: 0.011 sec
    [junit] Running org.apache.nutch.crawl.TestInjector
    [junit] Tests run: 0, Failures: 0, Errors: 0, Time elapsed: 0.012 sec
    [junit] Running org.apache.nutch.crawl.TestSignatureFactory
    [junit] Tests run: 1, Failures: 0, Errors: 0, Time elapsed: 0.249 sec
    [junit] Running org.apache.nutch.crawl.TestURLPartitioner
    [junit] Tests run: 7, Failures: 0, Errors: 0, Time elapsed: 1.434 sec
    [junit] Running org.apache.nutch.crawl.TestUrlWithScore
    [junit] Tests run: 4, Failures: 0, Errors: 0, Time elapsed: 0.132 sec
    [junit] Running org.apache.nutch.fetcher.TestFetcher
    [junit] Tests run: 1, Failures: 0, Errors: 0, Time elapsed: 1.311 sec
    [junit] Running org.apache.nutch.indexer.TestIndexingFilters
    [junit] Tests run: 3, Failures: 0, Errors: 0, Time elapsed: 0.891 sec
    [junit] Running org.apache.nutch.metadata.TestMetadata
    [junit] Tests run: 10, Failures: 0, Errors: 0, Time elapsed: 0.119 sec
    [junit] Running org.apache.nutch.metadata.TestSpellCheckedMetadata
    [junit] Tests run: 11, Failures: 0, Errors: 0, Time elapsed: 3.065 sec
    [junit] Running org.apache.nutch.net.TestURLFilters
    [junit] Tests run: 1, Failures: 0, Errors: 0, Time elapsed: 0.555 sec
    [junit] Running org.apache.nutch.net.TestURLNormalizers
    [junit] Tests run: 1, Failures: 0, Errors: 0, Time elapsed: 0.378 sec
    [junit] Running org.apache.nutch.parse.TestOutlinkExtractor
    [junit] Tests run: 3, Failures: 0, Errors: 0, Time elapsed: 0.05 sec
    [junit] Running org.apache.nutch.parse.TestParserFactory
    [junit] Tests run: 2, Failures: 0, Errors: 0, Time elapsed: 0.978 sec
    [junit] Running org.apache.nutch.plugin.TestPluginSystem
    [junit] Tests run: 7, Failures: 0, Errors: 0, Time elapsed: 1.098 sec
    [junit] Running org.apache.nutch.protocol.TestContent
    [junit] Tests run: 2, Failures: 0, Errors: 0, Time elapsed: 0.528 sec
    [junit] Running org.apache.nutch.protocol.TestProtocolFactory
    [junit] Tests run: 2, Failures: 0, Errors: 0, Time elapsed: 0.888 sec
    [junit] Running org.apache.nutch.storage.TestGoraStorage
    [junit] Tests run: 0, Failures: 0, Errors: 0, Time elapsed: 0.013 sec
    [junit] Running org.apache.nutch.util.TestEncodingDetector
    [junit] Tests run: 1, Failures: 0, Errors: 0, Time elapsed: 0.517 sec
    [junit] Running org.apache.nutch.util.TestGZIPUtils
    [junit] Tests run: 4, Failures: 0, Errors: 0, Time elapsed: 0.57 sec
    [junit] Running org.apache.nutch.util.TestNodeWalker
    [junit] Tests run: 1, Failures: 0, Errors: 0, Time elapsed: 0.212 sec
    [junit] Running org.apache.nutch.util.TestPrefixStringMatcher
    [junit] Tests run: 1, Failures: 0, Errors: 0, Time elapsed: 0.101 sec
    [junit] Running org.apache.nutch.util.TestStringUtil
    [junit] Tests run: 2, Failures: 0, Errors: 0, Time elapsed: 0.022 sec
    [junit] Running org.apache.nutch.util.TestSuffixStringMatcher
    [junit] Tests run: 1, Failures: 0, Errors: 0, Time elapsed: 0.08 sec
    [junit] Running org.apache.nutch.util.TestTableUtil
    [junit] Tests run: 2, Failures: 0, Errors: 0, Time elapsed: 0.033 sec
    [junit] Running org.apache.nutch.util.TestURLUtil
    [junit] Tests run: 7, Failures: 0, Errors: 0, Time elapsed: 0.683 sec

test-plugins:

test:

init:

init-plugin:

deps-jar:

clean-lib:

resolve-default:
[ivy:resolve] :: loading settings :: file = <https://builds.apache.org/job/Nutch-nutchgora/ws/2.x/ivy/ivysettings.xml>

compile:
     [echo] Compiling plugin: creativecommons

compile-test:
    [javac] Compiling 1 source file to <https://builds.apache.org/job/Nutch-nutchgora/ws/2.x/build/creativecommons/test>
    [javac] warning: [options] bootstrap class path not set in conjunction with -source 1.6
    [javac] 1 warning

jar:

deps-test:

init:

init-plugin:

clean-lib:

resolve-default:
[ivy:resolve] :: loading settings :: file = <https://builds.apache.org/job/Nutch-nutchgora/ws/2.x/ivy/ivysettings.xml>

compile:

jar:

deps-test:

deploy:

copy-generated-lib:

deploy:

copy-generated-lib:

test:
     [echo] Testing plugin: creativecommons
    [junit] Running org.creativecommons.nutch.TestCCParseFilter
    [junit] Tests run: 1, Failures: 0, Errors: 0, Time elapsed: 2.357 sec

init:

init-plugin:

deps-jar:

clean-lib:

resolve-default:
[ivy:resolve] :: loading settings :: file = <https://builds.apache.org/job/Nutch-nutchgora/ws/2.x/ivy/ivysettings.xml>

compile:
     [echo] Compiling plugin: parse-tika

compile-test:
    [javac] Compiling 7 source files to <https://builds.apache.org/job/Nutch-nutchgora/ws/2.x/build/parse-tika/test>
    [javac] warning: [options] bootstrap class path not set in conjunction with -source 1.6
    [javac] 1 warning

jar:

deps-test:

init:

init-plugin:

clean-lib:

resolve-default:
[ivy:resolve] :: loading settings :: file = <https://builds.apache.org/job/Nutch-nutchgora/ws/2.x/ivy/ivysettings.xml>

compile:

jar:

deps-test:

deploy:

copy-generated-lib:

init:

init-plugin:

deps-jar:

clean-lib:

resolve-default:
[ivy:resolve] :: loading settings :: file = <https://builds.apache.org/job/Nutch-nutchgora/ws/2.x/ivy/ivysettings.xml>

compile:
     [echo] Compiling plugin: protocol-file

jar:

deps-test:

deploy:

copy-generated-lib:

deploy:

copy-generated-lib:

test:
     [echo] Testing plugin: parse-tika
    [junit] Running org.apache.nutch.parse.tika.TestImageMetadata
    [junit] Tests run: 1, Failures: 0, Errors: 1, Time elapsed: 1.823 sec
    [junit] Test org.apache.nutch.parse.tika.TestImageMetadata FAILED
    [junit] Running org.apache.nutch.parse.tika.TestMSWordParser
    [junit] Tests run: 2, Failures: 0, Errors: 0, Time elapsed: 2.509 sec
    [junit] Running org.apache.nutch.parse.tika.TestOOParser
    [junit] Tests run: 1, Failures: 0, Errors: 0, Time elapsed: 2.093 sec
    [junit] Running org.apache.nutch.parse.tika.TestPdfParser
    [junit] Tests run: 1, Failures: 0, Errors: 0, Time elapsed: 3.108 sec
    [junit] Running org.apache.nutch.parse.tika.TestRSSParser
    [junit] Tests run: 1, Failures: 0, Errors: 0, Time elapsed: 2.012 sec
    [junit] Running org.apache.nutch.parse.tika.TestRTFParser
    [junit] Tests run: 1, Failures: 0, Errors: 0, Time elapsed: 2.416 sec

BUILD FAILED
<https://builds.apache.org/job/Nutch-nutchgora/ws/2.x/build.xml>:448: The following error occurred while executing this line:
<https://builds.apache.org/job/Nutch-nutchgora/ws/2.x/src/plugin/build.xml>:78: The following error occurred while executing this line:
<https://builds.apache.org/job/Nutch-nutchgora/ws/2.x/src/plugin/build-plugin.xml>:207: Tests failed!

Total time: 1 minute 29 seconds
Build step 'Invoke Ant' marked build as failure
Publishing Javadoc

Build failed in Jenkins: Nutch-nutchgora #1046

Posted by Apache Jenkins Server <je...@builds.apache.org>.
See <https://builds.apache.org/job/Nutch-nutchgora/1046/changes>

Changes:

[jnioche] NUTCH-1590 [SECURITY] Frame injection vulnerability in published Javadoc (jnioche)

------------------------------------------
[...truncated 3068 lines...]

clean-lib:

resolve-default:
[ivy:resolve] :: loading settings :: file = <https://builds.apache.org/job/Nutch-nutchgora/ws/2.x/ivy/ivysettings.xml>

compile:

jar:

deps-test:

deploy:

copy-generated-lib:

deploy:
     [copy] Copying 1 file to <https://builds.apache.org/job/Nutch-nutchgora/ws/2.x/build/plugins/urlnormalizer-regex>

copy-generated-lib:
     [copy] Copying 1 file to <https://builds.apache.org/job/Nutch-nutchgora/ws/2.x/build/plugins/urlnormalizer-regex>

compile:

job:
      [jar] Building jar: <https://builds.apache.org/job/Nutch-nutchgora/ws/2.x/build/apache-nutch-2.3-SNAPSHOT.job>

resolve-test:
  [taskdef] Could not load definitions from resource org/sonar/ant/antlib.xml. It could not be found.

copy-libs:

compile-core-test:
    [javac] Compiling 34 source files to <https://builds.apache.org/job/Nutch-nutchgora/ws/2.x/build/test/classes>
    [javac] warning: [options] bootstrap class path not set in conjunction with -source 1.6
    [javac] 1 warning

test-core:
    [mkdir] Created dir: <https://builds.apache.org/job/Nutch-nutchgora/ws/2.x/build/test/data>
     [copy] Copying 90 files to <https://builds.apache.org/job/Nutch-nutchgora/ws/2.x/build/test/data>
     [copy] Copying 1 file to <https://builds.apache.org/job/Nutch-nutchgora/ws/2.x/build/test/classes>
     [copy] Copying 1 file to <https://builds.apache.org/job/Nutch-nutchgora/ws/2.x/build/test/classes>
     [copy] Copying 1 file to <https://builds.apache.org/job/Nutch-nutchgora/ws/2.x/build/test/classes>
     [copy] Copying 1 file to <https://builds.apache.org/job/Nutch-nutchgora/ws/2.x/build/test/classes>
     [copy] Copying 1 file to <https://builds.apache.org/job/Nutch-nutchgora/ws/2.x/build/test/classes>
     [copy] Copying 1 file to <https://builds.apache.org/job/Nutch-nutchgora/ws/2.x/build/test/classes>
    [junit] Running org.apache.nutch.api.TestAPI
    [junit] Tests run: 1, Failures: 0, Errors: 0, Time elapsed: 0.021 sec
    [junit] Running org.apache.nutch.crawl.TestAdaptiveFetchSchedule
    [junit] Tests run: 1, Failures: 0, Errors: 0, Time elapsed: 0.539 sec
    [junit] Running org.apache.nutch.crawl.TestGenerator
    [junit] Tests run: 0, Failures: 0, Errors: 0, Time elapsed: 0.011 sec
    [junit] Running org.apache.nutch.crawl.TestInjector
    [junit] Tests run: 0, Failures: 0, Errors: 0, Time elapsed: 0.012 sec
    [junit] Running org.apache.nutch.crawl.TestSignatureFactory
    [junit] Tests run: 1, Failures: 0, Errors: 0, Time elapsed: 0.257 sec
    [junit] Running org.apache.nutch.crawl.TestURLPartitioner
    [junit] Tests run: 7, Failures: 0, Errors: 0, Time elapsed: 1.343 sec
    [junit] Running org.apache.nutch.crawl.TestUrlWithScore
    [junit] Tests run: 4, Failures: 0, Errors: 0, Time elapsed: 0.12 sec
    [junit] Running org.apache.nutch.fetcher.TestFetcher
    [junit] Tests run: 1, Failures: 0, Errors: 0, Time elapsed: 0.914 sec
    [junit] Running org.apache.nutch.indexer.TestIndexingFilters
    [junit] Tests run: 3, Failures: 0, Errors: 0, Time elapsed: 0.886 sec
    [junit] Running org.apache.nutch.metadata.TestMetadata
    [junit] Tests run: 10, Failures: 0, Errors: 0, Time elapsed: 0.121 sec
    [junit] Running org.apache.nutch.metadata.TestSpellCheckedMetadata
    [junit] Tests run: 11, Failures: 0, Errors: 0, Time elapsed: 3.071 sec
    [junit] Running org.apache.nutch.net.TestURLFilters
    [junit] Tests run: 1, Failures: 0, Errors: 0, Time elapsed: 0.565 sec
    [junit] Running org.apache.nutch.net.TestURLNormalizers
    [junit] Tests run: 1, Failures: 0, Errors: 0, Time elapsed: 0.381 sec
    [junit] Running org.apache.nutch.parse.TestOutlinkExtractor
    [junit] Tests run: 3, Failures: 0, Errors: 0, Time elapsed: 0.054 sec
    [junit] Running org.apache.nutch.parse.TestParserFactory
    [junit] Tests run: 2, Failures: 0, Errors: 0, Time elapsed: 1.011 sec
    [junit] Running org.apache.nutch.plugin.TestPluginSystem
    [junit] Tests run: 7, Failures: 0, Errors: 0, Time elapsed: 1.167 sec
    [junit] Running org.apache.nutch.protocol.TestContent
    [junit] Tests run: 2, Failures: 0, Errors: 0, Time elapsed: 0.553 sec
    [junit] Running org.apache.nutch.protocol.TestProtocolFactory
    [junit] Tests run: 2, Failures: 0, Errors: 0, Time elapsed: 4.385 sec
    [junit] Running org.apache.nutch.storage.TestGoraStorage
    [junit] Tests run: 0, Failures: 0, Errors: 0, Time elapsed: 0.012 sec
    [junit] Running org.apache.nutch.util.TestEncodingDetector
    [junit] Tests run: 1, Failures: 0, Errors: 0, Time elapsed: 0.474 sec
    [junit] Running org.apache.nutch.util.TestGZIPUtils
    [junit] Tests run: 4, Failures: 0, Errors: 0, Time elapsed: 0.564 sec
    [junit] Running org.apache.nutch.util.TestNodeWalker
    [junit] Tests run: 1, Failures: 0, Errors: 0, Time elapsed: 0.216 sec
    [junit] Running org.apache.nutch.util.TestPrefixStringMatcher
    [junit] Tests run: 1, Failures: 0, Errors: 0, Time elapsed: 0.102 sec
    [junit] Running org.apache.nutch.util.TestStringUtil
    [junit] Tests run: 2, Failures: 0, Errors: 0, Time elapsed: 0.022 sec
    [junit] Running org.apache.nutch.util.TestSuffixStringMatcher
    [junit] Tests run: 1, Failures: 0, Errors: 0, Time elapsed: 0.092 sec
    [junit] Running org.apache.nutch.util.TestTableUtil
    [junit] Tests run: 2, Failures: 0, Errors: 0, Time elapsed: 0.047 sec
    [junit] Running org.apache.nutch.util.TestURLUtil
    [junit] Tests run: 7, Failures: 0, Errors: 0, Time elapsed: 0.738 sec

test-plugins:

test:

init:

init-plugin:

deps-jar:

clean-lib:

resolve-default:
[ivy:resolve] :: loading settings :: file = <https://builds.apache.org/job/Nutch-nutchgora/ws/2.x/ivy/ivysettings.xml>

compile:
     [echo] Compiling plugin: creativecommons

compile-test:
    [javac] Compiling 1 source file to <https://builds.apache.org/job/Nutch-nutchgora/ws/2.x/build/creativecommons/test>
    [javac] warning: [options] bootstrap class path not set in conjunction with -source 1.6
    [javac] 1 warning

jar:

deps-test:

init:

init-plugin:

clean-lib:

resolve-default:
[ivy:resolve] :: loading settings :: file = <https://builds.apache.org/job/Nutch-nutchgora/ws/2.x/ivy/ivysettings.xml>

compile:

jar:

deps-test:

deploy:

copy-generated-lib:

deploy:

copy-generated-lib:

test:
     [echo] Testing plugin: creativecommons
    [junit] Running org.creativecommons.nutch.TestCCParseFilter
    [junit] Tests run: 1, Failures: 0, Errors: 0, Time elapsed: 2.331 sec

init:

init-plugin:

deps-jar:

clean-lib:

resolve-default:
[ivy:resolve] :: loading settings :: file = <https://builds.apache.org/job/Nutch-nutchgora/ws/2.x/ivy/ivysettings.xml>

compile:
     [echo] Compiling plugin: parse-tika

compile-test:
    [javac] Compiling 7 source files to <https://builds.apache.org/job/Nutch-nutchgora/ws/2.x/build/parse-tika/test>
    [javac] warning: [options] bootstrap class path not set in conjunction with -source 1.6
    [javac] 1 warning

jar:

deps-test:

init:

init-plugin:

clean-lib:

resolve-default:
[ivy:resolve] :: loading settings :: file = <https://builds.apache.org/job/Nutch-nutchgora/ws/2.x/ivy/ivysettings.xml>

compile:

jar:

deps-test:

deploy:

copy-generated-lib:

init:

init-plugin:

deps-jar:

clean-lib:

resolve-default:
[ivy:resolve] :: loading settings :: file = <https://builds.apache.org/job/Nutch-nutchgora/ws/2.x/ivy/ivysettings.xml>

compile:
     [echo] Compiling plugin: protocol-file

jar:

deps-test:

deploy:

copy-generated-lib:

deploy:

copy-generated-lib:

test:
     [echo] Testing plugin: parse-tika
    [junit] Running org.apache.nutch.parse.tika.TestImageMetadata
    [junit] Tests run: 1, Failures: 0, Errors: 1, Time elapsed: 1.788 sec
    [junit] Test org.apache.nutch.parse.tika.TestImageMetadata FAILED
    [junit] Running org.apache.nutch.parse.tika.TestMSWordParser
    [junit] Tests run: 2, Failures: 0, Errors: 0, Time elapsed: 2.521 sec
    [junit] Running org.apache.nutch.parse.tika.TestOOParser
    [junit] Tests run: 1, Failures: 0, Errors: 0, Time elapsed: 2.163 sec
    [junit] Running org.apache.nutch.parse.tika.TestPdfParser
    [junit] Tests run: 1, Failures: 0, Errors: 0, Time elapsed: 3.135 sec
    [junit] Running org.apache.nutch.parse.tika.TestRSSParser
    [junit] Tests run: 1, Failures: 0, Errors: 0, Time elapsed: 2.026 sec
    [junit] Running org.apache.nutch.parse.tika.TestRTFParser
    [junit] Tests run: 1, Failures: 0, Errors: 0, Time elapsed: 2.781 sec

BUILD FAILED
<https://builds.apache.org/job/Nutch-nutchgora/ws/2.x/build.xml>:448: The following error occurred while executing this line:
<https://builds.apache.org/job/Nutch-nutchgora/ws/2.x/src/plugin/build.xml>:78: The following error occurred while executing this line:
<https://builds.apache.org/job/Nutch-nutchgora/ws/2.x/src/plugin/build-plugin.xml>:207: Tests failed!

Total time: 1 minute 51 seconds
Build step 'Invoke Ant' marked build as failure
Publishing Javadoc
Updating NUTCH-1590

Build failed in Jenkins: Nutch-nutchgora #1045

Posted by Apache Jenkins Server <je...@builds.apache.org>.
See <https://builds.apache.org/job/Nutch-nutchgora/1045/>

------------------------------------------
[...truncated 3068 lines...]
init-plugin:

clean-lib:

resolve-default:
[ivy:resolve] :: loading settings :: file = <https://builds.apache.org/job/Nutch-nutchgora/ws/2.x/ivy/ivysettings.xml>

compile:

jar:

deps-test:

deploy:

copy-generated-lib:

deploy:
     [copy] Copying 1 file to <https://builds.apache.org/job/Nutch-nutchgora/ws/2.x/build/plugins/urlnormalizer-regex>

copy-generated-lib:
     [copy] Copying 1 file to <https://builds.apache.org/job/Nutch-nutchgora/ws/2.x/build/plugins/urlnormalizer-regex>

compile:

job:
      [jar] Building jar: <https://builds.apache.org/job/Nutch-nutchgora/ws/2.x/build/apache-nutch-2.3-SNAPSHOT.job>

resolve-test:
  [taskdef] Could not load definitions from resource org/sonar/ant/antlib.xml. It could not be found.

copy-libs:

compile-core-test:
    [javac] Compiling 34 source files to <https://builds.apache.org/job/Nutch-nutchgora/ws/2.x/build/test/classes>
    [javac] warning: [options] bootstrap class path not set in conjunction with -source 1.6
    [javac] 1 warning

test-core:
    [mkdir] Created dir: <https://builds.apache.org/job/Nutch-nutchgora/ws/2.x/build/test/data>
     [copy] Copying 90 files to <https://builds.apache.org/job/Nutch-nutchgora/ws/2.x/build/test/data>
     [copy] Copying 1 file to <https://builds.apache.org/job/Nutch-nutchgora/ws/2.x/build/test/classes>
     [copy] Copying 1 file to <https://builds.apache.org/job/Nutch-nutchgora/ws/2.x/build/test/classes>
     [copy] Copying 1 file to <https://builds.apache.org/job/Nutch-nutchgora/ws/2.x/build/test/classes>
     [copy] Copying 1 file to <https://builds.apache.org/job/Nutch-nutchgora/ws/2.x/build/test/classes>
     [copy] Copying 1 file to <https://builds.apache.org/job/Nutch-nutchgora/ws/2.x/build/test/classes>
     [copy] Copying 1 file to <https://builds.apache.org/job/Nutch-nutchgora/ws/2.x/build/test/classes>
    [junit] Running org.apache.nutch.api.TestAPI
    [junit] Tests run: 1, Failures: 0, Errors: 0, Time elapsed: 0.02 sec
    [junit] Running org.apache.nutch.crawl.TestAdaptiveFetchSchedule
    [junit] Tests run: 1, Failures: 0, Errors: 0, Time elapsed: 0.612 sec
    [junit] Running org.apache.nutch.crawl.TestGenerator
    [junit] Tests run: 0, Failures: 0, Errors: 0, Time elapsed: 0.011 sec
    [junit] Running org.apache.nutch.crawl.TestInjector
    [junit] Tests run: 0, Failures: 0, Errors: 0, Time elapsed: 0.012 sec
    [junit] Running org.apache.nutch.crawl.TestSignatureFactory
    [junit] Tests run: 1, Failures: 0, Errors: 0, Time elapsed: 0.249 sec
    [junit] Running org.apache.nutch.crawl.TestURLPartitioner
    [junit] Tests run: 7, Failures: 0, Errors: 0, Time elapsed: 1.416 sec
    [junit] Running org.apache.nutch.crawl.TestUrlWithScore
    [junit] Tests run: 4, Failures: 0, Errors: 0, Time elapsed: 0.122 sec
    [junit] Running org.apache.nutch.fetcher.TestFetcher
    [junit] Tests run: 1, Failures: 0, Errors: 0, Time elapsed: 0.912 sec
    [junit] Running org.apache.nutch.indexer.TestIndexingFilters
    [junit] Tests run: 3, Failures: 0, Errors: 0, Time elapsed: 0.901 sec
    [junit] Running org.apache.nutch.metadata.TestMetadata
    [junit] Tests run: 10, Failures: 0, Errors: 0, Time elapsed: 0.119 sec
    [junit] Running org.apache.nutch.metadata.TestSpellCheckedMetadata
    [junit] Tests run: 11, Failures: 0, Errors: 0, Time elapsed: 3.073 sec
    [junit] Running org.apache.nutch.net.TestURLFilters
    [junit] Tests run: 1, Failures: 0, Errors: 0, Time elapsed: 0.573 sec
    [junit] Running org.apache.nutch.net.TestURLNormalizers
    [junit] Tests run: 1, Failures: 0, Errors: 0, Time elapsed: 0.383 sec
    [junit] Running org.apache.nutch.parse.TestOutlinkExtractor
    [junit] Tests run: 3, Failures: 0, Errors: 0, Time elapsed: 0.054 sec
    [junit] Running org.apache.nutch.parse.TestParserFactory
    [junit] Tests run: 2, Failures: 0, Errors: 0, Time elapsed: 1.013 sec
    [junit] Running org.apache.nutch.plugin.TestPluginSystem
    [junit] Tests run: 7, Failures: 0, Errors: 0, Time elapsed: 1.072 sec
    [junit] Running org.apache.nutch.protocol.TestContent
    [junit] Tests run: 2, Failures: 0, Errors: 0, Time elapsed: 0.525 sec
    [junit] Running org.apache.nutch.protocol.TestProtocolFactory
    [junit] Tests run: 2, Failures: 0, Errors: 0, Time elapsed: 0.884 sec
    [junit] Running org.apache.nutch.storage.TestGoraStorage
    [junit] Tests run: 0, Failures: 0, Errors: 0, Time elapsed: 0.012 sec
    [junit] Running org.apache.nutch.util.TestEncodingDetector
    [junit] Tests run: 1, Failures: 0, Errors: 0, Time elapsed: 0.513 sec
    [junit] Running org.apache.nutch.util.TestGZIPUtils
    [junit] Tests run: 4, Failures: 0, Errors: 0, Time elapsed: 0.564 sec
    [junit] Running org.apache.nutch.util.TestNodeWalker
    [junit] Tests run: 1, Failures: 0, Errors: 0, Time elapsed: 0.214 sec
    [junit] Running org.apache.nutch.util.TestPrefixStringMatcher
    [junit] Tests run: 1, Failures: 0, Errors: 0, Time elapsed: 0.103 sec
    [junit] Running org.apache.nutch.util.TestStringUtil
    [junit] Tests run: 2, Failures: 0, Errors: 0, Time elapsed: 0.021 sec
    [junit] Running org.apache.nutch.util.TestSuffixStringMatcher
    [junit] Tests run: 1, Failures: 0, Errors: 0, Time elapsed: 0.09 sec
    [junit] Running org.apache.nutch.util.TestTableUtil
    [junit] Tests run: 2, Failures: 0, Errors: 0, Time elapsed: 0.043 sec
    [junit] Running org.apache.nutch.util.TestURLUtil
    [junit] Tests run: 7, Failures: 0, Errors: 0, Time elapsed: 0.721 sec

test-plugins:

test:

init:

init-plugin:

deps-jar:

clean-lib:

resolve-default:
[ivy:resolve] :: loading settings :: file = <https://builds.apache.org/job/Nutch-nutchgora/ws/2.x/ivy/ivysettings.xml>

compile:
     [echo] Compiling plugin: creativecommons

compile-test:
    [javac] Compiling 1 source file to <https://builds.apache.org/job/Nutch-nutchgora/ws/2.x/build/creativecommons/test>
    [javac] warning: [options] bootstrap class path not set in conjunction with -source 1.6
    [javac] 1 warning

jar:

deps-test:

init:

init-plugin:

clean-lib:

resolve-default:
[ivy:resolve] :: loading settings :: file = <https://builds.apache.org/job/Nutch-nutchgora/ws/2.x/ivy/ivysettings.xml>

compile:

jar:

deps-test:

deploy:

copy-generated-lib:

deploy:

copy-generated-lib:

test:
     [echo] Testing plugin: creativecommons
    [junit] Running org.creativecommons.nutch.TestCCParseFilter
    [junit] Tests run: 1, Failures: 0, Errors: 0, Time elapsed: 2.303 sec

init:

init-plugin:

deps-jar:

clean-lib:

resolve-default:
[ivy:resolve] :: loading settings :: file = <https://builds.apache.org/job/Nutch-nutchgora/ws/2.x/ivy/ivysettings.xml>

compile:
     [echo] Compiling plugin: parse-tika

compile-test:
    [javac] Compiling 7 source files to <https://builds.apache.org/job/Nutch-nutchgora/ws/2.x/build/parse-tika/test>
    [javac] warning: [options] bootstrap class path not set in conjunction with -source 1.6
    [javac] 1 warning

jar:

deps-test:

init:

init-plugin:

clean-lib:

resolve-default:
[ivy:resolve] :: loading settings :: file = <https://builds.apache.org/job/Nutch-nutchgora/ws/2.x/ivy/ivysettings.xml>

compile:

jar:

deps-test:

deploy:

copy-generated-lib:

init:

init-plugin:

deps-jar:

clean-lib:

resolve-default:
[ivy:resolve] :: loading settings :: file = <https://builds.apache.org/job/Nutch-nutchgora/ws/2.x/ivy/ivysettings.xml>

compile:
     [echo] Compiling plugin: protocol-file

jar:

deps-test:

deploy:

copy-generated-lib:

deploy:

copy-generated-lib:

test:
     [echo] Testing plugin: parse-tika
    [junit] Running org.apache.nutch.parse.tika.TestImageMetadata
    [junit] Tests run: 1, Failures: 0, Errors: 1, Time elapsed: 1.776 sec
    [junit] Test org.apache.nutch.parse.tika.TestImageMetadata FAILED
    [junit] Running org.apache.nutch.parse.tika.TestMSWordParser
    [junit] Tests run: 2, Failures: 0, Errors: 0, Time elapsed: 2.572 sec
    [junit] Running org.apache.nutch.parse.tika.TestOOParser
    [junit] Tests run: 1, Failures: 0, Errors: 0, Time elapsed: 2.149 sec
    [junit] Running org.apache.nutch.parse.tika.TestPdfParser
    [junit] Tests run: 1, Failures: 0, Errors: 0, Time elapsed: 3.241 sec
    [junit] Running org.apache.nutch.parse.tika.TestRSSParser
    [junit] Tests run: 1, Failures: 0, Errors: 0, Time elapsed: 2.028 sec
    [junit] Running org.apache.nutch.parse.tika.TestRTFParser
    [junit] Tests run: 1, Failures: 0, Errors: 0, Time elapsed: 2.448 sec

BUILD FAILED
<https://builds.apache.org/job/Nutch-nutchgora/ws/2.x/build.xml>:437: The following error occurred while executing this line:
<https://builds.apache.org/job/Nutch-nutchgora/ws/2.x/src/plugin/build.xml>:78: The following error occurred while executing this line:
<https://builds.apache.org/job/Nutch-nutchgora/ws/2.x/src/plugin/build-plugin.xml>:207: Tests failed!

Total time: 1 minute 26 seconds
Build step 'Invoke Ant' marked build as failure
Publishing Javadoc

Build failed in Jenkins: Nutch-nutchgora #1044

Posted by Apache Jenkins Server <je...@builds.apache.org>.
See <https://builds.apache.org/job/Nutch-nutchgora/1044/>

------------------------------------------
[...truncated 3089 lines...]
init-plugin:

clean-lib:

resolve-default:
[ivy:resolve] :: loading settings :: file = <https://builds.apache.org/job/Nutch-nutchgora/ws/2.x/ivy/ivysettings.xml>

compile:

jar:

deps-test:

deploy:

copy-generated-lib:

deploy:
     [copy] Copying 1 file to <https://builds.apache.org/job/Nutch-nutchgora/ws/2.x/build/plugins/urlnormalizer-regex>

copy-generated-lib:
     [copy] Copying 1 file to <https://builds.apache.org/job/Nutch-nutchgora/ws/2.x/build/plugins/urlnormalizer-regex>

compile:

job:
      [jar] Building jar: <https://builds.apache.org/job/Nutch-nutchgora/ws/2.x/build/apache-nutch-2.3-SNAPSHOT.job>

resolve-test:
  [taskdef] Could not load definitions from resource org/sonar/ant/antlib.xml. It could not be found.

copy-libs:

compile-core-test:
    [javac] Compiling 34 source files to <https://builds.apache.org/job/Nutch-nutchgora/ws/2.x/build/test/classes>
    [javac] warning: [options] bootstrap class path not set in conjunction with -source 1.6
    [javac] 1 warning

test-core:
    [mkdir] Created dir: <https://builds.apache.org/job/Nutch-nutchgora/ws/2.x/build/test/data>
     [copy] Copying 90 files to <https://builds.apache.org/job/Nutch-nutchgora/ws/2.x/build/test/data>
     [copy] Copying 1 file to <https://builds.apache.org/job/Nutch-nutchgora/ws/2.x/build/test/classes>
     [copy] Copying 1 file to <https://builds.apache.org/job/Nutch-nutchgora/ws/2.x/build/test/classes>
     [copy] Copying 1 file to <https://builds.apache.org/job/Nutch-nutchgora/ws/2.x/build/test/classes>
     [copy] Copying 1 file to <https://builds.apache.org/job/Nutch-nutchgora/ws/2.x/build/test/classes>
     [copy] Copying 1 file to <https://builds.apache.org/job/Nutch-nutchgora/ws/2.x/build/test/classes>
     [copy] Copying 1 file to <https://builds.apache.org/job/Nutch-nutchgora/ws/2.x/build/test/classes>
    [junit] Running org.apache.nutch.api.TestAPI
    [junit] Tests run: 1, Failures: 0, Errors: 0, Time elapsed: 0.02 sec
    [junit] Running org.apache.nutch.crawl.TestAdaptiveFetchSchedule
    [junit] Tests run: 1, Failures: 0, Errors: 0, Time elapsed: 0.558 sec
    [junit] Running org.apache.nutch.crawl.TestGenerator
    [junit] Tests run: 0, Failures: 0, Errors: 0, Time elapsed: 0.011 sec
    [junit] Running org.apache.nutch.crawl.TestInjector
    [junit] Tests run: 0, Failures: 0, Errors: 0, Time elapsed: 0.012 sec
    [junit] Running org.apache.nutch.crawl.TestSignatureFactory
    [junit] Tests run: 1, Failures: 0, Errors: 0, Time elapsed: 0.253 sec
    [junit] Running org.apache.nutch.crawl.TestURLPartitioner
    [junit] Tests run: 7, Failures: 0, Errors: 0, Time elapsed: 2.4 sec
    [junit] Running org.apache.nutch.crawl.TestUrlWithScore
    [junit] Tests run: 4, Failures: 0, Errors: 0, Time elapsed: 0.12 sec
    [junit] Running org.apache.nutch.fetcher.TestFetcher
    [junit] Tests run: 1, Failures: 0, Errors: 0, Time elapsed: 1.188 sec
    [junit] Running org.apache.nutch.indexer.TestIndexingFilters
    [junit] Tests run: 3, Failures: 0, Errors: 0, Time elapsed: 0.884 sec
    [junit] Running org.apache.nutch.metadata.TestMetadata
    [junit] Tests run: 10, Failures: 0, Errors: 0, Time elapsed: 0.119 sec
    [junit] Running org.apache.nutch.metadata.TestSpellCheckedMetadata
    [junit] Tests run: 11, Failures: 0, Errors: 0, Time elapsed: 3.094 sec
    [junit] Running org.apache.nutch.net.TestURLFilters
    [junit] Tests run: 1, Failures: 0, Errors: 0, Time elapsed: 0.53 sec
    [junit] Running org.apache.nutch.net.TestURLNormalizers
    [junit] Tests run: 1, Failures: 0, Errors: 0, Time elapsed: 0.378 sec
    [junit] Running org.apache.nutch.parse.TestOutlinkExtractor
    [junit] Tests run: 3, Failures: 0, Errors: 0, Time elapsed: 0.05 sec
    [junit] Running org.apache.nutch.parse.TestParserFactory
    [junit] Tests run: 2, Failures: 0, Errors: 0, Time elapsed: 0.989 sec
    [junit] Running org.apache.nutch.plugin.TestPluginSystem
    [junit] Tests run: 7, Failures: 0, Errors: 0, Time elapsed: 1.09 sec
    [junit] Running org.apache.nutch.protocol.TestContent
    [junit] Tests run: 2, Failures: 0, Errors: 0, Time elapsed: 0.534 sec
    [junit] Running org.apache.nutch.protocol.TestProtocolFactory
    [junit] Tests run: 2, Failures: 0, Errors: 0, Time elapsed: 0.904 sec
    [junit] Running org.apache.nutch.storage.TestGoraStorage
    [junit] Tests run: 0, Failures: 0, Errors: 0, Time elapsed: 0.012 sec
    [junit] Running org.apache.nutch.util.TestEncodingDetector
    [junit] Tests run: 1, Failures: 0, Errors: 0, Time elapsed: 0.422 sec
    [junit] Running org.apache.nutch.util.TestGZIPUtils
    [junit] Tests run: 4, Failures: 0, Errors: 0, Time elapsed: 0.562 sec
    [junit] Running org.apache.nutch.util.TestNodeWalker
    [junit] Tests run: 1, Failures: 0, Errors: 0, Time elapsed: 0.213 sec
    [junit] Running org.apache.nutch.util.TestPrefixStringMatcher
    [junit] Tests run: 1, Failures: 0, Errors: 0, Time elapsed: 0.082 sec
    [junit] Running org.apache.nutch.util.TestStringUtil
    [junit] Tests run: 2, Failures: 0, Errors: 0, Time elapsed: 0.022 sec
    [junit] Running org.apache.nutch.util.TestSuffixStringMatcher
    [junit] Tests run: 1, Failures: 0, Errors: 0, Time elapsed: 0.101 sec
    [junit] Running org.apache.nutch.util.TestTableUtil
    [junit] Tests run: 2, Failures: 0, Errors: 0, Time elapsed: 0.033 sec
    [junit] Running org.apache.nutch.util.TestURLUtil
    [junit] Tests run: 7, Failures: 0, Errors: 0, Time elapsed: 0.731 sec

test-plugins:

test:

init:

init-plugin:

deps-jar:

clean-lib:

resolve-default:
[ivy:resolve] :: loading settings :: file = <https://builds.apache.org/job/Nutch-nutchgora/ws/2.x/ivy/ivysettings.xml>

compile:
     [echo] Compiling plugin: creativecommons

compile-test:
    [javac] Compiling 1 source file to <https://builds.apache.org/job/Nutch-nutchgora/ws/2.x/build/creativecommons/test>
    [javac] warning: [options] bootstrap class path not set in conjunction with -source 1.6
    [javac] 1 warning

jar:

deps-test:

init:

init-plugin:

clean-lib:

resolve-default:
[ivy:resolve] :: loading settings :: file = <https://builds.apache.org/job/Nutch-nutchgora/ws/2.x/ivy/ivysettings.xml>

compile:

jar:

deps-test:

deploy:

copy-generated-lib:

deploy:

copy-generated-lib:

test:
     [echo] Testing plugin: creativecommons
    [junit] Running org.creativecommons.nutch.TestCCParseFilter
    [junit] Tests run: 1, Failures: 0, Errors: 0, Time elapsed: 2.304 sec

init:

init-plugin:

deps-jar:

clean-lib:

resolve-default:
[ivy:resolve] :: loading settings :: file = <https://builds.apache.org/job/Nutch-nutchgora/ws/2.x/ivy/ivysettings.xml>

compile:
     [echo] Compiling plugin: parse-tika

compile-test:
    [javac] Compiling 7 source files to <https://builds.apache.org/job/Nutch-nutchgora/ws/2.x/build/parse-tika/test>
    [javac] warning: [options] bootstrap class path not set in conjunction with -source 1.6
    [javac] 1 warning

jar:

deps-test:

init:

init-plugin:

clean-lib:

resolve-default:
[ivy:resolve] :: loading settings :: file = <https://builds.apache.org/job/Nutch-nutchgora/ws/2.x/ivy/ivysettings.xml>

compile:

jar:

deps-test:

deploy:

copy-generated-lib:

init:

init-plugin:

deps-jar:

clean-lib:

resolve-default:
[ivy:resolve] :: loading settings :: file = <https://builds.apache.org/job/Nutch-nutchgora/ws/2.x/ivy/ivysettings.xml>

compile:
     [echo] Compiling plugin: protocol-file

jar:

deps-test:

deploy:

copy-generated-lib:

deploy:

copy-generated-lib:

test:
     [echo] Testing plugin: parse-tika
    [junit] Running org.apache.nutch.parse.tika.TestImageMetadata
    [junit] Tests run: 1, Failures: 0, Errors: 1, Time elapsed: 1.731 sec
    [junit] Test org.apache.nutch.parse.tika.TestImageMetadata FAILED
    [junit] Running org.apache.nutch.parse.tika.TestMSWordParser
    [junit] Tests run: 2, Failures: 0, Errors: 0, Time elapsed: 2.497 sec
    [junit] Running org.apache.nutch.parse.tika.TestOOParser
    [junit] Tests run: 1, Failures: 0, Errors: 0, Time elapsed: 2.103 sec
    [junit] Running org.apache.nutch.parse.tika.TestPdfParser
    [junit] Tests run: 1, Failures: 0, Errors: 0, Time elapsed: 3.09 sec
    [junit] Running org.apache.nutch.parse.tika.TestRSSParser
    [junit] Tests run: 1, Failures: 0, Errors: 0, Time elapsed: 2.004 sec
    [junit] Running org.apache.nutch.parse.tika.TestRTFParser
    [junit] Tests run: 1, Failures: 0, Errors: 0, Time elapsed: 2.362 sec

BUILD FAILED
<https://builds.apache.org/job/Nutch-nutchgora/ws/2.x/build.xml>:437: The following error occurred while executing this line:
<https://builds.apache.org/job/Nutch-nutchgora/ws/2.x/src/plugin/build.xml>:78: The following error occurred while executing this line:
<https://builds.apache.org/job/Nutch-nutchgora/ws/2.x/src/plugin/build-plugin.xml>:207: Tests failed!

Total time: 1 minute 37 seconds
Build step 'Invoke Ant' marked build as failure
Publishing Javadoc

Build failed in Jenkins: Nutch-nutchgora #1043

Posted by Apache Jenkins Server <je...@builds.apache.org>.
See <https://builds.apache.org/job/Nutch-nutchgora/1043/>

------------------------------------------
[...truncated 3108 lines...]
init-plugin:

clean-lib:

resolve-default:
[ivy:resolve] :: loading settings :: file = <https://builds.apache.org/job/Nutch-nutchgora/ws/2.x/ivy/ivysettings.xml>

compile:

jar:

deps-test:

deploy:

copy-generated-lib:

deploy:
     [copy] Copying 1 file to <https://builds.apache.org/job/Nutch-nutchgora/ws/2.x/build/plugins/urlnormalizer-regex>

copy-generated-lib:
     [copy] Copying 1 file to <https://builds.apache.org/job/Nutch-nutchgora/ws/2.x/build/plugins/urlnormalizer-regex>

compile:

job:
      [jar] Building jar: <https://builds.apache.org/job/Nutch-nutchgora/ws/2.x/build/apache-nutch-2.3-SNAPSHOT.job>

resolve-test:
  [taskdef] Could not load definitions from resource org/sonar/ant/antlib.xml. It could not be found.

copy-libs:

compile-core-test:
    [javac] Compiling 34 source files to <https://builds.apache.org/job/Nutch-nutchgora/ws/2.x/build/test/classes>
    [javac] warning: [options] bootstrap class path not set in conjunction with -source 1.6
    [javac] 1 warning

test-core:
    [mkdir] Created dir: <https://builds.apache.org/job/Nutch-nutchgora/ws/2.x/build/test/data>
     [copy] Copying 90 files to <https://builds.apache.org/job/Nutch-nutchgora/ws/2.x/build/test/data>
     [copy] Copying 1 file to <https://builds.apache.org/job/Nutch-nutchgora/ws/2.x/build/test/classes>
     [copy] Copying 1 file to <https://builds.apache.org/job/Nutch-nutchgora/ws/2.x/build/test/classes>
     [copy] Copying 1 file to <https://builds.apache.org/job/Nutch-nutchgora/ws/2.x/build/test/classes>
     [copy] Copying 1 file to <https://builds.apache.org/job/Nutch-nutchgora/ws/2.x/build/test/classes>
     [copy] Copying 1 file to <https://builds.apache.org/job/Nutch-nutchgora/ws/2.x/build/test/classes>
     [copy] Copying 1 file to <https://builds.apache.org/job/Nutch-nutchgora/ws/2.x/build/test/classes>
    [junit] Running org.apache.nutch.api.TestAPI
    [junit] Tests run: 1, Failures: 0, Errors: 0, Time elapsed: 0.021 sec
    [junit] Running org.apache.nutch.crawl.TestAdaptiveFetchSchedule
    [junit] Tests run: 1, Failures: 0, Errors: 0, Time elapsed: 0.536 sec
    [junit] Running org.apache.nutch.crawl.TestGenerator
    [junit] Tests run: 0, Failures: 0, Errors: 0, Time elapsed: 0.012 sec
    [junit] Running org.apache.nutch.crawl.TestInjector
    [junit] Tests run: 0, Failures: 0, Errors: 0, Time elapsed: 0.012 sec
    [junit] Running org.apache.nutch.crawl.TestSignatureFactory
    [junit] Tests run: 1, Failures: 0, Errors: 0, Time elapsed: 0.251 sec
    [junit] Running org.apache.nutch.crawl.TestURLPartitioner
    [junit] Tests run: 7, Failures: 0, Errors: 0, Time elapsed: 2.551 sec
    [junit] Running org.apache.nutch.crawl.TestUrlWithScore
    [junit] Tests run: 4, Failures: 0, Errors: 0, Time elapsed: 0.119 sec
    [junit] Running org.apache.nutch.fetcher.TestFetcher
    [junit] Tests run: 1, Failures: 0, Errors: 0, Time elapsed: 0.917 sec
    [junit] Running org.apache.nutch.indexer.TestIndexingFilters
    [junit] Tests run: 3, Failures: 0, Errors: 0, Time elapsed: 0.886 sec
    [junit] Running org.apache.nutch.metadata.TestMetadata
    [junit] Tests run: 10, Failures: 0, Errors: 0, Time elapsed: 0.12 sec
    [junit] Running org.apache.nutch.metadata.TestSpellCheckedMetadata
    [junit] Tests run: 11, Failures: 0, Errors: 0, Time elapsed: 3.104 sec
    [junit] Running org.apache.nutch.net.TestURLFilters
    [junit] Tests run: 1, Failures: 0, Errors: 0, Time elapsed: 0.543 sec
    [junit] Running org.apache.nutch.net.TestURLNormalizers
    [junit] Tests run: 1, Failures: 0, Errors: 0, Time elapsed: 0.413 sec
    [junit] Running org.apache.nutch.parse.TestOutlinkExtractor
    [junit] Tests run: 3, Failures: 0, Errors: 0, Time elapsed: 0.053 sec
    [junit] Running org.apache.nutch.parse.TestParserFactory
    [junit] Tests run: 2, Failures: 0, Errors: 0, Time elapsed: 1 sec
    [junit] Running org.apache.nutch.plugin.TestPluginSystem
    [junit] Tests run: 7, Failures: 0, Errors: 0, Time elapsed: 1.632 sec
    [junit] Running org.apache.nutch.protocol.TestContent
    [junit] Tests run: 2, Failures: 0, Errors: 0, Time elapsed: 0.526 sec
    [junit] Running org.apache.nutch.protocol.TestProtocolFactory
    [junit] Tests run: 2, Failures: 0, Errors: 0, Time elapsed: 0.93 sec
    [junit] Running org.apache.nutch.storage.TestGoraStorage
    [junit] Tests run: 0, Failures: 0, Errors: 0, Time elapsed: 0.012 sec
    [junit] Running org.apache.nutch.util.TestEncodingDetector
    [junit] Tests run: 1, Failures: 0, Errors: 0, Time elapsed: 0.458 sec
    [junit] Running org.apache.nutch.util.TestGZIPUtils
    [junit] Tests run: 4, Failures: 0, Errors: 0, Time elapsed: 0.561 sec
    [junit] Running org.apache.nutch.util.TestNodeWalker
    [junit] Tests run: 1, Failures: 0, Errors: 0, Time elapsed: 0.214 sec
    [junit] Running org.apache.nutch.util.TestPrefixStringMatcher
    [junit] Tests run: 1, Failures: 0, Errors: 0, Time elapsed: 0.086 sec
    [junit] Running org.apache.nutch.util.TestStringUtil
    [junit] Tests run: 2, Failures: 0, Errors: 0, Time elapsed: 0.022 sec
    [junit] Running org.apache.nutch.util.TestSuffixStringMatcher
    [junit] Tests run: 1, Failures: 0, Errors: 0, Time elapsed: 0.097 sec
    [junit] Running org.apache.nutch.util.TestTableUtil
    [junit] Tests run: 2, Failures: 0, Errors: 0, Time elapsed: 0.035 sec
    [junit] Running org.apache.nutch.util.TestURLUtil
    [junit] Tests run: 7, Failures: 0, Errors: 0, Time elapsed: 0.745 sec

test-plugins:

test:

init:

init-plugin:

deps-jar:

clean-lib:

resolve-default:
[ivy:resolve] :: loading settings :: file = <https://builds.apache.org/job/Nutch-nutchgora/ws/2.x/ivy/ivysettings.xml>

compile:
     [echo] Compiling plugin: creativecommons

compile-test:
    [javac] Compiling 1 source file to <https://builds.apache.org/job/Nutch-nutchgora/ws/2.x/build/creativecommons/test>
    [javac] warning: [options] bootstrap class path not set in conjunction with -source 1.6
    [javac] 1 warning

jar:

deps-test:

init:

init-plugin:

clean-lib:

resolve-default:
[ivy:resolve] :: loading settings :: file = <https://builds.apache.org/job/Nutch-nutchgora/ws/2.x/ivy/ivysettings.xml>

compile:

jar:

deps-test:

deploy:

copy-generated-lib:

deploy:

copy-generated-lib:

test:
     [echo] Testing plugin: creativecommons
    [junit] Running org.creativecommons.nutch.TestCCParseFilter
    [junit] Tests run: 1, Failures: 0, Errors: 0, Time elapsed: 2.318 sec

init:

init-plugin:

deps-jar:

clean-lib:

resolve-default:
[ivy:resolve] :: loading settings :: file = <https://builds.apache.org/job/Nutch-nutchgora/ws/2.x/ivy/ivysettings.xml>

compile:
     [echo] Compiling plugin: parse-tika

compile-test:
    [javac] Compiling 7 source files to <https://builds.apache.org/job/Nutch-nutchgora/ws/2.x/build/parse-tika/test>
    [javac] warning: [options] bootstrap class path not set in conjunction with -source 1.6
    [javac] 1 warning

jar:

deps-test:

init:

init-plugin:

clean-lib:

resolve-default:
[ivy:resolve] :: loading settings :: file = <https://builds.apache.org/job/Nutch-nutchgora/ws/2.x/ivy/ivysettings.xml>

compile:

jar:

deps-test:

deploy:

copy-generated-lib:

init:

init-plugin:

deps-jar:

clean-lib:

resolve-default:
[ivy:resolve] :: loading settings :: file = <https://builds.apache.org/job/Nutch-nutchgora/ws/2.x/ivy/ivysettings.xml>

compile:
     [echo] Compiling plugin: protocol-file

jar:

deps-test:

deploy:

copy-generated-lib:

deploy:

copy-generated-lib:

test:
     [echo] Testing plugin: parse-tika
    [junit] Running org.apache.nutch.parse.tika.TestImageMetadata
    [junit] Tests run: 1, Failures: 0, Errors: 1, Time elapsed: 1.723 sec
    [junit] Test org.apache.nutch.parse.tika.TestImageMetadata FAILED
    [junit] Running org.apache.nutch.parse.tika.TestMSWordParser
    [junit] Tests run: 2, Failures: 0, Errors: 0, Time elapsed: 2.518 sec
    [junit] Running org.apache.nutch.parse.tika.TestOOParser
    [junit] Tests run: 1, Failures: 0, Errors: 0, Time elapsed: 2.149 sec
    [junit] Running org.apache.nutch.parse.tika.TestPdfParser
    [junit] Tests run: 1, Failures: 0, Errors: 0, Time elapsed: 3.399 sec
    [junit] Running org.apache.nutch.parse.tika.TestRSSParser
    [junit] Tests run: 1, Failures: 0, Errors: 0, Time elapsed: 2.01 sec
    [junit] Running org.apache.nutch.parse.tika.TestRTFParser
    [junit] Tests run: 1, Failures: 0, Errors: 0, Time elapsed: 2.382 sec

BUILD FAILED
<https://builds.apache.org/job/Nutch-nutchgora/ws/2.x/build.xml>:437: The following error occurred while executing this line:
<https://builds.apache.org/job/Nutch-nutchgora/ws/2.x/src/plugin/build.xml>:78: The following error occurred while executing this line:
<https://builds.apache.org/job/Nutch-nutchgora/ws/2.x/src/plugin/build-plugin.xml>:207: Tests failed!

Total time: 1 minute 59 seconds
Build step 'Invoke Ant' marked build as failure
Publishing Javadoc

Build failed in Jenkins: Nutch-nutchgora #1042

Posted by Apache Jenkins Server <je...@builds.apache.org>.
See <https://builds.apache.org/job/Nutch-nutchgora/1042/>

------------------------------------------
[...truncated 3122 lines...]
init-plugin:

clean-lib:

resolve-default:
[ivy:resolve] :: loading settings :: file = <https://builds.apache.org/job/Nutch-nutchgora/ws/2.x/ivy/ivysettings.xml>

compile:

jar:

deps-test:

deploy:

copy-generated-lib:

deploy:
     [copy] Copying 1 file to <https://builds.apache.org/job/Nutch-nutchgora/ws/2.x/build/plugins/urlnormalizer-regex>

copy-generated-lib:
     [copy] Copying 1 file to <https://builds.apache.org/job/Nutch-nutchgora/ws/2.x/build/plugins/urlnormalizer-regex>

compile:

job:
      [jar] Building jar: <https://builds.apache.org/job/Nutch-nutchgora/ws/2.x/build/apache-nutch-2.3-SNAPSHOT.job>

resolve-test:
  [taskdef] Could not load definitions from resource org/sonar/ant/antlib.xml. It could not be found.

copy-libs:

compile-core-test:
    [javac] Compiling 34 source files to <https://builds.apache.org/job/Nutch-nutchgora/ws/2.x/build/test/classes>
    [javac] warning: [options] bootstrap class path not set in conjunction with -source 1.6
    [javac] 1 warning

test-core:
    [mkdir] Created dir: <https://builds.apache.org/job/Nutch-nutchgora/ws/2.x/build/test/data>
     [copy] Copying 90 files to <https://builds.apache.org/job/Nutch-nutchgora/ws/2.x/build/test/data>
     [copy] Copying 1 file to <https://builds.apache.org/job/Nutch-nutchgora/ws/2.x/build/test/classes>
     [copy] Copying 1 file to <https://builds.apache.org/job/Nutch-nutchgora/ws/2.x/build/test/classes>
     [copy] Copying 1 file to <https://builds.apache.org/job/Nutch-nutchgora/ws/2.x/build/test/classes>
     [copy] Copying 1 file to <https://builds.apache.org/job/Nutch-nutchgora/ws/2.x/build/test/classes>
     [copy] Copying 1 file to <https://builds.apache.org/job/Nutch-nutchgora/ws/2.x/build/test/classes>
     [copy] Copying 1 file to <https://builds.apache.org/job/Nutch-nutchgora/ws/2.x/build/test/classes>
    [junit] Running org.apache.nutch.api.TestAPI
    [junit] Tests run: 1, Failures: 0, Errors: 0, Time elapsed: 0.021 sec
    [junit] Running org.apache.nutch.crawl.TestAdaptiveFetchSchedule
    [junit] Tests run: 1, Failures: 0, Errors: 0, Time elapsed: 0.545 sec
    [junit] Running org.apache.nutch.crawl.TestGenerator
    [junit] Tests run: 0, Failures: 0, Errors: 0, Time elapsed: 0.011 sec
    [junit] Running org.apache.nutch.crawl.TestInjector
    [junit] Tests run: 0, Failures: 0, Errors: 0, Time elapsed: 0.012 sec
    [junit] Running org.apache.nutch.crawl.TestSignatureFactory
    [junit] Tests run: 1, Failures: 0, Errors: 0, Time elapsed: 0.25 sec
    [junit] Running org.apache.nutch.crawl.TestURLPartitioner
    [junit] Tests run: 7, Failures: 0, Errors: 0, Time elapsed: 1.475 sec
    [junit] Running org.apache.nutch.crawl.TestUrlWithScore
    [junit] Tests run: 4, Failures: 0, Errors: 0, Time elapsed: 0.121 sec
    [junit] Running org.apache.nutch.fetcher.TestFetcher
    [junit] Tests run: 1, Failures: 0, Errors: 0, Time elapsed: 1.174 sec
    [junit] Running org.apache.nutch.indexer.TestIndexingFilters
    [junit] Tests run: 3, Failures: 0, Errors: 0, Time elapsed: 0.893 sec
    [junit] Running org.apache.nutch.metadata.TestMetadata
    [junit] Tests run: 10, Failures: 0, Errors: 0, Time elapsed: 0.119 sec
    [junit] Running org.apache.nutch.metadata.TestSpellCheckedMetadata
    [junit] Tests run: 11, Failures: 0, Errors: 0, Time elapsed: 3.07 sec
    [junit] Running org.apache.nutch.net.TestURLFilters
    [junit] Tests run: 1, Failures: 0, Errors: 0, Time elapsed: 0.538 sec
    [junit] Running org.apache.nutch.net.TestURLNormalizers
    [junit] Tests run: 1, Failures: 0, Errors: 0, Time elapsed: 0.375 sec
    [junit] Running org.apache.nutch.parse.TestOutlinkExtractor
    [junit] Tests run: 3, Failures: 0, Errors: 0, Time elapsed: 0.052 sec
    [junit] Running org.apache.nutch.parse.TestParserFactory
    [junit] Tests run: 2, Failures: 0, Errors: 0, Time elapsed: 0.998 sec
    [junit] Running org.apache.nutch.plugin.TestPluginSystem
    [junit] Tests run: 7, Failures: 0, Errors: 0, Time elapsed: 1.057 sec
    [junit] Running org.apache.nutch.protocol.TestContent
    [junit] Tests run: 2, Failures: 0, Errors: 0, Time elapsed: 0.531 sec
    [junit] Running org.apache.nutch.protocol.TestProtocolFactory
    [junit] Tests run: 2, Failures: 0, Errors: 0, Time elapsed: 0.896 sec
    [junit] Running org.apache.nutch.storage.TestGoraStorage
    [junit] Tests run: 0, Failures: 0, Errors: 0, Time elapsed: 0.012 sec
    [junit] Running org.apache.nutch.util.TestEncodingDetector
    [junit] Tests run: 1, Failures: 0, Errors: 0, Time elapsed: 0.477 sec
    [junit] Running org.apache.nutch.util.TestGZIPUtils
    [junit] Tests run: 4, Failures: 0, Errors: 0, Time elapsed: 0.557 sec
    [junit] Running org.apache.nutch.util.TestNodeWalker
    [junit] Tests run: 1, Failures: 0, Errors: 0, Time elapsed: 0.213 sec
    [junit] Running org.apache.nutch.util.TestPrefixStringMatcher
    [junit] Tests run: 1, Failures: 0, Errors: 0, Time elapsed: 0.096 sec
    [junit] Running org.apache.nutch.util.TestStringUtil
    [junit] Tests run: 2, Failures: 0, Errors: 0, Time elapsed: 0.022 sec
    [junit] Running org.apache.nutch.util.TestSuffixStringMatcher
    [junit] Tests run: 1, Failures: 0, Errors: 0, Time elapsed: 0.085 sec
    [junit] Running org.apache.nutch.util.TestTableUtil
    [junit] Tests run: 2, Failures: 0, Errors: 0, Time elapsed: 0.034 sec
    [junit] Running org.apache.nutch.util.TestURLUtil
    [junit] Tests run: 7, Failures: 0, Errors: 0, Time elapsed: 0.72 sec

test-plugins:

test:

init:

init-plugin:

deps-jar:

clean-lib:

resolve-default:
[ivy:resolve] :: loading settings :: file = <https://builds.apache.org/job/Nutch-nutchgora/ws/2.x/ivy/ivysettings.xml>

compile:
     [echo] Compiling plugin: creativecommons

compile-test:
    [javac] Compiling 1 source file to <https://builds.apache.org/job/Nutch-nutchgora/ws/2.x/build/creativecommons/test>
    [javac] warning: [options] bootstrap class path not set in conjunction with -source 1.6
    [javac] 1 warning

jar:

deps-test:

init:

init-plugin:

clean-lib:

resolve-default:
[ivy:resolve] :: loading settings :: file = <https://builds.apache.org/job/Nutch-nutchgora/ws/2.x/ivy/ivysettings.xml>

compile:

jar:

deps-test:

deploy:

copy-generated-lib:

deploy:

copy-generated-lib:

test:
     [echo] Testing plugin: creativecommons
    [junit] Running org.creativecommons.nutch.TestCCParseFilter
    [junit] Tests run: 1, Failures: 0, Errors: 0, Time elapsed: 2.285 sec

init:

init-plugin:

deps-jar:

clean-lib:

resolve-default:
[ivy:resolve] :: loading settings :: file = <https://builds.apache.org/job/Nutch-nutchgora/ws/2.x/ivy/ivysettings.xml>

compile:
     [echo] Compiling plugin: parse-tika

compile-test:
    [javac] Compiling 7 source files to <https://builds.apache.org/job/Nutch-nutchgora/ws/2.x/build/parse-tika/test>
    [javac] warning: [options] bootstrap class path not set in conjunction with -source 1.6
    [javac] 1 warning

jar:

deps-test:

init:

init-plugin:

clean-lib:

resolve-default:
[ivy:resolve] :: loading settings :: file = <https://builds.apache.org/job/Nutch-nutchgora/ws/2.x/ivy/ivysettings.xml>

compile:

jar:

deps-test:

deploy:

copy-generated-lib:

init:

init-plugin:

deps-jar:

clean-lib:

resolve-default:
[ivy:resolve] :: loading settings :: file = <https://builds.apache.org/job/Nutch-nutchgora/ws/2.x/ivy/ivysettings.xml>

compile:
     [echo] Compiling plugin: protocol-file

jar:

deps-test:

deploy:

copy-generated-lib:

deploy:

copy-generated-lib:

test:
     [echo] Testing plugin: parse-tika
    [junit] Running org.apache.nutch.parse.tika.TestImageMetadata
    [junit] Tests run: 1, Failures: 0, Errors: 1, Time elapsed: 1.672 sec
    [junit] Test org.apache.nutch.parse.tika.TestImageMetadata FAILED
    [junit] Running org.apache.nutch.parse.tika.TestMSWordParser
    [junit] Tests run: 2, Failures: 0, Errors: 0, Time elapsed: 2.489 sec
    [junit] Running org.apache.nutch.parse.tika.TestOOParser
    [junit] Tests run: 1, Failures: 0, Errors: 0, Time elapsed: 2.108 sec
    [junit] Running org.apache.nutch.parse.tika.TestPdfParser
    [junit] Tests run: 1, Failures: 0, Errors: 0, Time elapsed: 3.149 sec
    [junit] Running org.apache.nutch.parse.tika.TestRSSParser
    [junit] Tests run: 1, Failures: 0, Errors: 0, Time elapsed: 2.007 sec
    [junit] Running org.apache.nutch.parse.tika.TestRTFParser
    [junit] Tests run: 1, Failures: 0, Errors: 0, Time elapsed: 2.389 sec

BUILD FAILED
<https://builds.apache.org/job/Nutch-nutchgora/ws/2.x/build.xml>:437: The following error occurred while executing this line:
<https://builds.apache.org/job/Nutch-nutchgora/ws/2.x/src/plugin/build.xml>:78: The following error occurred while executing this line:
<https://builds.apache.org/job/Nutch-nutchgora/ws/2.x/src/plugin/build-plugin.xml>:207: Tests failed!

Total time: 1 minute 26 seconds
Build step 'Invoke Ant' marked build as failure
Publishing Javadoc

Build failed in Jenkins: Nutch-nutchgora #1041

Posted by Apache Jenkins Server <je...@builds.apache.org>.
See <https://builds.apache.org/job/Nutch-nutchgora/1041/>

------------------------------------------
[...truncated 3192 lines...]
init-plugin:

clean-lib:

resolve-default:
[ivy:resolve] :: loading settings :: file = <https://builds.apache.org/job/Nutch-nutchgora/ws/2.x/ivy/ivysettings.xml>

compile:

jar:

deps-test:

deploy:

copy-generated-lib:

deploy:
     [copy] Copying 1 file to <https://builds.apache.org/job/Nutch-nutchgora/ws/2.x/build/plugins/urlnormalizer-regex>

copy-generated-lib:
     [copy] Copying 1 file to <https://builds.apache.org/job/Nutch-nutchgora/ws/2.x/build/plugins/urlnormalizer-regex>

compile:

job:
      [jar] Building jar: <https://builds.apache.org/job/Nutch-nutchgora/ws/2.x/build/apache-nutch-2.3-SNAPSHOT.job>

resolve-test:
  [taskdef] Could not load definitions from resource org/sonar/ant/antlib.xml. It could not be found.

copy-libs:

compile-core-test:
    [javac] Compiling 34 source files to <https://builds.apache.org/job/Nutch-nutchgora/ws/2.x/build/test/classes>
    [javac] warning: [options] bootstrap class path not set in conjunction with -source 1.6
    [javac] 1 warning

test-core:
    [mkdir] Created dir: <https://builds.apache.org/job/Nutch-nutchgora/ws/2.x/build/test/data>
     [copy] Copying 90 files to <https://builds.apache.org/job/Nutch-nutchgora/ws/2.x/build/test/data>
     [copy] Copying 1 file to <https://builds.apache.org/job/Nutch-nutchgora/ws/2.x/build/test/classes>
     [copy] Copying 1 file to <https://builds.apache.org/job/Nutch-nutchgora/ws/2.x/build/test/classes>
     [copy] Copying 1 file to <https://builds.apache.org/job/Nutch-nutchgora/ws/2.x/build/test/classes>
     [copy] Copying 1 file to <https://builds.apache.org/job/Nutch-nutchgora/ws/2.x/build/test/classes>
     [copy] Copying 1 file to <https://builds.apache.org/job/Nutch-nutchgora/ws/2.x/build/test/classes>
     [copy] Copying 1 file to <https://builds.apache.org/job/Nutch-nutchgora/ws/2.x/build/test/classes>
    [junit] Running org.apache.nutch.api.TestAPI
    [junit] Tests run: 1, Failures: 0, Errors: 0, Time elapsed: 0.02 sec
    [junit] Running org.apache.nutch.crawl.TestAdaptiveFetchSchedule
    [junit] Tests run: 1, Failures: 0, Errors: 0, Time elapsed: 1.086 sec
    [junit] Running org.apache.nutch.crawl.TestGenerator
    [junit] Tests run: 0, Failures: 0, Errors: 0, Time elapsed: 0.011 sec
    [junit] Running org.apache.nutch.crawl.TestInjector
    [junit] Tests run: 0, Failures: 0, Errors: 0, Time elapsed: 0.012 sec
    [junit] Running org.apache.nutch.crawl.TestSignatureFactory
    [junit] Tests run: 1, Failures: 0, Errors: 0, Time elapsed: 0.249 sec
    [junit] Running org.apache.nutch.crawl.TestURLPartitioner
    [junit] Tests run: 7, Failures: 0, Errors: 0, Time elapsed: 1.48 sec
    [junit] Running org.apache.nutch.crawl.TestUrlWithScore
    [junit] Tests run: 4, Failures: 0, Errors: 0, Time elapsed: 0.121 sec
    [junit] Running org.apache.nutch.fetcher.TestFetcher
    [junit] Tests run: 1, Failures: 0, Errors: 0, Time elapsed: 0.988 sec
    [junit] Running org.apache.nutch.indexer.TestIndexingFilters
    [junit] Tests run: 3, Failures: 0, Errors: 0, Time elapsed: 0.91 sec
    [junit] Running org.apache.nutch.metadata.TestMetadata
    [junit] Tests run: 10, Failures: 0, Errors: 0, Time elapsed: 0.125 sec
    [junit] Running org.apache.nutch.metadata.TestSpellCheckedMetadata
    [junit] Tests run: 11, Failures: 0, Errors: 0, Time elapsed: 3.079 sec
    [junit] Running org.apache.nutch.net.TestURLFilters
    [junit] Tests run: 1, Failures: 0, Errors: 0, Time elapsed: 0.67 sec
    [junit] Running org.apache.nutch.net.TestURLNormalizers
    [junit] Tests run: 1, Failures: 0, Errors: 0, Time elapsed: 0.384 sec
    [junit] Running org.apache.nutch.parse.TestOutlinkExtractor
    [junit] Tests run: 3, Failures: 0, Errors: 0, Time elapsed: 0.054 sec
    [junit] Running org.apache.nutch.parse.TestParserFactory
    [junit] Tests run: 2, Failures: 0, Errors: 0, Time elapsed: 0.973 sec
    [junit] Running org.apache.nutch.plugin.TestPluginSystem
    [junit] Tests run: 7, Failures: 0, Errors: 0, Time elapsed: 1.101 sec
    [junit] Running org.apache.nutch.protocol.TestContent
    [junit] Tests run: 2, Failures: 0, Errors: 0, Time elapsed: 0.531 sec
    [junit] Running org.apache.nutch.protocol.TestProtocolFactory
    [junit] Tests run: 2, Failures: 0, Errors: 0, Time elapsed: 0.885 sec
    [junit] Running org.apache.nutch.storage.TestGoraStorage
    [junit] Tests run: 0, Failures: 0, Errors: 0, Time elapsed: 0.013 sec
    [junit] Running org.apache.nutch.util.TestEncodingDetector
    [junit] Tests run: 1, Failures: 0, Errors: 0, Time elapsed: 0.459 sec
    [junit] Running org.apache.nutch.util.TestGZIPUtils
    [junit] Tests run: 4, Failures: 0, Errors: 0, Time elapsed: 0.568 sec
    [junit] Running org.apache.nutch.util.TestNodeWalker
    [junit] Tests run: 1, Failures: 0, Errors: 0, Time elapsed: 0.214 sec
    [junit] Running org.apache.nutch.util.TestPrefixStringMatcher
    [junit] Tests run: 1, Failures: 0, Errors: 0, Time elapsed: 0.09 sec
    [junit] Running org.apache.nutch.util.TestStringUtil
    [junit] Tests run: 2, Failures: 0, Errors: 0, Time elapsed: 0.022 sec
    [junit] Running org.apache.nutch.util.TestSuffixStringMatcher
    [junit] Tests run: 1, Failures: 0, Errors: 0, Time elapsed: 0.092 sec
    [junit] Running org.apache.nutch.util.TestTableUtil
    [junit] Tests run: 2, Failures: 0, Errors: 0, Time elapsed: 0.033 sec
    [junit] Running org.apache.nutch.util.TestURLUtil
    [junit] Tests run: 7, Failures: 0, Errors: 0, Time elapsed: 0.689 sec

test-plugins:

test:

init:

init-plugin:

deps-jar:

clean-lib:

resolve-default:
[ivy:resolve] :: loading settings :: file = <https://builds.apache.org/job/Nutch-nutchgora/ws/2.x/ivy/ivysettings.xml>

compile:
     [echo] Compiling plugin: creativecommons

compile-test:
    [javac] Compiling 1 source file to <https://builds.apache.org/job/Nutch-nutchgora/ws/2.x/build/creativecommons/test>
    [javac] warning: [options] bootstrap class path not set in conjunction with -source 1.6
    [javac] 1 warning

jar:

deps-test:

init:

init-plugin:

clean-lib:

resolve-default:
[ivy:resolve] :: loading settings :: file = <https://builds.apache.org/job/Nutch-nutchgora/ws/2.x/ivy/ivysettings.xml>

compile:

jar:

deps-test:

deploy:

copy-generated-lib:

deploy:

copy-generated-lib:

test:
     [echo] Testing plugin: creativecommons
    [junit] Running org.creativecommons.nutch.TestCCParseFilter
    [junit] Tests run: 1, Failures: 0, Errors: 0, Time elapsed: 2.411 sec

init:

init-plugin:

deps-jar:

clean-lib:

resolve-default:
[ivy:resolve] :: loading settings :: file = <https://builds.apache.org/job/Nutch-nutchgora/ws/2.x/ivy/ivysettings.xml>

compile:
     [echo] Compiling plugin: parse-tika

compile-test:
    [javac] Compiling 7 source files to <https://builds.apache.org/job/Nutch-nutchgora/ws/2.x/build/parse-tika/test>
    [javac] warning: [options] bootstrap class path not set in conjunction with -source 1.6
    [javac] 1 warning

jar:

deps-test:

init:

init-plugin:

clean-lib:

resolve-default:
[ivy:resolve] :: loading settings :: file = <https://builds.apache.org/job/Nutch-nutchgora/ws/2.x/ivy/ivysettings.xml>

compile:

jar:

deps-test:

deploy:

copy-generated-lib:

init:

init-plugin:

deps-jar:

clean-lib:

resolve-default:
[ivy:resolve] :: loading settings :: file = <https://builds.apache.org/job/Nutch-nutchgora/ws/2.x/ivy/ivysettings.xml>

compile:
     [echo] Compiling plugin: protocol-file

jar:

deps-test:

deploy:

copy-generated-lib:

deploy:

copy-generated-lib:

test:
     [echo] Testing plugin: parse-tika
    [junit] Running org.apache.nutch.parse.tika.TestImageMetadata
    [junit] Tests run: 1, Failures: 0, Errors: 1, Time elapsed: 1.797 sec
    [junit] Test org.apache.nutch.parse.tika.TestImageMetadata FAILED
    [junit] Running org.apache.nutch.parse.tika.TestMSWordParser
    [junit] Tests run: 2, Failures: 0, Errors: 0, Time elapsed: 2.567 sec
    [junit] Running org.apache.nutch.parse.tika.TestOOParser
    [junit] Tests run: 1, Failures: 0, Errors: 0, Time elapsed: 2.198 sec
    [junit] Running org.apache.nutch.parse.tika.TestPdfParser
    [junit] Tests run: 1, Failures: 0, Errors: 0, Time elapsed: 3.147 sec
    [junit] Running org.apache.nutch.parse.tika.TestRSSParser
    [junit] Tests run: 1, Failures: 0, Errors: 0, Time elapsed: 1.999 sec
    [junit] Running org.apache.nutch.parse.tika.TestRTFParser
    [junit] Tests run: 1, Failures: 0, Errors: 0, Time elapsed: 2.411 sec

BUILD FAILED
<https://builds.apache.org/job/Nutch-nutchgora/ws/2.x/build.xml>:437: The following error occurred while executing this line:
<https://builds.apache.org/job/Nutch-nutchgora/ws/2.x/src/plugin/build.xml>:78: The following error occurred while executing this line:
<https://builds.apache.org/job/Nutch-nutchgora/ws/2.x/src/plugin/build-plugin.xml>:207: Tests failed!

Total time: 1 minute 47 seconds
Build step 'Invoke Ant' marked build as failure
Publishing Javadoc

Build failed in Jenkins: Nutch-nutchgora #1040

Posted by Apache Jenkins Server <je...@builds.apache.org>.
See <https://builds.apache.org/job/Nutch-nutchgora/1040/>

------------------------------------------
[...truncated 3068 lines...]
init-plugin:

clean-lib:

resolve-default:
[ivy:resolve] :: loading settings :: file = <https://builds.apache.org/job/Nutch-nutchgora/ws/2.x/ivy/ivysettings.xml>

compile:

jar:

deps-test:

deploy:

copy-generated-lib:

deploy:
     [copy] Copying 1 file to <https://builds.apache.org/job/Nutch-nutchgora/ws/2.x/build/plugins/urlnormalizer-regex>

copy-generated-lib:
     [copy] Copying 1 file to <https://builds.apache.org/job/Nutch-nutchgora/ws/2.x/build/plugins/urlnormalizer-regex>

compile:

job:
      [jar] Building jar: <https://builds.apache.org/job/Nutch-nutchgora/ws/2.x/build/apache-nutch-2.3-SNAPSHOT.job>

resolve-test:
  [taskdef] Could not load definitions from resource org/sonar/ant/antlib.xml. It could not be found.

copy-libs:

compile-core-test:
    [javac] Compiling 34 source files to <https://builds.apache.org/job/Nutch-nutchgora/ws/2.x/build/test/classes>
    [javac] warning: [options] bootstrap class path not set in conjunction with -source 1.6
    [javac] 1 warning

test-core:
    [mkdir] Created dir: <https://builds.apache.org/job/Nutch-nutchgora/ws/2.x/build/test/data>
     [copy] Copying 90 files to <https://builds.apache.org/job/Nutch-nutchgora/ws/2.x/build/test/data>
     [copy] Copying 1 file to <https://builds.apache.org/job/Nutch-nutchgora/ws/2.x/build/test/classes>
     [copy] Copying 1 file to <https://builds.apache.org/job/Nutch-nutchgora/ws/2.x/build/test/classes>
     [copy] Copying 1 file to <https://builds.apache.org/job/Nutch-nutchgora/ws/2.x/build/test/classes>
     [copy] Copying 1 file to <https://builds.apache.org/job/Nutch-nutchgora/ws/2.x/build/test/classes>
     [copy] Copying 1 file to <https://builds.apache.org/job/Nutch-nutchgora/ws/2.x/build/test/classes>
     [copy] Copying 1 file to <https://builds.apache.org/job/Nutch-nutchgora/ws/2.x/build/test/classes>
    [junit] Running org.apache.nutch.api.TestAPI
    [junit] Tests run: 1, Failures: 0, Errors: 0, Time elapsed: 0.021 sec
    [junit] Running org.apache.nutch.crawl.TestAdaptiveFetchSchedule
    [junit] Tests run: 1, Failures: 0, Errors: 0, Time elapsed: 0.527 sec
    [junit] Running org.apache.nutch.crawl.TestGenerator
    [junit] Tests run: 0, Failures: 0, Errors: 0, Time elapsed: 0.011 sec
    [junit] Running org.apache.nutch.crawl.TestInjector
    [junit] Tests run: 0, Failures: 0, Errors: 0, Time elapsed: 0.012 sec
    [junit] Running org.apache.nutch.crawl.TestSignatureFactory
    [junit] Tests run: 1, Failures: 0, Errors: 0, Time elapsed: 0.25 sec
    [junit] Running org.apache.nutch.crawl.TestURLPartitioner
    [junit] Tests run: 7, Failures: 0, Errors: 0, Time elapsed: 1.272 sec
    [junit] Running org.apache.nutch.crawl.TestUrlWithScore
    [junit] Tests run: 4, Failures: 0, Errors: 0, Time elapsed: 0.119 sec
    [junit] Running org.apache.nutch.fetcher.TestFetcher
    [junit] Tests run: 1, Failures: 0, Errors: 0, Time elapsed: 1.187 sec
    [junit] Running org.apache.nutch.indexer.TestIndexingFilters
    [junit] Tests run: 3, Failures: 0, Errors: 0, Time elapsed: 0.897 sec
    [junit] Running org.apache.nutch.metadata.TestMetadata
    [junit] Tests run: 10, Failures: 0, Errors: 0, Time elapsed: 0.119 sec
    [junit] Running org.apache.nutch.metadata.TestSpellCheckedMetadata
    [junit] Tests run: 11, Failures: 0, Errors: 0, Time elapsed: 3.07 sec
    [junit] Running org.apache.nutch.net.TestURLFilters
    [junit] Tests run: 1, Failures: 0, Errors: 0, Time elapsed: 0.555 sec
    [junit] Running org.apache.nutch.net.TestURLNormalizers
    [junit] Tests run: 1, Failures: 0, Errors: 0, Time elapsed: 0.376 sec
    [junit] Running org.apache.nutch.parse.TestOutlinkExtractor
    [junit] Tests run: 3, Failures: 0, Errors: 0, Time elapsed: 0.052 sec
    [junit] Running org.apache.nutch.parse.TestParserFactory
    [junit] Tests run: 2, Failures: 0, Errors: 0, Time elapsed: 0.996 sec
    [junit] Running org.apache.nutch.plugin.TestPluginSystem
    [junit] Tests run: 7, Failures: 0, Errors: 0, Time elapsed: 1.113 sec
    [junit] Running org.apache.nutch.protocol.TestContent
    [junit] Tests run: 2, Failures: 0, Errors: 0, Time elapsed: 0.536 sec
    [junit] Running org.apache.nutch.protocol.TestProtocolFactory
    [junit] Tests run: 2, Failures: 0, Errors: 0, Time elapsed: 0.905 sec
    [junit] Running org.apache.nutch.storage.TestGoraStorage
    [junit] Tests run: 0, Failures: 0, Errors: 0, Time elapsed: 0.013 sec
    [junit] Running org.apache.nutch.util.TestEncodingDetector
    [junit] Tests run: 1, Failures: 0, Errors: 0, Time elapsed: 0.511 sec
    [junit] Running org.apache.nutch.util.TestGZIPUtils
    [junit] Tests run: 4, Failures: 0, Errors: 0, Time elapsed: 0.56 sec
    [junit] Running org.apache.nutch.util.TestNodeWalker
    [junit] Tests run: 1, Failures: 0, Errors: 0, Time elapsed: 0.21 sec
    [junit] Running org.apache.nutch.util.TestPrefixStringMatcher
    [junit] Tests run: 1, Failures: 0, Errors: 0, Time elapsed: 0.101 sec
    [junit] Running org.apache.nutch.util.TestStringUtil
    [junit] Tests run: 2, Failures: 0, Errors: 0, Time elapsed: 0.022 sec
    [junit] Running org.apache.nutch.util.TestSuffixStringMatcher
    [junit] Tests run: 1, Failures: 0, Errors: 0, Time elapsed: 0.106 sec
    [junit] Running org.apache.nutch.util.TestTableUtil
    [junit] Tests run: 2, Failures: 0, Errors: 0, Time elapsed: 0.034 sec
    [junit] Running org.apache.nutch.util.TestURLUtil
    [junit] Tests run: 7, Failures: 0, Errors: 0, Time elapsed: 0.73 sec

test-plugins:

test:

init:

init-plugin:

deps-jar:

clean-lib:

resolve-default:
[ivy:resolve] :: loading settings :: file = <https://builds.apache.org/job/Nutch-nutchgora/ws/2.x/ivy/ivysettings.xml>

compile:
     [echo] Compiling plugin: creativecommons

compile-test:
    [javac] Compiling 1 source file to <https://builds.apache.org/job/Nutch-nutchgora/ws/2.x/build/creativecommons/test>
    [javac] warning: [options] bootstrap class path not set in conjunction with -source 1.6
    [javac] 1 warning

jar:

deps-test:

init:

init-plugin:

clean-lib:

resolve-default:
[ivy:resolve] :: loading settings :: file = <https://builds.apache.org/job/Nutch-nutchgora/ws/2.x/ivy/ivysettings.xml>

compile:

jar:

deps-test:

deploy:

copy-generated-lib:

deploy:

copy-generated-lib:

test:
     [echo] Testing plugin: creativecommons
    [junit] Running org.creativecommons.nutch.TestCCParseFilter
    [junit] Tests run: 1, Failures: 0, Errors: 0, Time elapsed: 2.282 sec

init:

init-plugin:

deps-jar:

clean-lib:

resolve-default:
[ivy:resolve] :: loading settings :: file = <https://builds.apache.org/job/Nutch-nutchgora/ws/2.x/ivy/ivysettings.xml>

compile:
     [echo] Compiling plugin: parse-tika

compile-test:
    [javac] Compiling 7 source files to <https://builds.apache.org/job/Nutch-nutchgora/ws/2.x/build/parse-tika/test>
    [javac] warning: [options] bootstrap class path not set in conjunction with -source 1.6
    [javac] 1 warning

jar:

deps-test:

init:

init-plugin:

clean-lib:

resolve-default:
[ivy:resolve] :: loading settings :: file = <https://builds.apache.org/job/Nutch-nutchgora/ws/2.x/ivy/ivysettings.xml>

compile:

jar:

deps-test:

deploy:

copy-generated-lib:

init:

init-plugin:

deps-jar:

clean-lib:

resolve-default:
[ivy:resolve] :: loading settings :: file = <https://builds.apache.org/job/Nutch-nutchgora/ws/2.x/ivy/ivysettings.xml>

compile:
     [echo] Compiling plugin: protocol-file

jar:

deps-test:

deploy:

copy-generated-lib:

deploy:

copy-generated-lib:

test:
     [echo] Testing plugin: parse-tika
    [junit] Running org.apache.nutch.parse.tika.TestImageMetadata
    [junit] Tests run: 1, Failures: 0, Errors: 1, Time elapsed: 1.767 sec
    [junit] Test org.apache.nutch.parse.tika.TestImageMetadata FAILED
    [junit] Running org.apache.nutch.parse.tika.TestMSWordParser
    [junit] Tests run: 2, Failures: 0, Errors: 0, Time elapsed: 2.485 sec
    [junit] Running org.apache.nutch.parse.tika.TestOOParser
    [junit] Tests run: 1, Failures: 0, Errors: 0, Time elapsed: 2.097 sec
    [junit] Running org.apache.nutch.parse.tika.TestPdfParser
    [junit] Tests run: 1, Failures: 0, Errors: 0, Time elapsed: 3.061 sec
    [junit] Running org.apache.nutch.parse.tika.TestRSSParser
    [junit] Tests run: 1, Failures: 0, Errors: 0, Time elapsed: 2.005 sec
    [junit] Running org.apache.nutch.parse.tika.TestRTFParser
    [junit] Tests run: 1, Failures: 0, Errors: 0, Time elapsed: 2.387 sec

BUILD FAILED
<https://builds.apache.org/job/Nutch-nutchgora/ws/2.x/build.xml>:437: The following error occurred while executing this line:
<https://builds.apache.org/job/Nutch-nutchgora/ws/2.x/src/plugin/build.xml>:78: The following error occurred while executing this line:
<https://builds.apache.org/job/Nutch-nutchgora/ws/2.x/src/plugin/build-plugin.xml>:207: Tests failed!

Total time: 1 minute 38 seconds
Build step 'Invoke Ant' marked build as failure
Publishing Javadoc

Build failed in Jenkins: Nutch-nutchgora #1039

Posted by Apache Jenkins Server <je...@builds.apache.org>.
See <https://builds.apache.org/job/Nutch-nutchgora/1039/changes>

Changes:

[jnioche] NUTCH-1736 Can't fetch page if http response header contains Transfer-Encoding:chunked

------------------------------------------
[...truncated 3068 lines...]

clean-lib:

resolve-default:
[ivy:resolve] :: loading settings :: file = <https://builds.apache.org/job/Nutch-nutchgora/ws/2.x/ivy/ivysettings.xml>

compile:

jar:

deps-test:

deploy:

copy-generated-lib:

deploy:
     [copy] Copying 1 file to <https://builds.apache.org/job/Nutch-nutchgora/ws/2.x/build/plugins/urlnormalizer-regex>

copy-generated-lib:
     [copy] Copying 1 file to <https://builds.apache.org/job/Nutch-nutchgora/ws/2.x/build/plugins/urlnormalizer-regex>

compile:

job:
      [jar] Building jar: <https://builds.apache.org/job/Nutch-nutchgora/ws/2.x/build/apache-nutch-2.3-SNAPSHOT.job>

resolve-test:
  [taskdef] Could not load definitions from resource org/sonar/ant/antlib.xml. It could not be found.

copy-libs:

compile-core-test:
    [javac] Compiling 34 source files to <https://builds.apache.org/job/Nutch-nutchgora/ws/2.x/build/test/classes>
    [javac] warning: [options] bootstrap class path not set in conjunction with -source 1.6
    [javac] 1 warning

test-core:
    [mkdir] Created dir: <https://builds.apache.org/job/Nutch-nutchgora/ws/2.x/build/test/data>
     [copy] Copying 90 files to <https://builds.apache.org/job/Nutch-nutchgora/ws/2.x/build/test/data>
     [copy] Copying 1 file to <https://builds.apache.org/job/Nutch-nutchgora/ws/2.x/build/test/classes>
     [copy] Copying 1 file to <https://builds.apache.org/job/Nutch-nutchgora/ws/2.x/build/test/classes>
     [copy] Copying 1 file to <https://builds.apache.org/job/Nutch-nutchgora/ws/2.x/build/test/classes>
     [copy] Copying 1 file to <https://builds.apache.org/job/Nutch-nutchgora/ws/2.x/build/test/classes>
     [copy] Copying 1 file to <https://builds.apache.org/job/Nutch-nutchgora/ws/2.x/build/test/classes>
     [copy] Copying 1 file to <https://builds.apache.org/job/Nutch-nutchgora/ws/2.x/build/test/classes>
    [junit] Running org.apache.nutch.api.TestAPI
    [junit] Tests run: 1, Failures: 0, Errors: 0, Time elapsed: 0.208 sec
    [junit] Running org.apache.nutch.crawl.TestAdaptiveFetchSchedule
    [junit] Tests run: 1, Failures: 0, Errors: 0, Time elapsed: 0.54 sec
    [junit] Running org.apache.nutch.crawl.TestGenerator
    [junit] Tests run: 0, Failures: 0, Errors: 0, Time elapsed: 0.012 sec
    [junit] Running org.apache.nutch.crawl.TestInjector
    [junit] Tests run: 0, Failures: 0, Errors: 0, Time elapsed: 0.012 sec
    [junit] Running org.apache.nutch.crawl.TestSignatureFactory
    [junit] Tests run: 1, Failures: 0, Errors: 0, Time elapsed: 0.247 sec
    [junit] Running org.apache.nutch.crawl.TestURLPartitioner
    [junit] Tests run: 7, Failures: 0, Errors: 0, Time elapsed: 1.39 sec
    [junit] Running org.apache.nutch.crawl.TestUrlWithScore
    [junit] Tests run: 4, Failures: 0, Errors: 0, Time elapsed: 0.12 sec
    [junit] Running org.apache.nutch.fetcher.TestFetcher
    [junit] Tests run: 1, Failures: 0, Errors: 0, Time elapsed: 1.1 sec
    [junit] Running org.apache.nutch.indexer.TestIndexingFilters
    [junit] Tests run: 3, Failures: 0, Errors: 0, Time elapsed: 0.892 sec
    [junit] Running org.apache.nutch.metadata.TestMetadata
    [junit] Tests run: 10, Failures: 0, Errors: 0, Time elapsed: 0.119 sec
    [junit] Running org.apache.nutch.metadata.TestSpellCheckedMetadata
    [junit] Tests run: 11, Failures: 0, Errors: 0, Time elapsed: 3.064 sec
    [junit] Running org.apache.nutch.net.TestURLFilters
    [junit] Tests run: 1, Failures: 0, Errors: 0, Time elapsed: 0.567 sec
    [junit] Running org.apache.nutch.net.TestURLNormalizers
    [junit] Tests run: 1, Failures: 0, Errors: 0, Time elapsed: 0.379 sec
    [junit] Running org.apache.nutch.parse.TestOutlinkExtractor
    [junit] Tests run: 3, Failures: 0, Errors: 0, Time elapsed: 1.301 sec
    [junit] Running org.apache.nutch.parse.TestParserFactory
    [junit] Tests run: 2, Failures: 0, Errors: 0, Time elapsed: 0.973 sec
    [junit] Running org.apache.nutch.plugin.TestPluginSystem
    [junit] Tests run: 7, Failures: 0, Errors: 0, Time elapsed: 1.062 sec
    [junit] Running org.apache.nutch.protocol.TestContent
    [junit] Tests run: 2, Failures: 0, Errors: 0, Time elapsed: 0.528 sec
    [junit] Running org.apache.nutch.protocol.TestProtocolFactory
    [junit] Tests run: 2, Failures: 0, Errors: 0, Time elapsed: 0.891 sec
    [junit] Running org.apache.nutch.storage.TestGoraStorage
    [junit] Tests run: 0, Failures: 0, Errors: 0, Time elapsed: 0.012 sec
    [junit] Running org.apache.nutch.util.TestEncodingDetector
    [junit] Tests run: 1, Failures: 0, Errors: 0, Time elapsed: 0.431 sec
    [junit] Running org.apache.nutch.util.TestGZIPUtils
    [junit] Tests run: 4, Failures: 0, Errors: 0, Time elapsed: 0.567 sec
    [junit] Running org.apache.nutch.util.TestNodeWalker
    [junit] Tests run: 1, Failures: 0, Errors: 0, Time elapsed: 0.212 sec
    [junit] Running org.apache.nutch.util.TestPrefixStringMatcher
    [junit] Tests run: 1, Failures: 0, Errors: 0, Time elapsed: 0.1 sec
    [junit] Running org.apache.nutch.util.TestStringUtil
    [junit] Tests run: 2, Failures: 0, Errors: 0, Time elapsed: 0.022 sec
    [junit] Running org.apache.nutch.util.TestSuffixStringMatcher
    [junit] Tests run: 1, Failures: 0, Errors: 0, Time elapsed: 0.092 sec
    [junit] Running org.apache.nutch.util.TestTableUtil
    [junit] Tests run: 2, Failures: 0, Errors: 0, Time elapsed: 0.034 sec
    [junit] Running org.apache.nutch.util.TestURLUtil
    [junit] Tests run: 7, Failures: 0, Errors: 0, Time elapsed: 0.757 sec

test-plugins:

test:

init:

init-plugin:

deps-jar:

clean-lib:

resolve-default:
[ivy:resolve] :: loading settings :: file = <https://builds.apache.org/job/Nutch-nutchgora/ws/2.x/ivy/ivysettings.xml>

compile:
     [echo] Compiling plugin: creativecommons

compile-test:
    [javac] Compiling 1 source file to <https://builds.apache.org/job/Nutch-nutchgora/ws/2.x/build/creativecommons/test>
    [javac] warning: [options] bootstrap class path not set in conjunction with -source 1.6
    [javac] 1 warning

jar:

deps-test:

init:

init-plugin:

clean-lib:

resolve-default:
[ivy:resolve] :: loading settings :: file = <https://builds.apache.org/job/Nutch-nutchgora/ws/2.x/ivy/ivysettings.xml>

compile:

jar:

deps-test:

deploy:

copy-generated-lib:

deploy:

copy-generated-lib:

test:
     [echo] Testing plugin: creativecommons
    [junit] Running org.creativecommons.nutch.TestCCParseFilter
    [junit] Tests run: 1, Failures: 0, Errors: 0, Time elapsed: 2.413 sec

init:

init-plugin:

deps-jar:

clean-lib:

resolve-default:
[ivy:resolve] :: loading settings :: file = <https://builds.apache.org/job/Nutch-nutchgora/ws/2.x/ivy/ivysettings.xml>

compile:
     [echo] Compiling plugin: parse-tika

compile-test:
    [javac] Compiling 7 source files to <https://builds.apache.org/job/Nutch-nutchgora/ws/2.x/build/parse-tika/test>
    [javac] warning: [options] bootstrap class path not set in conjunction with -source 1.6
    [javac] 1 warning

jar:

deps-test:

init:

init-plugin:

clean-lib:

resolve-default:
[ivy:resolve] :: loading settings :: file = <https://builds.apache.org/job/Nutch-nutchgora/ws/2.x/ivy/ivysettings.xml>

compile:

jar:

deps-test:

deploy:

copy-generated-lib:

init:

init-plugin:

deps-jar:

clean-lib:

resolve-default:
[ivy:resolve] :: loading settings :: file = <https://builds.apache.org/job/Nutch-nutchgora/ws/2.x/ivy/ivysettings.xml>

compile:
     [echo] Compiling plugin: protocol-file

jar:

deps-test:

deploy:

copy-generated-lib:

deploy:

copy-generated-lib:

test:
     [echo] Testing plugin: parse-tika
    [junit] Running org.apache.nutch.parse.tika.TestImageMetadata
    [junit] Tests run: 1, Failures: 0, Errors: 1, Time elapsed: 1.987 sec
    [junit] Test org.apache.nutch.parse.tika.TestImageMetadata FAILED
    [junit] Running org.apache.nutch.parse.tika.TestMSWordParser
    [junit] Tests run: 2, Failures: 0, Errors: 0, Time elapsed: 2.497 sec
    [junit] Running org.apache.nutch.parse.tika.TestOOParser
    [junit] Tests run: 1, Failures: 0, Errors: 0, Time elapsed: 2.103 sec
    [junit] Running org.apache.nutch.parse.tika.TestPdfParser
    [junit] Tests run: 1, Failures: 0, Errors: 0, Time elapsed: 3.069 sec
    [junit] Running org.apache.nutch.parse.tika.TestRSSParser
    [junit] Tests run: 1, Failures: 0, Errors: 0, Time elapsed: 2.029 sec
    [junit] Running org.apache.nutch.parse.tika.TestRTFParser
    [junit] Tests run: 1, Failures: 0, Errors: 0, Time elapsed: 2.383 sec

BUILD FAILED
<https://builds.apache.org/job/Nutch-nutchgora/ws/2.x/build.xml>:437: The following error occurred while executing this line:
<https://builds.apache.org/job/Nutch-nutchgora/ws/2.x/src/plugin/build.xml>:78: The following error occurred while executing this line:
<https://builds.apache.org/job/Nutch-nutchgora/ws/2.x/src/plugin/build-plugin.xml>:207: Tests failed!

Total time: 1 minute 46 seconds
Build step 'Invoke Ant' marked build as failure
Publishing Javadoc
Updating NUTCH-1736

Build failed in Jenkins: Nutch-nutchgora #1038

Posted by Apache Jenkins Server <je...@builds.apache.org>.
See <https://builds.apache.org/job/Nutch-nutchgora/1038/>

------------------------------------------
[...truncated 3068 lines...]
init-plugin:

clean-lib:

resolve-default:
[ivy:resolve] :: loading settings :: file = /home/hudson/jenkins-slave/workspace/Nutch-nutchgora/2.x/ivy/ivysettings.xml

compile:

jar:

deps-test:

deploy:

copy-generated-lib:

deploy:
     [copy] Copying 1 file to /home/hudson/jenkins-slave/workspace/Nutch-nutchgora/2.x/build/plugins/urlnormalizer-regex

copy-generated-lib:
     [copy] Copying 1 file to /home/hudson/jenkins-slave/workspace/Nutch-nutchgora/2.x/build/plugins/urlnormalizer-regex

compile:

job:
      [jar] Building jar: /home/hudson/jenkins-slave/workspace/Nutch-nutchgora/2.x/build/apache-nutch-2.3-SNAPSHOT.job

resolve-test:
  [taskdef] Could not load definitions from resource org/sonar/ant/antlib.xml. It could not be found.

copy-libs:

compile-core-test:
    [javac] Compiling 34 source files to /home/hudson/jenkins-slave/workspace/Nutch-nutchgora/2.x/build/test/classes
    [javac] warning: [options] bootstrap class path not set in conjunction with -source 1.6
    [javac] 1 warning

test-core:
    [mkdir] Created dir: /home/hudson/jenkins-slave/workspace/Nutch-nutchgora/2.x/build/test/data
     [copy] Copying 90 files to /home/hudson/jenkins-slave/workspace/Nutch-nutchgora/2.x/build/test/data
     [copy] Copying 1 file to /home/hudson/jenkins-slave/workspace/Nutch-nutchgora/2.x/build/test/classes
     [copy] Copying 1 file to /home/hudson/jenkins-slave/workspace/Nutch-nutchgora/2.x/build/test/classes
     [copy] Copying 1 file to /home/hudson/jenkins-slave/workspace/Nutch-nutchgora/2.x/build/test/classes
     [copy] Copying 1 file to /home/hudson/jenkins-slave/workspace/Nutch-nutchgora/2.x/build/test/classes
     [copy] Copying 1 file to /home/hudson/jenkins-slave/workspace/Nutch-nutchgora/2.x/build/test/classes
     [copy] Copying 1 file to /home/hudson/jenkins-slave/workspace/Nutch-nutchgora/2.x/build/test/classes
    [junit] Running org.apache.nutch.api.TestAPI
    [junit] Tests run: 1, Failures: 0, Errors: 0, Time elapsed: 0.101 sec
    [junit] Running org.apache.nutch.crawl.TestAdaptiveFetchSchedule
    [junit] Tests run: 1, Failures: 0, Errors: 0, Time elapsed: 0.986 sec
    [junit] Running org.apache.nutch.crawl.TestGenerator
    [junit] Tests run: 0, Failures: 0, Errors: 0, Time elapsed: 0.011 sec
    [junit] Running org.apache.nutch.crawl.TestInjector
    [junit] Tests run: 0, Failures: 0, Errors: 0, Time elapsed: 0.012 sec
    [junit] Running org.apache.nutch.crawl.TestSignatureFactory
    [junit] Tests run: 1, Failures: 0, Errors: 0, Time elapsed: 0.253 sec
    [junit] Running org.apache.nutch.crawl.TestURLPartitioner
    [junit] Tests run: 7, Failures: 0, Errors: 0, Time elapsed: 5.049 sec
    [junit] Running org.apache.nutch.crawl.TestUrlWithScore
    [junit] Tests run: 4, Failures: 0, Errors: 0, Time elapsed: 0.178 sec
    [junit] Running org.apache.nutch.fetcher.TestFetcher
    [junit] Tests run: 1, Failures: 0, Errors: 0, Time elapsed: 3.706 sec
    [junit] Running org.apache.nutch.indexer.TestIndexingFilters
    [junit] Tests run: 3, Failures: 0, Errors: 0, Time elapsed: 0.887 sec
    [junit] Running org.apache.nutch.metadata.TestMetadata
    [junit] Tests run: 10, Failures: 0, Errors: 0, Time elapsed: 0.12 sec
    [junit] Running org.apache.nutch.metadata.TestSpellCheckedMetadata
    [junit] Tests run: 11, Failures: 0, Errors: 0, Time elapsed: 3.127 sec
    [junit] Running org.apache.nutch.net.TestURLFilters
    [junit] Tests run: 1, Failures: 0, Errors: 0, Time elapsed: 0.528 sec
    [junit] Running org.apache.nutch.net.TestURLNormalizers
    [junit] Tests run: 1, Failures: 0, Errors: 0, Time elapsed: 0.374 sec
    [junit] Running org.apache.nutch.parse.TestOutlinkExtractor
    [junit] Tests run: 3, Failures: 0, Errors: 0, Time elapsed: 0.05 sec
    [junit] Running org.apache.nutch.parse.TestParserFactory
    [junit] Tests run: 2, Failures: 0, Errors: 0, Time elapsed: 8.813 sec
    [junit] Running org.apache.nutch.plugin.TestPluginSystem
    [junit] Tests run: 7, Failures: 0, Errors: 0, Time elapsed: 2.423 sec
    [junit] Running org.apache.nutch.protocol.TestContent
    [junit] Tests run: 2, Failures: 0, Errors: 0, Time elapsed: 0.528 sec
    [junit] Running org.apache.nutch.protocol.TestProtocolFactory
    [junit] Tests run: 2, Failures: 0, Errors: 0, Time elapsed: 1.552 sec
    [junit] Running org.apache.nutch.storage.TestGoraStorage
    [junit] Tests run: 0, Failures: 0, Errors: 0, Time elapsed: 0.012 sec
    [junit] Running org.apache.nutch.util.TestEncodingDetector
    [junit] Tests run: 1, Failures: 0, Errors: 0, Time elapsed: 0.579 sec
    [junit] Running org.apache.nutch.util.TestGZIPUtils
    [junit] Tests run: 4, Failures: 0, Errors: 0, Time elapsed: 0.571 sec
    [junit] Running org.apache.nutch.util.TestNodeWalker
    [junit] Tests run: 1, Failures: 0, Errors: 0, Time elapsed: 0.214 sec
    [junit] Running org.apache.nutch.util.TestPrefixStringMatcher
    [junit] Tests run: 1, Failures: 0, Errors: 0, Time elapsed: 0.093 sec
    [junit] Running org.apache.nutch.util.TestStringUtil
    [junit] Tests run: 2, Failures: 0, Errors: 0, Time elapsed: 0.024 sec
    [junit] Running org.apache.nutch.util.TestSuffixStringMatcher
    [junit] Tests run: 1, Failures: 0, Errors: 0, Time elapsed: 0.095 sec
    [junit] Running org.apache.nutch.util.TestTableUtil
    [junit] Tests run: 2, Failures: 0, Errors: 0, Time elapsed: 0.06 sec
    [junit] Running org.apache.nutch.util.TestURLUtil
    [junit] Tests run: 7, Failures: 0, Errors: 0, Time elapsed: 0.875 sec

test-plugins:

test:

init:

init-plugin:

deps-jar:

clean-lib:

resolve-default:
[ivy:resolve] :: loading settings :: file = /home/hudson/jenkins-slave/workspace/Nutch-nutchgora/2.x/ivy/ivysettings.xml

compile:
     [echo] Compiling plugin: creativecommons

compile-test:
    [javac] Compiling 1 source file to /home/hudson/jenkins-slave/workspace/Nutch-nutchgora/2.x/build/creativecommons/test
    [javac] warning: [options] bootstrap class path not set in conjunction with -source 1.6
    [javac] 1 warning

jar:

deps-test:

init:

init-plugin:

clean-lib:

resolve-default:
[ivy:resolve] :: loading settings :: file = /home/hudson/jenkins-slave/workspace/Nutch-nutchgora/2.x/ivy/ivysettings.xml

compile:

jar:

deps-test:

deploy:

copy-generated-lib:

deploy:

copy-generated-lib:

test:
     [echo] Testing plugin: creativecommons
    [junit] Running org.creativecommons.nutch.TestCCParseFilter
    [junit] Tests run: 1, Failures: 0, Errors: 0, Time elapsed: 2.351 sec

init:

init-plugin:

deps-jar:

clean-lib:

resolve-default:
[ivy:resolve] :: loading settings :: file = /home/hudson/jenkins-slave/workspace/Nutch-nutchgora/2.x/ivy/ivysettings.xml

compile:
     [echo] Compiling plugin: parse-tika

compile-test:
    [javac] Compiling 7 source files to /home/hudson/jenkins-slave/workspace/Nutch-nutchgora/2.x/build/parse-tika/test
    [javac] warning: [options] bootstrap class path not set in conjunction with -source 1.6
    [javac] 1 warning

jar:

deps-test:

init:

init-plugin:

clean-lib:

resolve-default:
[ivy:resolve] :: loading settings :: file = /home/hudson/jenkins-slave/workspace/Nutch-nutchgora/2.x/ivy/ivysettings.xml

compile:

jar:

deps-test:

deploy:

copy-generated-lib:

init:

init-plugin:

deps-jar:

clean-lib:

resolve-default:
[ivy:resolve] :: loading settings :: file = /home/hudson/jenkins-slave/workspace/Nutch-nutchgora/2.x/ivy/ivysettings.xml

compile:
     [echo] Compiling plugin: protocol-file

jar:

deps-test:

deploy:

copy-generated-lib:

deploy:

copy-generated-lib:

test:
     [echo] Testing plugin: parse-tika
    [junit] Running org.apache.nutch.parse.tika.TestImageMetadata
    [junit] Tests run: 1, Failures: 0, Errors: 1, Time elapsed: 2.865 sec
    [junit] Test org.apache.nutch.parse.tika.TestImageMetadata FAILED
    [junit] Running org.apache.nutch.parse.tika.TestMSWordParser
    [junit] Tests run: 2, Failures: 0, Errors: 0, Time elapsed: 2.527 sec
    [junit] Running org.apache.nutch.parse.tika.TestOOParser
    [junit] Tests run: 1, Failures: 0, Errors: 0, Time elapsed: 2.092 sec
    [junit] Running org.apache.nutch.parse.tika.TestPdfParser
    [junit] Tests run: 1, Failures: 0, Errors: 0, Time elapsed: 3.822 sec
    [junit] Running org.apache.nutch.parse.tika.TestRSSParser
    [junit] Tests run: 1, Failures: 0, Errors: 0, Time elapsed: 2.027 sec
    [junit] Running org.apache.nutch.parse.tika.TestRTFParser
    [junit] Tests run: 1, Failures: 0, Errors: 0, Time elapsed: 2.461 sec

BUILD FAILED
/home/hudson/jenkins-slave/workspace/Nutch-nutchgora/2.x/build.xml:437: The following error occurred while executing this line:
/home/hudson/jenkins-slave/workspace/Nutch-nutchgora/2.x/src/plugin/build.xml:78: The following error occurred while executing this line:
/home/hudson/jenkins-slave/workspace/Nutch-nutchgora/2.x/src/plugin/build-plugin.xml:207: Tests failed!

Total time: 2 minutes 11 seconds
Build step 'Invoke Ant' marked build as failure
Publishing Javadoc