You are viewing a plain text version of this content. The canonical link for it is here.
Posted to dev@atlas.apache.org by Apache Jenkins Server <je...@builds.apache.org> on 2016/03/02 08:11:07 UTC

Build failed in Jenkins: apache-atlas-nightly #206

See <https://builds.apache.org/job/apache-atlas-nightly/206/>

------------------------------------------
[...truncated 2274 lines...]
[INFO] --- scala-maven-plugin:3.2.0:compile (scala-compile-first) @ atlas-repository ---
[WARNING] Zinc server is not available at port 3030 - reverting to normal incremental compile
[INFO] Using incremental compilation
[INFO] Compiling 9 Scala sources and 35 Java sources to <https://builds.apache.org/job/apache-atlas-nightly/ws/repository/target/classes...>
[WARNING] <https://builds.apache.org/job/apache-atlas-nightly/ws/repository/src/main/java/org/apache/atlas/repository/graph/GraphBackedMetadataRepository.java>:123: warning: non-varargs call of varargs method with inexact argument type for last parameter;
[WARNING]         LOG.info("adding entities={}", entities);
[WARNING]                                        ^
[WARNING]   cast to Object for a varargs call
[WARNING]   cast to Object[] for a non-varargs call and to suppress this warning
[WARNING] <https://builds.apache.org/job/apache-atlas-nightly/ws/repository/src/main/java/org/apache/atlas/repository/graph/GraphBackedMetadataRepository.java>:296: warning: non-varargs call of varargs method with inexact argument type for last parameter;
[WARNING]         LOG.info("updating entity {}", entitiesUpdated);
[WARNING]                                        ^
[WARNING]   cast to Object for a varargs call
[WARNING]   cast to Object[] for a non-varargs call and to suppress this warning
[WARNING] Note: Some input files use unchecked or unsafe operations.
[WARNING] Note: Recompile with -Xlint:unchecked for details.
[WARNING] 2 warnings
[INFO] 
[INFO] --- maven-compiler-plugin:3.1:compile (default-compile) @ atlas-repository ---
[INFO] Changes detected - recompiling the module!
[INFO] Compiling 35 source files to <https://builds.apache.org/job/apache-atlas-nightly/ws/repository/target/classes>
[WARNING] <https://builds.apache.org/job/apache-atlas-nightly/ws/repository/src/main/java/org/apache/atlas/repository/graph/GraphBackedSearchIndexer.java>: Some input files use unchecked or unsafe operations.
[WARNING] <https://builds.apache.org/job/apache-atlas-nightly/ws/repository/src/main/java/org/apache/atlas/repository/graph/GraphBackedSearchIndexer.java>: Recompile with -Xlint:unchecked for details.
[INFO] 
[INFO] --- maven-resources-plugin:2.7:testResources (default-testResources) @ atlas-repository ---
[INFO] Using 'UTF-8' encoding to copy filtered resources.
[INFO] Copying 1 resource
[INFO] Copying 3 resources
[INFO] 
[INFO] --- scala-maven-plugin:3.2.0:testCompile (scala-test-compile-first) @ atlas-repository ---
[WARNING] Zinc server is not available at port 3030 - reverting to normal incremental compile
[INFO] Using incremental compilation
[INFO] Compiling 8 Scala sources and 12 Java sources to <https://builds.apache.org/job/apache-atlas-nightly/ws/repository/target/test-classes...>
[WARNING] Note: Some input files use unchecked or unsafe operations.
[WARNING] Note: Recompile with -Xlint:unchecked for details.
[INFO] 
[INFO] --- maven-compiler-plugin:3.1:testCompile (default-testCompile) @ atlas-repository ---
[INFO] Changes detected - recompiling the module!
[INFO] Compiling 12 source files to <https://builds.apache.org/job/apache-atlas-nightly/ws/repository/target/test-classes>
[WARNING] <https://builds.apache.org/job/apache-atlas-nightly/ws/repository/src/test/java/org/apache/atlas/BaseHiveRepositoryTest.java>: Some input files use unchecked or unsafe operations.
[WARNING] <https://builds.apache.org/job/apache-atlas-nightly/ws/repository/src/test/java/org/apache/atlas/BaseHiveRepositoryTest.java>: Recompile with -Xlint:unchecked for details.
[INFO] 
[INFO] --- maven-surefire-plugin:2.18.1:test (default-test) @ atlas-repository ---
[WARNING] The parameter forkMode is deprecated since version 2.14. Use forkCount and reuseForks instead.
[INFO] Surefire report directory: <https://builds.apache.org/job/apache-atlas-nightly/ws/repository/target/surefire-reports>
[INFO] Using configured provider org.apache.maven.surefire.testng.TestNGProvider
[WARNING] file.encoding cannot be set as system property, use <argLine>-Dfile.encoding=...<argLine> instead

-------------------------------------------------------
 T E S T S
-------------------------------------------------------
Running org.apache.atlas.service.DefaultMetadataServiceTest
Tests run: 16, Failures: 0, Errors: 0, Skipped: 0, Time elapsed: 23.507 sec - in org.apache.atlas.service.DefaultMetadataServiceTest
Running org.apache.atlas.discovery.HiveLineageServiceTest
Tests run: 44, Failures: 0, Errors: 0, Skipped: 0, Time elapsed: 38.659 sec - in org.apache.atlas.discovery.HiveLineageServiceTest
Running org.apache.atlas.discovery.GraphBackedDiscoveryServiceTest
Tests run: 43, Failures: 0, Errors: 0, Skipped: 0, Time elapsed: 37.598 sec - in org.apache.atlas.discovery.GraphBackedDiscoveryServiceTest
Running org.apache.atlas.repository.graph.GraphBackedMetadataRepositoryTest
Tests run: 26, Failures: 0, Errors: 0, Skipped: 0, Time elapsed: 19.546 sec - in org.apache.atlas.repository.graph.GraphBackedMetadataRepositoryTest
Running org.apache.atlas.repository.graph.GraphBackedMetadataRepositoryDeleteEntitiesTest
Tests run: 2, Failures: 0, Errors: 0, Skipped: 0, Time elapsed: 13.674 sec - in org.apache.atlas.repository.graph.GraphBackedMetadataRepositoryDeleteEntitiesTest
Running org.apache.atlas.repository.graph.GraphRepoMapperScaleTest
Tests run: 2, Failures: 0, Errors: 0, Skipped: 0, Time elapsed: 99.786 sec - in org.apache.atlas.repository.graph.GraphRepoMapperScaleTest
Running org.apache.atlas.repository.graph.TitanGraphProviderTest
Tests run: 1, Failures: 0, Errors: 0, Skipped: 0, Time elapsed: 8.701 sec - in org.apache.atlas.repository.graph.TitanGraphProviderTest
Running org.apache.atlas.repository.typestore.GraphBackedTypeStoreTest
Tests run: 3, Failures: 0, Errors: 0, Skipped: 0, Time elapsed: 13.228 sec - in org.apache.atlas.repository.typestore.GraphBackedTypeStoreTest
Running org.apache.atlas.RepositoryServiceLoadingTest
Tests run: 1, Failures: 0, Errors: 0, Skipped: 0, Time elapsed: 10.671 sec - in org.apache.atlas.RepositoryServiceLoadingTest
Running org.apache.atlas.query.ExpressionTest
Tests run: 19, Failures: 0, Errors: 0, Skipped: 0, Time elapsed: 1.253 sec - in org.apache.atlas.query.ExpressionTest
Running org.apache.atlas.query.TestApp
Tests run: 0, Failures: 0, Errors: 0, Skipped: 0, Time elapsed: 0.298 sec - in org.apache.atlas.query.TestApp
Running org.apache.atlas.query.LexerTest
Tests run: 1, Failures: 0, Errors: 0, Skipped: 0, Time elapsed: 0.835 sec - in org.apache.atlas.query.LexerTest
Running org.apache.atlas.query.LineageQueryTest
Tests run: 7, Failures: 1, Errors: 0, Skipped: 6, Time elapsed: 8.774 sec <<< FAILURE! - in org.apache.atlas.query.LineageQueryTest
beforeAll(org.apache.atlas.query.LineageQueryTest)  Time elapsed: 8.721 sec  <<< FAILURE!
javax.script.ScriptException: javax.script.ScriptException: java.lang.UnsupportedOperationException: Not a single key: __traitNames. Use addProperty instead
	at com.thinkaurelius.titan.graphdb.transaction.StandardTitanTx.setProperty(StandardTitanTx.java:755)
	at com.thinkaurelius.titan.graphdb.vertices.AbstractVertex.setProperty(AbstractVertex.java:244)
	at com.thinkaurelius.titan.graphdb.vertices.AbstractVertex.setProperty(AbstractVertex.java:239)
	at com.tinkerpop.blueprints.util.wrappers.batch.BatchGraph$BatchVertex.setProperty(BatchGraph.java:492)
	at com.tinkerpop.blueprints.util.io.graphson.GraphSONUtility.vertexFromJson(GraphSONUtility.java:136)
	at com.tinkerpop.blueprints.util.io.graphson.GraphSONReader.inputGraph(GraphSONReader.java:158)
	at com.tinkerpop.blueprints.util.io.graphson.GraphSONReader.inputGraph(GraphSONReader.java:104)
	at com.tinkerpop.blueprints.util.io.graphson.GraphSONReader.inputGraph(GraphSONReader.java:88)
	at sun.reflect.NativeMethodAccessorImpl.invoke0(Native Method)
	at sun.reflect.NativeMethodAccessorImpl.invoke(NativeMethodAccessorImpl.java:57)
	at sun.reflect.DelegatingMethodAccessorImpl.invoke(DelegatingMethodAccessorImpl.java:43)
	at java.lang.reflect.Method.invoke(Method.java:606)
	at org.codehaus.groovy.reflection.CachedMethod.invoke(CachedMethod.java:90)
	at groovy.lang.MetaMethod.doMethodInvoke(MetaMethod.java:233)
	at org.codehaus.groovy.runtime.callsite.StaticMetaMethodSite.invoke(StaticMetaMethodSite.java:43)
	at org.codehaus.groovy.runtime.callsite.StaticMetaMethodSite.call(StaticMetaMethodSite.java:88)
	at org.codehaus.groovy.runtime.callsite.CallSiteArray.defaultCall(CallSiteArray.java:42)
	at org.codehaus.groovy.runtime.callsite.AbstractCallSite.call(AbstractCallSite.java:108)
	at org.codehaus.groovy.runtime.callsite.AbstractCallSite.call(AbstractCallSite.java:120)
	at com.tinkerpop.gremlin.groovy.loaders.GraphLoader$_load_closure14.doCall(GraphLoader.groovy:126)
	at sun.reflect.NativeMethodAccessorImpl.invoke0(Native Method)
	at sun.reflect.NativeMethodAccessorImpl.invoke(NativeMethodAccessorImpl.java:57)
	at sun.reflect.DelegatingMethodAccessorImpl.invoke(DelegatingMethodAccessorImpl.java:43)
	at java.lang.reflect.Method.invoke(Method.java:606)
	at org.codehaus.groovy.reflection.CachedMethod.invoke(CachedMethod.java:90)
	at org.codehaus.groovy.runtime.metaclass.ClosureMetaMethod.invoke(ClosureMetaMethod.java:80)
	at org.codehaus.groovy.runtime.callsite.PojoMetaMethodSite$PojoMetaMethodSiteNoUnwrapNoCoerce.invoke(PojoMetaMethodSite.java:271)
	at org.codehaus.groovy.runtime.callsite.PojoMetaMethodSite.call(PojoMetaMethodSite.java:53)
	at org.codehaus.groovy.runtime.callsite.CallSiteArray.defaultCall(CallSiteArray.java:42)
	at org.codehaus.groovy.runtime.callsite.AbstractCallSite.call(AbstractCallSite.java:108)
	at org.codehaus.groovy.runtime.callsite.AbstractCallSite.call(AbstractCallSite.java:116)
	at Script1.run(Script1.groovy:1)
	at com.tinkerpop.gremlin.groovy.jsr223.GremlinGroovyScriptEngine.eval(GremlinGroovyScriptEngine.java:219)
	at com.tinkerpop.gremlin.groovy.jsr223.GremlinGroovyScriptEngine.eval(GremlinGroovyScriptEngine.java:90)
	at javax.script.AbstractScriptEngine.eval(AbstractScriptEngine.java:233)
	at org.apache.atlas.query.QueryTestsUtils$.setupTestGraph(QueryTestsUtils.scala:165)
	at org.apache.atlas.query.LineageQueryTest.beforeAll(LineageQueryTest.scala:41)

Running org.apache.atlas.query.GremlinTest
Tests run: 23, Failures: 1, Errors: 0, Skipped: 22, Time elapsed: 8.366 sec <<< FAILURE! - in org.apache.atlas.query.GremlinTest
beforeAll(org.apache.atlas.query.GremlinTest)  Time elapsed: 8.26 sec  <<< FAILURE!
javax.script.ScriptException: javax.script.ScriptException: java.lang.UnsupportedOperationException: Not a single key: __traitNames. Use addProperty instead
	at com.thinkaurelius.titan.graphdb.transaction.StandardTitanTx.setProperty(StandardTitanTx.java:755)
	at com.thinkaurelius.titan.graphdb.vertices.AbstractVertex.setProperty(AbstractVertex.java:244)
	at com.thinkaurelius.titan.graphdb.vertices.AbstractVertex.setProperty(AbstractVertex.java:239)
	at com.tinkerpop.blueprints.util.wrappers.batch.BatchGraph$BatchVertex.setProperty(BatchGraph.java:492)
	at com.tinkerpop.blueprints.util.io.graphson.GraphSONUtility.vertexFromJson(GraphSONUtility.java:136)
	at com.tinkerpop.blueprints.util.io.graphson.GraphSONReader.inputGraph(GraphSONReader.java:158)
	at com.tinkerpop.blueprints.util.io.graphson.GraphSONReader.inputGraph(GraphSONReader.java:104)
	at com.tinkerpop.blueprints.util.io.graphson.GraphSONReader.inputGraph(GraphSONReader.java:88)
	at sun.reflect.NativeMethodAccessorImpl.invoke0(Native Method)
	at sun.reflect.NativeMethodAccessorImpl.invoke(NativeMethodAccessorImpl.java:57)
	at sun.reflect.DelegatingMethodAccessorImpl.invoke(DelegatingMethodAccessorImpl.java:43)
	at java.lang.reflect.Method.invoke(Method.java:606)
	at org.codehaus.groovy.reflection.CachedMethod.invoke(CachedMethod.java:90)
	at groovy.lang.MetaMethod.doMethodInvoke(MetaMethod.java:233)
	at org.codehaus.groovy.runtime.callsite.StaticMetaMethodSite.invoke(StaticMetaMethodSite.java:43)
	at org.codehaus.groovy.runtime.callsite.StaticMetaMethodSite.call(StaticMetaMethodSite.java:88)
	at org.codehaus.groovy.runtime.callsite.CallSiteArray.defaultCall(CallSiteArray.java:42)
	at org.codehaus.groovy.runtime.callsite.AbstractCallSite.call(AbstractCallSite.java:108)
	at org.codehaus.groovy.runtime.callsite.AbstractCallSite.call(AbstractCallSite.java:120)
	at com.tinkerpop.gremlin.groovy.loaders.GraphLoader$_load_closure14.doCall(GraphLoader.groovy:126)
	at sun.reflect.NativeMethodAccessorImpl.invoke0(Native Method)
	at sun.reflect.NativeMethodAccessorImpl.invoke(NativeMethodAccessorImpl.java:57)
	at sun.reflect.DelegatingMethodAccessorImpl.invoke(DelegatingMethodAccessorImpl.java:43)
	at java.lang.reflect.Method.invoke(Method.java:606)
	at org.codehaus.groovy.reflection.CachedMethod.invoke(CachedMethod.java:90)
	at org.codehaus.groovy.runtime.metaclass.ClosureMetaMethod.invoke(ClosureMetaMethod.java:80)
	at org.codehaus.groovy.runtime.callsite.PojoMetaMethodSite$PojoMetaMethodSiteNoUnwrapNoCoerce.invoke(PojoMetaMethodSite.java:271)
	at org.codehaus.groovy.runtime.callsite.PojoMetaMethodSite.call(PojoMetaMethodSite.java:53)
	at org.codehaus.groovy.runtime.callsite.CallSiteArray.defaultCall(CallSiteArray.java:42)
	at org.codehaus.groovy.runtime.callsite.AbstractCallSite.call(AbstractCallSite.java:108)
	at org.codehaus.groovy.runtime.callsite.AbstractCallSite.call(AbstractCallSite.java:116)
	at Script1.run(Script1.groovy:1)
	at com.tinkerpop.gremlin.groovy.jsr223.GremlinGroovyScriptEngine.eval(GremlinGroovyScriptEngine.java:219)
	at com.tinkerpop.gremlin.groovy.jsr223.GremlinGroovyScriptEngine.eval(GremlinGroovyScriptEngine.java:90)
	at javax.script.AbstractScriptEngine.eval(AbstractScriptEngine.java:233)
	at org.apache.atlas.query.QueryTestsUtils$.setupTestGraph(QueryTestsUtils.scala:165)
	at org.apache.atlas.query.GremlinTest.beforeAll(GremlinTest.scala:41)

Running org.apache.atlas.query.TestApp$delayedInit$body
Tests run: 0, Failures: 0, Errors: 0, Skipped: 0, Time elapsed: 0.282 sec - in org.apache.atlas.query.TestApp$delayedInit$body
Running org.apache.atlas.query.TestApp$$anonfun$4
Tests run: 0, Failures: 0, Errors: 0, Skipped: 0, Time elapsed: 0.288 sec - in org.apache.atlas.query.TestApp$$anonfun$4
Running org.apache.atlas.query.ParserTest
Tests run: 13, Failures: 0, Errors: 0, Skipped: 0, Time elapsed: 1.602 sec - in org.apache.atlas.query.ParserTest
Running org.apache.atlas.query.TestApp$
Tests run: 0, Failures: 0, Errors: 0, Skipped: 0, Time elapsed: 0.289 sec - in org.apache.atlas.query.TestApp$
Running org.apache.atlas.TestUtils
Tests run: 0, Failures: 0, Errors: 0, Skipped: 0, Time elapsed: 0.263 sec - in org.apache.atlas.TestUtils

Results :

Failed tests: 
  GremlinTest.beforeAll:41 » Script javax.script.ScriptException: java.lang.Unsu...
  LineageQueryTest.beforeAll:41 » Script javax.script.ScriptException: java.lang...

Tests run: 201, Failures: 2, Errors: 0, Skipped: 28

[INFO] ------------------------------------------------------------------------
[INFO] Reactor Summary:
[INFO] 
[INFO] apache-atlas ...................................... SUCCESS [ 10.479 s]
[INFO] Apache Atlas Common ............................... SUCCESS [ 17.468 s]
[INFO] Apache Atlas Typesystem ........................... SUCCESS [01:18 min]
[INFO] Apache Atlas Server API ........................... SUCCESS [  8.527 s]
[INFO] Apache Atlas Client ............................... SUCCESS [ 18.999 s]
[INFO] Apache Atlas Notification ......................... SUCCESS [ 25.912 s]
[INFO] Apache Atlas Titan ................................ SUCCESS [ 49.187 s]
[INFO] Apache Atlas Repository ........................... FAILURE [05:50 min]
[INFO] Apache Atlas UI ................................... SKIPPED
[INFO] Apache Atlas Web Application ...................... SKIPPED
[INFO] Apache Atlas Documentation ........................ SKIPPED
[INFO] Apache Atlas Hive Bridge .......................... SKIPPED
[INFO] Apache Atlas Falcon Bridge ........................ SKIPPED
[INFO] Apache Atlas Sqoop Bridge ......................... SKIPPED
[INFO] Apache Atlas Storm Bridge ......................... SKIPPED
[INFO] Apache Atlas Distribution ......................... SKIPPED
[INFO] ------------------------------------------------------------------------
[INFO] BUILD FAILURE
[INFO] ------------------------------------------------------------------------
[INFO] Total time: 09:21 min
[INFO] Finished at: 2016-03-02T07:10:32+00:00
[INFO] Final Memory: 98M/873M
[INFO] ------------------------------------------------------------------------
[ERROR] Failed to execute goal org.apache.maven.plugins:maven-surefire-plugin:2.18.1:test (default-test) on project atlas-repository: There are test failures.
[ERROR] 
[ERROR] Please refer to <https://builds.apache.org/job/apache-atlas-nightly/ws/repository/target/surefire-reports> for the individual test results.
[ERROR] -> [Help 1]
[ERROR] 
[ERROR] To see the full stack trace of the errors, re-run Maven with the -e switch.
[ERROR] Re-run Maven using the -X switch to enable full debug logging.
[ERROR] 
[ERROR] For more information about the errors and possible solutions, please read the following articles:
[ERROR] [Help 1] http://cwiki.apache.org/confluence/display/MAVEN/MojoFailureException
[ERROR] 
[ERROR] After correcting the problems, you can resume the build with the command
[ERROR]   mvn <goals> -rf :atlas-repository
Build step 'Execute shell' marked build as failure
[CHECKSTYLE] Collecting checkstyle analysis files...
[CHECKSTYLE] Finding all files that match the pattern **/target/checkstyle-result.xml
[CHECKSTYLE] Parsing 7 files in <https://builds.apache.org/job/apache-atlas-nightly/ws/>
[CHECKSTYLE] Successfully parsed file <https://builds.apache.org/job/apache-atlas-nightly/ws/client/target/checkstyle-result.xml> with 43 unique warnings and 0 duplicates.
[CHECKSTYLE] Successfully parsed file <https://builds.apache.org/job/apache-atlas-nightly/ws/common/target/checkstyle-result.xml> with 43 unique warnings and 0 duplicates.
[CHECKSTYLE] Successfully parsed file <https://builds.apache.org/job/apache-atlas-nightly/ws/notification/target/checkstyle-result.xml> with 43 unique warnings and 0 duplicates.
[CHECKSTYLE] Successfully parsed file <https://builds.apache.org/job/apache-atlas-nightly/ws/server-api/target/checkstyle-result.xml> with 57 unique warnings and 0 duplicates.
[CHECKSTYLE] Successfully parsed file <https://builds.apache.org/job/apache-atlas-nightly/ws/target/checkstyle-result.xml> with 57 unique warnings and 0 duplicates.
[CHECKSTYLE] Successfully parsed file <https://builds.apache.org/job/apache-atlas-nightly/ws/titan/target/checkstyle-result.xml> with 417 unique warnings and 0 duplicates.
[CHECKSTYLE] Successfully parsed file <https://builds.apache.org/job/apache-atlas-nightly/ws/typesystem/target/checkstyle-result.xml> with 1027 unique warnings and 0 duplicates.
[CHECKSTYLE] Computing warning deltas based on reference build #199
[FINDBUGS] Collecting findbugs analysis files...
[FINDBUGS] Finding all files that match the pattern **/target/findbugs.xml
[FINDBUGS] Parsing 6 files in <https://builds.apache.org/job/apache-atlas-nightly/ws/>
[FINDBUGS] Successfully parsed file <https://builds.apache.org/job/apache-atlas-nightly/ws/client/target/findbugs.xml> with 0 unique warnings and 0 duplicates.
[FINDBUGS] Successfully parsed file <https://builds.apache.org/job/apache-atlas-nightly/ws/common/target/findbugs.xml> with 0 unique warnings and 0 duplicates.
[FINDBUGS] Successfully parsed file <https://builds.apache.org/job/apache-atlas-nightly/ws/notification/target/findbugs.xml> with 0 unique warnings and 0 duplicates.
[FINDBUGS] Successfully parsed file <https://builds.apache.org/job/apache-atlas-nightly/ws/server-api/target/findbugs.xml> with 0 unique warnings and 0 duplicates.
[FINDBUGS] Successfully parsed file <https://builds.apache.org/job/apache-atlas-nightly/ws/titan/target/findbugs.xml> with 0 unique warnings and 0 duplicates.
[FINDBUGS] Successfully parsed file <https://builds.apache.org/job/apache-atlas-nightly/ws/typesystem/target/findbugs.xml> with 0 unique warnings and 0 duplicates.
[FINDBUGS] Computing warning deltas based on reference build #199
Archiving artifacts
TestNG Reports Processing: START
Looking for TestNG results report in workspace using pattern: **/target/surefire-reports/testng-results.xml,**/target/failsafe-reports/testng-results.xml
Saving reports...
Processing '/x1/jenkins/jenkins-home/jobs/apache-atlas-nightly/builds/206/testng/testng-results-1.xml'
Processing '/x1/jenkins/jenkins-home/jobs/apache-atlas-nightly/builds/206/testng/testng-results-2.xml'
Processing '/x1/jenkins/jenkins-home/jobs/apache-atlas-nightly/builds/206/testng/testng-results-3.xml'
Processing '/x1/jenkins/jenkins-home/jobs/apache-atlas-nightly/builds/206/testng/testng-results-4.xml'
Processing '/x1/jenkins/jenkins-home/jobs/apache-atlas-nightly/builds/206/testng/testng-results.xml'
TestNG Reports Processing: FINISH

Jenkins build is back to normal : apache-atlas-nightly #208

Posted by Apache Jenkins Server <je...@builds.apache.org>.
See <https://builds.apache.org/job/apache-atlas-nightly/208/>


Build failed in Jenkins: apache-atlas-nightly #207

Posted by Apache Jenkins Server <je...@builds.apache.org>.
See <https://builds.apache.org/job/apache-atlas-nightly/207/>

------------------------------------------
[...truncated 3466 lines...]

-------------------------------------------------------
 T E S T S
-------------------------------------------------------
Running org.apache.atlas.notification.hook.HookNotificationTest
Tests run: 2, Failures: 0, Errors: 0, Skipped: 0, Time elapsed: 1.43 sec - in org.apache.atlas.notification.hook.HookNotificationTest
Running org.apache.atlas.notification.entity.EntityNotificationImplTest
Tests run: 5, Failures: 0, Errors: 0, Skipped: 0, Time elapsed: 0.656 sec - in org.apache.atlas.notification.entity.EntityNotificationImplTest
Running org.apache.atlas.notification.NotificationHookConsumerTest
Tests run: 4, Failures: 0, Errors: 0, Skipped: 0, Time elapsed: 0.636 sec - in org.apache.atlas.notification.NotificationHookConsumerTest
Running org.apache.atlas.kafka.KafkaNotificationTest
Tests run: 1, Failures: 0, Errors: 0, Skipped: 0, Time elapsed: 5.147 sec - in org.apache.atlas.kafka.KafkaNotificationTest

Results :

Tests run: 12, Failures: 0, Errors: 0, Skipped: 0

[INFO] 
[INFO] --- maven-jar-plugin:2.5:jar (default-jar) @ atlas-notification ---
[INFO] Building jar: /x1/jenkins/jenkins-slave/workspace/apache-atlas-nightly/notification/target/atlas-notification-0.7-incubating-SNAPSHOT.jar
[INFO] 
[INFO] --- maven-site-plugin:3.4:attach-descriptor (attach-descriptor) @ atlas-notification ---
[INFO] 
[INFO] --- maven-failsafe-plugin:2.18.1:integration-test (integration-test) @ atlas-notification ---
[INFO] 
[INFO] --- maven-source-plugin:2.4:jar-no-fork (attach-sources) @ atlas-notification ---
[INFO] Building jar: /x1/jenkins/jenkins-slave/workspace/apache-atlas-nightly/notification/target/atlas-notification-0.7-incubating-SNAPSHOT-sources.jar
[INFO] 
[INFO] --- maven-source-plugin:2.4:test-jar-no-fork (attach-sources) @ atlas-notification ---
[INFO] Building jar: /x1/jenkins/jenkins-slave/workspace/apache-atlas-nightly/notification/target/atlas-notification-0.7-incubating-SNAPSHOT-test-sources.jar
[INFO] 
[INFO] --- maven-failsafe-plugin:2.18.1:verify (verify) @ atlas-notification ---
[INFO] Failsafe report directory: /x1/jenkins/jenkins-slave/workspace/apache-atlas-nightly/notification/target/failsafe-reports
[INFO] 
[INFO] --- apache-rat-plugin:0.7:check (rat-check) @ atlas-notification ---
[INFO] Exclude: *.txt
[INFO] Exclude: **/*.json
[INFO] Exclude: .pc/**
[INFO] Exclude: debian/**
[INFO] Exclude: .svn/**
[INFO] Exclude: .git/**
[INFO] Exclude: .gitignore
[INFO] Exclude: **/.idea/**
[INFO] Exclude: **/*.twiki
[INFO] Exclude: **/*.iml
[INFO] Exclude: **/*.json
[INFO] Exclude: **/target/**
[INFO] Exclude: **/target*/**
[INFO] Exclude: **/build/**
[INFO] Exclude: **/*.patch
[INFO] Exclude: derby.log
[INFO] Exclude: **/logs/**
[INFO] Exclude: **/.classpath
[INFO] Exclude: **/.project
[INFO] Exclude: **/.settings/**
[INFO] Exclude: **/test-output/**
[INFO] Exclude: **/mock/**
[INFO] Exclude: **/data/**
[INFO] Exclude: **/maven-eclipse.xml
[INFO] Exclude: **/.externalToolBuilders/**
[INFO] Exclude: **/build.log
[INFO] Exclude: .bowerrc
[INFO] Exclude: *.json
[INFO] Exclude: **/overlays/**
[INFO] Exclude: dev-support/**
[INFO] 
[INFO] --- maven-checkstyle-plugin:2.9.1:check (checkstyle-check) @ atlas-notification ---
[INFO] Starting audit...
Audit done.

[INFO] 
[INFO] >>> findbugs-maven-plugin:3.0.1:check (findbugs-check) @ atlas-notification >>>
[INFO] 
[INFO] --- findbugs-maven-plugin:3.0.1:findbugs (findbugs) @ atlas-notification ---
[INFO] Fork Value is true
     [java] Warnings generated: 3
[INFO] Done FindBugs Analysis....
[INFO] 
[INFO] <<< findbugs-maven-plugin:3.0.1:check (findbugs-check) @ atlas-notification <<<
[INFO] 
[INFO] --- findbugs-maven-plugin:3.0.1:check (findbugs-check) @ atlas-notification ---
[INFO] BugInstance size is 3
[INFO] Error size is 0
[INFO] Total bugs: 3
[INFO] org.apache.atlas.hook.AtlasHook.atlasProperties isn't final but should be [org.apache.atlas.hook.AtlasHook] At AtlasHook.java:[line 63]
[INFO] org.apache.atlas.hook.AtlasHook.notifInterface isn't final but should be [org.apache.atlas.hook.AtlasHook] At AtlasHook.java:[line 69]
[INFO] Inconsistent synchronization of org.apache.atlas.kafka.KafkaNotification.producer; locked 40% of time [org.apache.atlas.kafka.KafkaNotification, org.apache.atlas.kafka.KafkaNotification, org.apache.atlas.kafka.KafkaNotification, org.apache.atlas.kafka.KafkaNotification] Unsynchronized access at KafkaNotification.java:[line 180]Unsynchronized access at KafkaNotification.java:[line 189]Synchronized access at KafkaNotification.java:[line 268]Synchronized access at KafkaNotification.java:[line 269]
[INFO] 


To see bug detail using the Findbugs GUI, use the following command "mvn findbugs:gui"



[INFO]                                                                         
[INFO] ------------------------------------------------------------------------
[INFO] Building Apache Atlas Titan 0.7-incubating-SNAPSHOT
[INFO] ------------------------------------------------------------------------
[INFO] 
[INFO] --- maven-clean-plugin:2.5:clean (default-clean) @ atlas-titan ---
[INFO] Deleting /x1/jenkins/jenkins-slave/workspace/apache-atlas-nightly/titan/target
[INFO] Deleting /x1/jenkins/jenkins-slave/workspace/apache-atlas-nightly/titan (includes = [**/*.pyc], excludes = [])
[INFO] 
[INFO] --- buildnumber-maven-plugin:1.4:create (default) @ atlas-titan ---
[INFO] Executing: /bin/sh -c cd '/x1/jenkins/jenkins-slave/workspace/apache-atlas-nightly/titan' && 'git' 'rev-parse' '--verify' 'HEAD'
[INFO] Working directory: /x1/jenkins/jenkins-slave/workspace/apache-atlas-nightly/titan
[INFO] Storing buildNumber: cda983f34b004ccc3e849cfedae9578a9c5e8637 at timestamp: 1456908456019
[WARNING] Cannot get the branch information from the git repository: 
Detecting the current branch failed: fatal: ref HEAD is not a symbolic ref

[INFO] Executing: /bin/sh -c cd '/x1/jenkins/jenkins-slave/workspace/apache-atlas-nightly/titan' && 'git' 'rev-parse' '--verify' 'HEAD'
[INFO] Working directory: /x1/jenkins/jenkins-slave/workspace/apache-atlas-nightly/titan
[INFO] Storing buildScmBranch: UNKNOWN
[INFO] 
[INFO] --- maven-remote-resources-plugin:1.5:process (default) @ atlas-titan ---
[INFO] 
[INFO] --- maven-resources-plugin:2.7:resources (default-resources) @ atlas-titan ---
[INFO] Using 'UTF-8' encoding to copy filtered resources.
[INFO] skip non existing resourceDirectory /x1/jenkins/jenkins-slave/workspace/apache-atlas-nightly/titan/src/main/resources
[INFO] Copying 2 resources to META-INF
[INFO] Copying 3 resources
[INFO] 
[INFO] --- scala-maven-plugin:3.2.0:compile (scala-compile-first) @ atlas-titan ---
[WARNING] Zinc server is not available at port 3030 - reverting to normal incremental compile
[INFO] Using incremental compilation
[INFO] Compiling 19 Java sources to /x1/jenkins/jenkins-slave/workspace/apache-atlas-nightly/titan/target/classes...
[WARNING] Note: Some input files use or override a deprecated API.
[WARNING] Note: Recompile with -Xlint:deprecation for details.
[WARNING] Note: /x1/jenkins/jenkins-slave/workspace/apache-atlas-nightly/titan/src/main/java/com/thinkaurelius/titan/diskstorage/solr/Solr5Index.java uses unchecked or unsafe operations.
[WARNING] Note: Recompile with -Xlint:unchecked for details.
[INFO] 
[INFO] --- maven-compiler-plugin:3.1:compile (default-compile) @ atlas-titan ---
[INFO] Changes detected - recompiling the module!
[INFO] Compiling 19 source files to /x1/jenkins/jenkins-slave/workspace/apache-atlas-nightly/titan/target/classes
[WARNING] /x1/jenkins/jenkins-slave/workspace/apache-atlas-nightly/titan/src/main/java/com/thinkaurelius/titan/diskstorage/hbase/HTable0_98.java: Some input files use or override a deprecated API.
[WARNING] /x1/jenkins/jenkins-slave/workspace/apache-atlas-nightly/titan/src/main/java/com/thinkaurelius/titan/diskstorage/hbase/HTable0_98.java: Recompile with -Xlint:deprecation for details.
[WARNING] /x1/jenkins/jenkins-slave/workspace/apache-atlas-nightly/titan/src/main/java/com/thinkaurelius/titan/diskstorage/solr/Solr5Index.java: /x1/jenkins/jenkins-slave/workspace/apache-atlas-nightly/titan/src/main/java/com/thinkaurelius/titan/diskstorage/solr/Solr5Index.java uses unchecked or unsafe operations.
[WARNING] /x1/jenkins/jenkins-slave/workspace/apache-atlas-nightly/titan/src/main/java/com/thinkaurelius/titan/diskstorage/solr/Solr5Index.java: Recompile with -Xlint:unchecked for details.
[INFO] 
[INFO] --- maven-resources-plugin:2.7:testResources (default-testResources) @ atlas-titan ---
[INFO] Using 'UTF-8' encoding to copy filtered resources.
[INFO] skip non existing resourceDirectory /x1/jenkins/jenkins-slave/workspace/apache-atlas-nightly/titan/src/test/resources
[INFO] Copying 3 resources
[INFO] 
[INFO] --- scala-maven-plugin:3.2.0:testCompile (scala-test-compile-first) @ atlas-titan ---
[WARNING] Zinc server is not available at port 3030 - reverting to normal incremental compile
[INFO] Using incremental compilation
[INFO] Compiling 1 Java source to /x1/jenkins/jenkins-slave/workspace/apache-atlas-nightly/titan/target/test-classes...
[INFO] 
[INFO] --- maven-compiler-plugin:3.1:testCompile (default-testCompile) @ atlas-titan ---
[INFO] Changes detected - recompiling the module!
[INFO] Compiling 1 source file to /x1/jenkins/jenkins-slave/workspace/apache-atlas-nightly/titan/target/test-classes
[INFO] 
[INFO] --- maven-surefire-plugin:2.18.1:test (default-test) @ atlas-titan ---
[WARNING] The parameter forkMode is deprecated since version 2.14. Use forkCount and reuseForks instead.
[INFO] Surefire report directory: /x1/jenkins/jenkins-slave/workspace/apache-atlas-nightly/titan/target/surefire-reports
[INFO] Using configured provider org.apache.maven.surefire.testng.TestNGProvider
[WARNING] file.encoding cannot be set as system property, use <argLine>-Dfile.encoding=...<argLine> instead

-------------------------------------------------------
 T E S T S
-------------------------------------------------------
Running com.thinkaurelius.titan.diskstorage.locking.LocalLockMediatorTest
Tests run: 1, Failures: 1, Errors: 0, Skipped: 0, Time elapsed: 0.442 sec <<< FAILURE! - in com.thinkaurelius.titan.diskstorage.locking.LocalLockMediatorTest
testLock(com.thinkaurelius.titan.diskstorage.locking.LocalLockMediatorTest)  Time elapsed: 0.018 sec  <<< FAILURE!
java.lang.AssertionError: expected:<true> but was:<false>
	at org.testng.Assert.fail(Assert.java:89)
	at org.testng.Assert.failNotEquals(Assert.java:489)
	at org.testng.Assert.assertTrue(Assert.java:37)
	at org.testng.Assert.assertTrue(Assert.java:47)
	at com.thinkaurelius.titan.diskstorage.locking.LocalLockMediatorTest.testLock(LocalLockMediatorTest.java:46)


Results :

Failed tests: 
  LocalLockMediatorTest.testLock:46 expected:<true> but was:<false>

Tests run: 1, Failures: 1, Errors: 0, Skipped: 0

[INFO] ------------------------------------------------------------------------
[INFO] Reactor Summary:
[INFO] 
[INFO] apache-atlas ...................................... SUCCESS [ 13.531 s]
[INFO] Apache Atlas Common ............................... SUCCESS [ 15.959 s]
[INFO] Apache Atlas Typesystem ........................... SUCCESS [01:08 min]
[INFO] Apache Atlas Server API ........................... SUCCESS [  8.393 s]
[INFO] Apache Atlas Client ............................... SUCCESS [ 17.810 s]
[INFO] Apache Atlas Notification ......................... SUCCESS [ 25.190 s]
[INFO] Apache Atlas Titan ................................ FAILURE [ 10.879 s]
[INFO] Apache Atlas Repository ........................... SKIPPED
[INFO] Apache Atlas UI ................................... SKIPPED
[INFO] Apache Atlas Web Application ...................... SKIPPED
[INFO] Apache Atlas Documentation ........................ SKIPPED
[INFO] Apache Atlas Hive Bridge .......................... SKIPPED
[INFO] Apache Atlas Falcon Bridge ........................ SKIPPED
[INFO] Apache Atlas Sqoop Bridge ......................... SKIPPED
[INFO] Apache Atlas Storm Bridge ......................... SKIPPED
[INFO] Apache Atlas Distribution ......................... SKIPPED
[INFO] ------------------------------------------------------------------------
[INFO] BUILD FAILURE
[INFO] ------------------------------------------------------------------------
[INFO] Total time: 02:41 min
[INFO] Finished at: 2016-03-02T08:47:46+00:00
[INFO] Final Memory: 99M/760M
[INFO] ------------------------------------------------------------------------
[ERROR] Failed to execute goal org.apache.maven.plugins:maven-surefire-plugin:2.18.1:test (default-test) on project atlas-titan: There are test failures.
[ERROR] 
[ERROR] Please refer to /x1/jenkins/jenkins-slave/workspace/apache-atlas-nightly/titan/target/surefire-reports for the individual test results.
[ERROR] -> [Help 1]
[ERROR] 
[ERROR] To see the full stack trace of the errors, re-run Maven with the -e switch.
[ERROR] Re-run Maven using the -X switch to enable full debug logging.
[ERROR] 
[ERROR] For more information about the errors and possible solutions, please read the following articles:
[ERROR] [Help 1] http://cwiki.apache.org/confluence/display/MAVEN/MojoFailureException
[ERROR] 
[ERROR] After correcting the problems, you can resume the build with the command
[ERROR]   mvn <goals> -rf :atlas-titan
Build step 'Execute shell' marked build as failure
[CHECKSTYLE] Collecting checkstyle analysis files...
[CHECKSTYLE] Finding all files that match the pattern **/target/checkstyle-result.xml
[CHECKSTYLE] Parsing 6 files in <https://builds.apache.org/job/apache-atlas-nightly/ws/>
[CHECKSTYLE] Successfully parsed file <https://builds.apache.org/job/apache-atlas-nightly/ws/client/target/checkstyle-result.xml> with 43 unique warnings and 0 duplicates.
[CHECKSTYLE] Successfully parsed file <https://builds.apache.org/job/apache-atlas-nightly/ws/common/target/checkstyle-result.xml> with 43 unique warnings and 0 duplicates.
[CHECKSTYLE] Successfully parsed file <https://builds.apache.org/job/apache-atlas-nightly/ws/notification/target/checkstyle-result.xml> with 43 unique warnings and 0 duplicates.
[CHECKSTYLE] Successfully parsed file <https://builds.apache.org/job/apache-atlas-nightly/ws/server-api/target/checkstyle-result.xml> with 57 unique warnings and 0 duplicates.
[CHECKSTYLE] Successfully parsed file <https://builds.apache.org/job/apache-atlas-nightly/ws/target/checkstyle-result.xml> with 57 unique warnings and 0 duplicates.
[CHECKSTYLE] Successfully parsed file <https://builds.apache.org/job/apache-atlas-nightly/ws/typesystem/target/checkstyle-result.xml> with 667 unique warnings and 0 duplicates.
[CHECKSTYLE] Computing warning deltas based on reference build #199
[FINDBUGS] Collecting findbugs analysis files...
[FINDBUGS] Finding all files that match the pattern **/target/findbugs.xml
[FINDBUGS] Parsing 5 files in <https://builds.apache.org/job/apache-atlas-nightly/ws/>
[FINDBUGS] Successfully parsed file <https://builds.apache.org/job/apache-atlas-nightly/ws/client/target/findbugs.xml> with 0 unique warnings and 0 duplicates.
[FINDBUGS] Successfully parsed file <https://builds.apache.org/job/apache-atlas-nightly/ws/common/target/findbugs.xml> with 0 unique warnings and 0 duplicates.
[FINDBUGS] Successfully parsed file <https://builds.apache.org/job/apache-atlas-nightly/ws/notification/target/findbugs.xml> with 0 unique warnings and 0 duplicates.
[FINDBUGS] Successfully parsed file <https://builds.apache.org/job/apache-atlas-nightly/ws/server-api/target/findbugs.xml> with 0 unique warnings and 0 duplicates.
[FINDBUGS] Successfully parsed file <https://builds.apache.org/job/apache-atlas-nightly/ws/typesystem/target/findbugs.xml> with 0 unique warnings and 0 duplicates.
[FINDBUGS] Computing warning deltas based on reference build #199
Archiving artifacts
TestNG Reports Processing: START
Looking for TestNG results report in workspace using pattern: **/target/surefire-reports/testng-results.xml,**/target/failsafe-reports/testng-results.xml
Saving reports...
Processing '/x1/jenkins/jenkins-home/jobs/apache-atlas-nightly/builds/207/testng/testng-results-1.xml'
Processing '/x1/jenkins/jenkins-home/jobs/apache-atlas-nightly/builds/207/testng/testng-results-2.xml'
Processing '/x1/jenkins/jenkins-home/jobs/apache-atlas-nightly/builds/207/testng/testng-results-3.xml'
Processing '/x1/jenkins/jenkins-home/jobs/apache-atlas-nightly/builds/207/testng/testng-results.xml'
Failed Tests/Configs found. Marking build as UNSTABLE.
TestNG Reports Processing: FINISH