You are viewing a plain text version of this content. The canonical link for it is here.
Posted to dev@airavata.apache.org by Apache Jenkins Server <je...@builds.apache.org> on 2011/10/18 03:09:25 UTC

Build failed in Jenkins: Airavata #111

See <https://builds.apache.org/job/Airavata/111/changes>

Changes:

[smarru] Adding globusonline transfer api client to maven

------------------------------------------
[...truncated 2080 lines...]
6938 [main] INFO org.apache.airavata.core.gfac.provider.impl.LocalProvider - Env[HUDSON_HOME] = /home/hudson/hudson
6938 [main] INFO org.apache.airavata.core.gfac.provider.impl.LocalProvider - Env[SVN_URL] = https://svn.apache.org/repos/asf/incubator/airavata/trunk
6938 [main] INFO org.apache.airavata.core.gfac.provider.impl.LocalProvider - Env[outputData] = /tmp/output
6938 [main] INFO org.apache.airavata.core.gfac.notification.impl.LoggingNotification - Notifier: class org.apache.airavata.core.gfac.notification.impl.LoggingNotification
6938 [main] INFO org.apache.airavata.core.gfac.notification.impl.LoggingNotification - -----DATA-----
6938 [main] INFO org.apache.airavata.core.gfac.notification.impl.LoggingNotification - Start execution
6938 [main] INFO org.apache.airavata.core.gfac.notification.impl.LoggingNotification - -----END DATA-----
6955 [main] INFO org.apache.airavata.core.gfac.provider.impl.LocalProvider - Process finished with return value of zero.
6955 [main] INFO org.apache.airavata.core.gfac.provider.impl.LocalProvider - Executed /bin/echo echo_output=hello  on the localHost, working directory = /tmp tempDirectory = /tmp With the status 0
6955 [main] INFO org.apache.airavata.core.gfac.notification.impl.LoggingNotification - Notifier: class org.apache.airavata.core.gfac.notification.impl.LoggingNotification
6955 [main] INFO org.apache.airavata.core.gfac.notification.impl.LoggingNotification - -----DATA-----
6955 [main] INFO org.apache.airavata.core.gfac.notification.impl.LoggingNotification - Finish execution
6955 [main] INFO org.apache.airavata.core.gfac.notification.impl.LoggingNotification - -----END DATA-----
6956 [main] INFO org.apache.airavata.core.gfac.services.impl.PropertiesBasedServiceImpl - try to load post-execution chain
6956 [main] INFO org.apache.airavata.core.gfac.services.impl.PropertiesBasedServiceImpl - org.apache.airavata.core.gfac.extension.PostExecuteChain : org.apache.airavata.core.gfac.extension.post.GridFtpOutputStaging is loaded
6957 [main] INFO org.apache.airavata.core.gfac.services.impl.PropertiesBasedServiceImpl - org.apache.airavata.core.gfac.extension.PostExecuteChain : org.apache.airavata.core.gfac.extension.post.OutputRegister is loaded
Tests run: 1, Failures: 0, Errors: 0, Skipped: 0, Time elapsed: 7.004 sec

Results :

Tests run: 1, Failures: 0, Errors: 0, Skipped: 0

[JENKINS] Recording test results
log4j:WARN No appenders could be found for logger (org.apache.commons.beanutils.converters.BooleanConverter).
log4j:WARN Please initialize the log4j system properly.
[INFO] 
[INFO] --- maven-jar-plugin:2.3.1:jar (default-jar) @ airavata-gfac-core ---
[INFO] Building jar: <https://builds.apache.org/job/Airavata/ws/modules/gfac-core/target/airavata-gfac-core-0.0.1-SNAPSHOT.jar>
[INFO] [INFO] Installing <https://builds.apache.org/job/Airavata/ws/modules/gfac-core/target/airavata-gfac-core-0.0.1-SNAPSHOT.jar> to /home/jenkins/.m2/repository/airavata/airavata-gfac-core/0.0.1-SNAPSHOT/airavata-gfac-core-0.0.1-SNAPSHOT.jar

[INFO] [INFO] Installing <https://builds.apache.org/job/Airavata/ws/modules/gfac-core/pom.xml> to /home/jenkins/.m2/repository/airavata/airavata-gfac-core/0.0.1-SNAPSHOT/airavata-gfac-core-0.0.1-SNAPSHOT.pom
--- maven-install-plugin:2.3.1:install (default-install) @ airavata-gfac-core ---
[JENKINS] Archiving <https://builds.apache.org/job/Airavata/ws/modules/gfac-core/pom.xml> to /home/hudson/hudson/jobs/Airavata/modules/airavata$airavata-gfac-core/builds/2011-10-18_01-05-13/archive/airavata/airavata-gfac-core/0.0.1-SNAPSHOT/airavata-gfac-core-0.0.1-SNAPSHOT.pom
[JENKINS] Archiving <https://builds.apache.org/job/Airavata/ws/modules/gfac-core/target/airavata-gfac-core-0.0.1-SNAPSHOT.jar> to /home/hudson/hudson/jobs/Airavata/modules/airavata$airavata-gfac-core/builds/2011-10-18_01-05-13/archive/airavata/airavata-gfac-core/0.0.1-SNAPSHOT/airavata-gfac-core-0.0.1-SNAPSHOT.jar
[INFO]                                                                         
[INFO] ------------------------------------------------------------------------
[INFO] Building GFac-Axis2-Interface 0.0.1-SNAPSHOT
[INFO] ------------------------------------------------------------------------
[INFO] 
[INFO] --- maven-clean-plugin:2.4.1:clean (default-clean) @ airavata-gfac-axis2-interface ---
[INFO] [INFO] Using 'UTF-8' encoding to copy filtered resources.
[INFO] Copying 2 resources

[INFO] --- maven-resources-plugin:2.4.3:resources (default-resources) @ airavata-gfac-axis2-interface ---
[INFO] [INFO] Compiling 9 source files to <https://builds.apache.org/job/Airavata/ws/modules/gfac-axis2/target/classes>

[INFO] --- maven-compiler-plugin:2.3.2:compile (default-compile) @ airavata-gfac-axis2-interface ---
[INFO] [INFO] Using 'UTF-8' encoding to copy filtered resources.
[INFO] skip non existing resourceDirectory <https://builds.apache.org/job/Airavata/ws/modules/gfac-axis2/src/test/resources>

[INFO] --- maven-resources-plugin:2.4.3:testResources (default-testResources) @ airavata-gfac-axis2-interface ---
[INFO] [INFO] No sources to compile

[INFO] --- maven-compiler-plugin:2.3.2:testCompile (default-testCompile) @ airavata-gfac-axis2-interface ---
[INFO] [INFO] No tests to run.
[INFO] Surefire report directory: <https://builds.apache.org/job/Airavata/ws/modules/gfac-axis2/target/surefire-reports>

[INFO] --- maven-surefire-plugin:2.7.1:test (default-test) @ airavata-gfac-axis2-interface ---

-------------------------------------------------------
 T E S T S
-------------------------------------------------------
There are no tests to run.

Results :

Tests run: 0, Failures: 0, Errors: 0, Skipped: 0

[JENKINS] Recording test results
[INFO] 
[INFO] --- maven-jar-plugin:2.3.1:jar (default-jar) @ airavata-gfac-axis2-interface ---
[INFO] Building jar: <https://builds.apache.org/job/Airavata/ws/modules/gfac-axis2/target/airavata-gfac-axis2-interface-0.0.1-SNAPSHOT.jar>
[INFO] 
[INFO] --- axis2-aar-maven-plugin:1.5.1:aar (createAAR) @ airavata-gfac-axis2-interface ---
[INFO] Generating aar <https://builds.apache.org/job/Airavata/ws/modules/gfac-axis2/target/airavata-gfac-axis2-interface-0.0.1-SNAPSHOT.aar>
[INFO] Building jar: <https://builds.apache.org/job/Airavata/ws/modules/gfac-axis2/target/airavata-gfac-axis2-interface-0.0.1-SNAPSHOT.aar>
[INFO] [INFO] Installing <https://builds.apache.org/job/Airavata/ws/modules/gfac-axis2/target/airavata-gfac-axis2-interface-0.0.1-SNAPSHOT.aar> to /home/jenkins/.m2/repository/airavata/airavata-gfac-axis2-interface/0.0.1-SNAPSHOT/airavata-gfac-axis2-interface-0.0.1-SNAPSHOT.jar

[INFO] --- maven-install-plugin:2.3.1:install (default-install) @ airavata-gfac-axis2-interface ---
[INFO] Installing <https://builds.apache.org/job/Airavata/ws/modules/gfac-axis2/pom.xml> to /home/jenkins/.m2/repository/airavata/airavata-gfac-axis2-interface/0.0.1-SNAPSHOT/airavata-gfac-axis2-interface-0.0.1-SNAPSHOT.pom
[JENKINS] Archiving <https://builds.apache.org/job/Airavata/ws/modules/gfac-axis2/pom.xml> to /home/hudson/hudson/jobs/Airavata/modules/airavata$airavata-gfac-axis2-interface/builds/2011-10-18_01-05-13/archive/airavata/airavata-gfac-axis2-interface/0.0.1-SNAPSHOT/airavata-gfac-axis2-interface-0.0.1-SNAPSHOT.pom
[JENKINS] Archiving <https://builds.apache.org/job/Airavata/ws/modules/gfac-axis2/target/airavata-gfac-axis2-interface-0.0.1-SNAPSHOT.aar> to /home/hudson/hudson/jobs/Airavata/modules/airavata$airavata-gfac-axis2-interface/builds/2011-10-18_01-05-13/archive/airavata/airavata-gfac-axis2-interface/0.0.1-SNAPSHOT/airavata-gfac-axis2-interface-0.0.1-SNAPSHOT.jar
[INFO]                                                                         
[INFO] ------------------------------------------------------------------------
[INFO] Building MessageBox 0.0.1-SNAPSHOT
[INFO] ------------------------------------------------------------------------
[INFO] 
[INFO] --- maven-clean-plugin:2.4.1:clean (default-clean) @ airavata-messagebox ---
[INFO] [INFO] Using 'UTF-8' encoding to copy filtered resources.
[INFO] skip non existing resourceDirectory <https://builds.apache.org/job/Airavata/ws/modules/ws-messenger/messagebox/resources>

[INFO] --- maven-resources-plugin:2.4.3:resources (default-resources) @ airavata-messagebox ---
[INFO] [INFO] Compiling 12 source files to <https://builds.apache.org/job/Airavata/ws/modules/ws-messenger/messagebox/target/classes>

[INFO] --- maven-compiler-plugin:2.0.2:compile (default-compile) @ airavata-messagebox ---
[INFO] [INFO] Using 'UTF-8' encoding to copy filtered resources.
[INFO] Copying 1 resource

[INFO] --- maven-resources-plugin:2.4.3:testResources (default-testResources) @ airavata-messagebox ---
[INFO] [INFO] Compiling 3 source files to <https://builds.apache.org/job/Airavata/ws/modules/ws-messenger/messagebox/target/test-classes>

[INFO] --- maven-compiler-plugin:2.0.2:testCompile (default-testCompile) @ airavata-messagebox ---
[INFO] [INFO] Tests are skipped.

[INFO] --- maven-surefire-plugin:2.7.1:test (default-test) @ airavata-messagebox ---
[INFO] 
[INFO] [INFO] Building jar: <https://builds.apache.org/job/Airavata/ws/modules/ws-messenger/messagebox/target/airavata-messagebox-0.0.1-SNAPSHOT.jar>
--- maven-jar-plugin:2.3.1:jar (default-jar) @ airavata-messagebox ---
[INFO] 
[INFO] --- axis2-aar-maven-plugin:1.5.1:aar (createAAR) @ airavata-messagebox ---
[INFO] Generating aar <https://builds.apache.org/job/Airavata/ws/modules/ws-messenger/messagebox/target/airavata-messagebox-0.0.1-SNAPSHOT.aar>
[INFO] Building jar: <https://builds.apache.org/job/Airavata/ws/modules/ws-messenger/messagebox/target/airavata-messagebox-0.0.1-SNAPSHOT.aar>
[INFO] [INFO] Installing <https://builds.apache.org/job/Airavata/ws/modules/ws-messenger/messagebox/target/airavata-messagebox-0.0.1-SNAPSHOT.aar> to /home/jenkins/.m2/repository/airavata/airavata-messagebox/0.0.1-SNAPSHOT/airavata-messagebox-0.0.1-SNAPSHOT.jar

[INFO] --- maven-install-plugin:2.3.1:install (default-install) @ airavata-messagebox ---
[INFO] Installing <https://builds.apache.org/job/Airavata/ws/modules/ws-messenger/messagebox/pom.xml> to /home/jenkins/.m2/repository/airavata/airavata-messagebox/0.0.1-SNAPSHOT/airavata-messagebox-0.0.1-SNAPSHOT.pom
[JENKINS] Archiving <https://builds.apache.org/job/Airavata/ws/modules/ws-messenger/messagebox/pom.xml> to /home/hudson/hudson/jobs/Airavata/modules/airavata$airavata-messagebox/builds/2011-10-18_01-05-13/archive/airavata/airavata-messagebox/0.0.1-SNAPSHOT/airavata-messagebox-0.0.1-SNAPSHOT.pom
[JENKINS] Archiving <https://builds.apache.org/job/Airavata/ws/modules/ws-messenger/messagebox/target/airavata-messagebox-0.0.1-SNAPSHOT.aar> to /home/hudson/hudson/jobs/Airavata/modules/airavata$airavata-messagebox/builds/2011-10-18_01-05-13/archive/airavata/airavata-messagebox/0.0.1-SNAPSHOT/airavata-messagebox-0.0.1-SNAPSHOT.jar
[INFO]                                                                         
[INFO] ------------------------------------------------------------------------
[INFO] Building Message Broker 0.0.1-SNAPSHOT
[INFO] ------------------------------------------------------------------------
Downloading: http://people.apache.org/repo/m2-snapshot-repository/edu/berkeley/yfilter/1.0/yfilter-1.0.pom
Downloading: http://mirrors.ibiblio.org/pub/mirrors/maven2/edu/berkeley/yfilter/1.0/yfilter-1.0.pom
Downloading: http://download.java.net/maven/2/edu/berkeley/yfilter/1.0/yfilter-1.0.pom
Downloading: http://people.apache.org/~lahiru/maven-repo/edu/berkeley/yfilter/1.0/yfilter-1.0.pom
Downloading: http://repo1.maven.org/maven2/edu/berkeley/yfilter/1.0/yfilter-1.0.pom
[JENKINS] Archiving <https://builds.apache.org/job/Airavata/ws/modules/ws-messenger/messagebroker/pom.xml> to /home/hudson/hudson/jobs/Airavata/modules/airavata$airavata-messagebroker/builds/2011-10-18_01-05-13/archive/airavata/airavata-messagebroker/0.0.1-SNAPSHOT/airavata-messagebroker-0.0.1-SNAPSHOT.pom
[INFO] ------------------------------------------------------------------------
[INFO] Reactor Summary:
[INFO] 
[INFO] Airavata .......................................... SUCCESS [1.824s]
[INFO] Airavata Commons .................................. SUCCESS [0.240s]
[INFO] Airavata GFac Schema Utilities .................... SUCCESS [6.028s]
[INFO] Airavata Registry API ............................. SUCCESS [1.284s]
[INFO] Airavata-WS-Messenger ............................. SUCCESS [0.152s]
[INFO] Messenger Commons ................................. SUCCESS [1.742s]
[INFO] Messenger Client .................................. SUCCESS [1.721s]
[INFO] Airavata Workflow Tracking ........................ SUCCESS [4.845s]
[INFO] GFac-Core ......................................... SUCCESS [20.991s]
[INFO] GFac-Axis2-Interface .............................. SUCCESS [6.890s]
[INFO] MessageBox ........................................ SUCCESS [2.489s]
[INFO] Message Broker .................................... FAILURE [2.070s]
[INFO] distribution ...................................... SKIPPED
[INFO] Airavata Common Utilities ......................... SKIPPED
[INFO] Airavata XBaya .................................... SKIPPED
[INFO] Simple Math Service ............................... SKIPPED
[INFO] distribution ...................................... SKIPPED
[INFO] ------------------------------------------------------------------------
[INFO] BUILD FAILURE
[INFO] ------------------------------------------------------------------------
[INFO] Total time: 4:07.062s
[INFO] Finished at: Tue Oct 18 01:09:24 UTC 2011
[INFO] Final Memory: 78M/225M
[INFO] ------------------------------------------------------------------------
mavenExecutionResult exceptions not empty
message : Failed to execute goal on project airavata-messagebroker: Could not resolve dependencies for project airavata:airavata-messagebroker:jar:0.0.1-SNAPSHOT: Failed to collect dependencies for [airavata:airavata-messenger-commons:jar:0.0.1-SNAPSHOT (compile), edu.berkeley:yfilter:jar:1.0 (compile), wsdl4j:wsdl4j:jar:1.5.2 (compile), javax.servlet:servlet-api:jar:2.5 (provided), org.apache.axis2:axis2:jar:1.5.1 (provided), org.apache.axis2:axis2-transport-http:jar:1.5.1 (compile), org.apache.axis2:axis2-transport-local:jar:1.5.1 (compile), org.slf4j:slf4j-api:jar:1.6.1 (compile), junit:junit:jar:4.7 (test), airavata:airavata-messenger-client:jar:0.0.1-SNAPSHOT (test)]
cause : Could not resolve dependencies for project airavata:airavata-messagebroker:jar:0.0.1-SNAPSHOT: Failed to collect dependencies for [airavata:airavata-messenger-commons:jar:0.0.1-SNAPSHOT (compile), edu.berkeley:yfilter:jar:1.0 (compile), wsdl4j:wsdl4j:jar:1.5.2 (compile), javax.servlet:servlet-api:jar:2.5 (provided), org.apache.axis2:axis2:jar:1.5.1 (provided), org.apache.axis2:axis2-transport-http:jar:1.5.1 (compile), org.apache.axis2:axis2-transport-local:jar:1.5.1 (compile), org.slf4j:slf4j-api:jar:1.6.1 (compile), junit:junit:jar:4.7 (test), airavata:airavata-messenger-client:jar:0.0.1-SNAPSHOT (test)]
Stack trace : 
org.apache.maven.lifecycle.LifecycleExecutionException: Failed to execute goal on project airavata-messagebroker: Could not resolve dependencies for project airavata:airavata-messagebroker:jar:0.0.1-SNAPSHOT: Failed to collect dependencies for [airavata:airavata-messenger-commons:jar:0.0.1-SNAPSHOT (compile), edu.berkeley:yfilter:jar:1.0 (compile), wsdl4j:wsdl4j:jar:1.5.2 (compile), javax.servlet:servlet-api:jar:2.5 (provided), org.apache.axis2:axis2:jar:1.5.1 (provided), org.apache.axis2:axis2-transport-http:jar:1.5.1 (compile), org.apache.axis2:axis2-transport-local:jar:1.5.1 (compile), org.slf4j:slf4j-api:jar:1.6.1 (compile), junit:junit:jar:4.7 (test), airavata:airavata-messenger-client:jar:0.0.1-SNAPSHOT (test)]
	at org.apache.maven.lifecycle.internal.LifecycleDependencyResolver.getDependencies(LifecycleDependencyResolver.java:190)
	at org.apache.maven.lifecycle.internal.LifecycleDependencyResolver.resolveProjectDependencies(LifecycleDependencyResolver.java:104)
	at org.apache.maven.lifecycle.internal.MojoExecutor.ensureDependenciesAreResolved(MojoExecutor.java:258)
	at org.apache.maven.lifecycle.internal.MojoExecutor.execute(MojoExecutor.java:201)
	at org.apache.maven.lifecycle.internal.MojoExecutor.execute(MojoExecutor.java:153)
	at org.apache.maven.lifecycle.internal.MojoExecutor.execute(MojoExecutor.java:145)
	at org.apache.maven.lifecycle.internal.LifecycleModuleBuilder.buildProject(LifecycleModuleBuilder.java:84)
	at org.apache.maven.lifecycle.internal.LifecycleModuleBuilder.buildProject(LifecycleModuleBuilder.java:59)
	at org.apache.maven.lifecycle.internal.LifecycleStarter.singleThreadedBuild(LifecycleStarter.java:183)
	at org.apache.maven.lifecycle.internal.LifecycleStarter.execute(LifecycleStarter.java:161)
	at org.apache.maven.DefaultMaven.doExecute(DefaultMaven.java:319)
	at org.apache.maven.DefaultMaven.execute(DefaultMaven.java:156)
	at org.jvnet.hudson.maven3.launcher.Maven3Launcher.main(Maven3Launcher.java:79)
	at sun.reflect.NativeMethodAccessorImpl.invoke0(Native Method)
	at sun.reflect.NativeMethodAccessorImpl.invoke(NativeMethodAccessorImpl.java:39)
	at sun.reflect.DelegatingMethodAccessorImpl.invoke(DelegatingMethodAccessorImpl.java:25)
	at java.lang.reflect.Method.invoke(Method.java:597)
	at org.codehaus.plexus.classworlds.launcher.Launcher.launchStandard(Launcher.java:329)
	at org.codehaus.plexus.classworlds.launcher.Launcher.launch(Launcher.java:239)
	at org.jvnet.hudson.maven3.agent.Maven3Main.launch(Maven3Main.java:158)
	at hudson.maven.Maven3Builder.call(Maven3Builder.java:122)
	at hudson.maven.Maven3Builder.call(Maven3Builder.java:74)
	at hudson.remoting.UserRequest.perform(UserRequest.java:118)
	at hudson.remoting.UserRequest.perform(UserRequest.java:48)
	at hudson.remoting.Request$2.run(Request.java:287)
	at java.util.concurrent.Executors$RunnableAdapter.call(Executors.java:441)
	at java.util.concurrent.FutureTask$Sync.innerRun(FutureTask.java:303)
	at java.util.concurrent.FutureTask.run(FutureTask.java:138)
	at java.util.concurrent.ThreadPoolExecutor$Worker.runTask(ThreadPoolExecutor.java:886)
	at java.util.concurrent.ThreadPoolExecutor$Worker.run(ThreadPoolExecutor.java:908)
	at java.lang.Thread.run(Thread.java:662)
Caused by: org.apache.maven.project.DependencyResolutionException: Could not resolve dependencies for project airavata:airavata-messagebroker:jar:0.0.1-SNAPSHOT: Failed to collect dependencies for [airavata:airavata-messenger-commons:jar:0.0.1-SNAPSHOT (compile), edu.berkeley:yfilter:jar:1.0 (compile), wsdl4j:wsdl4j:jar:1.5.2 (compile), javax.servlet:servlet-api:jar:2.5 (provided), org.apache.axis2:axis2:jar:1.5.1 (provided), org.apache.axis2:axis2-transport-http:jar:1.5.1 (compile), org.apache.axis2:axis2-transport-local:jar:1.5.1 (compile), org.slf4j:slf4j-api:jar:1.6.1 (compile), junit:junit:jar:4.7 (test), airavata:airavata-messenger-client:jar:0.0.1-SNAPSHOT (test)]
	at org.apache.maven.project.DefaultProjectDependenciesResolver.resolve(DefaultProjectDependenciesResolver.java:127)
	at org.apache.maven.lifecycle.internal.LifecycleDependencyResolver.getDependencies(LifecycleDependencyResolver.java:165)
	... 30 more
Caused by: org.sonatype.aether.collection.DependencyCollectionException: Failed to collect dependencies for [airavata:airavata-messenger-commons:jar:0.0.1-SNAPSHOT (compile), edu.berkeley:yfilter:jar:1.0 (compile), wsdl4j:wsdl4j:jar:1.5.2 (compile), javax.servlet:servlet-api:jar:2.5 (provided), org.apache.axis2:axis2:jar:1.5.1 (provided), org.apache.axis2:axis2-transport-http:jar:1.5.1 (compile), org.apache.axis2:axis2-transport-local:jar:1.5.1 (compile), org.slf4j:slf4j-api:jar:1.6.1 (compile), junit:junit:jar:4.7 (test), airavata:airavata-messenger-client:jar:0.0.1-SNAPSHOT (test)]
	at org.sonatype.aether.impl.internal.DefaultDependencyCollector.collectDependencies(DefaultDependencyCollector.java:251)
	at org.sonatype.aether.impl.internal.DefaultRepositorySystem.collectDependencies(DefaultRepositorySystem.java:318)
	at org.apache.maven.project.DefaultProjectDependenciesResolver.resolve(DefaultProjectDependenciesResolver.java:119)
	... 31 more
Caused by: org.sonatype.aether.resolution.ArtifactDescriptorException: Failed to read artifact descriptor for edu.berkeley:yfilter:jar:1.0
	at org.apache.maven.repository.internal.DefaultArtifactDescriptorReader.loadPom(DefaultArtifactDescriptorReader.java:283)
	at org.apache.maven.repository.internal.DefaultArtifactDescriptorReader.readArtifactDescriptor(DefaultArtifactDescriptorReader.java:173)
	at org.sonatype.aether.impl.internal.DefaultDependencyCollector.process(DefaultDependencyCollector.java:419)
	at org.sonatype.aether.impl.internal.DefaultDependencyCollector.collectDependencies(DefaultDependencyCollector.java:233)
	... 33 more
Caused by: org.sonatype.aether.resolution.ArtifactResolutionException: Could not transfer artifact edu.berkeley:yfilter:pom:1.0 from/to ibiblio (http://mirrors.ibiblio.org/pub/mirrors/maven2): Error transferring file: Connection refused
	at org.sonatype.aether.impl.internal.DefaultArtifactResolver.resolveArtifacts(DefaultArtifactResolver.java:526)
	at org.sonatype.aether.impl.internal.DefaultArtifactResolver.resolveArtifact(DefaultArtifactResolver.java:214)
	at org.apache.maven.repository.internal.DefaultArtifactDescriptorReader.loadPom(DefaultArtifactDescriptorReader.java:268)
	... 36 more
Caused by: org.sonatype.aether.transfer.ArtifactTransferException: Could not transfer artifact edu.berkeley:yfilter:pom:1.0 from/to ibiblio (http://mirrors.ibiblio.org/pub/mirrors/maven2): Error transferring file: Connection refused
	at org.sonatype.aether.connector.wagon.WagonRepositoryConnector$4.wrap(WagonRepositoryConnector.java:949)
	at org.sonatype.aether.connector.wagon.WagonRepositoryConnector$4.wrap(WagonRepositoryConnector.java:940)
	at org.sonatype.aether.connector.wagon.WagonRepositoryConnector$GetTask.flush(WagonRepositoryConnector.java:696)
	at org.sonatype.aether.connector.wagon.WagonRepositoryConnector$GetTask.flush(WagonRepositoryConnector.java:690)
	at org.sonatype.aether.connector.wagon.WagonRepositoryConnector.get(WagonRepositoryConnector.java:435)
	at org.sonatype.aether.impl.internal.DefaultArtifactResolver.resolveArtifacts(DefaultArtifactResolver.java:438)
	... 38 more
Caused by: org.apache.maven.wagon.TransferFailedException: Error transferring file: Connection refused
	at org.apache.maven.wagon.providers.http.LightweightHttpWagon.fillInputData(LightweightHttpWagon.java:143)
	at org.apache.maven.wagon.StreamWagon.getInputStream(StreamWagon.java:116)
	at org.apache.maven.wagon.StreamWagon.getIfNewer(StreamWagon.java:88)
	at org.apache.maven.wagon.StreamWagon.get(StreamWagon.java:61)
	at org.sonatype.aether.connector.wagon.WagonRepositoryConnector$GetTask.run(WagonRepositoryConnector.java:605)
	... 3 more
Caused by: java.net.ConnectException: Connection refused
	at java.net.PlainSocketImpl.socketConnect(Native Method)
	at java.net.PlainSocketImpl.doConnect(PlainSocketImpl.java:351)
	at java.net.PlainSocketImpl.connectToAddress(PlainSocketImpl.java:213)
	at java.net.PlainSocketImpl.connect(PlainSocketImpl.java:200)
	at java.net.SocksSocketImpl.connect(SocksSocketImpl.java:366)
	at java.net.Socket.connect(Socket.java:529)
	at java.net.Socket.connect(Socket.java:478)
	at sun.net.NetworkClient.doConnect(NetworkClient.java:163)
	at sun.net.www.http.HttpClient.openServer(HttpClient.java:395)
	at sun.net.www.http.HttpClient.openServer(HttpClient.java:530)
	at sun.net.www.http.HttpClient.<init>(HttpClient.java:234)
	at sun.net.www.http.HttpClient.New(HttpClient.java:307)
	at sun.net.www.http.HttpClient.New(HttpClient.java:324)
	at sun.net.www.protocol.http.HttpURLConnection.getNewHttpClient(HttpURLConnection.java:970)
	at sun.net.www.protocol.http.HttpURLConnection.plainConnect(HttpURLConnection.java:911)
	at sun.net.www.protocol.http.HttpURLConnection.connect(HttpURLConnection.java:836)
	at sun.net.www.protocol.http.HttpURLConnection.getInputStream(HttpURLConnection.java:1172)
	at java.net.HttpURLConnection.getResponseCode(HttpURLConnection.java:379)
	at org.apache.maven.wagon.providers.http.LightweightHttpWagon.fillInputData(LightweightHttpWagon.java:115)
	... 7 more
Sending e-mails to: airavata-dev@incubator.apache.org
channel stopped


Jenkins build is back to normal : Airavata #112

Posted by Apache Jenkins Server <je...@builds.apache.org>.
See <https://builds.apache.org/job/Airavata/112/changes>