You are viewing a plain text version of this content. The canonical link for it is here.
Posted to commits@beam.apache.org by Apache Jenkins Server <je...@builds.apache.org> on 2017/07/12 18:07:16 UTC

Build failed in Jenkins: beam_PostCommit_Java_ValidatesRunner_Flink #3385

See <https://builds.apache.org/job/beam_PostCommit_Java_ValidatesRunner_Flink/3385/display/redirect>

------------------------------------------
[...truncated 465.91 KB...]
2017-07-12T18:07:05.814 [INFO] Downloading: https://repo.maven.apache.org/maven2/commons-beanutils/commons-beanutils-bean-collections/1.8.3/commons-beanutils-bean-collections-1.8.3.pom
2017-07-12T18:07:05.840 [INFO] Downloaded: https://repo.maven.apache.org/maven2/commons-beanutils/commons-beanutils-bean-collections/1.8.3/commons-beanutils-bean-collections-1.8.3.pom (2 KB at 70.0 KB/sec)
2017-07-12T18:07:05.841 [INFO] Downloading: https://repo.maven.apache.org/maven2/commons-daemon/commons-daemon/1.0.13/commons-daemon-1.0.13.pom
2017-07-12T18:07:05.868 [INFO] Downloaded: https://repo.maven.apache.org/maven2/commons-daemon/commons-daemon/1.0.13/commons-daemon-1.0.13.pom (5 KB at 157.3 KB/sec)
2017-07-12T18:07:05.872 [INFO] Downloading: https://repo.maven.apache.org/maven2/javax/xml/bind/jaxb-api/2.2.2/jaxb-api-2.2.2.pom
2017-07-12T18:07:05.899 [INFO] Downloaded: https://repo.maven.apache.org/maven2/javax/xml/bind/jaxb-api/2.2.2/jaxb-api-2.2.2.pom (6 KB at 201.5 KB/sec)
2017-07-12T18:07:05.902 [INFO] Downloading: https://repo.maven.apache.org/maven2/javax/xml/stream/stax-api/1.0-2/stax-api-1.0-2.pom
2017-07-12T18:07:05.927 [INFO] Downloaded: https://repo.maven.apache.org/maven2/javax/xml/stream/stax-api/1.0-2/stax-api-1.0-2.pom (962 B at 37.6 KB/sec)
2017-07-12T18:07:05.929 [INFO] Downloading: https://repo.maven.apache.org/maven2/javax/activation/activation/1.1/activation-1.1.pom
2017-07-12T18:07:05.954 [INFO] Downloaded: https://repo.maven.apache.org/maven2/javax/activation/activation/1.1/activation-1.1.pom (2 KB at 41.3 KB/sec)
2017-07-12T18:07:05.956 [INFO] Downloading: https://repo.maven.apache.org/maven2/org/apache/flink/flink-runtime_2.10/1.3.0/flink-runtime_2.10-1.3.0.pom
2017-07-12T18:07:05.983 [INFO] Downloaded: https://repo.maven.apache.org/maven2/org/apache/flink/flink-runtime_2.10/1.3.0/flink-runtime_2.10-1.3.0.pom (14 KB at 515.8 KB/sec)
2017-07-12T18:07:05.987 [INFO] Downloading: https://repo.maven.apache.org/maven2/io/netty/netty-all/4.0.27.Final/netty-all-4.0.27.Final.pom
2017-07-12T18:07:06.016 [INFO] Downloaded: https://repo.maven.apache.org/maven2/io/netty/netty-all/4.0.27.Final/netty-all-4.0.27.Final.pom (17 KB at 581.1 KB/sec)
2017-07-12T18:07:06.019 [INFO] Downloading: https://repo.maven.apache.org/maven2/io/netty/netty-parent/4.0.27.Final/netty-parent-4.0.27.Final.pom
2017-07-12T18:07:06.051 [INFO] Downloaded: https://repo.maven.apache.org/maven2/io/netty/netty-parent/4.0.27.Final/netty-parent-4.0.27.Final.pom (48 KB at 1488.8 KB/sec)
2017-07-12T18:07:06.062 [INFO] Downloading: https://repo.maven.apache.org/maven2/org/javassist/javassist/3.18.2-GA/javassist-3.18.2-GA.pom
2017-07-12T18:07:06.090 [INFO] Downloaded: https://repo.maven.apache.org/maven2/org/javassist/javassist/3.18.2-GA/javassist-3.18.2-GA.pom (10 KB at 332.1 KB/sec)
2017-07-12T18:07:06.093 [INFO] Downloading: https://repo.maven.apache.org/maven2/org/scala-lang/scala-library/2.10.4/scala-library-2.10.4.pom
2017-07-12T18:07:06.120 [INFO] Downloaded: https://repo.maven.apache.org/maven2/org/scala-lang/scala-library/2.10.4/scala-library-2.10.4.pom (2 KB at 73.9 KB/sec)
2017-07-12T18:07:06.122 [INFO] Downloading: https://repo.maven.apache.org/maven2/com/data-artisans/flakka-actor_2.10/2.3-custom/flakka-actor_2.10-2.3-custom.pom
2017-07-12T18:07:06.149 [INFO] Downloaded: https://repo.maven.apache.org/maven2/com/data-artisans/flakka-actor_2.10/2.3-custom/flakka-actor_2.10-2.3-custom.pom (2 KB at 72.7 KB/sec)
2017-07-12T18:07:06.151 [INFO] Downloading: https://repo.maven.apache.org/maven2/com/typesafe/config/1.2.1/config-1.2.1.pom
2017-07-12T18:07:06.178 [INFO] Downloaded: https://repo.maven.apache.org/maven2/com/typesafe/config/1.2.1/config-1.2.1.pom (2 KB at 67.5 KB/sec)
2017-07-12T18:07:06.180 [INFO] Downloading: https://repo.maven.apache.org/maven2/com/data-artisans/flakka-remote_2.10/2.3-custom/flakka-remote_2.10-2.3-custom.pom
2017-07-12T18:07:06.210 [INFO] Downloaded: https://repo.maven.apache.org/maven2/com/data-artisans/flakka-remote_2.10/2.3-custom/flakka-remote_2.10-2.3-custom.pom (4 KB at 120.7 KB/sec)
2017-07-12T18:07:06.212 [INFO] Downloading: https://repo.maven.apache.org/maven2/io/netty/netty/3.8.0.Final/netty-3.8.0.Final.pom
2017-07-12T18:07:06.242 [INFO] Downloaded: https://repo.maven.apache.org/maven2/io/netty/netty/3.8.0.Final/netty-3.8.0.Final.pom (26 KB at 853.0 KB/sec)
2017-07-12T18:07:06.247 [INFO] Downloading: https://repo.maven.apache.org/maven2/org/uncommons/maths/uncommons-maths/1.2.2a/uncommons-maths-1.2.2a.pom
2017-07-12T18:07:06.274 [INFO] Downloaded: https://repo.maven.apache.org/maven2/org/uncommons/maths/uncommons-maths/1.2.2a/uncommons-maths-1.2.2a.pom (2 KB at 57.5 KB/sec)
2017-07-12T18:07:06.276 [INFO] Downloading: https://repo.maven.apache.org/maven2/com/data-artisans/flakka-slf4j_2.10/2.3-custom/flakka-slf4j_2.10-2.3-custom.pom
2017-07-12T18:07:06.302 [INFO] Downloaded: https://repo.maven.apache.org/maven2/com/data-artisans/flakka-slf4j_2.10/2.3-custom/flakka-slf4j_2.10-2.3-custom.pom (3 KB at 96.1 KB/sec)
2017-07-12T18:07:06.304 [INFO] Downloading: https://repo.maven.apache.org/maven2/org/clapper/grizzled-slf4j_2.10/1.0.2/grizzled-slf4j_2.10-1.0.2.pom
2017-07-12T18:07:06.329 [INFO] Downloaded: https://repo.maven.apache.org/maven2/org/clapper/grizzled-slf4j_2.10/1.0.2/grizzled-slf4j_2.10-1.0.2.pom (2 KB at 74.8 KB/sec)
2017-07-12T18:07:06.330 [INFO] Downloading: https://repo.maven.apache.org/maven2/org/scala-lang/scala-library/2.10.3/scala-library-2.10.3.pom
2017-07-12T18:07:06.355 [INFO] Downloaded: https://repo.maven.apache.org/maven2/org/scala-lang/scala-library/2.10.3/scala-library-2.10.3.pom (2 KB at 79.8 KB/sec)
2017-07-12T18:07:06.357 [INFO] Downloading: https://repo.maven.apache.org/maven2/com/github/scopt/scopt_2.10/3.5.0/scopt_2.10-3.5.0.pom
2017-07-12T18:07:06.382 [INFO] Downloaded: https://repo.maven.apache.org/maven2/com/github/scopt/scopt_2.10/3.5.0/scopt_2.10-3.5.0.pom (2 KB at 65.4 KB/sec)
2017-07-12T18:07:06.384 [INFO] Downloading: https://repo.maven.apache.org/maven2/org/apache/zookeeper/zookeeper/3.4.6/zookeeper-3.4.6.pom
2017-07-12T18:07:06.410 [INFO] Downloaded: https://repo.maven.apache.org/maven2/org/apache/zookeeper/zookeeper/3.4.6/zookeeper-3.4.6.pom (4 KB at 126.5 KB/sec)
2017-07-12T18:07:06.412 [INFO] Downloading: https://repo.maven.apache.org/maven2/jline/jline/0.9.94/jline-0.9.94.pom
2017-07-12T18:07:06.439 [INFO] Downloaded: https://repo.maven.apache.org/maven2/jline/jline/0.9.94/jline-0.9.94.pom (7 KB at 230.0 KB/sec)
2017-07-12T18:07:06.441 [INFO] Downloading: https://repo.maven.apache.org/maven2/io/netty/netty/3.7.0.Final/netty-3.7.0.Final.pom
2017-07-12T18:07:06.472 [INFO] Downloaded: https://repo.maven.apache.org/maven2/io/netty/netty/3.7.0.Final/netty-3.7.0.Final.pom (26 KB at 825.5 KB/sec)
2017-07-12T18:07:06.479 [INFO] Downloading: https://repo.maven.apache.org/maven2/com/twitter/chill_2.10/0.7.4/chill_2.10-0.7.4.pom
2017-07-12T18:07:06.507 [INFO] Downloaded: https://repo.maven.apache.org/maven2/com/twitter/chill_2.10/0.7.4/chill_2.10-0.7.4.pom (3 KB at 79.9 KB/sec)
2017-07-12T18:07:06.509 [INFO] Downloading: https://repo.maven.apache.org/maven2/org/scala-lang/scala-library/2.10.5/scala-library-2.10.5.pom
2017-07-12T18:07:06.537 [INFO] Downloaded: https://repo.maven.apache.org/maven2/org/scala-lang/scala-library/2.10.5/scala-library-2.10.5.pom (2 KB at 73.9 KB/sec)
2017-07-12T18:07:06.539 [INFO] Downloading: https://repo.maven.apache.org/maven2/com/twitter/chill-java/0.7.4/chill-java-0.7.4.pom
2017-07-12T18:07:06.566 [INFO] Downloaded: https://repo.maven.apache.org/maven2/com/twitter/chill-java/0.7.4/chill-java-0.7.4.pom (2 KB at 73.6 KB/sec)
2017-07-12T18:07:06.568 [INFO] Downloading: https://repo.maven.apache.org/maven2/org/apache/flink/flink-streaming-java_2.10/1.3.0/flink-streaming-java_2.10-1.3.0.pom
2017-07-12T18:07:06.594 [INFO] Downloaded: https://repo.maven.apache.org/maven2/org/apache/flink/flink-streaming-java_2.10/1.3.0/flink-streaming-java_2.10-1.3.0.pom (7 KB at 231.9 KB/sec)
2017-07-12T18:07:06.598 [INFO] Downloading: https://repo.maven.apache.org/maven2/org/apache/sling/org.apache.sling.commons.json/2.0.6/org.apache.sling.commons.json-2.0.6.pom
2017-07-12T18:07:06.627 [INFO] Downloaded: https://repo.maven.apache.org/maven2/org/apache/sling/org.apache.sling.commons.json/2.0.6/org.apache.sling.commons.json-2.0.6.pom (4 KB at 109.1 KB/sec)
2017-07-12T18:07:06.629 [INFO] Downloading: https://repo.maven.apache.org/maven2/org/apache/sling/sling/10/sling-10.pom
2017-07-12T18:07:06.659 [INFO] Downloaded: https://repo.maven.apache.org/maven2/org/apache/sling/sling/10/sling-10.pom (26 KB at 835.5 KB/sec)
2017-07-12T18:07:06.662 [INFO] Downloading: https://repo.maven.apache.org/maven2/org/apache/apache/8/apache-8.pom
2017-07-12T18:07:06.691 [INFO] Downloaded: https://repo.maven.apache.org/maven2/org/apache/apache/8/apache-8.pom (14 KB at 473.3 KB/sec)
2017-07-12T18:07:06.708 [INFO] Downloading: https://repo.maven.apache.org/maven2/com/google/apis/google-api-services-bigquery/v2-rev295-1.22.0/google-api-services-bigquery-v2-rev295-1.22.0.pom
2017-07-12T18:07:06.735 [INFO] Downloaded: https://repo.maven.apache.org/maven2/com/google/apis/google-api-services-bigquery/v2-rev295-1.22.0/google-api-services-bigquery-v2-rev295-1.22.0.pom (3 KB at 94.6 KB/sec)
2017-07-12T18:07:06.737 [INFO] Downloading: https://repo.maven.apache.org/maven2/com/google/api-client/google-api-client/1.22.0/google-api-client-1.22.0.pom
2017-07-12T18:07:06.763 [INFO] Downloaded: https://repo.maven.apache.org/maven2/com/google/api-client/google-api-client/1.22.0/google-api-client-1.22.0.pom (4 KB at 146.9 KB/sec)
2017-07-12T18:07:06.765 [INFO] Downloading: https://repo.maven.apache.org/maven2/com/google/api-client/google-api-client-parent/1.22.0/google-api-client-parent-1.22.0.pom
2017-07-12T18:07:06.794 [INFO] Downloaded: https://repo.maven.apache.org/maven2/com/google/api-client/google-api-client-parent/1.22.0/google-api-client-parent-1.22.0.pom (25 KB at 828.7 KB/sec)
2017-07-12T18:07:06.799 [INFO] Downloading: https://repo.maven.apache.org/maven2/com/google/oauth-client/google-oauth-client/1.22.0/google-oauth-client-1.22.0.pom
2017-07-12T18:07:06.825 [INFO] Downloaded: https://repo.maven.apache.org/maven2/com/google/oauth-client/google-oauth-client/1.22.0/google-oauth-client-1.22.0.pom (3 KB at 108.7 KB/sec)
2017-07-12T18:07:06.827 [INFO] Downloading: https://repo.maven.apache.org/maven2/com/google/oauth-client/google-oauth-client-parent/1.22.0/google-oauth-client-parent-1.22.0.pom
2017-07-12T18:07:06.855 [INFO] Downloaded: https://repo.maven.apache.org/maven2/com/google/oauth-client/google-oauth-client-parent/1.22.0/google-oauth-client-parent-1.22.0.pom (21 KB at 742.7 KB/sec)
2017-07-12T18:07:06.859 [INFO] Downloading: https://repo.maven.apache.org/maven2/com/google/http-client/google-http-client/1.22.0/google-http-client-1.22.0.pom
2017-07-12T18:07:06.887 [INFO] Downloaded: https://repo.maven.apache.org/maven2/com/google/http-client/google-http-client/1.22.0/google-http-client-1.22.0.pom (6 KB at 179.1 KB/sec)
2017-07-12T18:07:06.888 [INFO] Downloading: https://repo.maven.apache.org/maven2/com/google/http-client/google-http-client-parent/1.22.0/google-http-client-parent-1.22.0.pom
2017-07-12T18:07:06.917 [INFO] Downloaded: https://repo.maven.apache.org/maven2/com/google/http-client/google-http-client-parent/1.22.0/google-http-client-parent-1.22.0.pom (25 KB at 857.2 KB/sec)
2017-07-12T18:07:06.922 [INFO] Downloading: https://repo.maven.apache.org/maven2/org/apache/httpcomponents/httpclient/4.0.1/httpclient-4.0.1.pom
2017-07-12T18:07:06.948 [INFO] Downloaded: https://repo.maven.apache.org/maven2/org/apache/httpcomponents/httpclient/4.0.1/httpclient-4.0.1.pom (7 KB at 255.4 KB/sec)
2017-07-12T18:07:06.950 [INFO] Downloading: https://repo.maven.apache.org/maven2/org/apache/httpcomponents/httpcomponents-client/4.0.1/httpcomponents-client-4.0.1.pom
2017-07-12T18:07:06.976 [INFO] Downloaded: https://repo.maven.apache.org/maven2/org/apache/httpcomponents/httpcomponents-client/4.0.1/httpcomponents-client-4.0.1.pom (9 KB at 332.5 KB/sec)
2017-07-12T18:07:06.978 [INFO] Downloading: https://repo.maven.apache.org/maven2/com/google/http-client/google-http-client-jackson2/1.22.0/google-http-client-jackson2-1.22.0.pom
2017-07-12T18:07:07.004 [INFO] Downloaded: https://repo.maven.apache.org/maven2/com/google/http-client/google-http-client-jackson2/1.22.0/google-http-client-jackson2-1.22.0.pom (3 KB at 103.3 KB/sec)
2017-07-12T18:07:07.014 [INFO] Downloading: https://repo.maven.apache.org/maven2/org/apache/flink/flink-test-utils_2.10/1.3.0/flink-test-utils_2.10-1.3.0.pom
2017-07-12T18:07:07.040 [INFO] Downloaded: https://repo.maven.apache.org/maven2/org/apache/flink/flink-test-utils_2.10/1.3.0/flink-test-utils_2.10-1.3.0.pom (5 KB at 178.1 KB/sec)
2017-07-12T18:07:07.041 [INFO] Downloading: https://repo.maven.apache.org/maven2/org/apache/flink/flink-test-utils-parent/1.3.0/flink-test-utils-parent-1.3.0.pom
2017-07-12T18:07:07.068 [INFO] Downloaded: https://repo.maven.apache.org/maven2/org/apache/flink/flink-test-utils-parent/1.3.0/flink-test-utils-parent-1.3.0.pom (2 KB at 52.1 KB/sec)
2017-07-12T18:07:07.071 [INFO] Downloading: https://repo.maven.apache.org/maven2/org/apache/flink/flink-test-utils-junit/1.3.0/flink-test-utils-junit-1.3.0.pom
2017-07-12T18:07:07.099 [INFO] Downloaded: https://repo.maven.apache.org/maven2/org/apache/flink/flink-test-utils-junit/1.3.0/flink-test-utils-junit-1.3.0.pom (4 KB at 114.6 KB/sec)
2017-07-12T18:07:07.103 [INFO] Downloading: https://repo.maven.apache.org/maven2/org/apache/curator/curator-test/2.12.0/curator-test-2.12.0.pom
2017-07-12T18:07:07.132 [INFO] Downloaded: https://repo.maven.apache.org/maven2/org/apache/curator/curator-test/2.12.0/curator-test-2.12.0.pom (5 KB at 139.6 KB/sec)
2017-07-12T18:07:07.133 [INFO] Downloading: https://repo.maven.apache.org/maven2/org/apache/curator/apache-curator/2.12.0/apache-curator-2.12.0.pom
2017-07-12T18:07:07.161 [INFO] Downloaded: https://repo.maven.apache.org/maven2/org/apache/curator/apache-curator/2.12.0/apache-curator-2.12.0.pom (32 KB at 1127.5 KB/sec)
2017-07-12T18:07:07.164 [INFO] Downloading: https://repo.maven.apache.org/maven2/org/apache/zookeeper/zookeeper/3.4.8/zookeeper-3.4.8.pom
2017-07-12T18:07:07.189 [INFO] Downloaded: https://repo.maven.apache.org/maven2/org/apache/zookeeper/zookeeper/3.4.8/zookeeper-3.4.8.pom (4 KB at 157.2 KB/sec)
2017-07-12T18:07:07.190 [INFO] Downloading: https://repo.maven.apache.org/maven2/log4j/log4j/1.2.16/log4j-1.2.16.pom
2017-07-12T18:07:07.219 [INFO] Downloaded: https://repo.maven.apache.org/maven2/log4j/log4j/1.2.16/log4j-1.2.16.pom (20 KB at 684.9 KB/sec)
2017-07-12T18:07:07.222 [INFO] Downloading: https://repo.maven.apache.org/maven2/org/javassist/javassist/3.18.1-GA/javassist-3.18.1-GA.pom
2017-07-12T18:07:07.248 [INFO] Downloaded: https://repo.maven.apache.org/maven2/org/javassist/javassist/3.18.1-GA/javassist-3.18.1-GA.pom (10 KB at 357.6 KB/sec)
[JENKINS] Archiving disabled
[JENKINS] Archiving disabled
[JENKINS] Archiving disabled
[JENKINS] Archiving disabled
[JENKINS] Archiving disabled
[JENKINS] Archiving disabled
[JENKINS] Archiving disabled
[JENKINS] Archiving disabled
[JENKINS] Archiving disabled
[JENKINS] Archiving disabled
[JENKINS] Archiving disabled
[JENKINS] Archiving disabled
[JENKINS] Archiving disabled
2017-07-12T18:07:11.829 [INFO] ------------------------------------------------------------------------
2017-07-12T18:07:11.829 [INFO] Reactor Summary:
2017-07-12T18:07:11.829 [INFO] 
2017-07-12T18:07:11.829 [INFO] Apache Beam :: Parent .............................. SUCCESS [ 23.945 s]
2017-07-12T18:07:11.830 [INFO] Apache Beam :: SDKs :: Java :: Build Tools ......... SUCCESS [ 10.923 s]
2017-07-12T18:07:11.830 [INFO] Apache Beam :: SDKs ................................ SUCCESS [  1.636 s]
2017-07-12T18:07:11.830 [INFO] Apache Beam :: SDKs :: Common ...................... SUCCESS [  1.306 s]
2017-07-12T18:07:11.830 [INFO] Apache Beam :: SDKs :: Common :: Runner API ........ SUCCESS [ 10.816 s]
2017-07-12T18:07:11.830 [INFO] Apache Beam :: SDKs :: Common :: Fn API ............ SUCCESS [  7.557 s]
2017-07-12T18:07:11.830 [INFO] Apache Beam :: SDKs :: Java ........................ SUCCESS [  4.202 s]
2017-07-12T18:07:11.830 [INFO] Apache Beam :: SDKs :: Java :: Core ................ SUCCESS [02:17 min]
2017-07-12T18:07:11.830 [INFO] Apache Beam :: Runners ............................. SUCCESS [  3.160 s]
2017-07-12T18:07:11.830 [INFO] Apache Beam :: Runners :: Core Construction Java ... SUCCESS [ 17.403 s]
2017-07-12T18:07:11.830 [INFO] Apache Beam :: Runners :: Core Java ................ SUCCESS [ 38.190 s]
2017-07-12T18:07:11.830 [INFO] Apache Beam :: Runners :: Flink .................... FAILURE [  3.020 s]
2017-07-12T18:07:11.830 [INFO] ------------------------------------------------------------------------
2017-07-12T18:07:11.830 [INFO] BUILD FAILURE
2017-07-12T18:07:11.830 [INFO] ------------------------------------------------------------------------
2017-07-12T18:07:11.830 [INFO] Total time: 05:13 min
2017-07-12T18:07:11.830 [INFO] Finished at: 2017-07-12T18:07:11+00:00
2017-07-12T18:07:12.896 [INFO] Final Memory: 117M/1470M
2017-07-12T18:07:12.897 [INFO] ------------------------------------------------------------------------
2017-07-12T18:07:12.898 [WARNING] The requested profile "validates-runner-tests" could not be activated because it does not exist.
2017-07-12T18:07:12.905 [ERROR] Failed to execute goal on project beam-runners-flink_2.10: Could not resolve dependencies for project org.apache.beam:beam-runners-flink_2.10:jar:2.2.0-SNAPSHOT: Failed to collect dependencies at org.apache.flink:flink-clients_2.10:jar:1.3.0: Failed to read artifact descriptor for org.apache.flink:flink-clients_2.10:jar:1.3.0: Could not transfer artifact org.apache.flink:flink-clients_2.10:pom:1.3.0 from/to central (https://repo.maven.apache.org/maven2): Connection reset -> [Help 1]
org.apache.maven.lifecycle.LifecycleExecutionException: Failed to execute goal on project beam-runners-flink_2.10: Could not resolve dependencies for project org.apache.beam:beam-runners-flink_2.10:jar:2.2.0-SNAPSHOT: Failed to collect dependencies at org.apache.flink:flink-clients_2.10:jar:1.3.0
	at org.apache.maven.lifecycle.internal.LifecycleDependencyResolver.getDependencies(LifecycleDependencyResolver.java:221)
	at org.apache.maven.lifecycle.internal.LifecycleDependencyResolver.resolveProjectDependencies(LifecycleDependencyResolver.java:127)
	at org.apache.maven.lifecycle.internal.MojoExecutor.ensureDependenciesAreResolved(MojoExecutor.java:257)
	at org.apache.maven.lifecycle.internal.MojoExecutor.execute(MojoExecutor.java:200)
	at org.apache.maven.lifecycle.internal.MojoExecutor.execute(MojoExecutor.java:153)
	at org.apache.maven.lifecycle.internal.MojoExecutor.execute(MojoExecutor.java:145)
	at org.apache.maven.lifecycle.internal.LifecycleModuleBuilder.buildProject(LifecycleModuleBuilder.java:116)
	at org.apache.maven.lifecycle.internal.LifecycleModuleBuilder.buildProject(LifecycleModuleBuilder.java:80)
	at org.apache.maven.lifecycle.internal.builder.singlethreaded.SingleThreadedBuilder.build(SingleThreadedBuilder.java:51)
	at org.apache.maven.lifecycle.internal.LifecycleStarter.execute(LifecycleStarter.java:128)
	at org.apache.maven.DefaultMaven.doExecute(DefaultMaven.java:307)
	at org.apache.maven.DefaultMaven.doExecute(DefaultMaven.java:193)
	at org.apache.maven.DefaultMaven.execute(DefaultMaven.java:106)
	at org.jvnet.hudson.maven3.launcher.Maven33Launcher.main(Maven33Launcher.java:129)
	at sun.reflect.NativeMethodAccessorImpl.invoke0(Native Method)
	at sun.reflect.NativeMethodAccessorImpl.invoke(NativeMethodAccessorImpl.java:62)
	at sun.reflect.DelegatingMethodAccessorImpl.invoke(DelegatingMethodAccessorImpl.java:43)
	at java.lang.reflect.Method.invoke(Method.java:498)
	at org.codehaus.plexus.classworlds.launcher.Launcher.launchStandard(Launcher.java:330)
	at org.codehaus.plexus.classworlds.launcher.Launcher.launch(Launcher.java:238)
	at jenkins.maven3.agent.Maven33Main.launch(Maven33Main.java:176)
	at sun.reflect.NativeMethodAccessorImpl.invoke0(Native Method)
	at sun.reflect.NativeMethodAccessorImpl.invoke(NativeMethodAccessorImpl.java:62)
	at sun.reflect.DelegatingMethodAccessorImpl.invoke(DelegatingMethodAccessorImpl.java:43)
	at java.lang.reflect.Method.invoke(Method.java:498)
	at hudson.maven.Maven3Builder.call(Maven3Builder.java:139)
	at hudson.maven.Maven3Builder.call(Maven3Builder.java:70)
	at hudson.remoting.UserRequest.perform(UserRequest.java:153)
	at hudson.remoting.UserRequest.perform(UserRequest.java:50)
	at hudson.remoting.Request$2.run(Request.java:336)
	at hudson.remoting.InterceptingExecutorService$1.call(InterceptingExecutorService.java:68)
	at java.util.concurrent.FutureTask.run(FutureTask.java:266)
	at java.util.concurrent.ThreadPoolExecutor.runWorker(ThreadPoolExecutor.java:1142)
	at java.util.concurrent.ThreadPoolExecutor$Worker.run(ThreadPoolExecutor.java:617)
	at java.lang.Thread.run(Thread.java:748)
Caused by: org.apache.maven.project.DependencyResolutionException: Could not resolve dependencies for project org.apache.beam:beam-runners-flink_2.10:jar:2.2.0-SNAPSHOT: Failed to collect dependencies at org.apache.flink:flink-clients_2.10:jar:1.3.0
	at org.apache.maven.project.DefaultProjectDependenciesResolver.resolve(DefaultProjectDependenciesResolver.java:180)
	at org.apache.maven.lifecycle.internal.LifecycleDependencyResolver.getDependencies(LifecycleDependencyResolver.java:195)
	... 34 more
Caused by: org.eclipse.aether.collection.DependencyCollectionException: Failed to collect dependencies at org.apache.flink:flink-clients_2.10:jar:1.3.0
	at org.eclipse.aether.internal.impl.DefaultDependencyCollector.collectDependencies(DefaultDependencyCollector.java:291)
	at org.eclipse.aether.internal.impl.DefaultRepositorySystem.collectDependencies(DefaultRepositorySystem.java:316)
	at org.apache.maven.project.DefaultProjectDependenciesResolver.resolve(DefaultProjectDependenciesResolver.java:172)
	... 35 more
Caused by: org.eclipse.aether.resolution.ArtifactDescriptorException: Failed to read artifact descriptor for org.apache.flink:flink-clients_2.10:jar:1.3.0
	at org.apache.maven.repository.internal.DefaultArtifactDescriptorReader.loadPom(DefaultArtifactDescriptorReader.java:302)
	at org.apache.maven.repository.internal.DefaultArtifactDescriptorReader.readArtifactDescriptor(DefaultArtifactDescriptorReader.java:218)
	at org.eclipse.aether.internal.impl.DefaultDependencyCollector.resolveCachedArtifactDescriptor(DefaultDependencyCollector.java:535)
	at org.eclipse.aether.internal.impl.DefaultDependencyCollector.getArtifactDescriptorResult(DefaultDependencyCollector.java:519)
	at org.eclipse.aether.internal.impl.DefaultDependencyCollector.processDependency(DefaultDependencyCollector.java:409)
	at org.eclipse.aether.internal.impl.DefaultDependencyCollector.processDependency(DefaultDependencyCollector.java:363)
	at org.eclipse.aether.internal.impl.DefaultDependencyCollector.process(DefaultDependencyCollector.java:351)
	at org.eclipse.aether.internal.impl.DefaultDependencyCollector.collectDependencies(DefaultDependencyCollector.java:254)
	... 37 more
Caused by: org.eclipse.aether.resolution.ArtifactResolutionException: Could not transfer artifact org.apache.flink:flink-clients_2.10:pom:1.3.0 from/to central (https://repo.maven.apache.org/maven2): Connection reset
	at org.eclipse.aether.internal.impl.DefaultArtifactResolver.resolve(DefaultArtifactResolver.java:444)
	at org.eclipse.aether.internal.impl.DefaultArtifactResolver.resolveArtifacts(DefaultArtifactResolver.java:246)
	at org.eclipse.aether.internal.impl.DefaultArtifactResolver.resolveArtifact(DefaultArtifactResolver.java:223)
	at org.apache.maven.repository.internal.DefaultArtifactDescriptorReader.loadPom(DefaultArtifactDescriptorReader.java:287)
	... 44 more
Caused by: org.eclipse.aether.transfer.ArtifactTransferException: Could not transfer artifact org.apache.flink:flink-clients_2.10:pom:1.3.0 from/to central (https://repo.maven.apache.org/maven2): Connection reset
	at org.eclipse.aether.connector.basic.ArtifactTransportListener.transferFailed(ArtifactTransportListener.java:43)
	at org.eclipse.aether.connector.basic.BasicRepositoryConnector$TaskRunner.run(BasicRepositoryConnector.java:355)
	at org.eclipse.aether.util.concurrency.RunnableErrorForwarder$1.run(RunnableErrorForwarder.java:67)
	at org.eclipse.aether.connector.basic.BasicRepositoryConnector$DirectExecutor.execute(BasicRepositoryConnector.java:581)
	at org.eclipse.aether.connector.basic.BasicRepositoryConnector.get(BasicRepositoryConnector.java:249)
	at org.eclipse.aether.internal.impl.DefaultArtifactResolver.performDownloads(DefaultArtifactResolver.java:520)
	at org.eclipse.aether.internal.impl.DefaultArtifactResolver.resolve(DefaultArtifactResolver.java:421)
	... 47 more
Caused by: org.apache.maven.wagon.TransferFailedException: Connection reset
	at org.apache.maven.wagon.providers.http.AbstractHttpClientWagon.fillInputData(AbstractHttpClientWagon.java:1066)
	at org.apache.maven.wagon.providers.http.AbstractHttpClientWagon.fillInputData(AbstractHttpClientWagon.java:960)
	at org.apache.maven.wagon.StreamWagon.getInputStream(StreamWagon.java:116)
	at org.apache.maven.wagon.StreamWagon.getIfNewer(StreamWagon.java:88)
	at org.apache.maven.wagon.StreamWagon.get(StreamWagon.java:61)
	at org.eclipse.aether.transport.wagon.WagonTransporter$GetTaskRunner.run(WagonTransporter.java:560)
	at org.eclipse.aether.transport.wagon.WagonTransporter.execute(WagonTransporter.java:427)
	at org.eclipse.aether.transport.wagon.WagonTransporter.get(WagonTransporter.java:404)
	at org.eclipse.aether.connector.basic.BasicRepositoryConnector$GetTaskRunner.runTask(BasicRepositoryConnector.java:447)
	at org.eclipse.aether.connector.basic.BasicRepositoryConnector$TaskRunner.run(BasicRepositoryConnector.java:350)
	... 52 more
Caused by: java.net.SocketException: Connection reset
	at java.net.SocketInputStream.read(SocketInputStream.java:210)
	at java.net.SocketInputStream.read(SocketInputStream.java:141)
	at sun.security.ssl.InputRecord.readFully(InputRecord.java:465)
	at sun.security.ssl.InputRecord.read(InputRecord.java:503)
	at sun.security.ssl.SSLSocketImpl.readRecord(SSLSocketImpl.java:973)
	at sun.security.ssl.SSLSocketImpl.readDataRecord(SSLSocketImpl.java:930)
	at sun.security.ssl.AppInputStream.read(AppInputStream.java:105)
	at org.apache.maven.wagon.providers.http.httpclient.impl.io.SessionInputBufferImpl.streamRead(SessionInputBufferImpl.java:136)
	at org.apache.maven.wagon.providers.http.httpclient.impl.io.SessionInputBufferImpl.fillBuffer(SessionInputBufferImpl.java:152)
	at org.apache.maven.wagon.providers.http.httpclient.impl.io.SessionInputBufferImpl.readLine(SessionInputBufferImpl.java:270)
	at org.apache.maven.wagon.providers.http.httpclient.impl.conn.DefaultHttpResponseParser.parseHead(DefaultHttpResponseParser.java:140)
	at org.apache.maven.wagon.providers.http.httpclient.impl.conn.DefaultHttpResponseParser.parseHead(DefaultHttpResponseParser.java:57)
	at org.apache.maven.wagon.providers.http.httpclient.impl.io.AbstractMessageParser.parse(AbstractMessageParser.java:260)
	at org.apache.maven.wagon.providers.http.httpclient.impl.DefaultBHttpClientConnection.receiveResponseHeader(DefaultBHttpClientConnection.java:161)
	at org.apache.maven.wagon.providers.http.httpclient.impl.conn.CPoolProxy.receiveResponseHeader(CPoolProxy.java:153)
	at org.apache.maven.wagon.providers.http.httpclient.protocol.HttpRequestExecutor.doReceiveResponse(HttpRequestExecutor.java:271)
	at org.apache.maven.wagon.providers.http.httpclient.protocol.HttpRequestExecutor.execute(HttpRequestExecutor.java:123)
	at org.apache.maven.wagon.providers.http.httpclient.impl.execchain.MainClientExec.execute(MainClientExec.java:254)
	at org.apache.maven.wagon.providers.http.httpclient.impl.execchain.ProtocolExec.execute(ProtocolExec.java:195)
	at org.apache.maven.wagon.providers.http.httpclient.impl.execchain.RetryExec.execute(RetryExec.java:86)
	at org.apache.maven.wagon.providers.http.httpclient.impl.execchain.RedirectExec.execute(RedirectExec.java:108)
	at org.apache.maven.wagon.providers.http.httpclient.impl.client.InternalHttpClient.doExecute(InternalHttpClient.java:184)
	at org.apache.maven.wagon.providers.http.httpclient.impl.client.CloseableHttpClient.execute(CloseableHttpClient.java:82)
	at org.apache.maven.wagon.providers.http.AbstractHttpClientWagon.execute(AbstractHttpClientWagon.java:832)
	at org.apache.maven.wagon.providers.http.AbstractHttpClientWagon.fillInputData(AbstractHttpClientWagon.java:983)
	... 61 more
2017-07-12T18:07:12.925 [ERROR] 
2017-07-12T18:07:12.926 [ERROR] Re-run Maven using the -X switch to enable full debug logging.
2017-07-12T18:07:12.926 [ERROR] 
2017-07-12T18:07:12.926 [ERROR] For more information about the errors and possible solutions, please read the following articles:
2017-07-12T18:07:12.926 [ERROR] [Help 1] http://cwiki.apache.org/confluence/display/MAVEN/DependencyResolutionException
2017-07-12T18:07:12.927 [ERROR] 
2017-07-12T18:07:12.927 [ERROR] After correcting the problems, you can resume the build with the command
2017-07-12T18:07:12.927 [ERROR]   mvn <goals> -rf :beam-runners-flink_2.10
channel stopped

Jenkins build is unstable: beam_PostCommit_Java_ValidatesRunner_Flink #3410

Posted by Apache Jenkins Server <je...@builds.apache.org>.
See <https://builds.apache.org/job/beam_PostCommit_Java_ValidatesRunner_Flink/3410/display/redirect>


Build failed in Jenkins: beam_PostCommit_Java_ValidatesRunner_Flink #3409

Posted by Apache Jenkins Server <je...@builds.apache.org>.
See <https://builds.apache.org/job/beam_PostCommit_Java_ValidatesRunner_Flink/3409/display/redirect>

------------------------------------------
[...truncated 219.00 KB...]
2017-07-16T13:04:20.180 [INFO] Downloading: https://repo.maven.apache.org/maven2/org/apache/maven/plugins/maven-checkstyle-plugin/2.17/maven-checkstyle-plugin-2.17.jar
2017-07-16T13:04:20.237 [INFO] Downloaded: https://repo.maven.apache.org/maven2/org/apache/maven/plugins/maven-checkstyle-plugin/2.17/maven-checkstyle-plugin-2.17.jar (107 KB at 1860.1 KB/sec)
2017-07-16T13:04:20.245 [INFO] Downloading: https://repo.maven.apache.org/maven2/org/apache/maven/plugins/maven-surefire-plugin/2.20/maven-surefire-plugin-2.20.pom
2017-07-16T13:04:20.282 [INFO] Downloaded: https://repo.maven.apache.org/maven2/org/apache/maven/plugins/maven-surefire-plugin/2.20/maven-surefire-plugin-2.20.pom (7 KB at 171.0 KB/sec)
2017-07-16T13:04:20.283 [INFO] Downloading: https://repo.maven.apache.org/maven2/org/apache/maven/surefire/surefire/2.20/surefire-2.20.pom
2017-07-16T13:04:20.312 [INFO] Downloaded: https://repo.maven.apache.org/maven2/org/apache/maven/surefire/surefire/2.20/surefire-2.20.pom (21 KB at 700.5 KB/sec)
2017-07-16T13:04:20.316 [INFO] Downloading: https://repo.maven.apache.org/maven2/org/apache/maven/plugins/maven-surefire-plugin/2.20/maven-surefire-plugin-2.20.jar
2017-07-16T13:04:20.351 [INFO] Downloaded: https://repo.maven.apache.org/maven2/org/apache/maven/plugins/maven-surefire-plugin/2.20/maven-surefire-plugin-2.20.jar (52 KB at 1528.7 KB/sec)
2017-07-16T13:04:20.362 [INFO] 
2017-07-16T13:04:20.362 [INFO] --- maven-clean-plugin:3.0.0:clean (default-clean) @ beam-sdks-java-build-tools ---
2017-07-16T13:04:20.366 [INFO] Deleting <https://builds.apache.org/job/beam_PostCommit_Java_ValidatesRunner_Flink/ws/sdks/java/build-tools> (includes = [**/*.pyc, **/*.egg-info/, **/sdks/python/LICENSE, **/sdks/python/NOTICE, **/sdks/python/README.md], excludes = [])
2017-07-16T13:04:20.478 [INFO] 
2017-07-16T13:04:20.478 [INFO] --- maven-enforcer-plugin:1.4.1:enforce (enforce) @ beam-sdks-java-build-tools ---
2017-07-16T13:04:20.589 [INFO] 
2017-07-16T13:04:20.589 [INFO] --- maven-enforcer-plugin:1.4.1:enforce (enforce-banned-dependencies) @ beam-sdks-java-build-tools ---
2017-07-16T13:04:20.700 [INFO] 
2017-07-16T13:04:20.700 [INFO] --- maven-remote-resources-plugin:1.5:process (process-resource-bundles) @ beam-sdks-java-build-tools ---
2017-07-16T13:04:20.824 [INFO] 
2017-07-16T13:04:20.824 [INFO] --- maven-resources-plugin:3.0.2:resources (default-resources) @ beam-sdks-java-build-tools ---
2017-07-16T13:04:20.826 [INFO] Using 'UTF-8' encoding to copy filtered resources.
2017-07-16T13:04:20.827 [INFO] Copying 4 resources
2017-07-16T13:04:20.829 [INFO] Copying 3 resources
2017-07-16T13:04:20.937 [INFO] 
2017-07-16T13:04:20.937 [INFO] --- maven-compiler-plugin:3.6.1:compile (default-compile) @ beam-sdks-java-build-tools ---
2017-07-16T13:04:20.943 [INFO] Downloading: https://repo.maven.apache.org/maven2/org/apache/maven/shared/maven-shared-incremental/1.1/maven-shared-incremental-1.1.pom
2017-07-16T13:04:20.973 [INFO] Downloaded: https://repo.maven.apache.org/maven2/org/apache/maven/shared/maven-shared-incremental/1.1/maven-shared-incremental-1.1.pom (5 KB at 154.4 KB/sec)
2017-07-16T13:04:20.978 [INFO] Downloading: https://repo.maven.apache.org/maven2/org/apache/maven/shared/maven-shared-utils/0.1/maven-shared-utils-0.1.pom
2017-07-16T13:04:21.006 [INFO] Downloaded: https://repo.maven.apache.org/maven2/org/apache/maven/shared/maven-shared-utils/0.1/maven-shared-utils-0.1.pom (4 KB at 141.1 KB/sec)
2017-07-16T13:04:21.009 [INFO] Downloading: https://repo.maven.apache.org/maven2/org/ow2/asm/asm/6.0_ALPHA/asm-6.0_ALPHA.pom
2017-07-16T13:04:21.036 [INFO] Downloaded: https://repo.maven.apache.org/maven2/org/ow2/asm/asm/6.0_ALPHA/asm-6.0_ALPHA.pom (2 KB at 70.1 KB/sec)
2017-07-16T13:04:21.038 [INFO] Downloading: https://repo.maven.apache.org/maven2/org/ow2/asm/asm-parent/6.0_ALPHA/asm-parent-6.0_ALPHA.pom
2017-07-16T13:04:21.065 [INFO] Downloaded: https://repo.maven.apache.org/maven2/org/ow2/asm/asm-parent/6.0_ALPHA/asm-parent-6.0_ALPHA.pom (6 KB at 198.9 KB/sec)
2017-07-16T13:04:21.068 [INFO] Downloading: https://repo.maven.apache.org/maven2/com/thoughtworks/qdox/qdox/2.0-M5/qdox-2.0-M5.pom
2017-07-16T13:04:21.098 [INFO] Downloaded: https://repo.maven.apache.org/maven2/com/thoughtworks/qdox/qdox/2.0-M5/qdox-2.0-M5.pom (16 KB at 507.5 KB/sec)
2017-07-16T13:04:21.100 [INFO] Downloading: https://repo.maven.apache.org/maven2/org/codehaus/plexus/plexus-compiler-api/2.8.1/plexus-compiler-api-2.8.1.pom
2017-07-16T13:04:21.127 [INFO] Downloaded: https://repo.maven.apache.org/maven2/org/codehaus/plexus/plexus-compiler-api/2.8.1/plexus-compiler-api-2.8.1.pom (893 B at 32.3 KB/sec)
2017-07-16T13:04:21.128 [INFO] Downloading: https://repo.maven.apache.org/maven2/org/codehaus/plexus/plexus-compiler/2.8.1/plexus-compiler-2.8.1.pom
2017-07-16T13:04:21.160 [INFO] Downloaded: https://repo.maven.apache.org/maven2/org/codehaus/plexus/plexus-compiler/2.8.1/plexus-compiler-2.8.1.pom (5 KB at 152.7 KB/sec)
2017-07-16T13:04:21.167 [INFO] Downloading: https://repo.maven.apache.org/maven2/org/codehaus/plexus/plexus-compiler-manager/2.8.1/plexus-compiler-manager-2.8.1.pom
2017-07-16T13:04:21.194 [INFO] Downloaded: https://repo.maven.apache.org/maven2/org/codehaus/plexus/plexus-compiler-manager/2.8.1/plexus-compiler-manager-2.8.1.pom (713 B at 25.8 KB/sec)
2017-07-16T13:04:21.198 [INFO] Downloading: https://repo.maven.apache.org/maven2/org/codehaus/plexus/plexus-compiler-javac/2.8.1/plexus-compiler-javac-2.8.1.pom
2017-07-16T13:04:21.226 [INFO] Downloaded: https://repo.maven.apache.org/maven2/org/codehaus/plexus/plexus-compiler-javac/2.8.1/plexus-compiler-javac-2.8.1.pom (794 B at 27.7 KB/sec)
2017-07-16T13:04:21.228 [INFO] Downloading: https://repo.maven.apache.org/maven2/org/codehaus/plexus/plexus-compilers/2.8.1/plexus-compilers-2.8.1.pom
2017-07-16T13:04:21.255 [INFO] Downloaded: https://repo.maven.apache.org/maven2/org/codehaus/plexus/plexus-compilers/2.8.1/plexus-compilers-2.8.1.pom (2 KB at 52.0 KB/sec)
2017-07-16T13:04:21.260 [INFO] Downloading: https://repo.maven.apache.org/maven2/org/apache/maven/shared/maven-shared-utils/3.1.0/maven-shared-utils-3.1.0.jar
2017-07-16T13:04:21.261 [INFO] Downloading: https://repo.maven.apache.org/maven2/org/apache/maven/shared/maven-shared-incremental/1.1/maven-shared-incremental-1.1.jar
2017-07-16T13:04:21.261 [INFO] Downloading: https://repo.maven.apache.org/maven2/org/ow2/asm/asm/6.0_ALPHA/asm-6.0_ALPHA.jar
2017-07-16T13:04:21.263 [INFO] Downloading: https://repo.maven.apache.org/maven2/com/thoughtworks/qdox/qdox/2.0-M5/qdox-2.0-M5.jar
2017-07-16T13:04:21.267 [INFO] Downloading: https://repo.maven.apache.org/maven2/org/codehaus/plexus/plexus-compiler-api/2.8.1/plexus-compiler-api-2.8.1.jar
2017-07-16T13:04:21.310 [INFO] Downloaded: https://repo.maven.apache.org/maven2/org/apache/maven/shared/maven-shared-incremental/1.1/maven-shared-incremental-1.1.jar (14 KB at 264.4 KB/sec)
2017-07-16T13:04:21.310 [INFO] Downloading: https://repo.maven.apache.org/maven2/org/codehaus/plexus/plexus-compiler-manager/2.8.1/plexus-compiler-manager-2.8.1.jar
2017-07-16T13:04:21.326 [INFO] Downloaded: https://repo.maven.apache.org/maven2/org/codehaus/plexus/plexus-compiler-api/2.8.1/plexus-compiler-api-2.8.1.jar (26 KB at 408.2 KB/sec)
2017-07-16T13:04:21.326 [INFO] Downloading: https://repo.maven.apache.org/maven2/org/codehaus/plexus/plexus-compiler-javac/2.8.1/plexus-compiler-javac-2.8.1.jar
2017-07-16T13:04:21.336 [INFO] Downloaded: https://repo.maven.apache.org/maven2/org/codehaus/plexus/plexus-compiler-manager/2.8.1/plexus-compiler-manager-2.8.1.jar (5 KB at 66.4 KB/sec)
2017-07-16T13:04:21.338 [INFO] Downloaded: https://repo.maven.apache.org/maven2/org/ow2/asm/asm/6.0_ALPHA/asm-6.0_ALPHA.jar (55 KB at 698.9 KB/sec)
2017-07-16T13:04:21.364 [INFO] Downloaded: https://repo.maven.apache.org/maven2/org/codehaus/plexus/plexus-compiler-javac/2.8.1/plexus-compiler-javac-2.8.1.jar (20 KB at 200.8 KB/sec)
2017-07-16T13:04:21.367 [INFO] Downloaded: https://repo.maven.apache.org/maven2/org/apache/maven/shared/maven-shared-utils/3.1.0/maven-shared-utils-3.1.0.jar (160 KB at 1480.1 KB/sec)
2017-07-16T13:04:21.393 [INFO] Downloaded: https://repo.maven.apache.org/maven2/com/thoughtworks/qdox/qdox/2.0-M5/qdox-2.0-M5.jar (307 KB at 2318.9 KB/sec)
2017-07-16T13:04:21.469 [INFO] No sources to compile
2017-07-16T13:04:21.577 [INFO] 
2017-07-16T13:04:21.577 [INFO] --- formatter-maven-plugin:2.0.1:format (test-code-style) @ beam-sdks-java-build-tools ---
2017-07-16T13:04:21.582 [INFO] Downloading: https://repo.maven.apache.org/maven2/com/google/guava/guava/20.0/guava-20.0.pom
2017-07-16T13:04:21.621 [INFO] Downloaded: https://repo.maven.apache.org/maven2/com/google/guava/guava/20.0/guava-20.0.pom (7 KB at 171.2 KB/sec)
2017-07-16T13:04:21.624 [INFO] Downloading: https://repo.maven.apache.org/maven2/com/google/guava/guava-parent/20.0/guava-parent-20.0.pom
2017-07-16T13:04:21.652 [INFO] Downloaded: https://repo.maven.apache.org/maven2/com/google/guava/guava-parent/20.0/guava-parent-20.0.pom (10 KB at 345.1 KB/sec)
2017-07-16T13:04:21.656 [INFO] Downloading: https://repo.maven.apache.org/maven2/net/revelc/code/formatter/jdt-core/2.0.1/jdt-core-2.0.1.pom
2017-07-16T13:04:21.682 [INFO] Downloaded: https://repo.maven.apache.org/maven2/net/revelc/code/formatter/jdt-core/2.0.1/jdt-core-2.0.1.pom (2 KB at 46.8 KB/sec)
2017-07-16T13:04:21.684 [INFO] Downloading: https://repo.maven.apache.org/maven2/net/revelc/code/formatter/formatters/2.0.1/formatters-2.0.1.pom
2017-07-16T13:04:21.722 [INFO] Downloaded: https://repo.maven.apache.org/maven2/net/revelc/code/formatter/formatters/2.0.1/formatters-2.0.1.pom (4 KB at 98.1 KB/sec)
2017-07-16T13:04:21.727 [INFO] Downloading: https://repo.maven.apache.org/maven2/net/revelc/code/formatter/jsdt-core/2.0.1/jsdt-core-2.0.1.pom
2017-07-16T13:04:21.755 [INFO] Downloaded: https://repo.maven.apache.org/maven2/net/revelc/code/formatter/jsdt-core/2.0.1/jsdt-core-2.0.1.pom (2 KB at 43.5 KB/sec)
2017-07-16T13:04:21.760 [INFO] Downloading: https://repo.maven.apache.org/maven2/org/apache/commons/commons-digester3/3.2/commons-digester3-3.2.pom
2017-07-16T13:04:21.792 [INFO] Downloaded: https://repo.maven.apache.org/maven2/org/apache/commons/commons-digester3/3.2/commons-digester3-3.2.pom (18 KB at 554.1 KB/sec)
2017-07-16T13:04:21.797 [INFO] Downloading: https://repo.maven.apache.org/maven2/cglib/cglib/2.2.2/cglib-2.2.2.pom
2017-07-16T13:04:21.834 [INFO] Downloaded: https://repo.maven.apache.org/maven2/cglib/cglib/2.2.2/cglib-2.2.2.pom (2 KB at 38.9 KB/sec)
2017-07-16T13:04:21.836 [INFO] Downloading: https://repo.maven.apache.org/maven2/asm/asm/3.3.1/asm-3.3.1.pom
2017-07-16T13:04:21.862 [INFO] Downloaded: https://repo.maven.apache.org/maven2/asm/asm/3.3.1/asm-3.3.1.pom (266 B at 10.0 KB/sec)
2017-07-16T13:04:21.864 [INFO] Downloading: https://repo.maven.apache.org/maven2/asm/asm-parent/3.3.1/asm-parent-3.3.1.pom
2017-07-16T13:04:21.890 [INFO] Downloaded: https://repo.maven.apache.org/maven2/asm/asm-parent/3.3.1/asm-parent-3.3.1.pom (5 KB at 162.7 KB/sec)
2017-07-16T13:04:21.892 [INFO] Downloading: https://repo.maven.apache.org/maven2/commons-beanutils/commons-beanutils/1.8.3/commons-beanutils-1.8.3.pom
2017-07-16T13:04:21.918 [INFO] Downloaded: https://repo.maven.apache.org/maven2/commons-beanutils/commons-beanutils/1.8.3/commons-beanutils-1.8.3.pom (11 KB at 420.6 KB/sec)
2017-07-16T13:04:21.920 [INFO] Downloading: https://repo.maven.apache.org/maven2/org/apache/commons/commons-parent/14/commons-parent-14.pom
2017-07-16T13:04:21.948 [INFO] Downloaded: https://repo.maven.apache.org/maven2/org/apache/commons/commons-parent/14/commons-parent-14.pom (31 KB at 1094.8 KB/sec)
2017-07-16T13:04:21.960 [INFO] Downloading: https://repo.maven.apache.org/maven2/org/apache/maven/plugin-tools/maven-plugin-annotations/3.5/maven-plugin-annotations-3.5.pom
2017-07-16T13:04:21.991 [INFO] Downloaded: https://repo.maven.apache.org/maven2/org/apache/maven/plugin-tools/maven-plugin-annotations/3.5/maven-plugin-annotations-3.5.pom (2 KB at 52.6 KB/sec)
2017-07-16T13:04:21.993 [INFO] Downloading: https://repo.maven.apache.org/maven2/org/apache/maven/plugin-tools/maven-plugin-tools/3.5/maven-plugin-tools-3.5.pom
2017-07-16T13:04:22.023 [INFO] Downloaded: https://repo.maven.apache.org/maven2/org/apache/maven/plugin-tools/maven-plugin-tools/3.5/maven-plugin-tools-3.5.pom (16 KB at 545.2 KB/sec)
2017-07-16T13:04:22.028 [INFO] Downloading: https://repo.maven.apache.org/maven2/org/codehaus/plexus/plexus-resources/1.0.1/plexus-resources-1.0.1.pom
2017-07-16T13:04:22.054 [INFO] Downloaded: https://repo.maven.apache.org/maven2/org/codehaus/plexus/plexus-resources/1.0.1/plexus-resources-1.0.1.pom (2 KB at 49.5 KB/sec)
2017-07-16T13:04:22.058 [INFO] Downloading: https://repo.maven.apache.org/maven2/org/codehaus/plexus/plexus-utils/3.0.8/plexus-utils-3.0.8.pom
2017-07-16T13:04:22.085 [INFO] Downloaded: https://repo.maven.apache.org/maven2/org/codehaus/plexus/plexus-utils/3.0.8/plexus-utils-3.0.8.pom (4 KB at 113.6 KB/sec)
2017-07-16T13:04:22.090 [INFO] Downloading: https://repo.maven.apache.org/maven2/com/google/guava/guava/20.0/guava-20.0.jar
2017-07-16T13:04:22.095 [INFO] Downloading: https://repo.maven.apache.org/maven2/net/revelc/code/formatter/jdt-core/2.0.1/jdt-core-2.0.1.jar
2017-07-16T13:04:22.096 [INFO] Downloading: https://repo.maven.apache.org/maven2/net/revelc/code/formatter/jsdt-core/2.0.1/jsdt-core-2.0.1.jar
2017-07-16T13:04:22.096 [INFO] Downloading: https://repo.maven.apache.org/maven2/org/apache/commons/commons-digester3/3.2/commons-digester3-3.2.jar
2017-07-16T13:04:22.097 [INFO] Downloading: https://repo.maven.apache.org/maven2/cglib/cglib/2.2.2/cglib-2.2.2.jar
2017-07-16T13:04:22.234 [INFO] Downloaded: https://repo.maven.apache.org/maven2/org/apache/commons/commons-digester3/3.2/commons-digester3-3.2.jar (236 KB at 1722.3 KB/sec)
2017-07-16T13:04:22.234 [INFO] Downloading: https://repo.maven.apache.org/maven2/asm/asm/3.3.1/asm-3.3.1.jar
2017-07-16T13:04:22.242 [INFO] Downloaded: https://repo.maven.apache.org/maven2/cglib/cglib/2.2.2/cglib-2.2.2.jar (281 KB at 1921.0 KB/sec)
2017-07-16T13:04:22.242 [INFO] Downloading: https://repo.maven.apache.org/maven2/commons-beanutils/commons-beanutils/1.8.3/commons-beanutils-1.8.3.jar
[INFO] I/O exception (java.net.SocketException) caught when processing request to {s}->https://repo.maven.apache.org:443: Connection reset
[INFO] Retrying request to {s}->https://repo.maven.apache.org:443
2017-07-16T13:04:22.368 [INFO] Downloading: https://repo.maven.apache.org/maven2/commons-logging/commons-logging/1.1.1/commons-logging-1.1.1.jar
2017-07-16T13:04:22.379 [INFO] Downloaded: https://repo.maven.apache.org/maven2/commons-beanutils/commons-beanutils/1.8.3/commons-beanutils-1.8.3.jar (227 KB at 803.5 KB/sec)
2017-07-16T13:04:22.380 [INFO] Downloading: https://repo.maven.apache.org/maven2/org/apache/maven/plugin-tools/maven-plugin-annotations/3.5/maven-plugin-annotations-3.5.jar
2017-07-16T13:04:22.410 [INFO] Downloaded: https://repo.maven.apache.org/maven2/org/apache/maven/plugin-tools/maven-plugin-annotations/3.5/maven-plugin-annotations-3.5.jar (14 KB at 44.8 KB/sec)
2017-07-16T13:04:22.410 [INFO] Downloading: https://repo.maven.apache.org/maven2/commons-io/commons-io/2.2/commons-io-2.2.jar
2017-07-16T13:04:22.432 [INFO] Downloaded: https://repo.maven.apache.org/maven2/asm/asm/3.3.1/asm-3.3.1.jar (43 KB at 127.0 KB/sec)
2017-07-16T13:04:22.432 [INFO] Downloading: https://repo.maven.apache.org/maven2/org/codehaus/plexus/plexus-resources/1.0.1/plexus-resources-1.0.1.jar
2017-07-16T13:04:22.463 [INFO] Downloaded: https://repo.maven.apache.org/maven2/org/codehaus/plexus/plexus-resources/1.0.1/plexus-resources-1.0.1.jar (22 KB at 58.4 KB/sec)
2017-07-16T13:04:22.463 [INFO] Downloading: https://repo.maven.apache.org/maven2/classworlds/classworlds/1.1-alpha-2/classworlds-1.1-alpha-2.jar
2017-07-16T13:04:22.464 [INFO] Downloaded: https://repo.maven.apache.org/maven2/commons-logging/commons-logging/1.1.1/commons-logging-1.1.1.jar (60 KB at 161.5 KB/sec)
2017-07-16T13:04:22.495 [INFO] Downloaded: https://repo.maven.apache.org/maven2/commons-io/commons-io/2.2/commons-io-2.2.jar (170 KB at 425.9 KB/sec)
2017-07-16T13:04:22.497 [INFO] Downloaded: https://repo.maven.apache.org/maven2/classworlds/classworlds/1.1-alpha-2/classworlds-1.1-alpha-2.jar (37 KB at 91.6 KB/sec)
2017-07-16T13:04:22.597 [INFO] Downloaded: https://repo.maven.apache.org/maven2/com/google/guava/guava/20.0/guava-20.0.jar (2386 KB at 4695.6 KB/sec)
[WARNING] Failed to getClass for net.revelc.code.formatter.FormatterMojo
[JENKINS] Archiving disabled
[JENKINS] Archiving disabled
[JENKINS] Archiving disabled
[JENKINS] Archiving disabled
[JENKINS] Archiving disabled
[JENKINS] Archiving disabled
[JENKINS] Archiving disabled
[JENKINS] Archiving disabled
[JENKINS] Archiving disabled
[JENKINS] Archiving disabled
[JENKINS] Archiving disabled
[JENKINS] Archiving disabled
[JENKINS] Archiving disabled
2017-07-16T13:04:27.788 [INFO] ------------------------------------------------------------------------
2017-07-16T13:04:27.788 [INFO] Reactor Summary:
2017-07-16T13:04:27.788 [INFO] 
2017-07-16T13:04:27.788 [INFO] Apache Beam :: Parent .............................. SUCCESS [ 27.407 s]
2017-07-16T13:04:27.788 [INFO] Apache Beam :: SDKs :: Java :: Build Tools ......... FAILURE [  3.036 s]
2017-07-16T13:04:27.788 [INFO] Apache Beam :: SDKs ................................ SKIPPED
2017-07-16T13:04:27.788 [INFO] Apache Beam :: SDKs :: Common ...................... SKIPPED
2017-07-16T13:04:27.788 [INFO] Apache Beam :: SDKs :: Common :: Runner API ........ SKIPPED
2017-07-16T13:04:27.788 [INFO] Apache Beam :: SDKs :: Common :: Fn API ............ SKIPPED
2017-07-16T13:04:27.788 [INFO] Apache Beam :: SDKs :: Java ........................ SKIPPED
2017-07-16T13:04:27.788 [INFO] Apache Beam :: SDKs :: Java :: Core ................ SKIPPED
2017-07-16T13:04:27.788 [INFO] Apache Beam :: Runners ............................. SKIPPED
2017-07-16T13:04:27.788 [INFO] Apache Beam :: Runners :: Core Construction Java ... SKIPPED
2017-07-16T13:04:27.789 [INFO] Apache Beam :: Runners :: Core Java ................ SKIPPED
2017-07-16T13:04:27.789 [INFO] Apache Beam :: Runners :: Flink .................... SKIPPED
2017-07-16T13:04:27.789 [INFO] ------------------------------------------------------------------------
2017-07-16T13:04:27.789 [INFO] BUILD FAILURE
2017-07-16T13:04:27.789 [INFO] ------------------------------------------------------------------------
2017-07-16T13:04:27.789 [INFO] Total time: 01:07 min
2017-07-16T13:04:27.789 [INFO] Finished at: 2017-07-16T13:04:27+00:00
2017-07-16T13:04:28.251 [INFO] Final Memory: 58M/683M
2017-07-16T13:04:28.251 [INFO] ------------------------------------------------------------------------
2017-07-16T13:04:28.252 [WARNING] The requested profile "validates-runner-tests" could not be activated because it does not exist.
2017-07-16T13:04:28.257 [ERROR] Failed to execute goal net.revelc.code.formatter:formatter-maven-plugin:2.0.1:format (test-code-style) on project beam-sdks-java-build-tools: Execution test-code-style of goal net.revelc.code.formatter:formatter-maven-plugin:2.0.1:format failed: Plugin net.revelc.code.formatter:formatter-maven-plugin:2.0.1 or one of its dependencies could not be resolved: The following artifacts could not be resolved: net.revelc.code.formatter:jdt-core:jar:2.0.1, net.revelc.code.formatter:jsdt-core:jar:2.0.1: Could not transfer artifact net.revelc.code.formatter:jdt-core:jar:2.0.1 from/to central (https://repo.maven.apache.org/maven2): GET request of: net/revelc/code/formatter/jdt-core/2.0.1/jdt-core-2.0.1.jar from central failed: Connection reset -> [Help 1]
org.apache.maven.lifecycle.LifecycleExecutionException: Failed to execute goal net.revelc.code.formatter:formatter-maven-plugin:2.0.1:format (test-code-style) on project beam-sdks-java-build-tools: Execution test-code-style of goal net.revelc.code.formatter:formatter-maven-plugin:2.0.1:format failed: Plugin net.revelc.code.formatter:formatter-maven-plugin:2.0.1 or one of its dependencies could not be resolved: The following artifacts could not be resolved: net.revelc.code.formatter:jdt-core:jar:2.0.1, net.revelc.code.formatter:jsdt-core:jar:2.0.1: Could not transfer artifact net.revelc.code.formatter:jdt-core:jar:2.0.1 from/to central (https://repo.maven.apache.org/maven2): GET request of: net/revelc/code/formatter/jdt-core/2.0.1/jdt-core-2.0.1.jar from central failed
	at org.apache.maven.lifecycle.internal.MojoExecutor.execute(MojoExecutor.java:224)
	at org.apache.maven.lifecycle.internal.MojoExecutor.execute(MojoExecutor.java:153)
	at org.apache.maven.lifecycle.internal.MojoExecutor.execute(MojoExecutor.java:145)
	at org.apache.maven.lifecycle.internal.LifecycleModuleBuilder.buildProject(LifecycleModuleBuilder.java:116)
	at org.apache.maven.lifecycle.internal.LifecycleModuleBuilder.buildProject(LifecycleModuleBuilder.java:80)
	at org.apache.maven.lifecycle.internal.builder.singlethreaded.SingleThreadedBuilder.build(SingleThreadedBuilder.java:51)
	at org.apache.maven.lifecycle.internal.LifecycleStarter.execute(LifecycleStarter.java:128)
	at org.apache.maven.DefaultMaven.doExecute(DefaultMaven.java:307)
	at org.apache.maven.DefaultMaven.doExecute(DefaultMaven.java:193)
	at org.apache.maven.DefaultMaven.execute(DefaultMaven.java:106)
	at org.jvnet.hudson.maven3.launcher.Maven33Launcher.main(Maven33Launcher.java:129)
	at sun.reflect.NativeMethodAccessorImpl.invoke0(Native Method)
	at sun.reflect.NativeMethodAccessorImpl.invoke(NativeMethodAccessorImpl.java:62)
	at sun.reflect.DelegatingMethodAccessorImpl.invoke(DelegatingMethodAccessorImpl.java:43)
	at java.lang.reflect.Method.invoke(Method.java:498)
	at org.codehaus.plexus.classworlds.launcher.Launcher.launchStandard(Launcher.java:330)
	at org.codehaus.plexus.classworlds.launcher.Launcher.launch(Launcher.java:238)
	at jenkins.maven3.agent.Maven33Main.launch(Maven33Main.java:176)
	at sun.reflect.NativeMethodAccessorImpl.invoke0(Native Method)
	at sun.reflect.NativeMethodAccessorImpl.invoke(NativeMethodAccessorImpl.java:62)
	at sun.reflect.DelegatingMethodAccessorImpl.invoke(DelegatingMethodAccessorImpl.java:43)
	at java.lang.reflect.Method.invoke(Method.java:498)
	at hudson.maven.Maven3Builder.call(Maven3Builder.java:139)
	at hudson.maven.Maven3Builder.call(Maven3Builder.java:70)
	at hudson.remoting.UserRequest.perform(UserRequest.java:153)
	at hudson.remoting.UserRequest.perform(UserRequest.java:50)
	at hudson.remoting.Request$2.run(Request.java:336)
	at hudson.remoting.InterceptingExecutorService$1.call(InterceptingExecutorService.java:68)
	at java.util.concurrent.FutureTask.run(FutureTask.java:266)
	at java.util.concurrent.ThreadPoolExecutor.runWorker(ThreadPoolExecutor.java:1142)
	at java.util.concurrent.ThreadPoolExecutor$Worker.run(ThreadPoolExecutor.java:617)
	at java.lang.Thread.run(Thread.java:748)
Caused by: org.apache.maven.plugin.PluginExecutionException: Execution test-code-style of goal net.revelc.code.formatter:formatter-maven-plugin:2.0.1:format failed: Plugin net.revelc.code.formatter:formatter-maven-plugin:2.0.1 or one of its dependencies could not be resolved: The following artifacts could not be resolved: net.revelc.code.formatter:jdt-core:jar:2.0.1, net.revelc.code.formatter:jsdt-core:jar:2.0.1: Could not transfer artifact net.revelc.code.formatter:jdt-core:jar:2.0.1 from/to central (https://repo.maven.apache.org/maven2): GET request of: net/revelc/code/formatter/jdt-core/2.0.1/jdt-core-2.0.1.jar from central failed
	at org.apache.maven.plugin.DefaultBuildPluginManager.executeMojo(DefaultBuildPluginManager.java:106)
	at org.apache.maven.lifecycle.internal.MojoExecutor.execute(MojoExecutor.java:208)
	... 31 more
Caused by: org.apache.maven.plugin.PluginResolutionException: Plugin net.revelc.code.formatter:formatter-maven-plugin:2.0.1 or one of its dependencies could not be resolved: The following artifacts could not be resolved: net.revelc.code.formatter:jdt-core:jar:2.0.1, net.revelc.code.formatter:jsdt-core:jar:2.0.1: Could not transfer artifact net.revelc.code.formatter:jdt-core:jar:2.0.1 from/to central (https://repo.maven.apache.org/maven2): GET request of: net/revelc/code/formatter/jdt-core/2.0.1/jdt-core-2.0.1.jar from central failed
	at org.apache.maven.plugin.internal.DefaultPluginDependenciesResolver.resolveInternal(DefaultPluginDependenciesResolver.java:218)
	at org.apache.maven.plugin.internal.DefaultPluginDependenciesResolver.resolve(DefaultPluginDependenciesResolver.java:149)
	at org.apache.maven.plugin.internal.DefaultMavenPluginManager.createPluginRealm(DefaultMavenPluginManager.java:422)
	at org.apache.maven.plugin.internal.DefaultMavenPluginManager.setupPluginRealm(DefaultMavenPluginManager.java:385)
	at org.apache.maven.plugin.DefaultBuildPluginManager.getPluginRealm(DefaultBuildPluginManager.java:231)
	at org.apache.maven.plugin.DefaultBuildPluginManager.executeMojo(DefaultBuildPluginManager.java:102)
	... 32 more
Caused by: org.eclipse.aether.resolution.ArtifactResolutionException: The following artifacts could not be resolved: net.revelc.code.formatter:jdt-core:jar:2.0.1, net.revelc.code.formatter:jsdt-core:jar:2.0.1: Could not transfer artifact net.revelc.code.formatter:jdt-core:jar:2.0.1 from/to central (https://repo.maven.apache.org/maven2): GET request of: net/revelc/code/formatter/jdt-core/2.0.1/jdt-core-2.0.1.jar from central failed
	at org.eclipse.aether.internal.impl.DefaultArtifactResolver.resolve(DefaultArtifactResolver.java:444)
	at org.eclipse.aether.internal.impl.DefaultArtifactResolver.resolveArtifacts(DefaultArtifactResolver.java:246)
	at org.eclipse.aether.internal.impl.DefaultRepositorySystem.resolveDependencies(DefaultRepositorySystem.java:367)
	at org.apache.maven.plugin.internal.DefaultPluginDependenciesResolver.resolveInternal(DefaultPluginDependenciesResolver.java:210)
	... 37 more
Caused by: org.eclipse.aether.transfer.ArtifactTransferException: Could not transfer artifact net.revelc.code.formatter:jdt-core:jar:2.0.1 from/to central (https://repo.maven.apache.org/maven2): GET request of: net/revelc/code/formatter/jdt-core/2.0.1/jdt-core-2.0.1.jar from central failed
	at org.eclipse.aether.connector.basic.ArtifactTransportListener.transferFailed(ArtifactTransportListener.java:43)
	at org.eclipse.aether.connector.basic.BasicRepositoryConnector$TaskRunner.run(BasicRepositoryConnector.java:355)
	at org.eclipse.aether.util.concurrency.RunnableErrorForwarder$1.run(RunnableErrorForwarder.java:67)
	... 3 more
Caused by: org.apache.maven.wagon.TransferFailedException: GET request of: net/revelc/code/formatter/jdt-core/2.0.1/jdt-core-2.0.1.jar from central failed
	at org.apache.maven.wagon.AbstractWagon.getTransfer(AbstractWagon.java:363)
	at org.apache.maven.wagon.AbstractWagon.getTransfer(AbstractWagon.java:316)
	at org.apache.maven.wagon.AbstractWagon.getTransfer(AbstractWagon.java:285)
	at org.apache.maven.wagon.StreamWagon.getIfNewer(StreamWagon.java:97)
	at org.apache.maven.wagon.StreamWagon.get(StreamWagon.java:61)
	at org.eclipse.aether.transport.wagon.WagonTransporter$GetTaskRunner.run(WagonTransporter.java:560)
	at org.eclipse.aether.transport.wagon.WagonTransporter.execute(WagonTransporter.java:427)
	at org.eclipse.aether.transport.wagon.WagonTransporter.get(WagonTransporter.java:404)
	at org.eclipse.aether.connector.basic.BasicRepositoryConnector$GetTaskRunner.runTask(BasicRepositoryConnector.java:447)
	at org.eclipse.aether.connector.basic.BasicRepositoryConnector$TaskRunner.run(BasicRepositoryConnector.java:350)
	... 4 more
Caused by: java.net.SocketException: Connection reset
	at java.net.SocketInputStream.read(SocketInputStream.java:210)
	at java.net.SocketInputStream.read(SocketInputStream.java:141)
	at sun.security.ssl.InputRecord.readFully(InputRecord.java:465)
	at sun.security.ssl.InputRecord.readV3Record(InputRecord.java:593)
	at sun.security.ssl.InputRecord.read(InputRecord.java:532)
	at sun.security.ssl.SSLSocketImpl.readRecord(SSLSocketImpl.java:973)
	at sun.security.ssl.SSLSocketImpl.readDataRecord(SSLSocketImpl.java:930)
	at sun.security.ssl.AppInputStream.read(AppInputStream.java:105)
	at org.apache.maven.wagon.providers.http.httpclient.impl.io.SessionInputBufferImpl.streamRead(SessionInputBufferImpl.java:136)
	at org.apache.maven.wagon.providers.http.httpclient.impl.io.SessionInputBufferImpl.read(SessionInputBufferImpl.java:195)
	at org.apache.maven.wagon.providers.http.httpclient.impl.io.ContentLengthInputStream.read(ContentLengthInputStream.java:178)
	at org.apache.maven.wagon.providers.http.httpclient.conn.EofSensorInputStream.read(EofSensorInputStream.java:137)
	at org.apache.maven.wagon.AbstractWagon.transfer(AbstractWagon.java:531)
	at org.apache.maven.wagon.AbstractWagon.getTransfer(AbstractWagon.java:353)
	... 13 more
2017-07-16T13:04:28.271 [ERROR] 
2017-07-16T13:04:28.271 [ERROR] Re-run Maven using the -X switch to enable full debug logging.
2017-07-16T13:04:28.271 [ERROR] 
2017-07-16T13:04:28.271 [ERROR] For more information about the errors and possible solutions, please read the following articles:
2017-07-16T13:04:28.271 [ERROR] [Help 1] http://cwiki.apache.org/confluence/display/MAVEN/PluginResolutionException
2017-07-16T13:04:28.271 [ERROR] 
2017-07-16T13:04:28.271 [ERROR] After correcting the problems, you can resume the build with the command
2017-07-16T13:04:28.271 [ERROR]   mvn <goals> -rf :beam-sdks-java-build-tools
channel stopped
Not sending mail to unregistered user fipsy@google.com
Not sending mail to unregistered user kirpichov@google.com
Not sending mail to unregistered user klk@google.com

Jenkins build is still unstable: beam_PostCommit_Java_ValidatesRunner_Flink #3408

Posted by Apache Jenkins Server <je...@builds.apache.org>.
See <https://builds.apache.org/job/beam_PostCommit_Java_ValidatesRunner_Flink/3408/display/redirect?page=changes>


Jenkins build is still unstable: beam_PostCommit_Java_ValidatesRunner_Flink #3407

Posted by Apache Jenkins Server <je...@builds.apache.org>.
See <https://builds.apache.org/job/beam_PostCommit_Java_ValidatesRunner_Flink/3407/display/redirect?page=changes>


Jenkins build is still unstable: beam_PostCommit_Java_ValidatesRunner_Flink #3406

Posted by Apache Jenkins Server <je...@builds.apache.org>.
See <https://builds.apache.org/job/beam_PostCommit_Java_ValidatesRunner_Flink/3406/display/redirect>


Jenkins build is still unstable: beam_PostCommit_Java_ValidatesRunner_Flink #3405

Posted by Apache Jenkins Server <je...@builds.apache.org>.
See <https://builds.apache.org/job/beam_PostCommit_Java_ValidatesRunner_Flink/3405/display/redirect>


Jenkins build is still unstable: beam_PostCommit_Java_ValidatesRunner_Flink #3404

Posted by Apache Jenkins Server <je...@builds.apache.org>.
See <https://builds.apache.org/job/beam_PostCommit_Java_ValidatesRunner_Flink/3404/display/redirect>


Jenkins build is still unstable: beam_PostCommit_Java_ValidatesRunner_Flink #3403

Posted by Apache Jenkins Server <je...@builds.apache.org>.
See <https://builds.apache.org/job/beam_PostCommit_Java_ValidatesRunner_Flink/3403/display/redirect?page=changes>


Jenkins build is still unstable: beam_PostCommit_Java_ValidatesRunner_Flink #3402

Posted by Apache Jenkins Server <je...@builds.apache.org>.
See <https://builds.apache.org/job/beam_PostCommit_Java_ValidatesRunner_Flink/3402/display/redirect?page=changes>


Jenkins build is still unstable: beam_PostCommit_Java_ValidatesRunner_Flink #3401

Posted by Apache Jenkins Server <je...@builds.apache.org>.
See <https://builds.apache.org/job/beam_PostCommit_Java_ValidatesRunner_Flink/3401/display/redirect?page=changes>


Jenkins build is still unstable: beam_PostCommit_Java_ValidatesRunner_Flink #3400

Posted by Apache Jenkins Server <je...@builds.apache.org>.
See <https://builds.apache.org/job/beam_PostCommit_Java_ValidatesRunner_Flink/3400/display/redirect?page=changes>


Jenkins build is still unstable: beam_PostCommit_Java_ValidatesRunner_Flink #3399

Posted by Apache Jenkins Server <je...@builds.apache.org>.
See <https://builds.apache.org/job/beam_PostCommit_Java_ValidatesRunner_Flink/3399/display/redirect>


Jenkins build is still unstable: beam_PostCommit_Java_ValidatesRunner_Flink #3398

Posted by Apache Jenkins Server <je...@builds.apache.org>.
See <https://builds.apache.org/job/beam_PostCommit_Java_ValidatesRunner_Flink/3398/display/redirect>


Jenkins build is still unstable: beam_PostCommit_Java_ValidatesRunner_Flink #3397

Posted by Apache Jenkins Server <je...@builds.apache.org>.
See <https://builds.apache.org/job/beam_PostCommit_Java_ValidatesRunner_Flink/3397/display/redirect>


Jenkins build is still unstable: beam_PostCommit_Java_ValidatesRunner_Flink #3396

Posted by Apache Jenkins Server <je...@builds.apache.org>.
See <https://builds.apache.org/job/beam_PostCommit_Java_ValidatesRunner_Flink/3396/display/redirect?page=changes>


Jenkins build is still unstable: beam_PostCommit_Java_ValidatesRunner_Flink #3395

Posted by Apache Jenkins Server <je...@builds.apache.org>.
See <https://builds.apache.org/job/beam_PostCommit_Java_ValidatesRunner_Flink/3395/display/redirect?page=changes>


Jenkins build is still unstable: beam_PostCommit_Java_ValidatesRunner_Flink #3394

Posted by Apache Jenkins Server <je...@builds.apache.org>.
See <https://builds.apache.org/job/beam_PostCommit_Java_ValidatesRunner_Flink/3394/display/redirect?page=changes>


Jenkins build is still unstable: beam_PostCommit_Java_ValidatesRunner_Flink #3393

Posted by Apache Jenkins Server <je...@builds.apache.org>.
See <https://builds.apache.org/job/beam_PostCommit_Java_ValidatesRunner_Flink/3393/display/redirect?page=changes>


Jenkins build is still unstable: beam_PostCommit_Java_ValidatesRunner_Flink #3392

Posted by Apache Jenkins Server <je...@builds.apache.org>.
See <https://builds.apache.org/job/beam_PostCommit_Java_ValidatesRunner_Flink/3392/display/redirect?page=changes>


Jenkins build is still unstable: beam_PostCommit_Java_ValidatesRunner_Flink #3391

Posted by Apache Jenkins Server <je...@builds.apache.org>.
See <https://builds.apache.org/job/beam_PostCommit_Java_ValidatesRunner_Flink/3391/display/redirect>


Jenkins build is still unstable: beam_PostCommit_Java_ValidatesRunner_Flink #3390

Posted by Apache Jenkins Server <je...@builds.apache.org>.
See <https://builds.apache.org/job/beam_PostCommit_Java_ValidatesRunner_Flink/3390/display/redirect>


Jenkins build is still unstable: beam_PostCommit_Java_ValidatesRunner_Flink #3389

Posted by Apache Jenkins Server <je...@builds.apache.org>.
See <https://builds.apache.org/job/beam_PostCommit_Java_ValidatesRunner_Flink/3389/display/redirect>


Jenkins build is still unstable: beam_PostCommit_Java_ValidatesRunner_Flink #3388

Posted by Apache Jenkins Server <je...@builds.apache.org>.
See <https://builds.apache.org/job/beam_PostCommit_Java_ValidatesRunner_Flink/3388/display/redirect>


Jenkins build is still unstable: beam_PostCommit_Java_ValidatesRunner_Flink #3387

Posted by Apache Jenkins Server <je...@builds.apache.org>.
See <https://builds.apache.org/job/beam_PostCommit_Java_ValidatesRunner_Flink/3387/display/redirect?page=changes>


Jenkins build is unstable: beam_PostCommit_Java_ValidatesRunner_Flink #3386

Posted by Apache Jenkins Server <je...@builds.apache.org>.
See <https://builds.apache.org/job/beam_PostCommit_Java_ValidatesRunner_Flink/3386/display/redirect?page=changes>