You are viewing a plain text version of this content. The canonical link for it is here.
Posted to dev@lucene.apache.org by je...@sd-datasolutions.de on 2012/05/20 22:26:46 UTC

Build failed in Jenkins: Lucene-Solr-trunk-Windows-Java6-64 #107

See <http://jenkins.sd-datasolutions.de/job/Lucene-Solr-trunk-Windows-Java6-64/107/>

------------------------------------------
[...truncated 10890 lines...]
   [junit4] Completed in 0.15s, 2 tests
   [junit4]  
   [junit4] Suite: org.apache.solr.analysis.TestDictionaryCompoundWordTokenFilterFactory
   [junit4] Completed in 0.01s, 1 test
   [junit4]  
   [junit4] Suite: org.apache.solr.analysis.TestStandardFactories
   [junit4] Completed in 0.03s, 10 tests
   [junit4]  
   [junit4] Suite: org.apache.solr.schema.CopyFieldTest
   [junit4] Completed in 0.77s, 6 tests
   [junit4]  
   [junit4] Suite: org.apache.solr.core.TestXIncludeConfig
   [junit4] Completed in 0.83s, 1 test
   [junit4]  
   [junit4] Suite: org.apache.solr.cloud.NodeStateWatcherTest
   [junit4] Completed in 24.62s, 1 test
   [junit4]  
   [junit4] Suite: org.apache.solr.servlet.DirectSolrConnectionTest
   [junit4] Completed in 0.55s, 2 tests
   [junit4]  
   [junit4] Suite: org.apache.solr.search.TestRealTimeGet
   [junit4] IGNOR/A 0.01s | TestRealTimeGet.testStressRecovery
   [junit4]    > Assumption #1: FIXME: This test is horribly slow sometimes on Windows!
   [junit4] Completed in 18.04s, 8 tests, 1 skipped
   [junit4]  
   [junit4] Suite: org.apache.solr.cloud.OverseerTest
   [junit4] Completed in 50.19s, 7 tests
   [junit4]  
   [junit4] Suite: org.apache.solr.analysis.TestPhoneticFilterFactory
   [junit4] Completed in 10.23s, 5 tests
   [junit4]  
   [junit4] Suite: org.apache.solr.request.TestFaceting
   [junit4] Completed in 15.89s, 3 tests
   [junit4]  
   [junit4] Suite: org.apache.solr.TestGroupingSearch
   [junit4] Completed in 6.36s, 12 tests
   [junit4]  
   [junit4] Suite: org.apache.solr.handler.component.QueryElevationComponentTest
   [junit4] Completed in 8.27s, 7 tests
   [junit4]  
   [junit4] Suite: org.apache.solr.update.DirectUpdateHandlerTest
   [junit4] Completed in 3.81s, 6 tests
   [junit4]  
   [junit4] Suite: org.apache.solr.update.PeerSyncTest
   [junit4] Completed in 5.50s, 1 test
   [junit4]  
   [junit4] Suite: org.apache.solr.search.TestSort
   [junit4] Completed in 3.56s, 2 tests
   [junit4]  
   [junit4] Suite: org.apache.solr.TestTrie
   [junit4] Completed in 1.64s, 8 tests
   [junit4]  
   [junit4] Suite: org.apache.solr.core.SolrCoreTest
   [junit4] Completed in 5.78s, 5 tests
   [junit4]  
   [junit4] Suite: org.apache.solr.SolrInfoMBeanTest
   [junit4] Completed in 0.98s, 1 test
   [junit4]  
   [junit4] Suite: org.apache.solr.update.processor.SignatureUpdateProcessorFactoryTest
   [junit4] Completed in 1.34s, 6 tests
   [junit4]  
   [junit4] Suite: org.apache.solr.core.TestCoreContainer
   [junit4] Completed in 2.89s, 1 test
   [junit4]  
   [junit4] Suite: org.apache.solr.core.TestSolrDeletionPolicy2
   [junit4] Completed in 0.85s, 1 test
   [junit4]  
   [junit4] Suite: org.apache.solr.search.TestPseudoReturnFields
   [junit4] Completed in 1.53s, 13 tests
   [junit4]  
   [junit4] Suite: org.apache.solr.spelling.DirectSolrSpellCheckerTest
   [junit4] Completed in 1.16s, 2 tests
   [junit4]  
   [junit4] Suite: org.apache.solr.highlight.HighlighterTest
   [junit4] Completed in 2.29s, 27 tests
   [junit4]  
   [junit4] Suite: org.apache.solr.search.function.SortByFunctionTest
   [junit4] Completed in 2.20s, 2 tests
   [junit4]  
   [junit4] Suite: org.apache.solr.update.processor.UniqFieldsUpdateProcessorFactoryTest
   [junit4] Completed in 0.97s, 1 test
   [junit4]  
   [junit4] Suite: org.apache.solr.search.function.distance.DistanceFunctionTest
   [junit4] Completed in 1.17s, 3 tests
   [junit4]  
   [junit4] Suite: org.apache.solr.request.TestRemoteStreaming
   [junit4] Completed in 1.21s, 4 tests
   [junit4]  
   [junit4] Suite: org.apache.solr.handler.DocumentAnalysisRequestHandlerTest
   [junit4] Completed in 1.09s, 4 tests
   [junit4]  
   [junit4] Suite: org.apache.solr.servlet.CacheHeaderTest
   [junit4] Completed in 1.37s, 5 tests
   [junit4]  
   [junit4] Suite: org.apache.solr.core.TestPropInject
   [junit4] Completed in 1.79s, 2 tests
   [junit4]  
   [junit4] Suite: org.apache.solr.core.RequestHandlersTest
   [junit4] Completed in 1.02s, 3 tests
   [junit4]  
   [junit4] Suite: org.apache.solr.highlight.FastVectorHighlighterTest
   [junit4] Completed in 1.02s, 2 tests
   [junit4]  
   [junit4] Suite: org.apache.solr.search.TestDocSet
   [junit4] Completed in 0.70s, 2 tests
   [junit4]  
   [junit4] Suite: org.apache.solr.search.TestQueryTypes
   [junit4] Completed in 0.82s, 1 test
   [junit4]  
   [junit4] Suite: org.apache.solr.search.TestValueSourceCache
   [junit4] Completed in 1.01s, 2 tests
   [junit4]  
   [junit4] Suite: org.apache.solr.util.SolrPluginUtilsTest
   [junit4] Completed in 0.96s, 7 tests
   [junit4]  
   [junit4] Suite: org.apache.solr.core.IndexReaderFactoryTest
   [junit4] Completed in 0.89s, 1 test
   [junit4]  
   [junit4] Suite: org.apache.solr.core.TestArbitraryIndexDir
   [junit4] Completed in 1.04s, 1 test
   [junit4]  
   [junit4] Suite: org.apache.solr.handler.component.TermVectorComponentTest
   [junit4] Completed in 1.13s, 4 tests
   [junit4]  
   [junit4] Suite: org.apache.solr.handler.component.SearchHandlerTest
   [junit4] Completed in 1.02s, 1 test
   [junit4]  
   [junit4] Suite: org.apache.solr.core.AlternateDirectoryTest
   [junit4] Completed in 0.93s, 1 test
   [junit4]  
   [junit4] Suite: org.apache.solr.core.TestQuerySenderNoQuery
   [junit4] Completed in 0.94s, 3 tests
   [junit4]  
   [junit4] Suite: org.apache.solr.OutputWriterTest
   [junit4] Completed in 0.24s, 5 tests
   [junit4]  
   [junit4] Suite: org.apache.solr.analysis.TestKStemFilterFactory
   [junit4] Completed in 0.16s, 1 test
   [junit4]  
   [junit4] Suite: org.apache.solr.search.similarities.TestBM25SimilarityFactory
   [junit4] Completed in 0.16s, 2 tests
   [junit4]  
   [junit4] Suite: org.apache.solr.spelling.suggest.TestPhraseSuggestions
   [junit4] Completed in 0.21s, 1 test
   [junit4]  
   [junit4] Suite: org.apache.solr.EchoParamsTest
   [junit4] Completed in 0.21s, 1 test
   [junit4]  
   [junit4] Suite: org.apache.solr.core.TestCodecSupport
   [junit4] Completed in 0.17s, 3 tests
   [junit4]  
   [junit4] Suite: org.apache.solr.TestPluginEnable
   [junit4] Completed in 0.16s, 1 test
   [junit4]  
   [junit4] Suite: org.apache.solr.core.TestSolrXMLSerializer
   [junit4] Completed in 0.03s, 1 test
   [junit4]  
   [junit4] Suite: org.apache.solr.util.DateMathParserTest
   [junit4] Completed in 0.05s, 8 tests
   [junit4]  
   [junit4] Suite: org.apache.solr.util.PrimUtilsTest
   [junit4] Completed in 0.05s, 2 tests
   [junit4]  
   [junit4] Suite: org.apache.solr.analysis.TestGalicianStemFilterFactory
   [junit4] Completed in 0.01s, 1 test
   [junit4]  
   [junit4] Suite: org.apache.solr.analysis.TestShingleFilterFactory
   [junit4] Completed in 0.05s, 13 tests
   [junit4]  
   [junit4] Suite: org.apache.solr.analysis.TestNGramFilters
   [junit4] Completed in 0.05s, 10 tests
   [junit4]  
   [junit4] Suite: org.apache.solr.analysis.TestGalicianMinimalStemFilterFactory
   [junit4] Completed in 0.01s, 1 test
   [junit4]  
   [junit4] Suite: org.apache.solr.analysis.TestSynonymFilterFactory
   [junit4] Completed in 0.02s, 4 tests
   [junit4]  
   [junit4] Suite: org.apache.solr.analysis.SnowballPorterFilterFactoryTest
   [junit4] Completed in 0.02s, 2 tests
   [junit4]  
   [junit4] Suite: org.apache.solr.util.DOMUtilTest
   [junit4] Completed in 0.02s, 1 test
   [junit4]  
   [junit4] Suite: org.apache.solr.analysis.TestCJKTokenizerFactory
   [junit4] Completed in 0.02s, 1 test
   [junit4]  
   [junit4] Suite: org.apache.solr.analysis.TestNorwegianLightStemFilterFactory
   [junit4] Completed in 0.01s, 1 test
   [junit4]  
   [junit4] Suite: org.apache.solr.analysis.TestElisionFilterFactory
   [junit4] Completed in 0.02s, 3 tests
   [junit4]  
   [junit4] Suite: org.apache.solr.analysis.TestStopFilterFactory
   [junit4] Completed in 0.01s, 1 test
   [junit4]  
   [junit4] Suite: org.apache.solr.analysis.TestPorterStemFilterFactory
   [junit4] Completed in 0.00s, 1 test
   [junit4]  
   [junit4] Suite: org.apache.solr.core.TestBadConfig
   [junit4] Completed in 0.01s, 1 test
   [junit4]  
   [junit4] Suite: org.apache.solr.analysis.TestIrishLowerCaseFilterFactory
   [junit4] Completed in 0.01s, 1 test
   [junit4]  
   [junit4] Suite: org.apache.solr.analysis.TestSpanishLightStemFilterFactory
   [junit4] Completed in 0.01s, 1 test
   [junit4]  
   [junit4] Suite: org.apache.solr.analysis.TestBulgarianStemFilterFactory
   [junit4] Completed in 0.01s, 1 test
   [junit4]  
   [junit4] Suite: org.apache.solr.cloud.CloudStateTest
   [junit4] Completed in 0.01s, 1 test
   [junit4]  
   [junit4] Suite: org.apache.solr.analysis.TestEnglishMinimalStemFilterFactory
   [junit4] Completed in 0.01s, 1 test
   [junit4]  
   [junit4] Suite: org.apache.solr.core.RAMDirectoryFactoryTest
   [junit4] Completed in 0.01s, 1 test
   [junit4]  
   [junit4] Suite: org.apache.solr.analysis.TestRemoveDuplicatesTokenFilterFactory
   [junit4] Completed in 0.01s, 1 test
   [junit4]  
   [junit4] Suite: org.apache.solr.handler.admin.SystemInfoHandlerTest
   [junit4] Completed in 0.01s, 1 test
   [junit4]  
   [junit4] Suite: org.apache.solr.cloud.ChaosMonkeyNothingIsSafeTest
   [junit4] Completed in 0.00s, 0 tests
   [junit4]  
   [junit4] Suite: org.apache.solr.TestRandomFaceting
   [junit4] Completed in 22.74s, 1 test
   [junit4]  
   [junit4] Suite: org.apache.solr.schema.PreAnalyzedFieldTest
   [junit4] Completed in 0.03s, 3 tests
   [junit4]  
   [junit4] JVM J0:     1.24 ..  1033.03 =  1031.80s
   [junit4] Execution time total: 17 minutes 13 seconds
   [junit4] Tests summary: 286 suites, 968 tests, 1 suite-level error, 11 ignored (6 assumptions)

BUILD FAILED
<http://jenkins.sd-datasolutions.de/job/Lucene-Solr-trunk-Windows-Java6-64/ws/build.xml>:29: The following error occurred while executing this line:
<http://jenkins.sd-datasolutions.de/job/Lucene-Solr-trunk-Windows-Java6-64/ws/solr\build.xml>:144: The following error occurred while executing this line:
<http://jenkins.sd-datasolutions.de/job/Lucene-Solr-trunk-Windows-Java6-64/ws/lucene\module-build.xml>:62: The following error occurred while executing this line:
<http://jenkins.sd-datasolutions.de/job/Lucene-Solr-trunk-Windows-Java6-64/ws/lucene\common-build.xml>:1019: The following error occurred while executing this line:
<http://jenkins.sd-datasolutions.de/job/Lucene-Solr-trunk-Windows-Java6-64/ws/lucene\common-build.xml>:745: There were test failures: 286 suites, 968 tests, 1 suite-level error, 11 ignored (6 assumptions)

Total time: 37 minutes 34 seconds
Build step 'Invoke Ant' marked build as failure
Recording test results

---------------------------------------------------------------------
To unsubscribe, e-mail: dev-unsubscribe@lucene.apache.org
For additional commands, e-mail: dev-help@lucene.apache.org


Jenkins build is back to normal : Lucene-Solr-trunk-Windows-Java6-64 #109

Posted by je...@sd-datasolutions.de.
See <http://jenkins.sd-datasolutions.de/job/Lucene-Solr-trunk-Windows-Java6-64/109/>


---------------------------------------------------------------------
To unsubscribe, e-mail: dev-unsubscribe@lucene.apache.org
For additional commands, e-mail: dev-help@lucene.apache.org


Build failed in Jenkins: Lucene-Solr-trunk-Windows-Java6-64 #108

Posted by je...@sd-datasolutions.de.
See <http://jenkins.sd-datasolutions.de/job/Lucene-Solr-trunk-Windows-Java6-64/108/changes>

Changes:

[markrmiller] add a couple cloud props to multicore example solr.xml

------------------------------------------
[...truncated 10789 lines...]
   [junit4]   2> 	at java.lang.Thread.run(Thread.java:662)
   [junit4]   2> 
   [junit4]   2> 55285 T2780 oash.SnapPuller.copyAFile SEVERE Unable to move index file from: .\org.apache.solr.handler.TestReplicationHandler$SolrInstance-1337550395956\slave\data\index.20120521064730\_9_nrm.cfe to: <http://jenkins.sd-datasolutions.de/job/Lucene-Solr-trunk-Windows-Java6-64/ws/solr\build\solr-core\test\J0\org.apache.solr.handler.TestReplicationHandler$SolrInstance-1337550395956\slave\data\index.20120521064700\_9_nrm.cfeTrying> to do a copy
   [junit4]   2> 55286 T2780 oash.SnapPuller.copyAFile SEVERE Unable to copy index file from: .\org.apache.solr.handler.TestReplicationHandler$SolrInstance-1337550395956\slave\data\index.20120521064730\_9_nrm.cfe to: <http://jenkins.sd-datasolutions.de/job/Lucene-Solr-trunk-Windows-Java6-64/ws/solr\build\solr-core\test\J0\org.apache.solr.handler.TestReplicationHandler$SolrInstance-1337550395956\slave\data\index.20120521064700\_9_nrm.cfe> java.io.FileNotFoundException: <http://jenkins.sd-datasolutions.de/job/Lucene-Solr-trunk-Windows-Java6-64/ws/solr\build\solr-core\test\J0\org.apache.solr.handler.TestReplicationHandler$SolrInstance-1337550395956\slave\data\index.20120521064700\_9_nrm.cfe> (The system cannot find the path specified)
   [junit4]   2> 	at java.io.FileOutputStream.open(Native Method)
   [junit4]   2> 	at java.io.FileOutputStream.<init>(FileOutputStream.java:194)
   [junit4]   2> 	at java.io.FileOutputStream.<init>(FileOutputStream.java:145)
   [junit4]   2> 	at org.apache.solr.util.FileUtils.copyFile(FileUtils.java:48)
   [junit4]   2> 	at org.apache.solr.handler.SnapPuller.copyAFile(SnapPuller.java:661)
   [junit4]   2> 	at org.apache.solr.handler.SnapPuller.copyIndexFiles(SnapPuller.java:698)
   [junit4]   2> 	at org.apache.solr.handler.SnapPuller.fetchLatestIndex(SnapPuller.java:378)
   [junit4]   2> 	at org.apache.solr.handler.ReplicationHandler.doFetch(ReplicationHandler.java:298)
   [junit4]   2> 	at org.apache.solr.handler.SnapPuller$1.run(SnapPuller.java:176)
   [junit4]   2> 	at java.util.concurrent.Executors$RunnableAdapter.call(Executors.java:441)
   [junit4]   2> 	at java.util.concurrent.FutureTask$Sync.innerRunAndReset(FutureTask.java:317)
   [junit4]   2> 	at java.util.concurrent.FutureTask.runAndReset(FutureTask.java:150)
   [junit4]   2> 	at java.util.concurrent.ScheduledThreadPoolExecutor$ScheduledFutureTask.access$101(ScheduledThreadPoolExecutor.java:98)
   [junit4]   2> 	at java.util.concurrent.ScheduledThreadPoolExecutor$ScheduledFutureTask.runPeriodic(ScheduledThreadPoolExecutor.java:180)
   [junit4]   2> 	at java.util.concurrent.ScheduledThreadPoolExecutor$ScheduledFutureTask.run(ScheduledThreadPoolExecutor.java:204)
   [junit4]   2> 	at java.util.concurrent.ThreadPoolExecutor$Worker.runTask(ThreadPoolExecutor.java:886)
   [junit4]   2> 	at java.util.concurrent.ThreadPoolExecutor$Worker.run(ThreadPoolExecutor.java:908)
   [junit4]   2> 	at java.lang.Thread.run(Thread.java:662)
   [junit4]   2> 
   [junit4]   1> replicate slave to master
   [junit4]   2> NOTE: reproduce with: ant test -Dtestcase=TestReplicationHandler -Dtests.method=test -Dtests.seed=C598F0EB88E16E67 -Dtests.locale=fr_BE -Dtests.timezone=Asia/Irkutsk -Dargs="-Dfile.encoding=Cp1252"
   [junit4]   1> 
   [junit4]   2>
   [junit4]    > (@AfterClass output)
   [junit4]   2> NOTE: test params are: codec=Lucene40, sim=DefaultSimilarity, locale=fr_BE, timezone=Asia/Irkutsk
   [junit4]   2> NOTE: Windows 7 6.1 amd64/Sun Microsystems Inc. 1.6.0_32 (64-bit)/cpus=2,threads=1,free=106843368,total=199426048
   [junit4]   2> NOTE: All tests run in this JVM: [TestJoin, TestIrishLowerCaseFilterFactory, TestDFRSimilarityFactory, SuggesterTest, TestIndexingPerformance, TestRecovery, PluginInfoTest, XsltUpdateRequestHandlerTest, AlternateDirectoryTest, SolrCmdDistributorTest, TestThaiWordFilterFactory, TestPatternReplaceCharFilterFactory, TestStemmerOverrideFilterFactory, CommonGramsFilterFactoryTest, TestCodecSupport, TestPerFieldSimilarity, TestJmxMonitoredMap, OpenExchangeRatesOrgProviderTest, TestGreekLowerCaseFilterFactory, LukeRequestHandlerTest, SuggesterFSTTest, TestGreekStemFilterFactory, TestHindiFilters, TestNumberUtils, TestSolrXMLSerializer, TestCollationKeyRangeQueries, UpdateRequestProcessorFactoryTest, TestNorwegianMinimalStemFilterFactory, TestJapanesePartOfSpeechStopFilterFactory, TestCSVLoader, TestRussianLightStemFilterFactory, ReturnFieldsTest, TestExtendedDismaxParser, DOMUtilTest, TestArabicFilters, TestSwedishLightStemFilterFactory, TestHungarianLightStemFilterFactory, TestPluginEnable, BinaryUpdateRequestHandlerTest, TestPatternReplaceFilterFactory, SolrInfoMBeanTest, SolrIndexConfigTest, StandardRequestHandlerTest, TestChineseTokenizerFactory, ZkControllerTest, TestSolrDeletionPolicy1, DisMaxRequestHandlerTest, DirectSolrConnectionTest, BasicZkTest, TestOmitPositions, JSONWriterTest, DirectUpdateHandlerOptimizeTest, TestRangeQuery, TestSuggestSpellingConverter, TestLatvianStemFilterFactory, TestElisionFilterFactory, LegacyHTMLStripCharFilterTest, CloudStateUpdateTest, RecoveryZkTest, DirectSolrSpellCheckerTest, FileBasedSpellCheckerTest, TestSolrQueryParser, NoCacheHeaderTest, TestJapaneseBaseFormFilterFactory, LengthFilterTest, TestHashPartitioner, TestQueryUtils, TestTrie, TestSynonymFilterFactory, TestFiltering, TestSlowSynonymFilter, PingRequestHandlerTest, TestHunspellStemFilterFactory, TestMergePolicyConfig, TestJmxIntegration, TestUpdate, TestCSVResponseWriter, DebugComponentTest, TestCJKBigramFilterFactory, TestMappingCharFilterFactory, TestNorwegianLightStemFilterFactory, TermVectorComponentTest, TestIndexSearcher, TestItalianLightStemFilterFactory, TestDistributedGrouping, TestMultiCoreConfBootstrap, TestBinaryField, ResourceLoaderTest, StatsComponentTest, TestArbitraryIndexDir, TestPortugueseStemFilterFactory, RAMDirectoryFactoryTest, TestPatternTokenizerFactory, SolrCoreCheckLockOnStartupTest, DirectUpdateHandlerTest, TestRemoteStreaming, FileUtilsTest, TestSearchPerf, TestLMJelinekMercerSimilarityFactory, AutoCommitTest, UUIDFieldTest, TestEnglishMinimalStemFilterFactory, DoubleMetaphoneFilterFactoryTest, TestSolrDeletionPolicy2, SnowballPorterFilterFactoryTest, TestSurroundQueryParser, TestNGramFilters, CoreAdminHandlerTest, BasicFunctionalityTest, TestLMDirichletSimilarityFactory, JsonLoaderTest, TestBrazilianStemFilterFactory, SuggesterTSTTest, TestGermanStemFilterFactory, FastVectorHighlighterTest, TestGermanMinimalStemFilterFactory, TestKStemFilterFactory, TestQuerySenderNoQuery, SystemInfoHandlerTest, TestShingleFilterFactory, MinimalSchemaTest, TestPropInjectDefaults, TestTypeTokenFilterFactory, QueryParsingTest, TestPHPSerializedResponseWriter, RequiredFieldsTest, TestWordDelimiterFilterFactory, SuggesterWFSTTest, MultiTermTest, TestFastLRUCache, EchoParamsTest, SortByFunctionTest, UpdateParamsTest, ZkNodePropsTest, TestKeywordMarkerFilterFactory, SpellPossibilityIteratorTest, PeerSyncTest, FullSolrCloudDistribCmdsTest, TestIBSimilarityFactory, DateFieldTest, DistributedQueryElevationComponentTest, TestCJKWidthFilterFactory, BadComponentTest, TestPseudoReturnFields, SolrPluginUtilsTest, TestFinnishLightStemFilterFactory, TestLFUCache, ShowFileRequestHandlerTest, TestBinaryResponseWriter, TermsComponentTest, TestQueryTypes, IndexSchemaTest, TestBeiderMorseFilterFactory, TestFunctionQuery, TestTrimFilterFactory, ConvertedLegacyTest, TestPhraseSuggestions, TestPorterStemFilterFactory, TestUtils, LoggingHandlerTest, SignatureUpdateProcessorFactoryTest, FieldAnalysisRequestHandlerTest, TestWikipediaTokenizerFactory, SampleTest, TestGermanLightStemFilterFactory, DocumentAnalysisRequestHandlerTest, TestReverseStringFilterFactory, TestRemoveDuplicatesTokenFilterFactory, TimeZoneUtilsTest, RequestHandlersTest, TestRussianFilters, ZkSolrClientTest, TestCapitalizationFilterFactory, MoreLikeThisHandlerTest, TestStopFilterFactory, CurrencyFieldTest, TestSort, TestRandomFaceting, SpellCheckComponentTest, TestRealTimeGet, URLClassifyProcessorTest, SpellingQueryConverterTest, DistributedSpellCheckComponentTest, IndexBasedSpellCheckerTest, TestValueSourceCache, SOLR749Test, SimpleFacetsTest, TestLRUCache, LeaderElectionTest, TestLuceneMatchVersion, TestFrenchMinimalStemFilterFactory, TestConfig, IndexReaderFactoryTest, QueryElevationComponentTest, DateMathParserTest, TestSolrCoreProperties, TestXIncludeConfig, CopyFieldTest, NodeStateWatcherTest, TestGalicianMinimalStemFilterFactory, TestPhoneticFilterFactory, TestHyphenationCompoundWordTokenFilterFactory, TestCzechStemFilterFactory, SpatialFilterTest, SoftAutoCommitTest, OverseerTest, LeaderElectionIntegrationTest, BasicDistributedZkTest, TestReplicationHandler]
   [junit4]   2> 
   [junit4] Completed in 55.78s, 1 test, 1 failure <<< FAILURES!
   [junit4]  
   [junit4] Suite: org.apache.solr.TestDistributedSearch
   [junit4] Completed in 37.02s, 1 test
   [junit4]  
   [junit4] Suite: org.apache.solr.handler.component.DistributedTermsComponentTest
   [junit4] Completed in 25.37s, 1 test
   [junit4]  
   [junit4] Suite: org.apache.solr.request.TestFaceting
   [junit4] Completed in 19.00s, 3 tests
   [junit4]  
   [junit4] Suite: org.apache.solr.TestGroupingSearch
   [junit4] Completed in 5.62s, 12 tests
   [junit4]  
   [junit4] Suite: org.apache.solr.core.SolrCoreTest
   [junit4] Completed in 7.77s, 5 tests
   [junit4]  
   [junit4] Suite: org.apache.solr.schema.BadIndexSchemaTest
   [junit4] Completed in 1.58s, 6 tests
   [junit4]  
   [junit4] Suite: org.apache.solr.servlet.SolrRequestParserTest
   [junit4] Completed in 1.14s, 4 tests
   [junit4]  
   [junit4] Suite: org.apache.solr.core.TestCoreContainer
   [junit4] Completed in 3.41s, 1 test
   [junit4]  
   [junit4] Suite: org.apache.solr.request.TestWriterPerf
   [junit4] Completed in 1.34s, 1 test
   [junit4]  
   [junit4] Suite: org.apache.solr.highlight.HighlighterTest
   [junit4] Completed in 2.34s, 27 tests
   [junit4]  
   [junit4] Suite: org.apache.solr.handler.CSVRequestHandlerTest
   [junit4] Completed in 0.82s, 1 test
   [junit4]  
   [junit4] Suite: org.apache.solr.update.processor.UniqFieldsUpdateProcessorFactoryTest
   [junit4] Completed in 0.80s, 1 test
   [junit4]  
   [junit4] Suite: org.apache.solr.spelling.SpellCheckCollatorTest
   [junit4] Completed in 1.13s, 5 tests
   [junit4]  
   [junit4] Suite: org.apache.solr.update.DocumentBuilderTest
   [junit4] Completed in 1.00s, 11 tests
   [junit4]  
   [junit4] Suite: org.apache.solr.search.function.distance.DistanceFunctionTest
   [junit4] Completed in 1.21s, 3 tests
   [junit4]  
   [junit4] Suite: org.apache.solr.schema.PolyFieldTest
   [junit4] Completed in 1.49s, 4 tests
   [junit4]  
   [junit4] Suite: org.apache.solr.servlet.CacheHeaderTest
   [junit4] Completed in 1.05s, 5 tests
   [junit4]  
   [junit4] Suite: org.apache.solr.core.TestPropInject
   [junit4] Completed in 1.47s, 2 tests
   [junit4]  
   [junit4] Suite: org.apache.solr.search.TestFoldingMultitermQuery
   [junit4] Completed in 1.35s, 18 tests
   [junit4]  
   [junit4] Suite: org.apache.solr.update.processor.FieldMutatingUpdateProcessorTest
   [junit4] Completed in 0.88s, 20 tests
   [junit4]  
   [junit4] Suite: org.apache.solr.search.TestDocSet
   [junit4] Completed in 0.72s, 2 tests
   [junit4]  
   [junit4] Suite: org.apache.solr.handler.XmlUpdateRequestHandlerTest
   [junit4] Completed in 0.83s, 3 tests
   [junit4]  
   [junit4] Suite: org.apache.solr.analysis.TestReversedWildcardFilterFactory
   [junit4] Completed in 0.69s, 4 tests
   [junit4]  
   [junit4] Suite: org.apache.solr.schema.PrimitiveFieldTypeTest
   [junit4] Completed in 1.15s, 1 test
   [junit4]  
   [junit4] Suite: org.apache.solr.highlight.HighlighterConfigTest
   [junit4] Completed in 0.70s, 1 test
   [junit4]  
   [junit4] Suite: org.apache.solr.schema.TestCollationField
   [junit4] Completed in 0.50s, 8 tests
   [junit4]  
   [junit4] Suite: org.apache.solr.schema.IndexSchemaRuntimeFieldTest
   [junit4] Completed in 0.77s, 1 test
   [junit4]  
   [junit4] Suite: org.apache.solr.handler.component.SearchHandlerTest
   [junit4] Completed in 0.95s, 1 test
   [junit4]  
   [junit4] Suite: org.apache.solr.handler.admin.MBeansHandlerTest
   [junit4] Completed in 0.76s, 1 test
   [junit4]  
   [junit4] Suite: org.apache.solr.core.TestQuerySenderListener
   [junit4] Completed in 0.69s, 3 tests
   [junit4]  
   [junit4] Suite: org.apache.solr.schema.NumericFieldsTest
   [junit4] Completed in 0.48s, 1 test
   [junit4]  
   [junit4] Suite: org.apache.solr.OutputWriterTest
   [junit4] Completed in 0.21s, 5 tests
   [junit4]  
   [junit4] Suite: org.apache.solr.analysis.TestJapaneseTokenizerFactory
   [junit4] Completed in 0.02s, 4 tests
   [junit4]  
   [junit4] Suite: org.apache.solr.search.similarities.TestDefaultSimilarityFactory
   [junit4] Completed in 0.11s, 1 test
   [junit4]  
   [junit4] Suite: org.apache.solr.schema.NotRequiredUniqueKeyTest
   [junit4] Completed in 0.19s, 1 test
   [junit4]  
   [junit4] Suite: org.apache.solr.analysis.TestCollationKeyFilterFactory
   [junit4] Completed in 0.02s, 5 tests
   [junit4]  
   [junit4] Suite: org.apache.solr.search.similarities.TestBM25SimilarityFactory
   [junit4] Completed in 0.16s, 2 tests
   [junit4]  
   [junit4] Suite: org.apache.solr.analysis.TestUAX29URLEmailTokenizerFactory
   [junit4] Completed in 0.08s, 9 tests
   [junit4]  
   [junit4] Suite: org.apache.solr.analysis.TestHTMLStripCharFilterFactory
   [junit4] Completed in 0.03s, 6 tests
   [junit4]  
   [junit4] Suite: org.apache.solr.util.PrimUtilsTest
   [junit4] Completed in 0.04s, 2 tests
   [junit4]  
   [junit4] Suite: org.apache.solr.internal.csv.CSVStrategyTest
   [junit4] Completed in 0.01s, 5 tests
   [junit4]  
   [junit4] Suite: org.apache.solr.analysis.TestGalicianStemFilterFactory
   [junit4] Completed in 0.01s, 1 test
   [junit4]  
   [junit4] Suite: org.apache.solr.analysis.TestPortugueseMinimalStemFilterFactory
   [junit4] Completed in 0.01s, 1 test
   [junit4]  
   [junit4] Suite: org.apache.solr.analysis.TestStandardFactories
   [junit4] Completed in 0.05s, 10 tests
   [junit4]  
   [junit4] Suite: org.apache.solr.util.TestSystemIdResolver
   [junit4] Completed in 0.01s, 1 test
   [junit4]  
   [junit4] Suite: org.apache.solr.analysis.TestMultiWordSynonyms
   [junit4] Completed in 0.01s, 2 tests
   [junit4]  
   [junit4] Suite: org.apache.solr.internal.csv.ExtendedBufferedReaderTest
   [junit4] Completed in 0.02s, 8 tests
   [junit4]  
   [junit4] Suite: org.apache.solr.analysis.TestCJKTokenizerFactory
   [junit4] Completed in 0.01s, 1 test
   [junit4]  
   [junit4] Suite: org.apache.solr.analysis.TestFrenchLightStemFilterFactory
   [junit4] Completed in 0.01s, 1 test
   [junit4]  
   [junit4] Suite: org.apache.solr.analysis.TestPortugueseLightStemFilterFactory
   [junit4] Completed in 0.01s, 1 test
   [junit4]  
   [junit4] Suite: org.apache.solr.analysis.TestSynonymMap
   [junit4] Completed in 0.02s, 6 tests
   [junit4]  
   [junit4] Suite: org.apache.solr.analysis.CommonGramsQueryFilterFactoryTest
   [junit4] Completed in 0.02s, 2 tests
   [junit4]  
   [junit4] Suite: org.apache.solr.analysis.TestDictionaryCompoundWordTokenFilterFactory
   [junit4] Completed in 0.01s, 1 test
   [junit4]  
   [junit4] Suite: org.apache.solr.analysis.TestIndonesianStemFilterFactory
   [junit4] Completed in 0.01s, 2 tests
   [junit4]  
   [junit4] Suite: org.apache.solr.analysis.TestKeepFilterFactory
   [junit4] Completed in 0.01s, 1 test
   [junit4]  
   [junit4] Suite: org.apache.solr.core.TestBadConfig
   [junit4] Completed in 0.01s, 1 test
   [junit4]  
   [junit4] Suite: org.apache.solr.internal.csv.writer.CSVWriterTest
   [junit4] Completed in 0.01s, 2 tests
   [junit4]  
   [junit4] Suite: org.apache.solr.analysis.TestPersianNormalizationFilterFactory
   [junit4] Completed in 0.01s, 1 test
   [junit4]  
   [junit4] Suite: org.apache.solr.analysis.TestSpanishLightStemFilterFactory
   [junit4] Completed in 0.01s, 1 test
   [junit4]  
   [junit4] Suite: org.apache.solr.analysis.TestTurkishLowerCaseFilterFactory
   [junit4] Completed in 0.01s, 1 test
   [junit4]  
   [junit4] Suite: org.apache.solr.analysis.TestBulgarianStemFilterFactory
   [junit4] Completed in 0.01s, 1 test
   [junit4]  
   [junit4] Suite: org.apache.solr.analysis.TestDelimitedPayloadTokenFilterFactory
   [junit4] Completed in 0.01s, 2 tests
   [junit4]  
   [junit4] Suite: org.apache.solr.cloud.CloudStateTest
   [junit4] Completed in 0.01s, 1 test
   [junit4]  
   [junit4] Suite: org.apache.solr.analysis.TestChineseFilterFactory
   [junit4] Completed in 0.01s, 1 test
   [junit4]  
   [junit4] Suite: org.apache.solr.analysis.TestGermanNormalizationFilterFactory
   [junit4] Completed in 0.01s, 1 test
   [junit4]  
   [junit4] Suite: org.apache.solr.cloud.ChaosMonkeySafeLeaderTest
   [junit4] Completed in 0.00s, 0 tests
   [junit4]  
   [junit4] Suite: org.apache.solr.cloud.FullSolrCloudTest
   [junit4] Completed in 0.00s, 0 tests
   [junit4]  
   [junit4] JVM J0:     1.17 ..   929.97 =   928.80s
   [junit4] Execution time total: 15 minutes 30 seconds
   [junit4] Tests summary: 286 suites, 968 tests, 1 failure, 10 ignored (5 assumptions)

BUILD FAILED
<http://jenkins.sd-datasolutions.de/job/Lucene-Solr-trunk-Windows-Java6-64/ws/build.xml>:29: The following error occurred while executing this line:
<http://jenkins.sd-datasolutions.de/job/Lucene-Solr-trunk-Windows-Java6-64/ws/solr\build.xml>:144: The following error occurred while executing this line:
<http://jenkins.sd-datasolutions.de/job/Lucene-Solr-trunk-Windows-Java6-64/ws/lucene\module-build.xml>:62: The following error occurred while executing this line:
<http://jenkins.sd-datasolutions.de/job/Lucene-Solr-trunk-Windows-Java6-64/ws/lucene\common-build.xml>:1019: The following error occurred while executing this line:
<http://jenkins.sd-datasolutions.de/job/Lucene-Solr-trunk-Windows-Java6-64/ws/lucene\common-build.xml>:745: There were test failures: 286 suites, 968 tests, 1 failure, 10 ignored (5 assumptions)

Total time: 37 minutes 19 seconds
Build step 'Invoke Ant' marked build as failure
Recording test results

---------------------------------------------------------------------
To unsubscribe, e-mail: dev-unsubscribe@lucene.apache.org
For additional commands, e-mail: dev-help@lucene.apache.org