You are viewing a plain text version of this content. The canonical link for it is here.
Posted to builds@beam.apache.org by Apache Jenkins Server <je...@builds.apache.org> on 2019/04/15 11:45:32 UTC
Build failed in Jenkins:
beam_PostCommit_Java11_ValidatesRunner_PortabilityApi_Dataflow #173
See <https://builds.apache.org/job/beam_PostCommit_Java11_ValidatesRunner_PortabilityApi_Dataflow/173/display/redirect?page=changes>
Changes:
[iemejia] [BEAM-7075] Create Redis embedded server on @BeforeClass and simplify
------------------------------------------
[...truncated 44.33 KB...]
> Task :beam-runners-google-cloud-dataflow-java-fn-api-worker:shadowJar
> Task :beam-sdks-go:resolveBuildDependencies
Resolving google.golang.org/api: commit='386d4e5f4f92f86e6aec85985761bba4b938a2d5', urls=[https://code.googlesource.com/google-api-go-client]
Resolving google.golang.org/genproto: commit='2b5a72b8730b0b16380010cfe5286c42108d88e7', urls=[https://github.com/google/go-genproto]
Resolving google.golang.org/grpc: commit='7646b5360d049a7ca31e9133315db43456f39e2e', urls=[https://github.com/grpc/grpc-go]
Resolving cached github.com/coreos/etcd: commit='11214aa33bf5a47d3d9d8dafe0f6b97237dfe921', urls=[https://github.com/coreos/etcd.git, git@github.com:coreos/etcd.git]
Resolving cached github.com/coreos/etcd: commit='11214aa33bf5a47d3d9d8dafe0f6b97237dfe921', urls=[https://github.com/coreos/etcd.git, git@github.com:coreos/etcd.git]
> Task :beam-sdks-go:installDependencies
> Task :beam-sdks-go:buildLinuxAmd64
> Task :beam-sdks-go:goBuild
> Task :beam-sdks-java-container:resolveBuildDependencies
Resolving ./github.com/apache/beam/sdks/go@<https://builds.apache.org/job/beam_PostCommit_Java11_ValidatesRunner_PortabilityApi_Dataflow/ws/src/sdks/go>
> Task :beam-sdks-java-container:installDependencies
> Task :beam-sdks-java-container:buildLinuxAmd64
> Task :beam-sdks-java-container:goBuild
> Task :beam-sdks-java-container:dockerPrepare
> Task :beam-sdks-java-container:docker
> Task :beam-runners-google-cloud-dataflow-java:buildAndPushDockerContainer
WARNING: `gcloud docker` will not be supported for Docker client versions above 18.03.
As an alternative, use `gcloud auth configure-docker` to configure `docker` to
use `gcloud` as a credential helper, then use `docker` as you would for non-GCR
registries, e.g. `docker pull gcr.io/project-id/my-image`. Add
`--verbosity=error` to silence this warning: `gcloud docker
--verbosity=error -- pull gcr.io/project-id/my-image`.
See: https://cloud.google.com/container-registry/docs/support/deprecation-notices#gcloud-docker
The push refers to a repository [us.gcr.io/apache-beam-testing/java-postcommit-it/java]
37a777d4c96a: Preparing
8aafe49277f1: Preparing
1f16274b5a8e: Preparing
5c88cb0ae8ce: Preparing
89d791f41102: Preparing
ab5b1b65d8b9: Preparing
4b985886d7b1: Preparing
c4064abeedd9: Preparing
af5ae4841776: Preparing
b17cc31e431b: Preparing
12cb127eee44: Preparing
604829a174eb: Preparing
fbb641a8b943: Preparing
ab5b1b65d8b9: Waiting
12cb127eee44: Waiting
604829a174eb: Waiting
fbb641a8b943: Waiting
b17cc31e431b: Waiting
af5ae4841776: Waiting
c4064abeedd9: Waiting
4b985886d7b1: Waiting
89d791f41102: Layer already exists
ab5b1b65d8b9: Layer already exists
4b985886d7b1: Layer already exists
c4064abeedd9: Layer already exists
af5ae4841776: Layer already exists
b17cc31e431b: Layer already exists
12cb127eee44: Layer already exists
604829a174eb: Layer already exists
fbb641a8b943: Layer already exists
1f16274b5a8e: Pushed
5c88cb0ae8ce: Pushed
37a777d4c96a: Pushed
8aafe49277f1: Pushed
20190415092936: digest: sha256:35128b0dc6ff8aa7cc0b87099ff075b8e89bc2197a4f783d11f204ab1348f680 size: 3048
> Task :beam-runners-google-cloud-dataflow-java:validatesRunnerFnApiWorkerTest
org.apache.beam.sdk.transforms.GroupByKeyTest$BasicTests > testGroupByKeyEmpty FAILED
java.lang.RuntimeException at GroupByKeyTest.java:145
org.apache.beam.sdk.transforms.ParDoTest$BasicTests > testParDoEmpty FAILED
java.lang.RuntimeException at ParDoTest.java:362
org.apache.beam.sdk.testing.PAssertTest > testIsEqualTo FAILED
java.lang.RuntimeException at PAssertTest.java:308
org.apache.beam.sdk.transforms.ReifyTimestampsTest > inValuesSucceeds FAILED
java.lang.RuntimeException at ReifyTimestampsTest.java:60
org.apache.beam.sdk.transforms.ViewTest > testEmptyIterableSideInput FAILED
java.lang.RuntimeException at ViewTest.java:470
org.apache.beam.sdk.transforms.ReshuffleTest > testReshuffleAfterFixedWindowsAndGroupByKey FAILED
java.lang.RuntimeException at ReshuffleTest.java:190
org.apache.beam.sdk.PipelineTest > testTupleProjectionTransform FAILED
java.lang.RuntimeException at PipelineTest.java:316
org.apache.beam.sdk.transforms.ReshuffleTest > testReshuffleAfterSlidingWindows FAILED
java.lang.RuntimeException at ReshuffleTest.java:251
org.apache.beam.sdk.transforms.windowing.WindowingTest > testNonPartitioningWindowing FAILED
java.lang.RuntimeException at WindowingTest.java:150
org.apache.beam.sdk.transforms.ParDoTest$MultipleInputsAndOutputTests > testSideInputsWithMultipleWindows FAILED
java.lang.RuntimeException at ParDoTest.java:895
org.apache.beam.sdk.testing.PAssertTest > testEmpty FAILED
java.lang.RuntimeException at PAssertTest.java:451
org.apache.beam.sdk.transforms.ViewTest > testSideInputWithNestedIterables FAILED
java.lang.RuntimeException at ViewTest.java:1539
org.apache.beam.sdk.testing.PAssertTest > testWindowedContainsInAnyOrder FAILED
java.lang.RuntimeException at PAssertTest.java:441
org.apache.beam.sdk.transforms.ParDoTest$MultipleInputsAndOutputTests > testParDoEmptyWithTaggedOutput FAILED
java.lang.RuntimeException at ParDoTest.java:634
org.apache.beam.sdk.transforms.ViewTest > testListSideInput FAILED
java.lang.RuntimeException at ViewTest.java:241
org.apache.beam.sdk.transforms.ReshuffleTest > testReshufflePreservesTimestamps FAILED
java.lang.RuntimeException at ReshuffleTest.java:148
org.apache.beam.sdk.transforms.ParDoTest$StateTests > testValueStateSimple FAILED
java.lang.RuntimeException at ParDoTest.java:1426
org.apache.beam.sdk.transforms.WithTimestampsTest > withTimestampsLambdaShouldApplyTimestamps FAILED
java.lang.RuntimeException at WithTimestampsTest.java:205
org.apache.beam.sdk.transforms.ViewTest > testMapSideInput FAILED
java.lang.RuntimeException at ViewTest.java:945
org.apache.beam.sdk.transforms.ReshuffleTest > testReshuffleAfterSlidingWindowsAndGroupByKey FAILED
java.lang.RuntimeException at ReshuffleTest.java:211
org.apache.beam.sdk.transforms.ParDoTest$MultipleInputsAndOutputTests > testParDoWithTaggedOutput FAILED
java.lang.RuntimeException at ParDoTest.java:592
org.apache.beam.sdk.transforms.join.CoGroupByKeyTest > testCoGroupByKeyHandleResults FAILED
java.lang.RuntimeException at CoGroupByKeyTest.java:466
org.apache.beam.sdk.transforms.ParDoTest$MultipleInputsAndOutputTests > testMultiOutputParDoWithSideInputsIsCumulative FAILED
java.lang.RuntimeException at ParDoTest.java:847
org.apache.beam.sdk.transforms.join.CoGroupByKeyTest > testCoGroupByKeyWithWindowing FAILED
java.lang.RuntimeException at CoGroupByKeyTest.java:494
org.apache.beam.sdk.transforms.ParDoTest$StateTests > testBagStateSideInput FAILED
java.lang.RuntimeException at ParDoTest.java:2011
org.apache.beam.sdk.transforms.CombineTest$WindowingTests > testCombineGloballyAsSingletonView FAILED
java.lang.RuntimeException at CombineTest.java:1326
org.apache.beam.sdk.transforms.ParDoTest$MultipleInputsAndOutputTests > testParDoWithEmptyTaggedOutput FAILED
java.lang.RuntimeException at ParDoTest.java:658
org.apache.beam.sdk.transforms.ReshuffleTest > testJustReshuffle FAILED
java.lang.RuntimeException at ReshuffleTest.java:102
org.apache.beam.sdk.transforms.CombineTest$BasicTests > testCombinePerKeyLambda FAILED
java.lang.RuntimeException at CombineTest.java:907
org.apache.beam.sdk.transforms.ParDoTest$StateTests > testCombiningStateParameterSuperclass FAILED
java.lang.RuntimeException at ParDoTest.java:1960
org.apache.beam.sdk.transforms.GroupByKeyTest$WindowTests > testGroupByKeyAndWindows FAILED
java.lang.RuntimeException at GroupByKeyTest.java:422
org.apache.beam.sdk.transforms.ParDoTest$MultipleInputsAndOutputTests > testParDoWithSideInputs FAILED
java.lang.RuntimeException at ParDoTest.java:737
org.apache.beam.sdk.transforms.ParDoTest$StateTests > testValueStateDedup FAILED
java.lang.RuntimeException at ParDoTest.java:1476
org.apache.beam.sdk.transforms.CombineTest$WindowingTests > testSlidingWindowsCombine FAILED
java.lang.RuntimeException at CombineTest.java:1131
org.apache.beam.sdk.transforms.ParDoTest$MultipleInputsAndOutputTests > testParDoWithSideInputsIsCumulative FAILED
java.lang.RuntimeException at ParDoTest.java:771
org.apache.beam.sdk.transforms.CombineTest$WindowingTests > testSessionsCombine FAILED
java.lang.RuntimeException at CombineTest.java:1235
org.apache.beam.sdk.transforms.CombineTest$WindowingTests > testWindowedCombineGloballyAsSingletonView FAILED
java.lang.RuntimeException at CombineTest.java:1369
org.apache.beam.sdk.transforms.CombineTest$BasicTests > testHotKeyCombiningWithAccumulationMode FAILED
java.lang.RuntimeException at CombineTest.java:761
org.apache.beam.sdk.transforms.GroupByKeyTest$BasicTests > testGroupByKey FAILED
java.lang.RuntimeException at GroupByKeyTest.java:128
org.apache.beam.sdk.transforms.CombineTest$WindowingTests > testCombineGloballyInstanceMethodReference FAILED
java.lang.RuntimeException at CombineTest.java:1403
org.apache.beam.sdk.transforms.GroupByKeyTest$BasicTests > testLargeKeys10KB FAILED
java.lang.RuntimeException at GroupByKeyTest.java:353
org.apache.beam.sdk.transforms.FlattenTest > testFlattenIterablesLists FAILED
java.lang.RuntimeException at FlattenTest.java:265
org.apache.beam.sdk.transforms.FlattenTest > testFlattenInputMultipleCopies FAILED
java.lang.RuntimeException at FlattenTest.java:162
org.apache.beam.sdk.transforms.ViewTest > testWindowedIterableSideInput FAILED
java.lang.RuntimeException at ViewTest.java:442
org.apache.beam.sdk.transforms.GroupByKeyTest$BasicTests > testLargeKeys100KB FAILED
java.lang.RuntimeException at GroupByKeyTest.java:359
org.apache.beam.sdk.testing.PAssertTest > testPAssertEqualsSingletonFalseDefaultReasonString FAILED
java.lang.AssertionError at PAssertTest.java:385
154 tests completed, 46 failed, 2 skipped
> Task :beam-runners-google-cloud-dataflow-java:validatesRunnerFnApiWorkerTest FAILED
> Task :beam-runners-google-cloud-dataflow-java:cleanUpDockerImages
Untagged: us.gcr.io/apache-beam-testing/java-postcommit-it/java:20190415092936
Untagged: us.gcr.io/apache-beam-testing/java-postcommit-it/java@sha256:35128b0dc6ff8aa7cc0b87099ff075b8e89bc2197a4f783d11f204ab1348f680
Digests:
- us.gcr.io/apache-beam-testing/java-postcommit-it/java@sha256:35128b0dc6ff8aa7cc0b87099ff075b8e89bc2197a4f783d11f204ab1348f680
Associated tags:
- 20190415092936
Tags:
- us.gcr.io/apache-beam-testing/java-postcommit-it/java:20190415092936
Deleted [us.gcr.io/apache-beam-testing/java-postcommit-it/java:20190415092936].
Deleted [us.gcr.io/apache-beam-testing/java-postcommit-it/java@sha256:35128b0dc6ff8aa7cc0b87099ff075b8e89bc2197a4f783d11f204ab1348f680].
FAILURE: Build failed with an exception.
* What went wrong:
Execution failed for task ':beam-runners-google-cloud-dataflow-java:validatesRunnerFnApiWorkerTest'.
> There were failing tests. See the report at: file://<https://builds.apache.org/job/beam_PostCommit_Java11_ValidatesRunner_PortabilityApi_Dataflow/ws/src/runners/google-cloud-dataflow-java/build/reports/tests/validatesRunnerFnApiWorkerTest/index.html>
* Try:
Run with --stacktrace option to get the stack trace. Run with --info or --debug option to get more log output. Run with --scan to get full insights.
* Get more help at https://help.gradle.org
Deprecated Gradle features were used in this build, making it incompatible with Gradle 6.0.
Use '--warning-mode all' to show the individual deprecation warnings.
See https://docs.gradle.org/5.2.1/userguide/command_line_interface.html#sec:command_line_warnings
BUILD FAILED in 2h 16m 5s
76 actionable tasks: 57 executed, 18 from cache, 1 up-to-date
Publishing build scan...
https://gradle.com/s/khhzxyuu4llhc
Build step 'Invoke Gradle script' changed build result to FAILURE
Build step 'Invoke Gradle script' marked build as failure
---------------------------------------------------------------------
To unsubscribe, e-mail: builds-unsubscribe@beam.apache.org
For additional commands, e-mail: builds-help@beam.apache.org
Jenkins build is back to normal :
beam_PostCommit_Java11_ValidatesRunner_PortabilityApi_Dataflow #175
Posted by Apache Jenkins Server <je...@builds.apache.org>.
See <https://builds.apache.org/job/beam_PostCommit_Java11_ValidatesRunner_PortabilityApi_Dataflow/175/display/redirect>
---------------------------------------------------------------------
To unsubscribe, e-mail: builds-unsubscribe@beam.apache.org
For additional commands, e-mail: builds-help@beam.apache.org
Build failed in Jenkins:
beam_PostCommit_Java11_ValidatesRunner_PortabilityApi_Dataflow #174
Posted by Apache Jenkins Server <je...@builds.apache.org>.
See <https://builds.apache.org/job/beam_PostCommit_Java11_ValidatesRunner_PortabilityApi_Dataflow/174/display/redirect?page=changes>
Changes:
[kcweaver] [BEAM-7067] make cleanArtifactsPerJob configurable for Flink job server
[iemejia] [BEAM-7076] Update Spark runner to use spark version 2.4.1
[iemejia] [BEAM-7076] Multiple static analysis fixes on Spark runner
------------------------------------------
[...truncated 35.12 KB...]
> Task :beam-sdks-java-extensions-protobuf:extractIncludeProto
> Task :beam-sdks-java-extensions-protobuf:generateProto NO-SOURCE
> Task :beam-vendor-sdks-java-extensions-protobuf:compileJava
Note: Some input files use or override a deprecated API.
Note: Recompile with -Xlint:deprecation for details.
> Task :beam-sdks-java-extensions-protobuf:compileJava
Note: Some input files use or override a deprecated API.
Note: Recompile with -Xlint:deprecation for details.
> Task :beam-sdks-java-extensions-protobuf:classes
> Task :beam-vendor-sdks-java-extensions-protobuf:classes
> Task :beam-sdks-java-fn-execution:compileJava
Note: <https://builds.apache.org/job/beam_PostCommit_Java11_ValidatesRunner_PortabilityApi_Dataflow/ws/src/sdks/java/fn-execution/src/main/java/org/apache/beam/sdk/fn/data/BeamFnDataBufferingOutboundObserver.java> uses or overrides a deprecated API.
Note: Recompile with -Xlint:deprecation for details.
Note: Some input files use unchecked or unsafe operations.
Note: Recompile with -Xlint:unchecked for details.
> Task :beam-sdks-java-extensions-protobuf:shadowJar
> Task :beam-sdks-java-fn-execution:classes
> Task :beam-sdks-java-fn-execution:shadowJar
> Task :beam-sdks-java-extensions-google-cloud-platform-core:compileJava
Note: <https://builds.apache.org/job/beam_PostCommit_Java11_ValidatesRunner_PortabilityApi_Dataflow/ws/src/sdks/java/extensions/google-cloud-platform-core/src/main/java/org/apache/beam/sdk/extensions/gcp/util/GcsUtil.java> uses or overrides a deprecated API.
Note: Recompile with -Xlint:deprecation for details.
> Task :beam-sdks-java-extensions-google-cloud-platform-core:classes
> Task :beam-vendor-sdks-java-extensions-protobuf:shadowJar
> Task :beam-sdks-java-extensions-google-cloud-platform-core:shadowJar
> Task :beam-runners-core-construction-java:compileJava
Note: Some input files use or override a deprecated API.
Note: Recompile with -Xlint:deprecation for details.
Note: Some input files use unchecked or unsafe operations.
Note: Recompile with -Xlint:unchecked for details.
> Task :beam-runners-core-construction-java:classes
> Task :beam-runners-core-construction-java:shadowJar
> Task :beam-runners-core-java:compileJava
Note: Some input files use or override a deprecated API.
Note: Recompile with -Xlint:deprecation for details.
Note: Some input files use unchecked or unsafe operations.
Note: Recompile with -Xlint:unchecked for details.
> Task :beam-runners-core-java:classes
> Task :beam-runners-core-java:shadowJar
> Task :beam-sdks-java-core:compileTestJava
> Task :beam-sdks-java-io-google-cloud-platform:compileJava
Note: Some input files use or override a deprecated API.
Note: Recompile with -Xlint:deprecation for details.
Note: Some input files use unchecked or unsafe operations.
Note: Recompile with -Xlint:unchecked for details.
> Task :beam-sdks-java-io-google-cloud-platform:classes
> Task :beam-sdks-java-io-google-cloud-platform:shadowJar
> Task :beam-sdks-java-core:compileTestJava
Note: Some input files use or override a deprecated API.
Note: Recompile with -Xlint:deprecation for details.
Note: Some input files use unchecked or unsafe operations.
Note: Recompile with -Xlint:unchecked for details.
> Task :beam-sdks-java-harness:compileJava
Note: Some input files use or override a deprecated API.
Note: Recompile with -Xlint:deprecation for details.
Note: Some input files use unchecked or unsafe operations.
Note: Recompile with -Xlint:unchecked for details.
> Task :beam-sdks-java-harness:classes
> Task :beam-sdks-java-core:testClasses
> Task :beam-runners-google-cloud-dataflow-java:compileJava
Note: Some input files use or override a deprecated API.
Note: Recompile with -Xlint:deprecation for details.
Note: Some input files use unchecked or unsafe operations.
Note: Recompile with -Xlint:unchecked for details.
> Task :beam-runners-google-cloud-dataflow-java:classes
> Task :beam-runners-google-cloud-dataflow-java:shadowJar
> Task :beam-sdks-go:resolveBuildDependencies
Resolving google.golang.org/api: commit='386d4e5f4f92f86e6aec85985761bba4b938a2d5', urls=[https://code.googlesource.com/google-api-go-client]
> Task :beam-sdks-java-core:shadowTestJar
> Task :beam-sdks-go:resolveBuildDependencies
Resolving google.golang.org/genproto: commit='2b5a72b8730b0b16380010cfe5286c42108d88e7', urls=[https://github.com/google/go-genproto]
Resolving google.golang.org/grpc: commit='7646b5360d049a7ca31e9133315db43456f39e2e', urls=[https://github.com/grpc/grpc-go]
Resolving cached github.com/coreos/etcd: commit='11214aa33bf5a47d3d9d8dafe0f6b97237dfe921', urls=[https://github.com/coreos/etcd.git, git@github.com:coreos/etcd.git]
Resolving cached github.com/coreos/etcd: commit='11214aa33bf5a47d3d9d8dafe0f6b97237dfe921', urls=[https://github.com/coreos/etcd.git, git@github.com:coreos/etcd.git]
> Task :beam-sdks-go:installDependencies
> Task :beam-sdks-go:buildLinuxAmd64
> Task :beam-sdks-go:goBuild
> Task :beam-sdks-java-container:resolveBuildDependencies
Resolving ./github.com/apache/beam/sdks/go@<https://builds.apache.org/job/beam_PostCommit_Java11_ValidatesRunner_PortabilityApi_Dataflow/ws/src/sdks/go>
> Task :beam-sdks-java-container:installDependencies
> Task :beam-sdks-java-container:buildLinuxAmd64
> Task :beam-sdks-java-container:goBuild
> Task :beam-sdks-java-harness:shadowJar
> Task :beam-sdks-java-harness:jar
> Task :beam-sdks-java-container:copyDockerfileDependencies
> Task :beam-sdks-java-container:dockerPrepare
> Task :beam-sdks-java-container:docker
> Task :beam-runners-java-fn-execution:compileJava
Note: <https://builds.apache.org/job/beam_PostCommit_Java11_ValidatesRunner_PortabilityApi_Dataflow/ws/src/runners/java-fn-execution/src/main/java/org/apache/beam/runners/fnexecution/ServerFactory.java> uses or overrides a deprecated API.
Note: Recompile with -Xlint:deprecation for details.
Note: Some input files use unchecked or unsafe operations.
Note: Recompile with -Xlint:unchecked for details.
> Task :beam-runners-java-fn-execution:classes
> Task :beam-runners-google-cloud-dataflow-java:buildAndPushDockerContainer
WARNING: `gcloud docker` will not be supported for Docker client versions above 18.03.
As an alternative, use `gcloud auth configure-docker` to configure `docker` to
use `gcloud` as a credential helper, then use `docker` as you would for non-GCR
registries, e.g. `docker pull gcr.io/project-id/my-image`. Add
`--verbosity=error` to silence this warning: `gcloud docker
--verbosity=error -- pull gcr.io/project-id/my-image`.
See: https://cloud.google.com/container-registry/docs/support/deprecation-notices#gcloud-docker
The push refers to a repository [us.gcr.io/apache-beam-testing/java-postcommit-it/java]
4e13fc00ae88: Preparing
b0fc740a481b: Preparing
a10e253ea159: Preparing
9546cfbe2601: Preparing
89d791f41102: Preparing
ab5b1b65d8b9: Preparing
4b985886d7b1: Preparing
ab5b1b65d8b9: Waiting
c4064abeedd9: Preparing
af5ae4841776: Preparing
4b985886d7b1: Waiting
c4064abeedd9: Waiting
b17cc31e431b: Preparing
12cb127eee44: Preparing
604829a174eb: Preparing
b17cc31e431b: Waiting
12cb127eee44: Waiting
fbb641a8b943: Preparing
604829a174eb: Waiting
fbb641a8b943: Waiting
89d791f41102: Layer already exists
ab5b1b65d8b9: Layer already exists
4b985886d7b1: Layer already exists
c4064abeedd9: Layer already exists
af5ae4841776: Layer already exists
b17cc31e431b: Layer already exists
12cb127eee44: Layer already exists
604829a174eb: Layer already exists
fbb641a8b943: Layer already exists
a10e253ea159: Pushed
9546cfbe2601: Pushed
4e13fc00ae88: Pushed
> Task :beam-runners-java-fn-execution:shadowJar
> Task :beam-runners-google-cloud-dataflow-java-fn-api-worker:compileJava
Note: Some input files use or override a deprecated API.
Note: Recompile with -Xlint:deprecation for details.
Note: Some input files use unchecked or unsafe operations.
Note: Recompile with -Xlint:unchecked for details.
> Task :beam-runners-google-cloud-dataflow-java-fn-api-worker:classes
> Task :beam-runners-google-cloud-dataflow-java-fn-api-worker:shadowJar
> Task :beam-runners-google-cloud-dataflow-java:validatesRunnerFnApiWorkerTest
org.apache.beam.sdk.transforms.ViewTest > testListSideInput FAILED
java.lang.RuntimeException at ViewTest.java:241
org.apache.beam.sdk.transforms.ViewTest > testMapSideInput FAILED
java.lang.RuntimeException at ViewTest.java:945
org.apache.beam.sdk.transforms.CombineTest$WindowingTests > testSessionsCombine FAILED
java.lang.RuntimeException at CombineTest.java:1235
org.apache.beam.sdk.transforms.CreateTest > testCreate FAILED
java.lang.RuntimeException at CreateTest.java:90
org.apache.beam.sdk.transforms.ViewTest > testWindowedSideInputFixedToFixedWithDefault FAILED
java.lang.RuntimeException at ViewTest.java:1455
org.apache.beam.sdk.transforms.ParDoTest$StateTests > testCombiningStateParameterSuperclass FAILED
java.lang.RuntimeException at ParDoTest.java:1960
org.apache.beam.sdk.transforms.CombineTest$WindowingTests > testWindowedCombineGloballyAsSingletonView FAILED
java.lang.RuntimeException at CombineTest.java:1369
org.apache.beam.sdk.transforms.ViewTest > testWindowedIterableSideInput FAILED
java.lang.RuntimeException at ViewTest.java:442
org.apache.beam.sdk.transforms.GroupByKeyTest$BasicTests > testLargeKeys10KB FAILED
java.lang.RuntimeException at GroupByKeyTest.java:353
org.apache.beam.sdk.transforms.CombineTest$BasicTests > testBasicCombineEmpty FAILED
java.lang.RuntimeException at CombineTest.java:687
org.apache.beam.sdk.transforms.GroupByKeyTest$BasicTests > testLargeKeys100KB FAILED
java.lang.RuntimeException at GroupByKeyTest.java:359
org.apache.beam.sdk.transforms.ViewTest > testSingletonSideInput FAILED
java.lang.RuntimeException at ViewTest.java:113
154 tests completed, 12 failed, 2 skipped
> Task :beam-runners-google-cloud-dataflow-java:validatesRunnerFnApiWorkerTest FAILED
> Task :beam-runners-google-cloud-dataflow-java:cleanUpDockerImages
Digests:
- us.gcr.io/apache-beam-testing/java-postcommit-it/java@sha256:58b52fef389d50686657ac64faef4215d514b91cfa89aa17d621d37dbc4c718a
Associated tags:
- 20190415114559
Tags:
- us.gcr.io/apache-beam-testing/java-postcommit-it/java:20190415114559
Deleted [us.gcr.io/apache-beam-testing/java-postcommit-it/java:20190415114559].
Deleted [us.gcr.io/apache-beam-testing/java-postcommit-it/java@sha256:58b52fef389d50686657ac64faef4215d514b91cfa89aa17d621d37dbc4c718a].
FAILURE: Build failed with an exception.
* What went wrong:
Execution failed for task ':beam-runners-google-cloud-dataflow-java:validatesRunnerFnApiWorkerTest'.
> There were failing tests. See the report at: file://<https://builds.apache.org/job/beam_PostCommit_Java11_ValidatesRunner_PortabilityApi_Dataflow/ws/src/runners/google-cloud-dataflow-java/build/reports/tests/validatesRunnerFnApiWorkerTest/index.html>
* Try:
Run with --stacktrace option to get the stack trace. Run with --info or --debug option to get more log output. Run with --scan to get full insights.
* Get more help at https://help.gradle.org
Deprecated Gradle features were used in this build, making it incompatible with Gradle 6.0.
Use '--warning-mode all' to show the individual deprecation warnings.
See https://docs.gradle.org/5.2.1/userguide/command_line_interface.html#sec:command_line_warnings
BUILD FAILED in 2h 20m 21s
76 actionable tasks: 74 executed, 1 from cache, 1 up-to-date
Publishing build scan...
https://gradle.com/s/tvmrrwd6bhkrc
Build step 'Invoke Gradle script' changed build result to FAILURE
Build step 'Invoke Gradle script' marked build as failure
---------------------------------------------------------------------
To unsubscribe, e-mail: builds-unsubscribe@beam.apache.org
For additional commands, e-mail: builds-help@beam.apache.org