You are viewing a plain text version of this content. The canonical link for it is here.
Posted to builds@lucene.apache.org by Policeman Jenkins Server <je...@thetaphi.de> on 2020/01/02 22:36:44 UTC

[JENKINS] Lucene-Solr-8.x-Windows (64bit/jdk-11.0.4) - Build # 626 - Unstable!

Build: https://jenkins.thetaphi.de/job/Lucene-Solr-8.x-Windows/626/
Java: 64bit/jdk-11.0.4 -XX:+UseCompressedOops -XX:+UseG1GC

4 tests failed.
FAILED:  org.apache.solr.cloud.LegacyCloudClusterPropTest.testCreateCollectionSwitchLegacyCloud

Error Message:
IOException occurred when talking to server at: https://127.0.0.1:64370/solr

Stack Trace:
org.apache.solr.client.solrj.SolrServerException: IOException occurred when talking to server at: https://127.0.0.1:64370/solr
	at __randomizedtesting.SeedInfo.seed([6574A549D50BE0DD:B47357CC71046BEF]:0)
	at org.apache.solr.client.solrj.impl.HttpSolrClient.executeMethod(HttpSolrClient.java:679)
	at org.apache.solr.client.solrj.impl.HttpSolrClient.request(HttpSolrClient.java:265)
	at org.apache.solr.client.solrj.impl.HttpSolrClient.request(HttpSolrClient.java:248)
	at org.apache.solr.client.solrj.impl.LBSolrClient.doRequest(LBSolrClient.java:368)
	at org.apache.solr.client.solrj.impl.LBSolrClient.request(LBSolrClient.java:296)
	at org.apache.solr.client.solrj.impl.BaseCloudSolrClient.sendRequest(BaseCloudSolrClient.java:1143)
	at org.apache.solr.client.solrj.impl.BaseCloudSolrClient.requestWithRetryOnStaleState(BaseCloudSolrClient.java:906)
	at org.apache.solr.client.solrj.impl.BaseCloudSolrClient.request(BaseCloudSolrClient.java:838)
	at org.apache.solr.client.solrj.SolrRequest.process(SolrRequest.java:211)
	at org.apache.solr.client.solrj.SolrRequest.process(SolrRequest.java:228)
	at org.apache.solr.cloud.LegacyCloudClusterPropTest.createAndTest(LegacyCloudClusterPropTest.java:87)
	at org.apache.solr.cloud.LegacyCloudClusterPropTest.testCreateCollectionSwitchLegacyCloud(LegacyCloudClusterPropTest.java:79)
	at java.base/jdk.internal.reflect.NativeMethodAccessorImpl.invoke0(Native Method)
	at java.base/jdk.internal.reflect.NativeMethodAccessorImpl.invoke(NativeMethodAccessorImpl.java:62)
	at java.base/jdk.internal.reflect.DelegatingMethodAccessorImpl.invoke(DelegatingMethodAccessorImpl.java:43)
	at java.base/java.lang.reflect.Method.invoke(Method.java:566)
	at com.carrotsearch.randomizedtesting.RandomizedRunner.invoke(RandomizedRunner.java:1750)
	at com.carrotsearch.randomizedtesting.RandomizedRunner$8.evaluate(RandomizedRunner.java:938)
	at com.carrotsearch.randomizedtesting.RandomizedRunner$9.evaluate(RandomizedRunner.java:974)
	at com.carrotsearch.randomizedtesting.RandomizedRunner$10.evaluate(RandomizedRunner.java:988)
	at com.carrotsearch.randomizedtesting.rules.SystemPropertiesRestoreRule$1.evaluate(SystemPropertiesRestoreRule.java:57)
	at org.apache.lucene.util.TestRuleSetupTeardownChained$1.evaluate(TestRuleSetupTeardownChained.java:49)
	at org.apache.lucene.util.AbstractBeforeAfterRule$1.evaluate(AbstractBeforeAfterRule.java:45)
	at org.apache.lucene.util.TestRuleThreadAndTestName$1.evaluate(TestRuleThreadAndTestName.java:48)
	at org.apache.lucene.util.TestRuleIgnoreAfterMaxFailures$1.evaluate(TestRuleIgnoreAfterMaxFailures.java:64)
	at org.apache.lucene.util.TestRuleMarkFailure$1.evaluate(TestRuleMarkFailure.java:47)
	at com.carrotsearch.randomizedtesting.rules.StatementAdapter.evaluate(StatementAdapter.java:36)
	at com.carrotsearch.randomizedtesting.ThreadLeakControl$StatementRunner.run(ThreadLeakControl.java:368)
	at com.carrotsearch.randomizedtesting.ThreadLeakControl.forkTimeoutingTask(ThreadLeakControl.java:817)
	at com.carrotsearch.randomizedtesting.ThreadLeakControl$3.evaluate(ThreadLeakControl.java:468)
	at com.carrotsearch.randomizedtesting.RandomizedRunner.runSingleTest(RandomizedRunner.java:947)
	at com.carrotsearch.randomizedtesting.RandomizedRunner$5.evaluate(RandomizedRunner.java:832)
	at com.carrotsearch.randomizedtesting.RandomizedRunner$6.evaluate(RandomizedRunner.java:883)
	at com.carrotsearch.randomizedtesting.RandomizedRunner$7.evaluate(RandomizedRunner.java:894)
	at com.carrotsearch.randomizedtesting.rules.StatementAdapter.evaluate(StatementAdapter.java:36)
	at com.carrotsearch.randomizedtesting.rules.SystemPropertiesRestoreRule$1.evaluate(SystemPropertiesRestoreRule.java:57)
	at org.apache.lucene.util.AbstractBeforeAfterRule$1.evaluate(AbstractBeforeAfterRule.java:45)
	at com.carrotsearch.randomizedtesting.rules.StatementAdapter.evaluate(StatementAdapter.java:36)
	at org.apache.lucene.util.TestRuleStoreClassName$1.evaluate(TestRuleStoreClassName.java:41)
	at com.carrotsearch.randomizedtesting.rules.NoShadowingOrOverridesOnMethodsRule$1.evaluate(NoShadowingOrOverridesOnMethodsRule.java:40)
	at com.carrotsearch.randomizedtesting.rules.NoShadowingOrOverridesOnMethodsRule$1.evaluate(NoShadowingOrOverridesOnMethodsRule.java:40)
	at com.carrotsearch.randomizedtesting.rules.StatementAdapter.evaluate(StatementAdapter.java:36)
	at com.carrotsearch.randomizedtesting.rules.StatementAdapter.evaluate(StatementAdapter.java:36)
	at org.apache.lucene.util.TestRuleAssertionsRequired$1.evaluate(TestRuleAssertionsRequired.java:53)
	at org.apache.lucene.util.TestRuleMarkFailure$1.evaluate(TestRuleMarkFailure.java:47)
	at org.apache.lucene.util.TestRuleIgnoreAfterMaxFailures$1.evaluate(TestRuleIgnoreAfterMaxFailures.java:64)
	at org.apache.lucene.util.TestRuleIgnoreTestSuites$1.evaluate(TestRuleIgnoreTestSuites.java:54)
	at com.carrotsearch.randomizedtesting.rules.StatementAdapter.evaluate(StatementAdapter.java:36)
	at com.carrotsearch.randomizedtesting.ThreadLeakControl$StatementRunner.run(ThreadLeakControl.java:368)
	at java.base/java.lang.Thread.run(Thread.java:834)
Caused by: javax.net.ssl.SSLException: Software caused connection abort: recv failed
	at java.base/sun.security.ssl.Alert.createSSLException(Alert.java:127)
	at java.base/sun.security.ssl.TransportContext.fatal(TransportContext.java:320)
	at java.base/sun.security.ssl.TransportContext.fatal(TransportContext.java:263)
	at java.base/sun.security.ssl.TransportContext.fatal(TransportContext.java:258)
	at java.base/sun.security.ssl.SSLSocketImpl.handleException(SSLSocketImpl.java:1315)
	at java.base/sun.security.ssl.SSLSocketImpl$AppInputStream.read(SSLSocketImpl.java:839)
	at org.apache.http.impl.io.SessionInputBufferImpl.streamRead(SessionInputBufferImpl.java:137)
	at org.apache.http.impl.io.SessionInputBufferImpl.fillBuffer(SessionInputBufferImpl.java:153)
	at org.apache.http.impl.io.SessionInputBufferImpl.readLine(SessionInputBufferImpl.java:280)
	at org.apache.http.impl.conn.DefaultHttpResponseParser.parseHead(DefaultHttpResponseParser.java:138)
	at org.apache.http.impl.conn.DefaultHttpResponseParser.parseHead(DefaultHttpResponseParser.java:56)
	at org.apache.http.impl.io.AbstractMessageParser.parse(AbstractMessageParser.java:259)
	at org.apache.http.impl.DefaultBHttpClientConnection.receiveResponseHeader(DefaultBHttpClientConnection.java:163)
	at org.apache.http.impl.conn.CPoolProxy.receiveResponseHeader(CPoolProxy.java:157)
	at org.apache.http.protocol.HttpRequestExecutor.doReceiveResponse(HttpRequestExecutor.java:273)
	at org.apache.http.protocol.HttpRequestExecutor.execute(HttpRequestExecutor.java:125)
	at org.apache.http.impl.execchain.MainClientExec.execute(MainClientExec.java:272)
	at org.apache.http.impl.execchain.ProtocolExec.execute(ProtocolExec.java:186)
	at org.apache.http.impl.execchain.RetryExec.execute(RetryExec.java:89)
	at org.apache.http.impl.execchain.RedirectExec.execute(RedirectExec.java:110)
	at org.apache.http.impl.client.InternalHttpClient.doExecute(InternalHttpClient.java:185)
	at org.apache.http.impl.client.CloseableHttpClient.execute(CloseableHttpClient.java:83)
	at org.apache.http.impl.client.CloseableHttpClient.execute(CloseableHttpClient.java:56)
	at org.apache.solr.client.solrj.impl.HttpSolrClient.executeMethod(HttpSolrClient.java:564)
	... 49 more
	Suppressed: java.net.SocketException: Software caused connection abort: socket write error
		at java.base/java.net.SocketOutputStream.socketWrite0(Native Method)
		at java.base/java.net.SocketOutputStream.socketWrite(SocketOutputStream.java:110)
		at java.base/java.net.SocketOutputStream.write(SocketOutputStream.java:150)
		at java.base/sun.security.ssl.SSLSocketOutputRecord.encodeAlert(SSLSocketOutputRecord.java:81)
		at java.base/sun.security.ssl.TransportContext.fatal(TransportContext.java:351)
		... 71 more
Caused by: java.net.SocketException: Software caused connection abort: recv failed
	at java.base/java.net.SocketInputStream.socketRead0(Native Method)
	at java.base/java.net.SocketInputStream.socketRead(SocketInputStream.java:115)
	at java.base/java.net.SocketInputStream.read(SocketInputStream.java:168)
	at java.base/java.net.SocketInputStream.read(SocketInputStream.java:140)
	at java.base/sun.security.ssl.SSLSocketInputRecord.read(SSLSocketInputRecord.java:448)
	at java.base/sun.security.ssl.SSLSocketInputRecord.bytesInCompletePacket(SSLSocketInputRecord.java:68)
	at java.base/sun.security.ssl.SSLSocketImpl.readApplicationRecord(SSLSocketImpl.java:1104)
	at java.base/sun.security.ssl.SSLSocketImpl$AppInputStream.read(SSLSocketImpl.java:823)
	... 67 more


FAILED:  org.apache.solr.cloud.LegacyCloudClusterPropTest.testCreateCollectionSwitchLegacyCloud

Error Message:
IOException occurred when talking to server at: https://127.0.0.1:64405/solr

Stack Trace:
org.apache.solr.client.solrj.SolrServerException: IOException occurred when talking to server at: https://127.0.0.1:64405/solr
	at __randomizedtesting.SeedInfo.seed([6574A549D50BE0DD:B47357CC71046BEF]:0)
	at org.apache.solr.client.solrj.impl.HttpSolrClient.executeMethod(HttpSolrClient.java:679)
	at org.apache.solr.client.solrj.impl.HttpSolrClient.request(HttpSolrClient.java:265)
	at org.apache.solr.client.solrj.impl.HttpSolrClient.request(HttpSolrClient.java:248)
	at org.apache.solr.client.solrj.impl.LBSolrClient.doRequest(LBSolrClient.java:368)
	at org.apache.solr.client.solrj.impl.LBSolrClient.request(LBSolrClient.java:296)
	at org.apache.solr.client.solrj.impl.BaseCloudSolrClient.sendRequest(BaseCloudSolrClient.java:1143)
	at org.apache.solr.client.solrj.impl.BaseCloudSolrClient.requestWithRetryOnStaleState(BaseCloudSolrClient.java:906)
	at org.apache.solr.client.solrj.impl.BaseCloudSolrClient.request(BaseCloudSolrClient.java:838)
	at org.apache.solr.client.solrj.SolrRequest.process(SolrRequest.java:211)
	at org.apache.solr.client.solrj.SolrRequest.process(SolrRequest.java:228)
	at org.apache.solr.cloud.LegacyCloudClusterPropTest.createAndTest(LegacyCloudClusterPropTest.java:87)
	at org.apache.solr.cloud.LegacyCloudClusterPropTest.testCreateCollectionSwitchLegacyCloud(LegacyCloudClusterPropTest.java:79)
	at java.base/jdk.internal.reflect.NativeMethodAccessorImpl.invoke0(Native Method)
	at java.base/jdk.internal.reflect.NativeMethodAccessorImpl.invoke(NativeMethodAccessorImpl.java:62)
	at java.base/jdk.internal.reflect.DelegatingMethodAccessorImpl.invoke(DelegatingMethodAccessorImpl.java:43)
	at java.base/java.lang.reflect.Method.invoke(Method.java:566)
	at com.carrotsearch.randomizedtesting.RandomizedRunner.invoke(RandomizedRunner.java:1750)
	at com.carrotsearch.randomizedtesting.RandomizedRunner$8.evaluate(RandomizedRunner.java:938)
	at com.carrotsearch.randomizedtesting.RandomizedRunner$9.evaluate(RandomizedRunner.java:974)
	at com.carrotsearch.randomizedtesting.RandomizedRunner$10.evaluate(RandomizedRunner.java:988)
	at com.carrotsearch.randomizedtesting.rules.SystemPropertiesRestoreRule$1.evaluate(SystemPropertiesRestoreRule.java:57)
	at org.apache.lucene.util.TestRuleSetupTeardownChained$1.evaluate(TestRuleSetupTeardownChained.java:49)
	at org.apache.lucene.util.AbstractBeforeAfterRule$1.evaluate(AbstractBeforeAfterRule.java:45)
	at org.apache.lucene.util.TestRuleThreadAndTestName$1.evaluate(TestRuleThreadAndTestName.java:48)
	at org.apache.lucene.util.TestRuleIgnoreAfterMaxFailures$1.evaluate(TestRuleIgnoreAfterMaxFailures.java:64)
	at org.apache.lucene.util.TestRuleMarkFailure$1.evaluate(TestRuleMarkFailure.java:47)
	at com.carrotsearch.randomizedtesting.rules.StatementAdapter.evaluate(StatementAdapter.java:36)
	at com.carrotsearch.randomizedtesting.ThreadLeakControl$StatementRunner.run(ThreadLeakControl.java:368)
	at com.carrotsearch.randomizedtesting.ThreadLeakControl.forkTimeoutingTask(ThreadLeakControl.java:817)
	at com.carrotsearch.randomizedtesting.ThreadLeakControl$3.evaluate(ThreadLeakControl.java:468)
	at com.carrotsearch.randomizedtesting.RandomizedRunner.runSingleTest(RandomizedRunner.java:947)
	at com.carrotsearch.randomizedtesting.RandomizedRunner$5.evaluate(RandomizedRunner.java:832)
	at com.carrotsearch.randomizedtesting.RandomizedRunner$6.evaluate(RandomizedRunner.java:883)
	at com.carrotsearch.randomizedtesting.RandomizedRunner$7.evaluate(RandomizedRunner.java:894)
	at com.carrotsearch.randomizedtesting.rules.StatementAdapter.evaluate(StatementAdapter.java:36)
	at com.carrotsearch.randomizedtesting.rules.SystemPropertiesRestoreRule$1.evaluate(SystemPropertiesRestoreRule.java:57)
	at org.apache.lucene.util.AbstractBeforeAfterRule$1.evaluate(AbstractBeforeAfterRule.java:45)
	at com.carrotsearch.randomizedtesting.rules.StatementAdapter.evaluate(StatementAdapter.java:36)
	at org.apache.lucene.util.TestRuleStoreClassName$1.evaluate(TestRuleStoreClassName.java:41)
	at com.carrotsearch.randomizedtesting.rules.NoShadowingOrOverridesOnMethodsRule$1.evaluate(NoShadowingOrOverridesOnMethodsRule.java:40)
	at com.carrotsearch.randomizedtesting.rules.NoShadowingOrOverridesOnMethodsRule$1.evaluate(NoShadowingOrOverridesOnMethodsRule.java:40)
	at com.carrotsearch.randomizedtesting.rules.StatementAdapter.evaluate(StatementAdapter.java:36)
	at com.carrotsearch.randomizedtesting.rules.StatementAdapter.evaluate(StatementAdapter.java:36)
	at org.apache.lucene.util.TestRuleAssertionsRequired$1.evaluate(TestRuleAssertionsRequired.java:53)
	at org.apache.lucene.util.TestRuleMarkFailure$1.evaluate(TestRuleMarkFailure.java:47)
	at org.apache.lucene.util.TestRuleIgnoreAfterMaxFailures$1.evaluate(TestRuleIgnoreAfterMaxFailures.java:64)
	at org.apache.lucene.util.TestRuleIgnoreTestSuites$1.evaluate(TestRuleIgnoreTestSuites.java:54)
	at com.carrotsearch.randomizedtesting.rules.StatementAdapter.evaluate(StatementAdapter.java:36)
	at com.carrotsearch.randomizedtesting.ThreadLeakControl$StatementRunner.run(ThreadLeakControl.java:368)
	at java.base/java.lang.Thread.run(Thread.java:834)
Caused by: javax.net.ssl.SSLException: Software caused connection abort: recv failed
	at java.base/sun.security.ssl.Alert.createSSLException(Alert.java:127)
	at java.base/sun.security.ssl.TransportContext.fatal(TransportContext.java:320)
	at java.base/sun.security.ssl.TransportContext.fatal(TransportContext.java:263)
	at java.base/sun.security.ssl.TransportContext.fatal(TransportContext.java:258)
	at java.base/sun.security.ssl.SSLSocketImpl.handleException(SSLSocketImpl.java:1315)
	at java.base/sun.security.ssl.SSLSocketImpl$AppInputStream.read(SSLSocketImpl.java:839)
	at org.apache.http.impl.io.SessionInputBufferImpl.streamRead(SessionInputBufferImpl.java:137)
	at org.apache.http.impl.io.SessionInputBufferImpl.fillBuffer(SessionInputBufferImpl.java:153)
	at org.apache.http.impl.io.SessionInputBufferImpl.readLine(SessionInputBufferImpl.java:280)
	at org.apache.http.impl.conn.DefaultHttpResponseParser.parseHead(DefaultHttpResponseParser.java:138)
	at org.apache.http.impl.conn.DefaultHttpResponseParser.parseHead(DefaultHttpResponseParser.java:56)
	at org.apache.http.impl.io.AbstractMessageParser.parse(AbstractMessageParser.java:259)
	at org.apache.http.impl.DefaultBHttpClientConnection.receiveResponseHeader(DefaultBHttpClientConnection.java:163)
	at org.apache.http.impl.conn.CPoolProxy.receiveResponseHeader(CPoolProxy.java:157)
	at org.apache.http.protocol.HttpRequestExecutor.doReceiveResponse(HttpRequestExecutor.java:273)
	at org.apache.http.protocol.HttpRequestExecutor.execute(HttpRequestExecutor.java:125)
	at org.apache.http.impl.execchain.MainClientExec.execute(MainClientExec.java:272)
	at org.apache.http.impl.execchain.ProtocolExec.execute(ProtocolExec.java:186)
	at org.apache.http.impl.execchain.RetryExec.execute(RetryExec.java:89)
	at org.apache.http.impl.execchain.RedirectExec.execute(RedirectExec.java:110)
	at org.apache.http.impl.client.InternalHttpClient.doExecute(InternalHttpClient.java:185)
	at org.apache.http.impl.client.CloseableHttpClient.execute(CloseableHttpClient.java:83)
	at org.apache.http.impl.client.CloseableHttpClient.execute(CloseableHttpClient.java:56)
	at org.apache.solr.client.solrj.impl.HttpSolrClient.executeMethod(HttpSolrClient.java:564)
	... 49 more
	Suppressed: java.net.SocketException: Software caused connection abort: socket write error
		at java.base/java.net.SocketOutputStream.socketWrite0(Native Method)
		at java.base/java.net.SocketOutputStream.socketWrite(SocketOutputStream.java:110)
		at java.base/java.net.SocketOutputStream.write(SocketOutputStream.java:150)
		at java.base/sun.security.ssl.SSLSocketOutputRecord.encodeAlert(SSLSocketOutputRecord.java:81)
		at java.base/sun.security.ssl.TransportContext.fatal(TransportContext.java:351)
		... 71 more
Caused by: java.net.SocketException: Software caused connection abort: recv failed
	at java.base/java.net.SocketInputStream.socketRead0(Native Method)
	at java.base/java.net.SocketInputStream.socketRead(SocketInputStream.java:115)
	at java.base/java.net.SocketInputStream.read(SocketInputStream.java:168)
	at java.base/java.net.SocketInputStream.read(SocketInputStream.java:140)
	at java.base/sun.security.ssl.SSLSocketInputRecord.read(SSLSocketInputRecord.java:448)
	at java.base/sun.security.ssl.SSLSocketInputRecord.bytesInCompletePacket(SSLSocketInputRecord.java:68)
	at java.base/sun.security.ssl.SSLSocketImpl.readApplicationRecord(SSLSocketImpl.java:1104)
	at java.base/sun.security.ssl.SSLSocketImpl$AppInputStream.read(SSLSocketImpl.java:823)
	... 67 more


FAILED:  org.apache.solr.cloud.LegacyCloudClusterPropTest.testCreateCollectionSwitchLegacyCloud

Error Message:
IOException occurred when talking to server at: https://127.0.0.1:64478/solr

Stack Trace:
org.apache.solr.client.solrj.SolrServerException: IOException occurred when talking to server at: https://127.0.0.1:64478/solr
	at __randomizedtesting.SeedInfo.seed([6574A549D50BE0DD:B47357CC71046BEF]:0)
	at org.apache.solr.client.solrj.impl.HttpSolrClient.executeMethod(HttpSolrClient.java:679)
	at org.apache.solr.client.solrj.impl.HttpSolrClient.request(HttpSolrClient.java:265)
	at org.apache.solr.client.solrj.impl.HttpSolrClient.request(HttpSolrClient.java:248)
	at org.apache.solr.client.solrj.impl.LBSolrClient.doRequest(LBSolrClient.java:368)
	at org.apache.solr.client.solrj.impl.LBSolrClient.request(LBSolrClient.java:296)
	at org.apache.solr.client.solrj.impl.BaseCloudSolrClient.sendRequest(BaseCloudSolrClient.java:1143)
	at org.apache.solr.client.solrj.impl.BaseCloudSolrClient.requestWithRetryOnStaleState(BaseCloudSolrClient.java:906)
	at org.apache.solr.client.solrj.impl.BaseCloudSolrClient.request(BaseCloudSolrClient.java:838)
	at org.apache.solr.client.solrj.SolrRequest.process(SolrRequest.java:211)
	at org.apache.solr.client.solrj.SolrRequest.process(SolrRequest.java:228)
	at org.apache.solr.cloud.LegacyCloudClusterPropTest.createAndTest(LegacyCloudClusterPropTest.java:87)
	at org.apache.solr.cloud.LegacyCloudClusterPropTest.testCreateCollectionSwitchLegacyCloud(LegacyCloudClusterPropTest.java:79)
	at java.base/jdk.internal.reflect.NativeMethodAccessorImpl.invoke0(Native Method)
	at java.base/jdk.internal.reflect.NativeMethodAccessorImpl.invoke(NativeMethodAccessorImpl.java:62)
	at java.base/jdk.internal.reflect.DelegatingMethodAccessorImpl.invoke(DelegatingMethodAccessorImpl.java:43)
	at java.base/java.lang.reflect.Method.invoke(Method.java:566)
	at com.carrotsearch.randomizedtesting.RandomizedRunner.invoke(RandomizedRunner.java:1750)
	at com.carrotsearch.randomizedtesting.RandomizedRunner$8.evaluate(RandomizedRunner.java:938)
	at com.carrotsearch.randomizedtesting.RandomizedRunner$9.evaluate(RandomizedRunner.java:974)
	at com.carrotsearch.randomizedtesting.RandomizedRunner$10.evaluate(RandomizedRunner.java:988)
	at com.carrotsearch.randomizedtesting.rules.SystemPropertiesRestoreRule$1.evaluate(SystemPropertiesRestoreRule.java:57)
	at org.apache.lucene.util.TestRuleSetupTeardownChained$1.evaluate(TestRuleSetupTeardownChained.java:49)
	at org.apache.lucene.util.AbstractBeforeAfterRule$1.evaluate(AbstractBeforeAfterRule.java:45)
	at org.apache.lucene.util.TestRuleThreadAndTestName$1.evaluate(TestRuleThreadAndTestName.java:48)
	at org.apache.lucene.util.TestRuleIgnoreAfterMaxFailures$1.evaluate(TestRuleIgnoreAfterMaxFailures.java:64)
	at org.apache.lucene.util.TestRuleMarkFailure$1.evaluate(TestRuleMarkFailure.java:47)
	at com.carrotsearch.randomizedtesting.rules.StatementAdapter.evaluate(StatementAdapter.java:36)
	at com.carrotsearch.randomizedtesting.ThreadLeakControl$StatementRunner.run(ThreadLeakControl.java:368)
	at com.carrotsearch.randomizedtesting.ThreadLeakControl.forkTimeoutingTask(ThreadLeakControl.java:817)
	at com.carrotsearch.randomizedtesting.ThreadLeakControl$3.evaluate(ThreadLeakControl.java:468)
	at com.carrotsearch.randomizedtesting.RandomizedRunner.runSingleTest(RandomizedRunner.java:947)
	at com.carrotsearch.randomizedtesting.RandomizedRunner$5.evaluate(RandomizedRunner.java:832)
	at com.carrotsearch.randomizedtesting.RandomizedRunner$6.evaluate(RandomizedRunner.java:883)
	at com.carrotsearch.randomizedtesting.RandomizedRunner$7.evaluate(RandomizedRunner.java:894)
	at com.carrotsearch.randomizedtesting.rules.StatementAdapter.evaluate(StatementAdapter.java:36)
	at com.carrotsearch.randomizedtesting.rules.SystemPropertiesRestoreRule$1.evaluate(SystemPropertiesRestoreRule.java:57)
	at org.apache.lucene.util.AbstractBeforeAfterRule$1.evaluate(AbstractBeforeAfterRule.java:45)
	at com.carrotsearch.randomizedtesting.rules.StatementAdapter.evaluate(StatementAdapter.java:36)
	at org.apache.lucene.util.TestRuleStoreClassName$1.evaluate(TestRuleStoreClassName.java:41)
	at com.carrotsearch.randomizedtesting.rules.NoShadowingOrOverridesOnMethodsRule$1.evaluate(NoShadowingOrOverridesOnMethodsRule.java:40)
	at com.carrotsearch.randomizedtesting.rules.NoShadowingOrOverridesOnMethodsRule$1.evaluate(NoShadowingOrOverridesOnMethodsRule.java:40)
	at com.carrotsearch.randomizedtesting.rules.StatementAdapter.evaluate(StatementAdapter.java:36)
	at com.carrotsearch.randomizedtesting.rules.StatementAdapter.evaluate(StatementAdapter.java:36)
	at org.apache.lucene.util.TestRuleAssertionsRequired$1.evaluate(TestRuleAssertionsRequired.java:53)
	at org.apache.lucene.util.TestRuleMarkFailure$1.evaluate(TestRuleMarkFailure.java:47)
	at org.apache.lucene.util.TestRuleIgnoreAfterMaxFailures$1.evaluate(TestRuleIgnoreAfterMaxFailures.java:64)
	at org.apache.lucene.util.TestRuleIgnoreTestSuites$1.evaluate(TestRuleIgnoreTestSuites.java:54)
	at com.carrotsearch.randomizedtesting.rules.StatementAdapter.evaluate(StatementAdapter.java:36)
	at com.carrotsearch.randomizedtesting.ThreadLeakControl$StatementRunner.run(ThreadLeakControl.java:368)
	at java.base/java.lang.Thread.run(Thread.java:834)
Caused by: javax.net.ssl.SSLException: Software caused connection abort: recv failed
	at java.base/sun.security.ssl.Alert.createSSLException(Alert.java:127)
	at java.base/sun.security.ssl.TransportContext.fatal(TransportContext.java:320)
	at java.base/sun.security.ssl.TransportContext.fatal(TransportContext.java:263)
	at java.base/sun.security.ssl.TransportContext.fatal(TransportContext.java:258)
	at java.base/sun.security.ssl.SSLSocketImpl.handleException(SSLSocketImpl.java:1315)
	at java.base/sun.security.ssl.SSLSocketImpl$AppInputStream.read(SSLSocketImpl.java:839)
	at org.apache.http.impl.io.SessionInputBufferImpl.streamRead(SessionInputBufferImpl.java:137)
	at org.apache.http.impl.io.SessionInputBufferImpl.fillBuffer(SessionInputBufferImpl.java:153)
	at org.apache.http.impl.io.SessionInputBufferImpl.readLine(SessionInputBufferImpl.java:280)
	at org.apache.http.impl.conn.DefaultHttpResponseParser.parseHead(DefaultHttpResponseParser.java:138)
	at org.apache.http.impl.conn.DefaultHttpResponseParser.parseHead(DefaultHttpResponseParser.java:56)
	at org.apache.http.impl.io.AbstractMessageParser.parse(AbstractMessageParser.java:259)
	at org.apache.http.impl.DefaultBHttpClientConnection.receiveResponseHeader(DefaultBHttpClientConnection.java:163)
	at org.apache.http.impl.conn.CPoolProxy.receiveResponseHeader(CPoolProxy.java:157)
	at org.apache.http.protocol.HttpRequestExecutor.doReceiveResponse(HttpRequestExecutor.java:273)
	at org.apache.http.protocol.HttpRequestExecutor.execute(HttpRequestExecutor.java:125)
	at org.apache.http.impl.execchain.MainClientExec.execute(MainClientExec.java:272)
	at org.apache.http.impl.execchain.ProtocolExec.execute(ProtocolExec.java:186)
	at org.apache.http.impl.execchain.RetryExec.execute(RetryExec.java:89)
	at org.apache.http.impl.execchain.RedirectExec.execute(RedirectExec.java:110)
	at org.apache.http.impl.client.InternalHttpClient.doExecute(InternalHttpClient.java:185)
	at org.apache.http.impl.client.CloseableHttpClient.execute(CloseableHttpClient.java:83)
	at org.apache.http.impl.client.CloseableHttpClient.execute(CloseableHttpClient.java:56)
	at org.apache.solr.client.solrj.impl.HttpSolrClient.executeMethod(HttpSolrClient.java:564)
	... 49 more
	Suppressed: java.net.SocketException: Software caused connection abort: socket write error
		at java.base/java.net.SocketOutputStream.socketWrite0(Native Method)
		at java.base/java.net.SocketOutputStream.socketWrite(SocketOutputStream.java:110)
		at java.base/java.net.SocketOutputStream.write(SocketOutputStream.java:150)
		at java.base/sun.security.ssl.SSLSocketOutputRecord.encodeAlert(SSLSocketOutputRecord.java:81)
		at java.base/sun.security.ssl.TransportContext.fatal(TransportContext.java:351)
		... 71 more
Caused by: java.net.SocketException: Software caused connection abort: recv failed
	at java.base/java.net.SocketInputStream.socketRead0(Native Method)
	at java.base/java.net.SocketInputStream.socketRead(SocketInputStream.java:115)
	at java.base/java.net.SocketInputStream.read(SocketInputStream.java:168)
	at java.base/java.net.SocketInputStream.read(SocketInputStream.java:140)
	at java.base/sun.security.ssl.SSLSocketInputRecord.read(SSLSocketInputRecord.java:448)
	at java.base/sun.security.ssl.SSLSocketInputRecord.bytesInCompletePacket(SSLSocketInputRecord.java:68)
	at java.base/sun.security.ssl.SSLSocketImpl.readApplicationRecord(SSLSocketImpl.java:1104)
	at java.base/sun.security.ssl.SSLSocketImpl$AppInputStream.read(SSLSocketImpl.java:823)
	... 67 more


FAILED:  org.apache.solr.cloud.LegacyCloudClusterPropTest.testCreateCollectionSwitchLegacyCloud

Error Message:
IOException occurred when talking to server at: https://127.0.0.1:58682/solr

Stack Trace:
org.apache.solr.client.solrj.SolrServerException: IOException occurred when talking to server at: https://127.0.0.1:58682/solr
	at __randomizedtesting.SeedInfo.seed([6574A549D50BE0DD:B47357CC71046BEF]:0)
	at org.apache.solr.client.solrj.impl.HttpSolrClient.executeMethod(HttpSolrClient.java:679)
	at org.apache.solr.client.solrj.impl.HttpSolrClient.request(HttpSolrClient.java:265)
	at org.apache.solr.client.solrj.impl.HttpSolrClient.request(HttpSolrClient.java:248)
	at org.apache.solr.client.solrj.impl.LBSolrClient.doRequest(LBSolrClient.java:368)
	at org.apache.solr.client.solrj.impl.LBSolrClient.request(LBSolrClient.java:296)
	at org.apache.solr.client.solrj.impl.BaseCloudSolrClient.sendRequest(BaseCloudSolrClient.java:1143)
	at org.apache.solr.client.solrj.impl.BaseCloudSolrClient.requestWithRetryOnStaleState(BaseCloudSolrClient.java:906)
	at org.apache.solr.client.solrj.impl.BaseCloudSolrClient.request(BaseCloudSolrClient.java:838)
	at org.apache.solr.client.solrj.SolrRequest.process(SolrRequest.java:211)
	at org.apache.solr.client.solrj.SolrRequest.process(SolrRequest.java:228)
	at org.apache.solr.cloud.LegacyCloudClusterPropTest.createAndTest(LegacyCloudClusterPropTest.java:87)
	at org.apache.solr.cloud.LegacyCloudClusterPropTest.testCreateCollectionSwitchLegacyCloud(LegacyCloudClusterPropTest.java:79)
	at java.base/jdk.internal.reflect.NativeMethodAccessorImpl.invoke0(Native Method)
	at java.base/jdk.internal.reflect.NativeMethodAccessorImpl.invoke(NativeMethodAccessorImpl.java:62)
	at java.base/jdk.internal.reflect.DelegatingMethodAccessorImpl.invoke(DelegatingMethodAccessorImpl.java:43)
	at java.base/java.lang.reflect.Method.invoke(Method.java:566)
	at com.carrotsearch.randomizedtesting.RandomizedRunner.invoke(RandomizedRunner.java:1750)
	at com.carrotsearch.randomizedtesting.RandomizedRunner$8.evaluate(RandomizedRunner.java:938)
	at com.carrotsearch.randomizedtesting.RandomizedRunner$9.evaluate(RandomizedRunner.java:974)
	at com.carrotsearch.randomizedtesting.RandomizedRunner$10.evaluate(RandomizedRunner.java:988)
	at com.carrotsearch.randomizedtesting.rules.SystemPropertiesRestoreRule$1.evaluate(SystemPropertiesRestoreRule.java:57)
	at org.apache.lucene.util.TestRuleSetupTeardownChained$1.evaluate(TestRuleSetupTeardownChained.java:49)
	at org.apache.lucene.util.AbstractBeforeAfterRule$1.evaluate(AbstractBeforeAfterRule.java:45)
	at org.apache.lucene.util.TestRuleThreadAndTestName$1.evaluate(TestRuleThreadAndTestName.java:48)
	at org.apache.lucene.util.TestRuleIgnoreAfterMaxFailures$1.evaluate(TestRuleIgnoreAfterMaxFailures.java:64)
	at org.apache.lucene.util.TestRuleMarkFailure$1.evaluate(TestRuleMarkFailure.java:47)
	at com.carrotsearch.randomizedtesting.rules.StatementAdapter.evaluate(StatementAdapter.java:36)
	at com.carrotsearch.randomizedtesting.ThreadLeakControl$StatementRunner.run(ThreadLeakControl.java:368)
	at com.carrotsearch.randomizedtesting.ThreadLeakControl.forkTimeoutingTask(ThreadLeakControl.java:817)
	at com.carrotsearch.randomizedtesting.ThreadLeakControl$3.evaluate(ThreadLeakControl.java:468)
	at com.carrotsearch.randomizedtesting.RandomizedRunner.runSingleTest(RandomizedRunner.java:947)
	at com.carrotsearch.randomizedtesting.RandomizedRunner$5.evaluate(RandomizedRunner.java:832)
	at com.carrotsearch.randomizedtesting.RandomizedRunner$6.evaluate(RandomizedRunner.java:883)
	at com.carrotsearch.randomizedtesting.RandomizedRunner$7.evaluate(RandomizedRunner.java:894)
	at com.carrotsearch.randomizedtesting.rules.StatementAdapter.evaluate(StatementAdapter.java:36)
	at com.carrotsearch.randomizedtesting.rules.SystemPropertiesRestoreRule$1.evaluate(SystemPropertiesRestoreRule.java:57)
	at org.apache.lucene.util.AbstractBeforeAfterRule$1.evaluate(AbstractBeforeAfterRule.java:45)
	at com.carrotsearch.randomizedtesting.rules.StatementAdapter.evaluate(StatementAdapter.java:36)
	at org.apache.lucene.util.TestRuleStoreClassName$1.evaluate(TestRuleStoreClassName.java:41)
	at com.carrotsearch.randomizedtesting.rules.NoShadowingOrOverridesOnMethodsRule$1.evaluate(NoShadowingOrOverridesOnMethodsRule.java:40)
	at com.carrotsearch.randomizedtesting.rules.NoShadowingOrOverridesOnMethodsRule$1.evaluate(NoShadowingOrOverridesOnMethodsRule.java:40)
	at com.carrotsearch.randomizedtesting.rules.StatementAdapter.evaluate(StatementAdapter.java:36)
	at com.carrotsearch.randomizedtesting.rules.StatementAdapter.evaluate(StatementAdapter.java:36)
	at org.apache.lucene.util.TestRuleAssertionsRequired$1.evaluate(TestRuleAssertionsRequired.java:53)
	at org.apache.lucene.util.TestRuleMarkFailure$1.evaluate(TestRuleMarkFailure.java:47)
	at org.apache.lucene.util.TestRuleIgnoreAfterMaxFailures$1.evaluate(TestRuleIgnoreAfterMaxFailures.java:64)
	at org.apache.lucene.util.TestRuleIgnoreTestSuites$1.evaluate(TestRuleIgnoreTestSuites.java:54)
	at com.carrotsearch.randomizedtesting.rules.StatementAdapter.evaluate(StatementAdapter.java:36)
	at com.carrotsearch.randomizedtesting.ThreadLeakControl$StatementRunner.run(ThreadLeakControl.java:368)
	at java.base/java.lang.Thread.run(Thread.java:834)
Caused by: javax.net.ssl.SSLException: Software caused connection abort: recv failed
	at java.base/sun.security.ssl.Alert.createSSLException(Alert.java:127)
	at java.base/sun.security.ssl.TransportContext.fatal(TransportContext.java:320)
	at java.base/sun.security.ssl.TransportContext.fatal(TransportContext.java:263)
	at java.base/sun.security.ssl.TransportContext.fatal(TransportContext.java:258)
	at java.base/sun.security.ssl.SSLSocketImpl.handleException(SSLSocketImpl.java:1315)
	at java.base/sun.security.ssl.SSLSocketImpl$AppInputStream.read(SSLSocketImpl.java:839)
	at org.apache.http.impl.io.SessionInputBufferImpl.streamRead(SessionInputBufferImpl.java:137)
	at org.apache.http.impl.io.SessionInputBufferImpl.fillBuffer(SessionInputBufferImpl.java:153)
	at org.apache.http.impl.io.SessionInputBufferImpl.readLine(SessionInputBufferImpl.java:280)
	at org.apache.http.impl.conn.DefaultHttpResponseParser.parseHead(DefaultHttpResponseParser.java:138)
	at org.apache.http.impl.conn.DefaultHttpResponseParser.parseHead(DefaultHttpResponseParser.java:56)
	at org.apache.http.impl.io.AbstractMessageParser.parse(AbstractMessageParser.java:259)
	at org.apache.http.impl.DefaultBHttpClientConnection.receiveResponseHeader(DefaultBHttpClientConnection.java:163)
	at org.apache.http.impl.conn.CPoolProxy.receiveResponseHeader(CPoolProxy.java:157)
	at org.apache.http.protocol.HttpRequestExecutor.doReceiveResponse(HttpRequestExecutor.java:273)
	at org.apache.http.protocol.HttpRequestExecutor.execute(HttpRequestExecutor.java:125)
	at org.apache.http.impl.execchain.MainClientExec.execute(MainClientExec.java:272)
	at org.apache.http.impl.execchain.ProtocolExec.execute(ProtocolExec.java:186)
	at org.apache.http.impl.execchain.RetryExec.execute(RetryExec.java:89)
	at org.apache.http.impl.execchain.RedirectExec.execute(RedirectExec.java:110)
	at org.apache.http.impl.client.InternalHttpClient.doExecute(InternalHttpClient.java:185)
	at org.apache.http.impl.client.CloseableHttpClient.execute(CloseableHttpClient.java:83)
	at org.apache.http.impl.client.CloseableHttpClient.execute(CloseableHttpClient.java:56)
	at org.apache.solr.client.solrj.impl.HttpSolrClient.executeMethod(HttpSolrClient.java:564)
	... 49 more
	Suppressed: java.net.SocketException: Software caused connection abort: socket write error
		at java.base/java.net.SocketOutputStream.socketWrite0(Native Method)
		at java.base/java.net.SocketOutputStream.socketWrite(SocketOutputStream.java:110)
		at java.base/java.net.SocketOutputStream.write(SocketOutputStream.java:150)
		at java.base/sun.security.ssl.SSLSocketOutputRecord.encodeAlert(SSLSocketOutputRecord.java:81)
		at java.base/sun.security.ssl.TransportContext.fatal(TransportContext.java:351)
		... 71 more
Caused by: java.net.SocketException: Software caused connection abort: recv failed
	at java.base/java.net.SocketInputStream.socketRead0(Native Method)
	at java.base/java.net.SocketInputStream.socketRead(SocketInputStream.java:115)
	at java.base/java.net.SocketInputStream.read(SocketInputStream.java:168)
	at java.base/java.net.SocketInputStream.read(SocketInputStream.java:140)
	at java.base/sun.security.ssl.SSLSocketInputRecord.read(SSLSocketInputRecord.java:448)
	at java.base/sun.security.ssl.SSLSocketInputRecord.bytesInCompletePacket(SSLSocketInputRecord.java:68)
	at java.base/sun.security.ssl.SSLSocketImpl.readApplicationRecord(SSLSocketImpl.java:1104)
	at java.base/sun.security.ssl.SSLSocketImpl$AppInputStream.read(SSLSocketImpl.java:823)
	... 67 more




Build Log:
[...truncated 14920 lines...]
   [junit4] Suite: org.apache.solr.cloud.LegacyCloudClusterPropTest
   [junit4]   2> 2849945 INFO  (SUITE-LegacyCloudClusterPropTest-seed#[6574A549D50BE0DD]-worker) [     ] o.a.s.SolrTestCaseJ4 SecureRandom sanity checks: test.solr.allowed.securerandom=null & java.security.egd=file:/dev/./urandom
   [junit4]   2> 2849949 INFO  (SUITE-LegacyCloudClusterPropTest-seed#[6574A549D50BE0DD]-worker) [     ] o.a.s.SolrTestCaseJ4 Created dataDir: C:\Users\jenkins\workspace\Lucene-Solr-8.x-Windows\solr\build\solr-core\test\J1\temp\solr.cloud.LegacyCloudClusterPropTest_6574A549D50BE0DD-001\data-dir-246-001
   [junit4]   2> 2849949 WARN  (SUITE-LegacyCloudClusterPropTest-seed#[6574A549D50BE0DD]-worker) [     ] o.a.s.SolrTestCaseJ4 startTrackingSearchers: numOpens=17 numCloses=17
   [junit4]   2> 2849949 INFO  (SUITE-LegacyCloudClusterPropTest-seed#[6574A549D50BE0DD]-worker) [     ] o.a.s.SolrTestCaseJ4 Using PointFields (NUMERIC_POINTS_SYSPROP=true) w/NUMERIC_DOCVALUES_SYSPROP=false
   [junit4]   2> 2849950 INFO  (SUITE-LegacyCloudClusterPropTest-seed#[6574A549D50BE0DD]-worker) [     ] o.a.s.SolrTestCaseJ4 Randomized ssl (true) and clientAuth (false) via: @org.apache.solr.util.RandomizeSSL(reason="", value=0.0/0.0, ssl=0.0/0.0, clientAuth=0.0/0.0)
   [junit4]   2> 2849953 INFO  (SUITE-LegacyCloudClusterPropTest-seed#[6574A549D50BE0DD]-worker) [     ] o.a.s.c.MiniSolrCloudCluster Starting cluster of 1 servers in C:\Users\jenkins\workspace\Lucene-Solr-8.x-Windows\solr\build\solr-core\test\J1\temp\solr.cloud.LegacyCloudClusterPropTest_6574A549D50BE0DD-001\tempDir-001
   [junit4]   2> 2849954 INFO  (SUITE-LegacyCloudClusterPropTest-seed#[6574A549D50BE0DD]-worker) [     ] o.a.s.c.ZkTestServer STARTING ZK TEST SERVER
   [junit4]   2> 2849954 INFO  (ZkTestServer Run Thread) [     ] o.a.s.c.ZkTestServer client port:0.0.0.0/0.0.0.0:0
   [junit4]   2> 2849954 INFO  (ZkTestServer Run Thread) [     ] o.a.s.c.ZkTestServer Starting server
   [junit4]   2> 2850054 INFO  (SUITE-LegacyCloudClusterPropTest-seed#[6574A549D50BE0DD]-worker) [     ] o.a.s.c.ZkTestServer start zk server on port:58669
   [junit4]   2> 2850054 INFO  (SUITE-LegacyCloudClusterPropTest-seed#[6574A549D50BE0DD]-worker) [     ] o.a.s.c.ZkTestServer waitForServerUp: 127.0.0.1:58669
   [junit4]   2> 2850054 INFO  (SUITE-LegacyCloudClusterPropTest-seed#[6574A549D50BE0DD]-worker) [     ] o.a.s.c.ZkTestServer parse host and port list: 127.0.0.1:58669
   [junit4]   2> 2850054 INFO  (SUITE-LegacyCloudClusterPropTest-seed#[6574A549D50BE0DD]-worker) [     ] o.a.s.c.ZkTestServer connecting to 127.0.0.1 58669
   [junit4]   2> 2850058 INFO  (SUITE-LegacyCloudClusterPropTest-seed#[6574A549D50BE0DD]-worker) [     ] o.a.s.c.c.ConnectionManager Waiting for client to connect to ZooKeeper
   [junit4]   2> 2850063 INFO  (zkConnectionManagerCallback-12214-thread-1) [     ] o.a.s.c.c.ConnectionManager zkClient has connected
   [junit4]   2> 2850063 INFO  (SUITE-LegacyCloudClusterPropTest-seed#[6574A549D50BE0DD]-worker) [     ] o.a.s.c.c.ConnectionManager Client is connected to ZooKeeper
   [junit4]   2> 2850067 INFO  (SUITE-LegacyCloudClusterPropTest-seed#[6574A549D50BE0DD]-worker) [     ] o.a.s.c.c.ConnectionManager Waiting for client to connect to ZooKeeper
   [junit4]   2> 2850070 INFO  (zkConnectionManagerCallback-12216-thread-1) [     ] o.a.s.c.c.ConnectionManager zkClient has connected
   [junit4]   2> 2850070 INFO  (SUITE-LegacyCloudClusterPropTest-seed#[6574A549D50BE0DD]-worker) [     ] o.a.s.c.c.ConnectionManager Client is connected to ZooKeeper
   [junit4]   2> 2850071 INFO  (SUITE-LegacyCloudClusterPropTest-seed#[6574A549D50BE0DD]-worker) [     ] o.a.s.c.c.ConnectionManager Waiting for client to connect to ZooKeeper
   [junit4]   2> 2850074 INFO  (zkConnectionManagerCallback-12218-thread-1) [     ] o.a.s.c.c.ConnectionManager zkClient has connected
   [junit4]   2> 2850074 INFO  (SUITE-LegacyCloudClusterPropTest-seed#[6574A549D50BE0DD]-worker) [     ] o.a.s.c.c.ConnectionManager Client is connected to ZooKeeper
   [junit4]   2> 2850196 WARN  (jetty-launcher-12219-thread-1) [     ] o.e.j.s.h.g.GzipHandler minGzipSize of 0 is inefficient for short content, break even is size 23
   [junit4]   2> 2850196 INFO  (jetty-launcher-12219-thread-1) [     ] o.a.s.c.s.e.JettySolrRunner Start Jetty (configured port=0, binding port=0)
   [junit4]   2> 2850196 INFO  (jetty-launcher-12219-thread-1) [     ] o.a.s.c.s.e.JettySolrRunner Trying to start Jetty on port 0 try number 1 ...
   [junit4]   2> 2850196 INFO  (jetty-launcher-12219-thread-1) [     ] o.e.j.s.Server jetty-9.4.24.v20191120; built: 2019-11-20T21:37:49.771Z; git: 363d5f2df3a8a28de40604320230664b9c793c16; jvm 11.0.4+11
   [junit4]   2> 2850196 INFO  (jetty-launcher-12219-thread-1) [     ] o.e.j.s.session DefaultSessionIdManager workerName=node0
   [junit4]   2> 2850196 INFO  (jetty-launcher-12219-thread-1) [     ] o.e.j.s.session No SessionScavenger set, using defaults
   [junit4]   2> 2850196 INFO  (jetty-launcher-12219-thread-1) [     ] o.e.j.s.session node0 Scavenging every 600000ms
   [junit4]   2> 2850196 INFO  (jetty-launcher-12219-thread-1) [     ] o.e.j.s.h.ContextHandler Started o.e.j.s.ServletContextHandler@7d857dfb{/solr,null,AVAILABLE}
   [junit4]   2> 2850197 INFO  (jetty-launcher-12219-thread-1) [     ] o.e.j.s.AbstractConnector Started ServerConnector@5367a3b3{ssl,[ssl, alpn, http/1.1, h2]}{127.0.0.1:58682}
   [junit4]   2> 2850198 INFO  (jetty-launcher-12219-thread-1) [     ] o.e.j.s.Server Started @2850252ms
   [junit4]   2> 2850198 INFO  (jetty-launcher-12219-thread-1) [     ] o.a.s.c.s.e.JettySolrRunner Jetty properties: {hostContext=/solr, hostPort=58682}
   [junit4]   2> 2850198 ERROR (jetty-launcher-12219-thread-1) [     ] o.a.s.u.StartupLoggingUtils Missing Java Option solr.log.dir. Logging may be missing or incomplete.
   [junit4]   2> 2850198 INFO  (jetty-launcher-12219-thread-1) [     ] o.a.s.s.SolrDispatchFilter Using logger factory org.apache.logging.slf4j.Log4jLoggerFactory
   [junit4]   2> 2850198 INFO  (jetty-launcher-12219-thread-1) [     ] o.a.s.s.SolrDispatchFilter  ___      _       Welcome to Apache Solr? version 8.5.0
   [junit4]   2> 2850198 INFO  (jetty-launcher-12219-thread-1) [     ] o.a.s.s.SolrDispatchFilter / __| ___| |_ _   Starting in cloud mode on port null
   [junit4]   2> 2850198 INFO  (jetty-launcher-12219-thread-1) [     ] o.a.s.s.SolrDispatchFilter \__ \/ _ \ | '_|  Install dir: null
   [junit4]   2> 2850198 INFO  (jetty-launcher-12219-thread-1) [     ] o.a.s.s.SolrDispatchFilter |___/\___/_|_|    Start time: 2020-01-02T21:18:00.199863800Z
   [junit4]   2> 2850199 INFO  (jetty-launcher-12219-thread-1) [     ] o.a.s.c.c.ConnectionManager Waiting for client to connect to ZooKeeper
   [junit4]   2> 2850202 INFO  (zkConnectionManagerCallback-12221-thread-1) [     ] o.a.s.c.c.ConnectionManager zkClient has connected
   [junit4]   2> 2850202 INFO  (jetty-launcher-12219-thread-1) [     ] o.a.s.c.c.ConnectionManager Client is connected to ZooKeeper
   [junit4]   2> 2850203 INFO  (jetty-launcher-12219-thread-1) [     ] o.a.s.s.SolrDispatchFilter solr.xml found in ZooKeeper. Loading...
   [junit4]   2> 2850610 INFO  (jetty-launcher-12219-thread-1) [     ] o.a.s.h.c.HttpShardHandlerFactory Host whitelist initialized: WhitelistHostChecker [whitelistHosts=null, whitelistHostCheckingEnabled=true]
   [junit4]   2> 2850612 WARN  (jetty-launcher-12219-thread-1) [     ] o.e.j.u.s.S.config Trusting all certificates configured for Client@5c81451b[provider=null,keyStore=null,trustStore=null]
   [junit4]   2> 2850612 WARN  (jetty-launcher-12219-thread-1) [     ] o.e.j.u.s.S.config No Client EndPointIdentificationAlgorithm configured for Client@5c81451b[provider=null,keyStore=null,trustStore=null]
   [junit4]   2> 2850617 WARN  (jetty-launcher-12219-thread-1) [     ] o.e.j.u.s.S.config Trusting all certificates configured for Client@3b45484d[provider=null,keyStore=null,trustStore=null]
   [junit4]   2> 2850617 WARN  (jetty-launcher-12219-thread-1) [     ] o.e.j.u.s.S.config No Client EndPointIdentificationAlgorithm configured for Client@3b45484d[provider=null,keyStore=null,trustStore=null]
   [junit4]   2> 2850619 INFO  (jetty-launcher-12219-thread-1) [     ] o.a.s.c.ZkContainer Zookeeper client=127.0.0.1:58669/solr
   [junit4]   2> 2850620 INFO  (jetty-launcher-12219-thread-1) [     ] o.a.s.c.c.ConnectionManager Waiting for client to connect to ZooKeeper
   [junit4]   2> 2850624 INFO  (zkConnectionManagerCallback-12228-thread-1) [     ] o.a.s.c.c.ConnectionManager zkClient has connected
   [junit4]   2> 2850624 INFO  (jetty-launcher-12219-thread-1) [     ] o.a.s.c.c.ConnectionManager Client is connected to ZooKeeper
   [junit4]   2> 2850731 INFO  (jetty-launcher-12219-thread-1) [n:127.0.0.1:58682_solr     ] o.a.s.c.c.ConnectionManager Waiting for client to connect to ZooKeeper
   [junit4]   2> 2850731 INFO  (zkConnectionManagerCallback-12230-thread-1) [     ] o.a.s.c.c.ConnectionManager zkClient has connected
   [junit4]   2> 2850731 INFO  (jetty-launcher-12219-thread-1) [n:127.0.0.1:58682_solr     ] o.a.s.c.c.ConnectionManager Client is connected to ZooKeeper
   [junit4]   2> 2850991 INFO  (jetty-launcher-12219-thread-1) [n:127.0.0.1:58682_solr     ] o.a.s.c.OverseerElectionContext I am going to be the leader 127.0.0.1:58682_solr
   [junit4]   2> 2850996 INFO  (jetty-launcher-12219-thread-1) [n:127.0.0.1:58682_solr     ] o.a.s.c.Overseer Overseer (id=72181117937713157-127.0.0.1:58682_solr-n_0000000000) starting
   [junit4]   2> 2851006 INFO  (OverseerStateUpdate-72181117937713157-127.0.0.1:58682_solr-n_0000000000) [n:127.0.0.1:58682_solr     ] o.a.s.c.Overseer Starting to work on the main queue : 127.0.0.1:58682_solr
   [junit4]   2> 2851006 INFO  (jetty-launcher-12219-thread-1) [n:127.0.0.1:58682_solr     ] o.a.s.c.ZkController Register node as live in ZooKeeper:/live_nodes/127.0.0.1:58682_solr
   [junit4]   2> 2851011 INFO  (OverseerStateUpdate-72181117937713157-127.0.0.1:58682_solr-n_0000000000) [n:127.0.0.1:58682_solr     ] o.a.s.c.c.ZkStateReader Updated live nodes from ZooKeeper... (0) -> (1)
   [junit4]   2> 2851018 WARN  (jetty-launcher-12219-thread-1) [n:127.0.0.1:58682_solr     ] o.a.s.c.CoreContainer Not all security plugins configured!  authentication=disabled authorization=disabled.  Solr is only as secure as you make it. Consider configuring authentication/authorization before exposing Solr to users internal or external.  See https://s.apache.org/solrsecurity for more info
   [junit4]   2> 2851096 INFO  (jetty-launcher-12219-thread-1) [n:127.0.0.1:58682_solr     ] o.a.s.h.a.MetricsHistoryHandler No .system collection, keeping metrics history in memory.
   [junit4]   2> 2851171 INFO  (jetty-launcher-12219-thread-1) [n:127.0.0.1:58682_solr     ] o.a.s.m.r.SolrJmxReporter JMX monitoring for 'solr_58682.solr.node' (registry 'solr.node') enabled at server: com.sun.jmx.mbeanserver.JmxMBeanServer@552d9f41
   [junit4]   2> 2851179 INFO  (jetty-launcher-12219-thread-1) [n:127.0.0.1:58682_solr     ] o.a.s.m.r.SolrJmxReporter JMX monitoring for 'solr_58682.solr.jvm' (registry 'solr.jvm') enabled at server: com.sun.jmx.mbeanserver.JmxMBeanServer@552d9f41
   [junit4]   2> 2851183 INFO  (jetty-launcher-12219-thread-1) [n:127.0.0.1:58682_solr     ] o.a.s.m.r.SolrJmxReporter JMX monitoring for 'solr_58682.solr.jetty' (registry 'solr.jetty') enabled at server: com.sun.jmx.mbeanserver.JmxMBeanServer@552d9f41
   [junit4]   2> 2851187 INFO  (jetty-launcher-12219-thread-1) [n:127.0.0.1:58682_solr     ] o.a.s.p.PackageLoader /packages.json updated to version -1
   [junit4]   2> 2851192 INFO  (jetty-launcher-12219-thread-1) [n:127.0.0.1:58682_solr     ] o.a.s.c.CorePropertiesLocator Found 0 core definitions underneath C:\Users\jenkins\workspace\Lucene-Solr-8.x-Windows\solr\build\solr-core\test\J1\temp\solr.cloud.LegacyCloudClusterPropTest_6574A549D50BE0DD-001\tempDir-001\node1\.
   [junit4]   2> 2851287 INFO  (SUITE-LegacyCloudClusterPropTest-seed#[6574A549D50BE0DD]-worker) [     ] o.a.s.c.MiniSolrCloudCluster waitForAllNodes: numServers=1
   [junit4]   2> 2851291 INFO  (SUITE-LegacyCloudClusterPropTest-seed#[6574A549D50BE0DD]-worker) [     ] o.a.s.c.c.ConnectionManager Waiting for client to connect to ZooKeeper
   [junit4]   2> 2851305 INFO  (zkConnectionManagerCallback-12239-thread-1) [     ] o.a.s.c.c.ConnectionManager zkClient has connected
   [junit4]   2> 2851305 INFO  (SUITE-LegacyCloudClusterPropTest-seed#[6574A549D50BE0DD]-worker) [     ] o.a.s.c.c.ConnectionManager Client is connected to ZooKeeper
   [junit4]   2> 2851310 INFO  (SUITE-LegacyCloudClusterPropTest-seed#[6574A549D50BE0DD]-worker) [     ] o.a.s.c.c.ZkStateReader Updated live nodes from ZooKeeper... (0) -> (1)
   [junit4]   2> 2851315 INFO  (SUITE-LegacyCloudClusterPropTest-seed#[6574A549D50BE0DD]-worker) [     ] o.a.s.c.s.i.ZkClientClusterStateProvider Cluster at 127.0.0.1:58669/solr ready
   [junit4]   2> 2851439 INFO  (TEST-LegacyCloudClusterPropTest.testCreateCollectionSwitchLegacyCloud-seed#[6574A549D50BE0DD]) [     ] o.a.s.SolrTestCaseJ4 ###Starting testCreateCollectionSwitchLegacyCloud
   [junit4]   2> 2851466 INFO  (qtp1503643843-34799) [n:127.0.0.1:58682_solr     ] o.a.s.h.a.CollectionsHandler Invoked Collection Action :clusterprop with params val=true&name=legacyCloud&action=CLUSTERPROP&wt=javabin&version=2 and sendToOCPQueue=true
   [junit4]   2> 2851475 INFO  (qtp1503643843-34799) [n:127.0.0.1:58682_solr     ] o.a.s.s.HttpSolrCall [admin] webapp=null path=/admin/collections params={val=true&name=legacyCloud&action=CLUSTERPROP&wt=javabin&version=2} status=0 QTime=9
   [junit4]   2> 2851478 INFO  (qtp1503643843-34801) [n:127.0.0.1:58682_solr     ] o.a.s.h.a.CollectionsHandler Invoked Collection Action :create with params collection.configName=conf&maxShardsPerNode=1&name=legacyTrue&nrtReplicas=1&action=CREATE&numShards=1&wt=javabin&version=2 and sendToOCPQueue=true
   [junit4]   2> 2851510 INFO  (OverseerThreadFactory-11987-thread-1-processing-n:127.0.0.1:58682_solr) [n:127.0.0.1:58682_solr     ] o.a.s.c.a.c.CreateCollectionCmd Create collection legacyTrue
   [junit4]   2> 2851639 INFO  (qtp1503643843-34798) [n:127.0.0.1:58682_solr    x:legacyTrue_shard1_replica_n1 ] o.a.s.h.a.CoreAdminOperation core create command qt=/admin/cores&collection.configName=conf&newCollection=true&name=legacyTrue_shard1_replica_n1&action=CREATE&numShards=1&collection=legacyTrue&shard=shard1&wt=javabin&version=2&replicaType=NRT
   [junit4]   2> 2851641 INFO  (qtp1503643843-34798) [n:127.0.0.1:58682_solr    x:legacyTrue_shard1_replica_n1 ] o.a.s.c.TransientSolrCoreCacheDefault Allocating transient cache for 2147483647 transient cores
   [junit4]   2> 2852687 INFO  (qtp1503643843-34798) [n:127.0.0.1:58682_solr c:legacyTrue s:shard1  x:legacyTrue_shard1_replica_n1 ] o.a.s.c.SolrConfig Using Lucene MatchVersion: 8.5.0
   [junit4]   2> 2852695 INFO  (qtp1503643843-34798) [n:127.0.0.1:58682_solr c:legacyTrue s:shard1  x:legacyTrue_shard1_replica_n1 ] o.a.s.s.IndexSchema [legacyTrue_shard1_replica_n1] Schema name=minimal
   [junit4]   2> 2852695 INFO  (qtp1503643843-34798) [n:127.0.0.1:58682_solr c:legacyTrue s:shard1  x:legacyTrue_shard1_replica_n1 ] o.a.s.s.IndexSchema Loaded schema minimal/1.1 with uniqueid field id
   [junit4]   2> 2852695 INFO  (qtp1503643843-34798) [n:127.0.0.1:58682_solr c:legacyTrue s:shard1  x:legacyTrue_shard1_replica_n1 ] o.a.s.c.CoreContainer Creating SolrCore 'legacyTrue_shard1_replica_n1' using configuration from collection legacyTrue, trusted=true
   [junit4]   2> 2852741 INFO  (qtp1503643843-34798) [n:127.0.0.1:58682_solr c:legacyTrue s:shard1  x:legacyTrue_shard1_replica_n1 ] o.a.s.m.r.SolrJmxReporter JMX monitoring for 'solr_58682.solr.core.legacyTrue.shard1.replica_n1' (registry 'solr.core.legacyTrue.shard1.replica_n1') enabled at server: com.sun.jmx.mbeanserver.JmxMBeanServer@552d9f41
   [junit4]   2> 2852741 INFO  (qtp1503643843-34798) [n:127.0.0.1:58682_solr c:legacyTrue s:shard1  x:legacyTrue_shard1_replica_n1 ] o.a.s.c.SolrCore [[legacyTrue_shard1_replica_n1] ] Opening new SolrCore at [C:\Users\jenkins\workspace\Lucene-Solr-8.x-Windows\solr\build\solr-core\test\J1\temp\solr.cloud.LegacyCloudClusterPropTest_6574A549D50BE0DD-001\tempDir-001\node1\legacyTrue_shard1_replica_n1], dataDir=[C:\Users\jenkins\workspace\Lucene-Solr-8.x-Windows\solr\build\solr-core\test\J1\temp\solr.cloud.LegacyCloudClusterPropTest_6574A549D50BE0DD-001\tempDir-001\node1\.\legacyTrue_shard1_replica_n1\data\]
   [junit4]   2> 2852963 INFO  (qtp1503643843-34798) [n:127.0.0.1:58682_solr c:legacyTrue s:shard1  x:legacyTrue_shard1_replica_n1 ] o.a.s.u.UpdateHandler Using UpdateLog implementation: org.apache.solr.update.UpdateLog
   [junit4]   2> 2852963 INFO  (qtp1503643843-34798) [n:127.0.0.1:58682_solr c:legacyTrue s:shard1  x:legacyTrue_shard1_replica_n1 ] o.a.s.u.UpdateLog Initializing UpdateLog: dataDir=null defaultSyncLevel=FLUSH numRecordsToKeep=100 maxNumLogsToKeep=10 numVersionBuckets=65536
   [junit4]   2> 2852967 INFO  (qtp1503643843-34798) [n:127.0.0.1:58682_solr c:legacyTrue s:shard1  x:legacyTrue_shard1_replica_n1 ] o.a.s.u.CommitTracker Hard AutoCommit: disabled
   [junit4]   2> 2852967 INFO  (qtp1503643843-34798) [n:127.0.0.1:58682_solr c:legacyTrue s:shard1  x:legacyTrue_shard1_replica_n1 ] o.a.s.u.CommitTracker Soft AutoCommit: disabled
   [junit4]   2> 2852969 INFO  (qtp1503643843-34798) [n:127.0.0.1:58682_solr c:legacyTrue s:shard1  x:legacyTrue_shard1_replica_n1 ] o.a.s.s.SolrIndexSearcher Opening [Searcher@5a529ebc[legacyTrue_shard1_replica_n1] main]
   [junit4]   2> 2852971 INFO  (qtp1503643843-34798) [n:127.0.0.1:58682_solr c:legacyTrue s:shard1  x:legacyTrue_shard1_replica_n1 ] o.a.s.r.ManagedResourceStorage Configured ZooKeeperStorageIO with znodeBase: /configs/conf
   [junit4]   2> 2852973 INFO  (qtp1503643843-34798) [n:127.0.0.1:58682_solr c:legacyTrue s:shard1  x:legacyTrue_shard1_replica_n1 ] o.a.s.r.ManagedResourceStorage Loaded null at path _rest_managed.json using ZooKeeperStorageIO:path=/configs/conf
   [junit4]   2> 2852973 INFO  (qtp1503643843-34798) [n:127.0.0.1:58682_solr c:legacyTrue s:shard1  x:legacyTrue_shard1_replica_n1 ] o.a.s.h.ReplicationHandler Commits will be reserved for 10000ms.
   [junit4]   2> 2852973 INFO  (qtp1503643843-34798) [n:127.0.0.1:58682_solr c:legacyTrue s:shard1  x:legacyTrue_shard1_replica_n1 ] o.a.s.u.UpdateLog Could not find max version in index or recent updates, using new clock 1654652805289345024
   [junit4]   2> 2852978 INFO  (searcherExecutor-11992-thread-1-processing-n:127.0.0.1:58682_solr x:legacyTrue_shard1_replica_n1 c:legacyTrue s:shard1) [n:127.0.0.1:58682_solr c:legacyTrue s:shard1  x:legacyTrue_shard1_replica_n1 ] o.a.s.c.SolrCore [legacyTrue_shard1_replica_n1] Registered new searcher Searcher@5a529ebc[legacyTrue_shard1_replica_n1] main{ExitableDirectoryReader(UninvertingDirectoryReader())}
   [junit4]   2> 2852990 INFO  (qtp1503643843-34798) [n:127.0.0.1:58682_solr c:legacyTrue s:shard1  x:legacyTrue_shard1_replica_n1 ] o.a.s.c.ZkShardTerms Successful update of terms at /collections/legacyTrue/terms/shard1 to Terms{values={core_node2=0}, version=0}
   [junit4]   2> 2852990 INFO  (qtp1503643843-34798) [n:127.0.0.1:58682_solr c:legacyTrue s:shard1  x:legacyTrue_shard1_replica_n1 ] o.a.s.c.ShardLeaderElectionContextBase make sure parent is created /collections/legacyTrue/leaders/shard1
   [junit4]   2> 2852999 INFO  (qtp1503643843-34798) [n:127.0.0.1:58682_solr c:legacyTrue s:shard1  x:legacyTrue_shard1_replica_n1 ] o.a.s.c.ShardLeaderElectionContext Enough replicas found to continue.
   [junit4]   2> 2852999 INFO  (qtp1503643843-34798) [n:127.0.0.1:58682_solr c:legacyTrue s:shard1  x:legacyTrue_shard1_replica_n1 ] o.a.s.c.ShardLeaderElectionContext I may be the new leader - try and sync
   [junit4]   2> 2852999 INFO  (qtp1503643843-34798) [n:127.0.0.1:58682_solr c:legacyTrue s:shard1  x:legacyTrue_shard1_replica_n1 ] o.a.s.c.SyncStrategy Sync replicas to https://127.0.0.1:58682/solr/legacyTrue_shard1_replica_n1/
   [junit4]   2> 2853001 INFO  (qtp1503643843-34798) [n:127.0.0.1:58682_solr c:legacyTrue s:shard1  x:legacyTrue_shard1_replica_n1 ] o.a.s.c.SyncStrategy Sync Success - now sync replicas to me
   [junit4]   2> 2853001 INFO  (qtp1503643843-34798) [n:127.0.0.1:58682_solr c:legacyTrue s:shard1  x:legacyTrue_shard1_replica_n1 ] o.a.s.c.SyncStrategy https://127.0.0.1:58682/solr/legacyTrue_shard1_replica_n1/ has no replicas
   [junit4]   2> 2853001 INFO  (qtp1503643843-34798) [n:127.0.0.1:58682_solr c:legacyTrue s:shard1  x:legacyTrue_shard1_replica_n1 ] o.a.s.c.ShardLeaderElectionContextBase Creating leader registration node /collections/legacyTrue/leaders/shard1/leader after winning as /collections/legacyTrue/leader_elect/shard1/election/72181117937713157-core_node2-n_0000000000
   [junit4]   2> 2853019 INFO  (qtp1503643843-34798) [n:127.0.0.1:58682_solr c:legacyTrue s:shard1  x:legacyTrue_shard1_replica_n1 ] o.a.s.c.ShardLeaderElectionContext I am the new leader: https://127.0.0.1:58682/solr/legacyTrue_shard1_replica_n1/ shard1
   [junit4]   2> 2853136 INFO  (zkCallback-12229-thread-1) [     ] o.a.s.c.c.ZkStateReader A cluster state change: [WatchedEvent state:SyncConnected type:NodeDataChanged path:/collections/legacyTrue/state.json] for collection [legacyTrue] has occurred - updating... (live nodes size: [1])
   [junit4]   2> 2853137 INFO  (zkCallback-12229-thread-2) [     ] o.a.s.c.c.ZkStateReader A cluster state change: [WatchedEvent state:SyncConnected type:NodeDataChanged path:/collections/legacyTrue/state.json] for collection [legacyTrue] has occurred - updating... (live nodes size: [1])
   [junit4]   2> 2853138 INFO  (qtp1503643843-34798) [n:127.0.0.1:58682_solr c:legacyTrue s:shard1  x:legacyTrue_shard1_replica_n1 ] o.a.s.c.ZkController I am the leader, no recovery necessary
   [junit4]   2> 2853150 INFO  (qtp1503643843-34798) [n:127.0.0.1:58682_solr c:legacyTrue s:shard1  x:legacyTrue_shard1_replica_n1 ] o.a.s.s.HttpSolrCall [admin] webapp=null path=/admin/cores params={qt=/admin/cores&collection.configName=conf&newCollection=true&name=legacyTrue_shard1_replica_n1&action=CREATE&numShards=1&collection=legacyTrue&shard=shard1&wt=javabin&version=2&replicaType=NRT} status=0 QTime=1510
   [junit4]   2> 2853153 INFO  (qtp1503643843-34801) [n:127.0.0.1:58682_solr     ] o.a.s.h.a.CollectionsHandler Wait for new collection to be active for at most 45 seconds. Check all shard replicas
   [junit4]   2> 2853251 INFO  (zkCallback-12229-thread-3) [     ] o.a.s.c.c.ZkStateReader A cluster state change: [WatchedEvent state:SyncConnected type:NodeDataChanged path:/collections/legacyTrue/state.json] for collection [legacyTrue] has occurred - updating... (live nodes size: [1])
   [junit4]   2> 2853251 INFO  (zkCallback-12229-thread-1) [     ] o.a.s.c.c.ZkStateReader A cluster state change: [WatchedEvent state:SyncConnected type:NodeDataChanged path:/collections/legacyTrue/state.json] for collection [legacyTrue] has occurred - updating... (live nodes size: [1])
   [junit4]   2> 2853251 INFO  (zkCallback-12229-thread-2) [     ] o.a.s.c.c.ZkStateReader A cluster state change: [WatchedEvent state:SyncConnected type:NodeDataChanged path:/collections/legacyTrue/state.json] for collection [legacyTrue] has occurred - updating... (live nodes size: [1])
   [junit4]   2> 2853255 INFO  (qtp1503643843-34801) [n:127.0.0.1:58682_solr     ] o.a.s.s.HttpSolrCall [admin] webapp=null path=/admin/collections params={collection.configName=conf&maxShardsPerNode=1&name=legacyTrue&nrtReplicas=1&action=CREATE&numShards=1&wt=javabin&version=2} status=0 QTime=1776
   [junit4]   2> 2853255 INFO  (TEST-LegacyCloudClusterPropTest.testCreateCollectionSwitchLegacyCloud-seed#[6574A549D50BE0DD]) [     ] o.a.s.c.MiniSolrCloudCluster waitForActiveCollection: legacyTrue
   [junit4]   2> 2853265 INFO  (TEST-LegacyCloudClusterPropTest.testCreateCollectionSwitchLegacyCloud-seed#[6574A549D50BE0DD]) [     ] o.a.s.c.CoreContainer Shutting down CoreContainer instance=393637092
   [junit4]   2> 2853265 INFO  (TEST-LegacyCloudClusterPropTest.testCreateCollectionSwitchLegacyCloud-seed#[6574A549D50BE0DD]) [     ] o.a.s.c.ZkController Remove node as live in ZooKeeper:/live_nodes/127.0.0.1:58682_solr
   [junit4]   2> 2853285 INFO  (TEST-LegacyCloudClusterPropTest.testCreateCollectionSwitchLegacyCloud-seed#[6574A549D50BE0DD]) [     ] o.a.s.c.ZkController Publish this node as DOWN...
   [junit4]   2> 2853285 INFO  (TEST-LegacyCloudClusterPropTest.testCreateCollectionSwitchLegacyCloud-seed#[6574A549D50BE0DD]) [     ] o.a.s.c.ZkController Publish node=127.0.0.1:58682_solr as DOWN
   [junit4]   2> 2853287 INFO  (coreCloseExecutor-11997-thread-1) [n:127.0.0.1:58682_solr c:legacyTrue s:shard1 r:core_node2 x:legacyTrue_shard1_replica_n1 ] o.a.s.c.SolrCore [legacyTrue_shard1_replica_n1]  CLOSING SolrCore org.apache.solr.core.SolrCore@6cc5c419
   [junit4]   2> 2853287 INFO  (coreCloseExecutor-11997-thread-1) [n:127.0.0.1:58682_solr c:legacyTrue s:shard1 r:core_node2 x:legacyTrue_shard1_replica_n1 ] o.a.s.m.SolrMetricManager Closing metric reporters for registry=solr.core.legacyTrue.shard1.replica_n1, tag=SolrCore@6cc5c419
   [junit4]   2> 2853287 INFO  (coreCloseExecutor-11997-thread-1) [n:127.0.0.1:58682_solr c:legacyTrue s:shard1 r:core_node2 x:legacyTrue_shard1_replica_n1 ] o.a.s.m.r.SolrJmxReporter Closing reporter [org.apache.solr.metrics.reporters.SolrJmxReporter@4ecdcb9a: rootName = solr_58682, domain = solr.core.legacyTrue.shard1.replica_n1, service url = null, agent id = null] for registry solr.core.legacyTrue.shard1.replica_n1 / com.codahale.metrics.MetricRegistry@5243f205
   [junit4]   2> 2853294 INFO  (coreCloseExecutor-11997-thread-1) [n:127.0.0.1:58682_solr c:legacyTrue s:shard1 r:core_node2 x:legacyTrue_shard1_replica_n1 ] o.a.s.m.SolrMetricManager Closing metric reporters for registry=solr.collection.legacyTrue.shard1.leader, tag=SolrCore@6cc5c419
   [junit4]   2> 2853309 INFO  (TEST-LegacyCloudClusterPropTest.testCreateCollectionSwitchLegacyCloud-seed#[6574A549D50BE0DD]) [     ] o.a.s.m.SolrMetricManager Closing metric reporters for registry=solr.node, tag=null
   [junit4]   2> 2853309 INFO  (TEST-LegacyCloudClusterPropTest.testCreateCollectionSwitchLegacyCloud-seed#[6574A549D50BE0DD]) [     ] o.a.s.m.r.SolrJmxReporter Closing reporter [org.apache.solr.metrics.reporters.SolrJmxReporter@22451cee: rootName = solr_58682, domain = solr.node, service url = null, agent id = null] for registry solr.node / com.codahale.metrics.MetricRegistry@11143cf2
   [junit4]   2> 2853339 INFO  (TEST-LegacyCloudClusterPropTest.testCreateCollectionSwitchLegacyCloud-seed#[6574A549D50BE0DD]) [     ] o.a.s.m.SolrMetricManager Closing metric reporters for registry=solr.jvm, tag=null
   [junit4]   2> 2853339 INFO  (TEST-LegacyCloudClusterPropTest.testCreateCollectionSwitchLegacyCloud-seed#[6574A549D50BE0DD]) [     ] o.a.s.m.r.SolrJmxReporter Closing reporter [org.apache.solr.metrics.reporters.SolrJmxReporter@340bf354: rootName = solr_58682, domain = solr.jvm, service url = null, agent id = null] for registry solr.jvm / com.codahale.metrics.MetricRegistry@7fdbe4cc
   [junit4]   2> 2853339 INFO  (TEST-LegacyCloudClusterPropTest.testCreateCollectionSwitchLegacyCloud-seed#[6574A549D50BE0DD]) [     ] o.a.s.m.SolrMetricManager Closing metric reporters for registry=solr.jetty, tag=null
   [junit4]   2> 2853339 INFO  (TEST-LegacyCloudClusterPropTest.testCreateCollectionSwitchLegacyCloud-seed#[6574A549D50BE0DD]) [     ] o.a.s.m.r.SolrJmxReporter Closing reporter [org.apache.solr.metrics.reporters.SolrJmxReporter@2ecab2d3: rootName = solr_58682, domain = solr.jetty, service url = null, agent id = null] for registry solr.jetty / com.codahale.metrics.MetricRegistry@2ddef70d
   [junit4]   2> 2853339 INFO  (TEST-LegacyCloudClusterPropTest.testCreateCollectionSwitchLegacyCloud-seed#[6574A549D50BE0DD]) [     ] o.a.s.m.SolrMetricManager Closing metric reporters for registry=solr.cluster, tag=null
   [junit4]   2> 2853367 INFO  (closeThreadPool-12244-thread-2) [     ] o.a.s.c.Overseer Overseer (id=72181117937713157-127.0.0.1:58682_solr-n_0000000000) closing
   [junit4]   2> 2853367 INFO  (OverseerStateUpdate-72181117937713157-127.0.0.1:58682_solr-n_0000000000) [n:127.0.0.1:58682_solr     ] o.a.s.c.Overseer Overseer Loop exiting : 127.0.0.1:58682_solr
   [junit4]   2> 2853411 INFO  (OverseerAutoScalingTriggerThread-72181117937713157-127.0.0.1:58682_solr-n_0000000000) [     ] o.a.s.c.a.OverseerTriggerThread OverseerTriggerThread woken up but we are closed, exiting.
   [junit4]   2> 2853411 INFO  (closeThreadPool-12244-thread-1) [     ] o.a.s.c.Overseer Overseer (id=72181117937713157-127.0.0.1:58682_solr-n_0000000000) closing
   [junit4]   2> 2853471 INFO  (TEST-LegacyCloudClusterPropTest.testCreateCollectionSwitchLegacyCloud-seed#[6574A549D50BE0DD]) [     ] o.a.s.c.Overseer Overseer (id=72181117937713157-127.0.0.1:58682_solr-n_0000000000) closing
   [junit4]   2> 2853471 INFO  (zkCallback-12238-thread-2) [     ] o.a.s.c.c.ZkStateReader Updated live nodes from ZooKeeper... (1) -> (0)
   [junit4]   2> 2853471 INFO  (TEST-LegacyCloudClusterPropTest.testCreateCollectionSwitchLegacyCloud-seed#[6574A549D50BE0DD]) [     ] o.e.j.s.AbstractConnector Stopped ServerConnector@5367a3b3{ssl,[ssl, alpn, http/1.1, h2]}{127.0.0.1:0}
   [junit4]   2> 2853471 INFO  (TEST-LegacyCloudClusterPropTest.testCreateCollectionSwitchLegacyCloud-seed#[6574A549D50BE0DD]) [     ] o.e.j.s.h.ContextHandler Stopped o.e.j.s.ServletContextHandler@7d857dfb{/solr,null,UNAVAILABLE}
   [junit4]   2> 2853471 INFO  (TEST-LegacyCloudClusterPropTest.testCreateCollectionSwitchLegacyCloud-seed#[6574A549D50BE0DD]) [     ] o.e.j.s.session node0 Stopped scavenging
   [junit4]   2> 2853475 INFO  (TEST-LegacyCloudClusterPropTest.testCreateCollectionSwitchLegacyCloud-seed#[6574A549D50BE0DD]) [     ] o.a.s.c.MiniSolrCloudCluster waitForJettyToStop: 58682
   [junit4]   2> 2853475 INFO  (TEST-LegacyCloudClusterPropTest.testCreateCollectionSwitchLegacyCloud-seed#[6574A549D50BE0DD]) [     ] o.a.s.c.s.e.JettySolrRunner Start Jetty (configured port=0, binding port=58682)
   [junit4]   2> 2853478 WARN  (TEST-LegacyCloudClusterPropTest.testCreateCollectionSwitchLegacyCloud-seed#[6574A549D50BE0DD]) [     ] o.e.j.s.h.g.GzipHandler minGzipSize of 0 is inefficient for short content, break even is size 23
   [junit4]   2> 2853478 INFO  (TEST-LegacyCloudClusterPropTest.testCreateCollectionSwitchLegacyCloud-seed#[6574A549D50BE0DD]) [     ] o.a.s.c.s.e.JettySolrRunner Trying to start Jetty on port 58682 try number 1 ...
   [junit4]   2> 2853478 INFO  (TEST-LegacyCloudClusterPropTest.testCreateCollectionSwitchLegacyCloud-seed#[6574A549D50BE0DD]) [     ] o.e.j.s.Server jetty-9.4.24.v20191120; built: 2019-11-20T21:37:49.771Z; git: 363d5f2df3a8a28de40604320230664b9c793c16; jvm 11.0.4+11
   [junit4]   2> 2853478 INFO  (TEST-LegacyCloudClusterPropTest.testCreateCollectionSwitchLegacyCloud-seed#[6574A549D50BE0DD]) [     ] o.e.j.s.session DefaultSessionIdManager workerName=node0
   [junit4]   2> 2853478 INFO  (TEST-LegacyCloudClusterPropTest.testCreateCollectionSwitchLegacyCloud-seed#[6574A549D50BE0DD]) [     ] o.e.j.s.session No SessionScavenger set, using defaults
   [junit4]   2> 2853478 INFO  (TEST-LegacyCloudClusterPropTest.testCreateCollectionSwitchLegacyCloud-seed#[6574A549D50BE0DD]) [     ] o.e.j.s.session node0 Scavenging every 600000ms
   [junit4]   2> 2853478 INFO  (TEST-LegacyCloudClusterPropTest.testCreateCollectionSwitchLegacyCloud-seed#[6574A549D50BE0DD]) [     ] o.e.j.s.h.ContextHandler Started o.e.j.s.ServletContextHandler@2fedbab9{/solr,null,AVAILABLE}
   [junit4]   2> 2853484 INFO  (TEST-LegacyCloudClusterPropTest.testCreateCollectionSwitchLegacyCloud-seed#[6574A549D50BE0DD]) [     ] o.e.j.s.AbstractConnector Started ServerConnector@76f8425{ssl,[ssl, alpn, http/1.1, h2]}{127.0.0.1:58682}
   [junit4]   2> 2853484 INFO  (TEST-LegacyCloudClusterPropTest.testCreateCollectionSwitchLegacyCloud-seed#[6574A549D50BE0DD]) [     ] o.e.j.s.Server Started @2853543ms
   [junit4]   2> 2853484 INFO  (TEST-LegacyCloudClusterPropTest.testCreateCollectionSwitchLegacyCloud-seed#[6574A549D50BE0DD]) [     ] o.a.s.c.s.e.JettySolrRunner Jetty properties: {hostContext=/solr, hostPort=58682}
   [junit4]   2> 2853484 ERROR (TEST-LegacyCloudClusterPropTest.testCreateCollectionSwitchLegacyCloud-seed#[6574A549D50BE0DD]) [     ] o.a.s.u.StartupLoggingUtils Missing Java Option solr.log.dir. Logging may be missing or incomplete.
   [junit4]   2> 2853484 INFO  (TEST-LegacyCloudClusterPropTest.testCreateCollectionSwitchLegacyCloud-seed#[6574A549D50BE0DD]) [     ] o.a.s.s.SolrDispatchFilter Using logger factory org.apache.logging.slf4j.Log4jLoggerFactory
   [junit4]   2> 2853484 INFO  (TEST-LegacyCloudClusterPropTest.testCreateCollectionSwitchLegacyCloud-seed#[6574A549D50BE0DD]) [     ] o.a.s.s.SolrDispatchFilter  ___      _       Welcome to Apache Solr? version 8.5.0
   [junit4]   2> 2853484 INFO  (TEST-LegacyCloudClusterPropTest.testCreateCollectionSwitchLegacyCloud-seed#[6574A549D50BE0DD]) [     ] o.a.s.s.SolrDispatchFilter / __| ___| |_ _   Starting in cloud mode on port null
   [junit4]   2> 2853484 INFO  (TEST-LegacyCloudClusterPropTest.testCreateCollectionSwitchLegacyCloud-seed#[6574A549D50BE0DD]) [     ] o.a.s.s.SolrDispatchFilter \__ \/ _ \ | '_|  Install dir: null
   [junit4]   2> 2853484 INFO  (TEST-LegacyCloudClusterPropTest.testCreateCollectionSwitchLegacyCloud-seed#[6574A549D50BE0DD]) [     ] o.a.s.s.SolrDispatchFilter |___/\___/_|_|    Start time: 2020-01-02T21:18:03.485542200Z
   [junit4]   2> 2853491 INFO  (TEST-LegacyCloudClusterPropTest.testCreateCollectionSwitchLegacyCloud-seed#[6574A549D50BE0DD]) [     ] o.a.s.c.c.ConnectionManager Waiting for client to connect to ZooKeeper
   [junit4]   2> 2853496 INFO  (zkConnectionManagerCallback-12246-thread-1) [     ] o.a.s.c.c.ConnectionManager zkClient has connected
   [junit4]   2> 2853500 INFO  (TEST-LegacyCloudClusterPropTest.testCreateCollectionSwitchLegacyCloud-seed#[6574A549D50BE0DD]) [     ] o.a.s.c.c.ConnectionManager Client is connected to ZooKeeper
   [junit4]   2> 2853500 INFO  (TEST-LegacyCloudClusterPropTest.testCreateCollectionSwitchLegacyCloud-seed#[6574A549D50BE0DD]) [     ] o.a.s.s.SolrDispatchFilter solr.xml found in ZooKeeper. Loading...
   [junit4]   2> 2853847 INFO  (TEST-LegacyCloudClusterPropTest.testCreateCollectionSwitchLegacyCloud-seed#[6574A549D50BE0DD]) [     ] o.a.s.h.c.HttpShardHandlerFactory Host whitelist initialized: WhitelistHostChecker [whitelistHosts=null, whitelistHostCheckingEnabled=true]
   [junit4]   2> 2853859 WARN  (TEST-LegacyCloudClusterPropTest.testCreateCollectionSwitchLegacyCloud-seed#[6574A549D50BE0DD]) [     ] o.e.j.u.s.S.config Trusting all certificates configured for Client@81732fe[provider=null,keyStore=null,trustStore=null]
   [junit4]   2> 2853859 WARN  (TEST-LegacyCloudClusterPropTest.testCreateCollectionSwitchLegacyCloud-seed#[6574A549D50BE0DD]) [     ] o.e.j.u.s.S.config No Client EndPointIdentificationAlgorithm configured for Client@81732fe[provider=null,keyStore=null,trustStore=null]
   [junit4]   2> 2853875 WARN  (TEST-LegacyCloudClusterPropTest.testCreateCollectionSwitchLegacyCloud-seed#[6574A549D50BE0DD]) [     ] o.e.j.u.s.S.config Trusting all certificates configured for Client@5798dfdb[provider=null,keyStore=null,trustStore=null]
   [junit4]   2> 2853875 WARN  (TEST-LegacyCloudClusterPropTest.testCreateCollectionSwitchLegacyCloud-seed#[6574A549D50BE0DD]) [     ] o.e.j.u.s.S.config No Client EndPointIdentificationAlgorithm configured for Client@5798dfdb[provider=null,keyStore=null,trustStore=null]
   [junit4]   2> 2853876 INFO  (TEST-LegacyCloudClusterPropTest.testCreateCollectionSwitchLegacyCloud-seed#[6574A549D50BE0DD]) [     ] o.a.s.c.ZkContainer Zookeeper client=127.0.0.1:58669/solr
   [junit4]   2> 2853881 INFO  (TEST-LegacyCloudClusterPropTest.testCreateCollectionSwitchLegacyCloud-seed#[6574A549D50BE0DD]) [     ] o.a.s.c.c.ConnectionManager Waiting for client to connect to ZooKeeper
   [junit4]   2> 2853901 INFO  (zkConnectionManagerCallback-12253-thread-1) [     ] o.a.s.c.c.ConnectionManager zkClient has connected
   [junit4]   2> 2853901 INFO  (TEST-LegacyCloudClusterPropTest.testCreateCollectionSwitchLegacyCloud-seed#[6574A549D50BE0DD]) [     ] o.a.s.c.c.ConnectionManager Client is connected to ZooKeeper
   [junit4]   2> 2854041 INFO  (TEST-LegacyCloudClusterPropTest.testCreateCollectionSwitchLegacyCloud-seed#[6574A549D50BE0DD]) [n:127.0.0.1:58682_solr     ] o.a.s.c.c.ConnectionManager Waiting for client to connect to ZooKeeper
   [junit4]   2> 2854051 INFO  (zkConnectionManagerCallback-12255-thread-1) [     ] o.a.s.c.c.ConnectionManager zkClient has connected
   [junit4]   2> 2854051 INFO  (TEST-LegacyCloudClusterPropTest.testCreateCollectionSwitchLegacyCloud-seed#[6574A549D50BE0DD]) [n:127.0.0.1:58682_solr     ] o.a.s.c.c.ConnectionManager Client is connected to ZooKeeper
   [junit4]   2> 2854146 INFO  (TEST-LegacyCloudClusterPropTest.testCreateCollectionSwitchLegacyCloud-seed#[6574A549D50BE0DD]) [n:127.0.0.1:58682_solr     ] o.a.s.c.OverseerElectionContext I am going to be the leader 127.0.0.1:58682_solr
   [junit4]   2> 2854147 INFO  (TEST-LegacyCloudClusterPropTest.testCreateCollectionSwitchLegacyCloud-seed#[6574A549D50BE0DD]) [n:127.0.0.1:58682_solr     ] o.a.s.c.Overseer Overseer (id=72181117937713161-127.0.0.1:58682_solr-n_0000000001) starting
   [junit4]   2> 2854166 INFO  (OverseerStateUpdate-72181117937713161-127.0.0.1:58682_solr-n_0000000001) [n:127.0.0.1:58682_solr     ] o.a.s.c.Overseer Starting to work on the main queue : 127.0.0.1:58682_solr
   [junit4]   2> 2854166 INFO  (TEST-LegacyCloudClusterPropTest.testCreateCollectionSwitchLegacyCloud-seed#[6574A549D50BE0DD]) [n:127.0.0.1:58682_solr     ] o.a.s.c.ZkController Register node as live in ZooKeeper:/live_nodes/127.0.0.1:58682_solr
   [junit4]   2> 2854169 INFO  (zkCallback-12238-thread-2) [     ] o.a.s.c.c.ZkStateReader Updated live nodes from ZooKeeper... (0) -> (1)
   [junit4]   2> 2854169 INFO  (OverseerStateUpdate-72181117937713161-127.0.0.1:58682_solr-n_0000000001) [n:127.0.0.1:58682_solr     ] o.a.s.c.c.ZkStateReader Updated live nodes from ZooKeeper... (0) -> (1)
   [junit4]   2> 2854231 WARN  (TEST-LegacyCloudClusterPropTest.testCreateCollectionSwitchLegacyCloud-seed#[6574A549D50BE0DD]) [n:127.0.0.1:58682_solr     ] o.a.s.c.CoreContainer Not all security plugins configured!  authentication=disabled authorization=disabled.  Solr is only as secure as you make it. Consider configuring authentication/authorization before exposing Solr to users internal or external.  See https://s.apache.org/solrsecurity for more info
   [junit4]   2> 2854271 INFO  (TEST-LegacyCloudClusterPropTest.testCreateCollectionSwitchLegacyCloud-seed#[6574A549D50BE0DD]) [n:127.0.0.1:58682_solr     ] o.a.s.h.a.MetricsHistoryHandler No .system collection, keeping metrics history in memory.
   [junit4]   2> 2854406 INFO  (TEST-LegacyCloudClusterPropTest.testCreateCollectionSwitchLegacyCloud-seed#[6574A549D50BE0DD]) [n:127.0.0.1:58682_solr     ] o.a.s.m.r.SolrJmxReporter JMX monitoring for 'solr_58682.solr.node' (registry 'solr.node') enabled at server: com.sun.jmx.mbeanserver.JmxMBeanServer@552d9f41
   [junit4]   2> 2854422 INFO  (TEST-LegacyCloudClusterPropTest.testCreateCollectionSwitchLegacyCloud-seed#[6574A549D50BE0DD]) [n:127.0.0.1:58682_solr     ] o.a.s.m.r.SolrJmxReporter JMX monitoring for 'solr_58682.solr.jvm' (registry 'solr.jvm') enabled at server: com.sun.jmx.mbeanserver.JmxMBeanServer@552d9f41
   [junit4]   2> 2854422 INFO  (TEST-LegacyCloudClusterPropTest.testCreateCollectionSwitchLegacyCloud-seed#[6574A549D50BE0DD]) [n:127.0.0.1:58682_solr     ] o.a.s.m.r.SolrJmxReporter JMX monitoring for 'solr_58682.solr.jetty' (registry 'solr.jetty') enabled at server: com.sun.jmx.mbeanserver.JmxMBeanServer@552d9f41
   [junit4]   2> 2854435 INFO  (TEST-LegacyCloudClusterPropTest.testCreateCollectionSwitchLegacyCloud-seed#[6574A549D50BE0DD]) [n:127.0.0.1:58682_solr     ] o.a.s.p.PackageLoader /packages.json updated to version -1
   [junit4]   2> 2854439 INFO  (TEST-LegacyCloudClusterPropTest.testCreateCollectionSwitchLegacyCloud-seed#[6574A549D50BE0DD]) [n:127.0.0.1:58682_solr     ] o.a.s.c.CorePropertiesLocator Found 1 core definitions underneath C:\Users\jenkins\workspace\Lucene-Solr-8.x-Windows\solr\build\solr-core\test\J1\temp\solr.cloud.LegacyCloudClusterPropTest_6574A549D50BE0DD-001\tempDir-001\node1\.
   [junit4]   2> 2854439 INFO  (TEST-LegacyCloudClusterPropTest.testCreateCollectionSwitchLegacyCloud-seed#[6574A549D50BE0DD]) [n:127.0.0.1:58682_solr     ] o.a.s.c.CorePropertiesLocator Cores are: [legacyTrue_shard1_replica_n1]
   [junit4]   2> 2854447 INFO  (coreLoadExecutor-12011-thread-1-processing-n:127.0.0.1:58682_solr) [n:127.0.0.1:58682_solr     ] o.a.s.c.TransientSolrCoreCacheDefault Allocating transient cache for 2147483647 transient cores
   [junit4]   2> 2854461 INFO  (coreLoadExecutor-12011-thread-1-processing-n:127.0.0.1:58682_solr) [n:127.0.0.1:58682_solr     ] o.a.s.c.SolrConfig Using Lucene MatchVersion: 8.5.0
   [junit4]   2> 2854468 INFO  (coreLoadExecutor-12011-thread-1-processing-n:127.0.0.1:58682_solr) [n:127.0.0.1:58682_solr     ] o.a.s.s.IndexSchema [legacyTrue_shard1_replica_n1] Schema name=minimal
   [junit4]   2> 2854472 INFO  (coreLoadExecutor-12011-thread-1-processing-n:127.0.0.1:58682_solr) [n:127.0.0.1:58682_solr     ] o.a.s.s.IndexSchema Loaded schema minimal/1.1 with uniqueid field id
   [junit4]   2> 2854490 INFO  (coreLoadExecutor-12011-thread-1-processing-n:127.0.0.1:58682_solr) [n:127.0.0.1:58682_solr c:legacyTrue s:shard1  x:legacyTrue_shard1_replica_n1 ] o.a.s.c.SolrConfig Using Lucene MatchVersion: 8.5.0
   [junit4]   2> 2854497 INFO  (coreLoadExecutor-12011-thread-1-processing-n:127.0.0.1:58682_solr) [n:127.0.0.1:58682_solr c:legacyTrue s:shard1  x:legacyTrue_shard1_replica_n1 ] o.a.s.s.IndexSchema [legacyTrue_shard1_replica_n1] Schema name=minimal
   [junit4]   2> 2854500 INFO  (coreLoadExecutor-12011-thread-1-processing-n:127.0.0.1:58682_solr) [n:127.0.0.1:58682_solr c:legacyTrue s:shard1  x:legacyTrue_shard1_replica_n1 ] o.a.s.s.IndexSchema Loaded schema minimal/1.1 with uniqueid field id
   [junit4]   2> 2854500 INFO  (coreLoadExecutor-12011-thread-1-processing-n:127.0.0.1:58682_solr) [n:127.0.0.1:58682_solr c:legacyTrue s:shard1  x:legacyTrue_shard1_replica_n1 ] o.a.s.c.CoreContainer Creating SolrCore 'legacyTrue_shard1_replica_n1' using configuration from collection legacyTrue, trusted=true
   [junit4]   2> 2854500 INFO  (coreLoadExecutor-12011-thread-1-processing-n:127.0.0.1:58682_solr) [n:127.0.0.1:58682_solr c:legacyTrue s:shard1  x:legacyTrue_shard1_replica_n1 ] o.a.s.m.r.SolrJmxReporter JMX monitoring for 'solr_58682.solr.core.legacyTrue.shard1.replica_n1' (registry 'solr.core.legacyTrue.shard1.replica_n1') enabled at server: com.sun.jmx.mbeanserver.JmxMBeanServer@552d9f41
   [junit4]   2> 2854501 INFO  (coreLoadExecutor-12011-thread-1-processing-n:127.0.0.1:58682_solr) [n:127.0.0.1:58682_solr c:legacyTrue s:shard1  x:legacyTrue_shard1_replica_n1 ] o.a.s.c.SolrCore [[legacyTrue_shard1_replica_n1] ] Opening new SolrCore at [C:\Users\jenkins\workspace\Lucene-Solr-8.x-Windows\solr\build\solr-core\test\J1\temp\solr.cloud.LegacyCloudClusterPropTest_6574A549D50BE0DD-001\tempDir-001\node1\legacyTrue_shard1_replica_n1], dataDir=[C:\Users\jenkins\workspace\Lucene-Solr-8.x-Windows\solr\build\solr-core\test\J1\temp\solr.cloud.LegacyCloudClusterPropTest_6574A549D50BE0DD-001\tempDir-001\node1\.\legacyTrue_shard1_replica_n1\data\]
   [junit4]   2> 2854603 INFO  (coreLoadExecutor-12011-thread-1-processing-n:127.0.0.1:58682_solr) [n:127.0.0.1:58682_solr c:legacyTrue s:shard1  x:legacyTrue_shard1_replica_n1 ] o.a.s.u.UpdateHandler Using UpdateLog implementation: org.apache.solr.update.UpdateLog
   [junit4]   2> 2854603 INFO  (coreLoadExecutor-12011-thread-1-processing-n:127.0.0.1:58682_solr) [n:127.0.0.1:58682_solr c:legacyTrue s:shard1  x:legacyTrue_shard1_replica_n1 ] o.a.s.u.UpdateLog Initializing UpdateLog: dataDir=null defaultSyncLevel=FLUSH numRecordsToKeep=100 maxNumLogsToKeep=10 numVersionBuckets=65536
   [junit4]   2> 2854605 INFO  (coreLoadExecutor-12011-thread-1-processing-n:127.0.0.1:58682_solr) [n:127.0.0.1:58682_solr c:legacyTrue s:shard1  x:legacyTrue_shard1_replica_n1 ] o.a.s.u.CommitTracker Hard AutoCommit: disabled
   [junit4]   2> 2854605 INFO  (coreLoadExecutor-12011-thread-1-processing-n:127.0.0.1:58682_solr) [n:127.0.0.1:58682_solr c:legacyTrue s:shard1  x:legacyTrue_shard1_replica_n1 ] o.a.s.u.CommitTracker Soft AutoCommit: disabled
   [junit4]   2> 2854607 INFO  (coreLoadExecutor-12011-thread-1-processing-n:127.0.0.1:58682_solr) [n:127.0.0.1:58682_solr c:legacyTrue s:shard1  x:legacyTrue_shard1_replica_n1 ] o.a.s.s.SolrIndexSearcher Opening [Searcher@5d83ba73[legacyTrue_shard1_replica_n1] main]
   [junit4]   2> 2854608 INFO  (coreLoadExecutor-12011-thread-1-processing-n:127.0.0.1:58682_solr) [n:127.0.0.1:58682_solr c:legacyTrue s:shard1  x:legacyTrue_shard1_replica_n1 ] o.a.s.r.ManagedResourceStorage Configured ZooKeeperStorageIO with znodeBase: /configs/conf
   [junit4]   2> 2854608 INFO  (coreLoadExecutor-12011-thread-1-processing-n:127.0.0.1:58682_solr) [n:127.0.0.1:58682_solr c:legacyTrue s:shard1  x:legacyTrue_shard1_replica_n1 ] o.a.s.r.ManagedResourceStorage Loaded null at path _rest_managed.json using ZooKeeperStorageIO:path=/configs/conf
   [junit4]   2> 2854608 INFO  (coreLoadExecutor-12011-thread-1-processing-n:127.0.0.1:58682_solr) [n:127.0.0.1:58682_solr c:legacyTrue s:shard1  x:legacyTrue_shard1_replica_n1 ] o.a.s.h.ReplicationHandler Commits will be reserved for 10000ms.
   [junit4]   2> 2854608 INFO  (coreLoadExecutor-12011-thread-1-processing-n:127.0.0.1:58682_solr) [n:127.0.0.1:58682_solr c:legacyTrue s:shard1  x:legacyTrue_shard1_replica_n1 ] o.a.s.u.UpdateLog Could not find max version in index or recent updates, using new clock 1654652807003766784
   [junit4]   2> 2854612 INFO  (TEST-LegacyCloudClusterPropTest.testCreateCollectionSwitchLegacyCloud-seed#[6574A549D50BE0DD]) [     ] o.a.s.c.MiniSolrCloudCluster waitForAllNodes: numServers=1
   [junit4]   2> 2854612 INFO  (searcherExecutor-12012-thread-1-processing-n:127.0.0.1:58682_solr x:legacyTrue_shard1_replica_n1 c:legacyTrue s:shard1) [n:127.0.0.1:58682_solr c:legacyTrue s:shard1  x:legacyTrue_shard1_replica_n1 ] o.a.s.c.SolrCore [legacyTrue_shard1_replica_n1] Registered new searcher Searcher@5d83ba73[legacyTrue_shard1_replica_n1] main{ExitableDirectoryReader(UninvertingDirectoryReader())}
   [junit4]   2> 2854615 INFO  (coreZkRegister-11999-thread-1-processing-n:127.0.0.1:58682_solr x:legacyTrue_shard1_replica_n1 c:legacyTrue s:shard1) [n:127.0.0.1:58682_solr c:legacyTrue s:shard1 r:core_node2 x:legacyTrue_shard1_replica_n1 ] o.a.s.c.ShardLeaderElectionContextBase make sure parent is created /collections/legacyTrue/leaders/shard1
   [junit4]   2> 2854619 INFO  (coreZkRegister-11999-thread-1-processing-n:127.0.0.1:58682_solr x:legacyTrue_shard1_replica_n1 c:legacyTrue s:shard1) [n:127.0.0.1:58682_solr c:legacyTrue s:shard1 r:core_node2 x:legacyTrue_shard1_replica_n1 ] o.a.s.c.ShardLeaderElectionContext Enough replicas found to continue.
   [junit4]   2> 2854619 INFO  (coreZkRegister-11999-thread-1-processing-n:127.0.0.1:58682_solr x:legacyTrue_shard1_replica_n1 c:legacyTrue s:shard1) [n:127.0.0.1:58682_solr c:legacyTrue s:shard1 r:core_node2 x:legacyTrue_shard1_replica_n1 ] o.a.s.c.ShardLeaderElectionContext I may be the new leader - try and sync
   [junit4]   2> 2854619 INFO  (coreZkRegister-11999-thread-1-processing-n:127.0.0.1:58682_solr x:legacyTrue_shard1_replica_n1 c:legacyTrue s:shard1) [n:127.0.0.1:58682_solr c:legacyTrue s:shard1 r:core_node2 x:legacyTrue_shard1_replica_n1 ] o.a.s.c.SyncStrategy Sync replicas to https://127.0.0.1:58682/solr/legacyTrue_shard1_replica_n1/
   [junit4]   2> 2854620 INFO  (coreZkRegister-11999-thread-1-processing-n:127.0.0.1:58682_solr x:legacyTrue_shard1_replica_n1 c:legacyTrue s:shard1) [n:127.0.0.1:58682_solr c:legacyTrue s:shard1 r:core_node2 x:legacyTrue_shard1_replica_n1 ] o.a.s.c.SyncStrategy Sync Success - now sync replicas to me
   [junit4]   2> 2854620 INFO  (coreZkRegister-11999-thread-1-processing-n:127.0.0.1:58682_solr x:legacyTrue_shard1_replica_n1 c:legacyTrue s:shard1) [n:127.0.0.1:58682_solr c:legacyTrue s:shard1 r:core_node2 x:legacyTrue_shard1_replica_n1 ] o.a.s.c.SyncStrategy https://127.0.0.1:58682/solr/legacyTrue_shard1_replica_n1/ has no replicas
   [junit4]   2> 2854620 INFO  (coreZkRegister-11999-thread-1-processing-n:127.0.0.1:58682_solr x:legacyTrue_shard1_replica_n1 c:legacyTrue s:shard1) [n:127.0.0.1:58682_solr c:legacyTrue s:shard1 r:core_node2 x:legacyTrue_shard1_replica_n1 ] o.a.s.c.ShardLeaderElectionContextBase Creating leader registration node /collections/legacyTrue/leaders/shard1/leader after winning as /collections/legacyTrue/leader_elect/shard1/election/72181117937713161-core_node2-n_0000000001
   [junit4]   2> 2854621 INFO  (coreZkRegister-11999-thread-1-processing-n:127.0.0.1:58682_solr x:legacyTrue_shard1_replica_n1 c:legacyTrue s:shard1) [n:127.0.0.1:58682_solr c:legacyTrue s:shard1 r:core_node2 x:legacyTrue_shard1_replica_n1 ] o.a.s.c.ShardLeaderElectionContext I am the new leader: https://127.0.0.1:58682/solr/legacyTrue_shard1_replica_n1/ shard1
   [junit4]   2> 2854622 INFO  (coreZkRegister-11999-thread-1-processing-n:127.0.0.1:58682_solr x:legacyTrue_shard1_replica_n1 c:legacyTrue s:shard1) [n:127.0.0.1:58682_solr c:legacyTrue s:shard1 r:core_node2 x:legacyTrue_shard1_replica_n1 ] o.a.s.c.ZkController I am the leader, no recovery necessary
   [junit4]   2> 2854731 INFO  (zkCallback-12254-thread-1) [     ] o.a.s.c.c.ZkStateReader A cluster state change: [WatchedEvent state:SyncConnected type:NodeDataChanged path:/collections/legacyTrue/state.json] for collection [legacyTrue] has occurred - updating... (live nodes size: [1])
   [junit4]   2> 2854732 INFO  (zkCallback-12254-thread-2) [     ] o.a.s.c.c.ZkStateReader A cluster state change: [WatchedEvent state:SyncConnected type:NodeDataChanged path:/collections/legacyTrue/state.json] for collection [legacyTrue] has occurred - updating... (live nodes size: [1])
   [junit4]   2> 2854732 INFO  (zkCallback-12254-thread-3) [     ] o.a.s.c.c.ZkStateReader A cluster state change: [WatchedEvent state:SyncConnected type:NodeDataChanged path:/collections/legacyTrue/state.json] for collection [legacyTrue] has occurred - updating... (live nodes size: [1])
   [junit4]   2> 2855693 INFO  (TEST-LegacyCloudClusterPropTest.testCreateCollectionSwitchLegacyCloud-seed#[6574A549D50BE0DD]) [     ] o.a.s.c.c.ZkStateReader Updated live nodes from ZooKeeper... (0) -> (1)
   [junit4]   2> 2855840 INFO  (qtp1075926473-34864) [n:127.0.0.1:58682_solr     ] o.a.s.h.a.CollectionsHandler Invoked Collection Action :delete with params name=legacyTrue&action=DELETE&wt=javabin&version=2 and sendToOCPQueue=true
   [junit4]   2> 2855955 INFO  (OverseerThreadFactory-12007-thread-1-processing-n:127.0.0.1:58682_solr) [n:127.0.0.1:58682_solr     ] o.a.s.c.a.c.OverseerCollectionMessageHandler Executing Collection Cmd=action=UNLOAD&deleteInstanceDir=true&deleteDataDir=true&deleteMetricsHistory=true, asyncId=null
   [junit4]   2> 2855969 INFO  (qtp1075926473-34863) [n:127.0.0.1:58682_solr    x:legacyTrue_shard1_replica_n1 ] o.a.s.m.SolrMetricManager Closing metric reporters for registry=solr.core.legacyTrue.shard1.replica_n1, tag=null
   [junit4]   2> 2855969 INFO  (qtp1075926473-34863) [n:127.0.0.1:58682_solr    x:legacyTrue_shard1_replica_n1 ] o.a.s.m.r.SolrJmxReporter Closing reporter [org.apache.solr.metrics.reporters.SolrJmxReporter@783bd4e6: rootName = solr_58682, domain = solr.core.legacyTrue.shard1.replica_n1, service url = null, agent id = null] for registry solr.core.legacyTrue.shard1.replica_n1 / com.codahale.metrics.MetricRegistry@18292f93
   [junit4]   2> 2856019 INFO  (qtp1075926473-34863) [n:127.0.0.1:58682_solr    x:legacyTrue_shard1_replica_n1 ] o.a.s.c.SolrCore [legacyTrue_shard1_replica_n1]  CLOSING SolrCore org.apache.solr.core.SolrCore@cba4577
   [junit4]   2> 2856019 INFO  (qtp1075926473-34863) [n:127.0.0.1:58682_solr    x:legacyTrue_shard1_replica_n1 ] o.a.s.m.SolrMetricManager Closing metric reporters for registry=solr.core.legacyTrue.shard1.replica_n1, tag=SolrCore@cba4577
   [junit4]   2> 2856019 INFO  (qtp1075926473-34863) [n:127.0.0.1:58682_solr    x:legacyTrue_shard1_replica_n1 ] o.a.s.m.SolrMetricManager Closing metric reporters for registry=solr.collection.legacyTrue.shard1.leader, tag=SolrCore@cba4577
   [junit4]   2> 2856035 INFO  (qtp1075926473-34863) [n:127.0.0.1:58682_solr    x:legacyTrue_shard1_replica_n1 ] o.a.s.c.ZkShardTerms Successful update of terms at /collections/legacyTrue/terms/shard1 to Terms{values={}, version=1}
   [junit4]   2> 2856035 INFO  (qtp1075926473-34863) [n:127.0.0.1:58682_solr    x:legacyTrue_shard1_replica_n1 ] o.a.s.s.HttpSolrCall [admin] webapp=null path=/admin/cores params={deleteInstanceDir=true&deleteMetricsHistory=true&core=legacyTrue_shard1_replica_n1&qt=/admin/cores&deleteDataDir=true&action=UNLOAD&wt=javabin&version=2} status=0 QTime=62
   [junit4]   2> 2856222 INFO  (zkCallback-12254-thread-2) [     ] o.a.s.c.c.ZkStateReader A cluster state change: [WatchedEvent state:SyncConnected type:NodeDeleted path:/collections/legacyTrue/state.json] for collection [legacyTrue] has occurred - updating... (live nodes size: [1])
   [junit4]   2> 2856222 INFO  (zkCallback-12254-thread-3) [     ] o.a.s.c.c.ZkStateReader A cluster state change: [WatchedEvent state:SyncConnected type:NodeDeleted path:/collections/legacyTrue/state.json] for collection [legacyTrue] has occurred - updating... (live nodes size: [1])
   [junit4]   2> 2856222 INFO  (zkCallback-12254-thread-4) [     ] o.a.s.c.c.ZkStateReader A cluster state change: [WatchedEvent state:SyncConnected type:NodeDeleted path:/collections/legacyTrue/state.json] for collection [legacyTrue] has occurred - updating... (live nodes size: [1])
   [junit4]   2> 2856232 INFO  (qtp1075926473-34864) [n:127.0.0.1:58682_solr     ] o.a.s.s.HttpSolrCall [admin] webapp=null path=/admin/collections params={name=legacyTrue&action=DELETE&wt=javabin&version=2} status=0 QTime=393
   [junit4]   2> 2856234 INFO  (TEST-LegacyCloudClusterPropTest.testCreateCollectionSwi

[...truncated too long message...]

l.SSLSocketOutputRecord.encodeAlert(SSLSocketOutputRecord.java:81)
   [junit4]    > 		at java.base/sun.security.ssl.TransportContext.fatal(TransportContext.java:351)
   [junit4]    > 		... 71 more
   [junit4]    > Caused by: java.net.SocketException: Software caused connection abort: recv failed
   [junit4]    > 	at java.base/java.net.SocketInputStream.socketRead0(Native Method)
   [junit4]    > 	at java.base/java.net.SocketInputStream.socketRead(SocketInputStream.java:115)
   [junit4]    > 	at java.base/java.net.SocketInputStream.read(SocketInputStream.java:168)
   [junit4]    > 	at java.base/java.net.SocketInputStream.read(SocketInputStream.java:140)
   [junit4]    > 	at java.base/sun.security.ssl.SSLSocketInputRecord.read(SSLSocketInputRecord.java:448)
   [junit4]    > 	at java.base/sun.security.ssl.SSLSocketInputRecord.bytesInCompletePacket(SSLSocketInputRecord.java:68)
   [junit4]    > 	at java.base/sun.security.ssl.SSLSocketImpl.readApplicationRecord(SSLSocketImpl.java:1104)
   [junit4]    > 	at java.base/sun.security.ssl.SSLSocketImpl$AppInputStream.read(SSLSocketImpl.java:823)
   [junit4]    > 	... 67 more
   [junit4]   2> 56666 INFO  (jetty-closer-186-thread-1) [     ] o.a.s.c.CoreContainer Shutting down CoreContainer instance=553625912
   [junit4]   2> 56666 INFO  (jetty-closer-186-thread-1) [     ] o.a.s.c.ZkController Remove node as live in ZooKeeper:/live_nodes/127.0.0.1:64478_solr
   [junit4]   2> 56667 INFO  (jetty-closer-186-thread-1) [     ] o.a.s.c.ZkController Publish this node as DOWN...
   [junit4]   2> 56667 INFO  (jetty-closer-186-thread-1) [     ] o.a.s.c.ZkController Publish node=127.0.0.1:64478_solr as DOWN
   [junit4]   2> 56670 INFO  (jetty-closer-186-thread-1) [     ] o.a.s.m.SolrMetricManager Closing metric reporters for registry=solr.node, tag=null
   [junit4]   2> 56671 INFO  (jetty-closer-186-thread-1) [     ] o.a.s.m.r.SolrJmxReporter Closing reporter [org.apache.solr.metrics.reporters.SolrJmxReporter@5991fe2b: rootName = solr_64478, domain = solr.node, service url = null, agent id = null] for registry solr.node / com.codahale.metrics.MetricRegistry@5167d24c
   [junit4]   2> 56675 INFO  (jetty-closer-186-thread-1) [     ] o.a.s.m.SolrMetricManager Closing metric reporters for registry=solr.jvm, tag=null
   [junit4]   2> 56676 INFO  (jetty-closer-186-thread-1) [     ] o.a.s.m.r.SolrJmxReporter Closing reporter [org.apache.solr.metrics.reporters.SolrJmxReporter@104f0704: rootName = solr_64478, domain = solr.jvm, service url = null, agent id = null] for registry solr.jvm / com.codahale.metrics.MetricRegistry@7d9453e9
   [junit4]   2> 56678 INFO  (jetty-closer-186-thread-1) [     ] o.a.s.m.SolrMetricManager Closing metric reporters for registry=solr.jetty, tag=null
   [junit4]   2> 56679 INFO  (jetty-closer-186-thread-1) [     ] o.a.s.m.r.SolrJmxReporter Closing reporter [org.apache.solr.metrics.reporters.SolrJmxReporter@5dcb7a9a: rootName = solr_64478, domain = solr.jetty, service url = null, agent id = null] for registry solr.jetty / com.codahale.metrics.MetricRegistry@24fa51f6
   [junit4]   2> 56679 INFO  (jetty-closer-186-thread-1) [     ] o.a.s.m.SolrMetricManager Closing metric reporters for registry=solr.cluster, tag=null
   [junit4]   2> 56682 INFO  (closeThreadPool-190-thread-2) [     ] o.a.s.c.Overseer Overseer (id=72181421569671177-127.0.0.1:64478_solr-n_0000000001) closing
   [junit4]   2> 56683 INFO  (OverseerStateUpdate-72181421569671177-127.0.0.1:64478_solr-n_0000000001) [n:127.0.0.1:64478_solr     ] o.a.s.c.Overseer Overseer Loop exiting : 127.0.0.1:64478_solr
   [junit4]   2> 56685 INFO  (OverseerAutoScalingTriggerThread-72181421569671177-127.0.0.1:64478_solr-n_0000000001) [     ] o.a.s.c.a.OverseerTriggerThread OverseerTriggerThread woken up but we are closed, exiting.
   [junit4]   2> 56692 INFO  (closeThreadPool-190-thread-1) [     ] o.a.s.c.Overseer Overseer (id=72181421569671177-127.0.0.1:64478_solr-n_0000000001) closing
   [junit4]   2> 56786 INFO  (jetty-closer-186-thread-1) [     ] o.a.s.c.Overseer Overseer (id=72181421569671177-127.0.0.1:64478_solr-n_0000000001) closing
   [junit4]   2> 56789 INFO  (jetty-closer-186-thread-1) [     ] o.e.j.s.AbstractConnector Stopped ServerConnector@487715fe{ssl,[ssl, alpn, http/1.1, h2]}{127.0.0.1:64478}
   [junit4]   2> 56789 INFO  (jetty-closer-186-thread-1) [     ] o.e.j.s.h.ContextHandler Stopped o.e.j.s.ServletContextHandler@7962ee3c{/solr,null,UNAVAILABLE}
   [junit4]   2> 56789 INFO  (jetty-closer-186-thread-1) [     ] o.e.j.s.session node0 Stopped scavenging
   [junit4]   2> 56790 INFO  (SUITE-LegacyCloudClusterPropTest-seed#[6574A549D50BE0DD]-worker) [     ] o.a.s.c.ZkTestServer Shutting down ZkTestServer.
   [junit4]   2> 56995 WARN  (ZkTestServer Run Thread) [     ] o.a.s.c.ZkTestServer Watch limit violations: 
   [junit4]   2> Maximum concurrent create/delete watches above limit:
   [junit4]   2> 
   [junit4]   2> 	4	/solr/aliases.json
   [junit4]   2> 	3	/solr/collections/legacyTrue/terms/shard1
   [junit4]   2> 	3	/solr/collections/legacyTrue/state.json
   [junit4]   2> 	2	/solr/packages.json
   [junit4]   2> 	2	/solr/security.json
   [junit4]   2> 	2	/solr/configs/conf
   [junit4]   2> 
   [junit4]   2> Maximum concurrent data watches above limit:
   [junit4]   2> 
   [junit4]   2> 	13	/solr/collections/legacyTrue/state.json
   [junit4]   2> 	6	/solr/clusterprops.json
   [junit4]   2> 	4	/solr/clusterstate.json
   [junit4]   2> 	3	/solr/aliases.json
   [junit4]   2> 	2	/solr/autoscaling.json
   [junit4]   2> 
   [junit4]   2> Maximum concurrent children watches above limit:
   [junit4]   2> 
   [junit4]   2> 	20	/solr/overseer/queue
   [junit4]   2> 	9	/solr/collections
   [junit4]   2> 	8	/solr/live_nodes
   [junit4]   2> 	8	/solr/overseer/collection-queue-work
   [junit4]   2> 	2	/solr/autoscaling/events/.scheduled_maintenance
   [junit4]   2> 	2	/solr/autoscaling/events/.auto_add_replicas
   [junit4]   2> 	2	/solr/overseer/queue-work
   [junit4]   2> 
   [junit4]   2> 57002 INFO  (SUITE-LegacyCloudClusterPropTest-seed#[6574A549D50BE0DD]-worker) [     ] o.a.s.c.ZkTestServer waitForServerDown: 127.0.0.1:64465
   [junit4]   2> 57002 INFO  (SUITE-LegacyCloudClusterPropTest-seed#[6574A549D50BE0DD]-worker) [     ] o.a.s.c.ZkTestServer parse host and port list: 127.0.0.1:64465
   [junit4]   2> 57002 INFO  (SUITE-LegacyCloudClusterPropTest-seed#[6574A549D50BE0DD]-worker) [     ] o.a.s.c.ZkTestServer connecting to 127.0.0.1 64465
   [junit4]   2> NOTE: leaving temporary files on disk at: C:\Users\jenkins\workspace\Lucene-Solr-8.x-Windows\solr\build\solr-core\test\J1\temp\solr.cloud.LegacyCloudClusterPropTest_6574A549D50BE0DD-002
   [junit4]   2> NOTE: test params are: codec=Asserting(Lucene84): {}, docValues:{}, maxPointsInLeafNode=788, maxMBSortInHeap=7.3172186109409125, sim=Asserting(org.apache.lucene.search.similarities.AssertingSimilarity@6f3f8dc), locale=vai-Vaii-LR, timezone=Etc/Zulu
   [junit4]   2> NOTE: Windows 10 10.0 amd64/AdoptOpenJDK 11.0.4 (64-bit)/cpus=3,threads=1,free=30445368,total=100663296
   [junit4]   2> NOTE: All tests run in this JVM: [LegacyCloudClusterPropTest, LegacyCloudClusterPropTest, LegacyCloudClusterPropTest]
   [junit4] Completed [5/5 (3!)] on J1 in 7.55s, 1 test, 1 error <<< FAILURES!

[...truncated 12 lines...]
BUILD FAILED
C:\Users\jenkins\workspace\Lucene-Solr-8.x-Windows\lucene\common-build.xml:1590: The following error occurred while executing this line:
C:\Users\jenkins\workspace\Lucene-Solr-8.x-Windows\lucene\common-build.xml:1117: There were test failures: 5 suites, 5 tests, 3 errors [seed: 6574A549D50BE0DD]

Total time: 1 minute 3 seconds

[repro] Setting last failure code to 1

[repro] Failures w/original seeds:
[repro]   3/5 failed: org.apache.solr.cloud.LegacyCloudClusterPropTest
[repro] Exiting with code 1

C:\Users\jenkins\workspace\Lucene-Solr-8.x-Windows>IF EXIST lucene\build move /y lucene\build lucene\build.repro 
        1 dir(s) moved.

C:\Users\jenkins\workspace\Lucene-Solr-8.x-Windows>IF EXIST solr\build move /y solr\build solr\build.repro 
        1 dir(s) moved.

C:\Users\jenkins\workspace\Lucene-Solr-8.x-Windows>IF EXIST lucene\build.orig move /y lucene\build.orig lucene\build 
        1 dir(s) moved.

C:\Users\jenkins\workspace\Lucene-Solr-8.x-Windows>IF EXIST solr\build.orig move /y solr\build.orig solr\build 
        1 dir(s) moved.

C:\Users\jenkins\workspace\Lucene-Solr-8.x-Windows>exit 0 
Archiving artifacts
Setting ANT_1_8_2_HOME=C:\Users\jenkins\tools\hudson.tasks.Ant_AntInstallation\ANT_1.8.2
[WARNINGS] Parsing warnings in console log with parser Java Compiler (javac)
Setting ANT_1_8_2_HOME=C:\Users\jenkins\tools\hudson.tasks.Ant_AntInstallation\ANT_1.8.2
No credentials specified
Setting ANT_1_8_2_HOME=C:\Users\jenkins\tools\hudson.tasks.Ant_AntInstallation\ANT_1.8.2
<Git Blamer> Using GitBlamer to create author and commit information for all warnings.
<Git Blamer> GIT_COMMIT=22386a1f127c03cff4506571b9a77062ea5dec08, workspace=C:\Users\jenkins\workspace\Lucene-Solr-8.x-Windows
[WARNINGS] Computing warning deltas based on reference build #625
Recording test results
Setting ANT_1_8_2_HOME=C:\Users\jenkins\tools\hudson.tasks.Ant_AntInstallation\ANT_1.8.2
Build step 'Publish JUnit test result report' changed build result to UNSTABLE
Email was triggered for: Unstable (Test Failures)
Sending email for trigger: Unstable (Test Failures)
Setting ANT_1_8_2_HOME=C:\Users\jenkins\tools\hudson.tasks.Ant_AntInstallation\ANT_1.8.2
Setting ANT_1_8_2_HOME=C:\Users\jenkins\tools\hudson.tasks.Ant_AntInstallation\ANT_1.8.2
Setting ANT_1_8_2_HOME=C:\Users\jenkins\tools\hudson.tasks.Ant_AntInstallation\ANT_1.8.2
Setting ANT_1_8_2_HOME=C:\Users\jenkins\tools\hudson.tasks.Ant_AntInstallation\ANT_1.8.2
Setting ANT_1_8_2_HOME=C:\Users\jenkins\tools\hudson.tasks.Ant_AntInstallation\ANT_1.8.2
Setting ANT_1_8_2_HOME=C:\Users\jenkins\tools\hudson.tasks.Ant_AntInstallation\ANT_1.8.2