You are viewing a plain text version of this content. The canonical link for it is here.
Posted to yarn-dev@hadoop.apache.org by Apache Jenkins Server <je...@builds.apache.org> on 2015/03/05 22:44:57 UTC

Failed: YARN-1809 PreCommit Build #6872

Jira: https://issues.apache.org/jira/browse/YARN-1809
Build: https://builds.apache.org/job/PreCommit-YARN-Build/6872/

###################################################################################
########################## LAST 60 LINES OF THE CONSOLE ###########################
Started by user xgong
Building remotely on H8 (Mapreduce Falcon Hadoop Pig Zookeeper Tez Hdfs) in workspace /home/jenkins/jenkins-slave/workspace/PreCommit-YARN-Build@2
 > git rev-parse --is-inside-work-tree # timeout=10
Fetching changes from the remote Git repository
 > git config remote.origin.url https://git-wip-us.apache.org/repos/asf/hadoop.git # timeout=10
Cleaning workspace
 > git rev-parse --verify HEAD # timeout=10
Resetting working tree
 > git reset --hard # timeout=10
 > git clean -fdx # timeout=10
Fetching upstream changes from https://git-wip-us.apache.org/repos/asf/hadoop.git
 > git --version # timeout=10
FATAL: Failed to fetch from https://git-wip-us.apache.org/repos/asf/hadoop.git
hudson.plugins.git.GitException: Failed to fetch from https://git-wip-us.apache.org/repos/asf/hadoop.git
	at hudson.plugins.git.GitSCM.fetchFrom(GitSCM.java:647)
	at hudson.plugins.git.GitSCM.retrieveChanges(GitSCM.java:889)
	at hudson.plugins.git.GitSCM.checkout(GitSCM.java:914)
	at hudson.model.AbstractProject.checkout(AbstractProject.java:1252)
	at hudson.model.AbstractBuild$AbstractBuildExecution.defaultCheckout(AbstractBuild.java:615)
	at jenkins.scm.SCMCheckoutStrategy.checkout(SCMCheckoutStrategy.java:86)
	at hudson.model.AbstractBuild$AbstractBuildExecution.run(AbstractBuild.java:524)
	at hudson.model.Run.execute(Run.java:1706)
	at hudson.model.FreeStyleBuild.run(FreeStyleBuild.java:43)
	at hudson.model.ResourceController.execute(ResourceController.java:88)
	at hudson.model.Executor.run(Executor.java:232)
Caused by: hudson.plugins.git.GitException: Failed to connect to https://git-wip-us.apache.org/repos/asf/hadoop.git (exception: org.apache.http.conn.ConnectTimeoutException: Connect to git-wip-us.apache.org:443 [git-wip-us.apache.org/140.211.11.23] failed: Connection timed out)
	at org.jenkinsci.plugins.gitclient.CliGitAPIImpl.checkCredentials(CliGitAPIImpl.java:2253)
	at org.jenkinsci.plugins.gitclient.CliGitAPIImpl.launchCommandWithCredentials(CliGitAPIImpl.java:1169)
	at org.jenkinsci.plugins.gitclient.CliGitAPIImpl.access$300(CliGitAPIImpl.java:85)
	at org.jenkinsci.plugins.gitclient.CliGitAPIImpl$1.execute(CliGitAPIImpl.java:280)
	at org.jenkinsci.plugins.gitclient.RemoteGitImpl$CommandInvocationHandler$1.call(RemoteGitImpl.java:153)
	at org.jenkinsci.plugins.gitclient.RemoteGitImpl$CommandInvocationHandler$1.call(RemoteGitImpl.java:146)
	at hudson.remoting.UserRequest.perform(UserRequest.java:118)
	at hudson.remoting.UserRequest.perform(UserRequest.java:48)
	at hudson.remoting.Request$2.run(Request.java:328)
	at hudson.remoting.InterceptingExecutorService$1.call(InterceptingExecutorService.java:72)
	at java.util.concurrent.FutureTask.run(FutureTask.java:262)
	at java.util.concurrent.ThreadPoolExecutor.runWorker(ThreadPoolExecutor.java:1145)
	at java.util.concurrent.ThreadPoolExecutor$Worker.run(ThreadPoolExecutor.java:615)
	at java.lang.Thread.run(Thread.java:745)



###################################################################################
############################## FAILED TESTS (if any) ##############################
No tests ran.

Success: YARN-2190 PreCommit Build #6877

Posted by Apache Jenkins Server <je...@builds.apache.org>.
Jira: https://issues.apache.org/jira/browse/YARN-2190
Build: https://builds.apache.org/job/PreCommit-YARN-Build/6877/

###################################################################################
########################## LAST 60 LINES OF THE CONSOLE ###########################
[...truncated 4923 lines...]




{color:green}+1 overall{color}.  Here are the results of testing the latest attachment 
  http://issues.apache.org/jira/secure/attachment/12702948/YARN-2190.12.patch
  against trunk revision 952640f.

    {color:green}+1 @author{color}.  The patch does not contain any @author tags.

    {color:green}+1 tests included{color}.  The patch appears to include 2 new or modified test files.

    {color:green}+1 javac{color}.  The applied patch does not increase the total number of javac compiler warnings.

    {color:green}+1 javadoc{color}.  There were no new javadoc warning messages.

    {color:green}+1 eclipse:eclipse{color}.  The patch built with eclipse:eclipse.

    {color:green}+1 findbugs{color}.  The patch does not introduce any new Findbugs (version 2.0.3) warnings.

    {color:green}+1 release audit{color}.  The applied patch does not increase the total number of release audit warnings.

    {color:green}+1 core tests{color}.  The patch passed unit tests in hadoop-common-project/hadoop-common hadoop-yarn-project/hadoop-yarn/hadoop-yarn-api hadoop-yarn-project/hadoop-yarn/hadoop-yarn-common hadoop-yarn-project/hadoop-yarn/hadoop-yarn-server/hadoop-yarn-server-nodemanager.

Test results: https://builds.apache.org/job/PreCommit-YARN-Build/6877//testReport/
Console output: https://builds.apache.org/job/PreCommit-YARN-Build/6877//console

This message is automatically generated.


======================================================================
======================================================================
    Adding comment to Jira.
======================================================================
======================================================================


Comment added.
56708415d8036e1c264aca0eb95a14d6a8512b43 logged out


======================================================================
======================================================================
    Finished build.
======================================================================
======================================================================


Archiving artifacts
Sending artifact delta relative to PreCommit-YARN-Build #6865
Archived 30 artifacts
Archive block size is 32768
Received 233 blocks and 2835047 bytes
Compression is 72.9%
Took 2.1 sec
Description set: YARN-2190
Recording test results
Email was triggered for: Success
Sending email for trigger: Success



###################################################################################
############################## FAILED TESTS (if any) ##############################
All tests passed

Failed: YARN-1809 PreCommit Build #6876

Posted by Apache Jenkins Server <je...@builds.apache.org>.
Jira: https://issues.apache.org/jira/browse/YARN-1809
Build: https://builds.apache.org/job/PreCommit-YARN-Build/6876/

###################################################################################
########################## LAST 60 LINES OF THE CONSOLE ###########################
[...truncated 3959 lines...]


{color:red}-1 overall{color}.  Here are the results of testing the latest attachment 
  http://issues.apache.org/jira/secure/attachment/12702918/YARN-1809.17.rebase.patch
  against trunk revision 952640f.

    {color:green}+1 @author{color}.  The patch does not contain any @author tags.

    {color:green}+1 tests included{color}.  The patch appears to include 6 new or modified test files.

    {color:green}+1 javac{color}.  The applied patch does not increase the total number of javac compiler warnings.

    {color:green}+1 javadoc{color}.  There were no new javadoc warning messages.

    {color:green}+1 eclipse:eclipse{color}.  The patch built with eclipse:eclipse.

    {color:red}-1 findbugs{color}.  The patch appears to introduce 7 new Findbugs (version 2.0.3) warnings.

    {color:green}+1 release audit{color}.  The applied patch does not increase the total number of release audit warnings.

    {color:green}+1 core tests{color}.  The patch passed unit tests in hadoop-yarn-project/hadoop-yarn/hadoop-yarn-api hadoop-yarn-project/hadoop-yarn/hadoop-yarn-common hadoop-yarn-project/hadoop-yarn/hadoop-yarn-server/hadoop-yarn-server-applicationhistoryservice hadoop-yarn-project/hadoop-yarn/hadoop-yarn-server/hadoop-yarn-server-common hadoop-yarn-project/hadoop-yarn/hadoop-yarn-server/hadoop-yarn-server-resourcemanager.

Test results: https://builds.apache.org/job/PreCommit-YARN-Build/6876//testReport/
Findbugs warnings: https://builds.apache.org/job/PreCommit-YARN-Build/6876//artifact/patchprocess/newPatchFindbugsWarningshadoop-yarn-server-resourcemanager.html
Console output: https://builds.apache.org/job/PreCommit-YARN-Build/6876//console

This message is automatically generated.


======================================================================
======================================================================
    Adding comment to Jira.
======================================================================
======================================================================


Comment added.
d4d25736be70ea6a5013b40c4c1d048723cf6e0c logged out


======================================================================
======================================================================
    Finished build.
======================================================================
======================================================================


Build step 'Execute shell' marked build as failure
Archiving artifacts
Sending artifact delta relative to PreCommit-YARN-Build #6865
Archived 35 artifacts
Archive block size is 32768
Received 224 blocks and 2627423 bytes
Compression is 73.6%
Took 2 sec
[description-setter] Could not determine description.
Recording test results
Email was triggered for: Failure
Sending email for trigger: Failure



###################################################################################
############################## FAILED TESTS (if any) ##############################
All tests passed

Failed: YARN-1809 PreCommit Build #6875

Posted by Apache Jenkins Server <je...@builds.apache.org>.
Jira: https://issues.apache.org/jira/browse/YARN-1809
Build: https://builds.apache.org/job/PreCommit-YARN-Build/6875/

###################################################################################
########################## LAST 60 LINES OF THE CONSOLE ###########################
Started by user xgong
Building remotely on H5 (Mapreduce Falcon Hadoop Pig Zookeeper Tez Hdfs) in workspace /home/jenkins/jenkins-slave/workspace/PreCommit-YARN-Build
 > git rev-parse --is-inside-work-tree # timeout=10
Fetching changes from the remote Git repository
 > git config remote.origin.url https://git-wip-us.apache.org/repos/asf/hadoop.git # timeout=10
Cleaning workspace
 > git rev-parse --verify HEAD # timeout=10
Resetting working tree
 > git reset --hard # timeout=10
 > git clean -fdx # timeout=10
Fetching upstream changes from https://git-wip-us.apache.org/repos/asf/hadoop.git
 > git --version # timeout=10
FATAL: Failed to fetch from https://git-wip-us.apache.org/repos/asf/hadoop.git
hudson.plugins.git.GitException: Failed to fetch from https://git-wip-us.apache.org/repos/asf/hadoop.git
	at hudson.plugins.git.GitSCM.fetchFrom(GitSCM.java:647)
	at hudson.plugins.git.GitSCM.retrieveChanges(GitSCM.java:889)
	at hudson.plugins.git.GitSCM.checkout(GitSCM.java:914)
	at hudson.model.AbstractProject.checkout(AbstractProject.java:1252)
	at hudson.model.AbstractBuild$AbstractBuildExecution.defaultCheckout(AbstractBuild.java:615)
	at jenkins.scm.SCMCheckoutStrategy.checkout(SCMCheckoutStrategy.java:86)
	at hudson.model.AbstractBuild$AbstractBuildExecution.run(AbstractBuild.java:524)
	at hudson.model.Run.execute(Run.java:1706)
	at hudson.model.FreeStyleBuild.run(FreeStyleBuild.java:43)
	at hudson.model.ResourceController.execute(ResourceController.java:88)
	at hudson.model.Executor.run(Executor.java:232)
Caused by: hudson.plugins.git.GitException: Failed to connect to https://git-wip-us.apache.org/repos/asf/hadoop.git (exception: org.apache.http.conn.HttpHostConnectException: Connect to git-wip-us.apache.org:443 [git-wip-us.apache.org/140.211.11.23] failed: Connection refused)
	at org.jenkinsci.plugins.gitclient.CliGitAPIImpl.checkCredentials(CliGitAPIImpl.java:2253)
	at org.jenkinsci.plugins.gitclient.CliGitAPIImpl.launchCommandWithCredentials(CliGitAPIImpl.java:1169)
	at org.jenkinsci.plugins.gitclient.CliGitAPIImpl.access$300(CliGitAPIImpl.java:85)
	at org.jenkinsci.plugins.gitclient.CliGitAPIImpl$1.execute(CliGitAPIImpl.java:280)
	at org.jenkinsci.plugins.gitclient.RemoteGitImpl$CommandInvocationHandler$1.call(RemoteGitImpl.java:153)
	at org.jenkinsci.plugins.gitclient.RemoteGitImpl$CommandInvocationHandler$1.call(RemoteGitImpl.java:146)
	at hudson.remoting.UserRequest.perform(UserRequest.java:118)
	at hudson.remoting.UserRequest.perform(UserRequest.java:48)
	at hudson.remoting.Request$2.run(Request.java:328)
	at hudson.remoting.InterceptingExecutorService$1.call(InterceptingExecutorService.java:72)
	at java.util.concurrent.FutureTask.run(FutureTask.java:262)
	at java.util.concurrent.ThreadPoolExecutor.runWorker(ThreadPoolExecutor.java:1145)
	at java.util.concurrent.ThreadPoolExecutor$Worker.run(ThreadPoolExecutor.java:615)
	at java.lang.Thread.run(Thread.java:745)



###################################################################################
############################## FAILED TESTS (if any) ##############################
No tests ran.

Failed: YARN-3264 PreCommit Build #6874

Posted by Apache Jenkins Server <je...@builds.apache.org>.
Jira: https://issues.apache.org/jira/browse/YARN-3264
Build: https://builds.apache.org/job/PreCommit-YARN-Build/6874/

###################################################################################
########################## LAST 60 LINES OF THE CONSOLE ###########################
Started by remote host 127.0.0.1
Building remotely on H8 (Mapreduce Falcon Hadoop Pig Zookeeper Tez Hdfs) in workspace /home/jenkins/jenkins-slave/workspace/PreCommit-YARN-Build@2
 > git rev-parse --is-inside-work-tree # timeout=10
Fetching changes from the remote Git repository
 > git config remote.origin.url https://git-wip-us.apache.org/repos/asf/hadoop.git # timeout=10
Cleaning workspace
 > git rev-parse --verify HEAD # timeout=10
Resetting working tree
 > git reset --hard # timeout=10
 > git clean -fdx # timeout=10
Fetching upstream changes from https://git-wip-us.apache.org/repos/asf/hadoop.git
 > git --version # timeout=10
FATAL: Failed to fetch from https://git-wip-us.apache.org/repos/asf/hadoop.git
hudson.plugins.git.GitException: Failed to fetch from https://git-wip-us.apache.org/repos/asf/hadoop.git
	at hudson.plugins.git.GitSCM.fetchFrom(GitSCM.java:647)
	at hudson.plugins.git.GitSCM.retrieveChanges(GitSCM.java:889)
	at hudson.plugins.git.GitSCM.checkout(GitSCM.java:914)
	at hudson.model.AbstractProject.checkout(AbstractProject.java:1252)
	at hudson.model.AbstractBuild$AbstractBuildExecution.defaultCheckout(AbstractBuild.java:615)
	at jenkins.scm.SCMCheckoutStrategy.checkout(SCMCheckoutStrategy.java:86)
	at hudson.model.AbstractBuild$AbstractBuildExecution.run(AbstractBuild.java:524)
	at hudson.model.Run.execute(Run.java:1706)
	at hudson.model.FreeStyleBuild.run(FreeStyleBuild.java:43)
	at hudson.model.ResourceController.execute(ResourceController.java:88)
	at hudson.model.Executor.run(Executor.java:232)
Caused by: hudson.plugins.git.GitException: Failed to connect to https://git-wip-us.apache.org/repos/asf/hadoop.git (exception: org.apache.http.conn.ConnectTimeoutException: Connect to git-wip-us.apache.org:443 [git-wip-us.apache.org/140.211.11.23] failed: Connection timed out)
	at org.jenkinsci.plugins.gitclient.CliGitAPIImpl.checkCredentials(CliGitAPIImpl.java:2253)
	at org.jenkinsci.plugins.gitclient.CliGitAPIImpl.launchCommandWithCredentials(CliGitAPIImpl.java:1169)
	at org.jenkinsci.plugins.gitclient.CliGitAPIImpl.access$300(CliGitAPIImpl.java:85)
	at org.jenkinsci.plugins.gitclient.CliGitAPIImpl$1.execute(CliGitAPIImpl.java:280)
	at org.jenkinsci.plugins.gitclient.RemoteGitImpl$CommandInvocationHandler$1.call(RemoteGitImpl.java:153)
	at org.jenkinsci.plugins.gitclient.RemoteGitImpl$CommandInvocationHandler$1.call(RemoteGitImpl.java:146)
	at hudson.remoting.UserRequest.perform(UserRequest.java:118)
	at hudson.remoting.UserRequest.perform(UserRequest.java:48)
	at hudson.remoting.Request$2.run(Request.java:328)
	at hudson.remoting.InterceptingExecutorService$1.call(InterceptingExecutorService.java:72)
	at java.util.concurrent.FutureTask.run(FutureTask.java:262)
	at java.util.concurrent.ThreadPoolExecutor.runWorker(ThreadPoolExecutor.java:1145)
	at java.util.concurrent.ThreadPoolExecutor$Worker.run(ThreadPoolExecutor.java:615)
	at java.lang.Thread.run(Thread.java:745)



###################################################################################
############################## FAILED TESTS (if any) ##############################
No tests ran.

Failed: YARN-1809 PreCommit Build #6873

Posted by Apache Jenkins Server <je...@builds.apache.org>.
Jira: https://issues.apache.org/jira/browse/YARN-1809
Build: https://builds.apache.org/job/PreCommit-YARN-Build/6873/

###################################################################################
########################## LAST 60 LINES OF THE CONSOLE ###########################
Started by user xgong
Building remotely on H8 (Mapreduce Falcon Hadoop Pig Zookeeper Tez Hdfs) in workspace /home/jenkins/jenkins-slave/workspace/PreCommit-YARN-Build@2
 > git rev-parse --is-inside-work-tree # timeout=10
Fetching changes from the remote Git repository
 > git config remote.origin.url https://git-wip-us.apache.org/repos/asf/hadoop.git # timeout=10
Cleaning workspace
 > git rev-parse --verify HEAD # timeout=10
Resetting working tree
 > git reset --hard # timeout=10
 > git clean -fdx # timeout=10
Fetching upstream changes from https://git-wip-us.apache.org/repos/asf/hadoop.git
 > git --version # timeout=10
FATAL: Failed to fetch from https://git-wip-us.apache.org/repos/asf/hadoop.git
hudson.plugins.git.GitException: Failed to fetch from https://git-wip-us.apache.org/repos/asf/hadoop.git
	at hudson.plugins.git.GitSCM.fetchFrom(GitSCM.java:647)
	at hudson.plugins.git.GitSCM.retrieveChanges(GitSCM.java:889)
	at hudson.plugins.git.GitSCM.checkout(GitSCM.java:914)
	at hudson.model.AbstractProject.checkout(AbstractProject.java:1252)
	at hudson.model.AbstractBuild$AbstractBuildExecution.defaultCheckout(AbstractBuild.java:615)
	at jenkins.scm.SCMCheckoutStrategy.checkout(SCMCheckoutStrategy.java:86)
	at hudson.model.AbstractBuild$AbstractBuildExecution.run(AbstractBuild.java:524)
	at hudson.model.Run.execute(Run.java:1706)
	at hudson.model.FreeStyleBuild.run(FreeStyleBuild.java:43)
	at hudson.model.ResourceController.execute(ResourceController.java:88)
	at hudson.model.Executor.run(Executor.java:232)
Caused by: hudson.plugins.git.GitException: Failed to connect to https://git-wip-us.apache.org/repos/asf/hadoop.git (exception: org.apache.http.conn.ConnectTimeoutException: Connect to git-wip-us.apache.org:443 [git-wip-us.apache.org/140.211.11.23] failed: Connection timed out)
	at org.jenkinsci.plugins.gitclient.CliGitAPIImpl.checkCredentials(CliGitAPIImpl.java:2253)
	at org.jenkinsci.plugins.gitclient.CliGitAPIImpl.launchCommandWithCredentials(CliGitAPIImpl.java:1169)
	at org.jenkinsci.plugins.gitclient.CliGitAPIImpl.access$300(CliGitAPIImpl.java:85)
	at org.jenkinsci.plugins.gitclient.CliGitAPIImpl$1.execute(CliGitAPIImpl.java:280)
	at org.jenkinsci.plugins.gitclient.RemoteGitImpl$CommandInvocationHandler$1.call(RemoteGitImpl.java:153)
	at org.jenkinsci.plugins.gitclient.RemoteGitImpl$CommandInvocationHandler$1.call(RemoteGitImpl.java:146)
	at hudson.remoting.UserRequest.perform(UserRequest.java:118)
	at hudson.remoting.UserRequest.perform(UserRequest.java:48)
	at hudson.remoting.Request$2.run(Request.java:328)
	at hudson.remoting.InterceptingExecutorService$1.call(InterceptingExecutorService.java:72)
	at java.util.concurrent.FutureTask.run(FutureTask.java:262)
	at java.util.concurrent.ThreadPoolExecutor.runWorker(ThreadPoolExecutor.java:1145)
	at java.util.concurrent.ThreadPoolExecutor$Worker.run(ThreadPoolExecutor.java:615)
	at java.lang.Thread.run(Thread.java:745)



###################################################################################
############################## FAILED TESTS (if any) ##############################
No tests ran.