You are viewing a plain text version of this content. The canonical link for it is here.
Posted to notifications@jclouds.apache.org by BuildHive <bu...@cloudbees.com> on 2014/11/26 16:30:14 UTC
Build failed in Jenkins: jclouds » jclouds-labs #1916
See <https://buildhive.cloudbees.com/job/jclouds/job/jclouds-labs/1916/changes>
Changes:
[Andrea Turli] support for docker 1.3.2
[Andrea Turli] add *ParseTest
[Andrea Turli] fix SSL/TLS issue
------------------------------------------
[...truncated 757 lines...]
Starting test testUnpauseContainer(org.jclouds.docker.features.ContainerApiMockTest)
Nov 26, 2014 3:29:48 PM com.squareup.okhttp.mockwebserver.MockWebServer$3 processOneRequest
INFO: Received request: POST /containers/1/pause HTTP/1.1 and responded: HTTP/1.1 204 OK
Nov 26, 2014 3:29:49 PM com.squareup.okhttp.mockwebserver.MockWebServer$3 processOneRequest
INFO: Received request: DELETE /containers/6d35806c1bd2b25cd92bba2d2c2c5169dc2156f53ab45c2b62d76e2d2fee14a9 HTTP/1.1 and responded: HTTP/1.1 204 OK
[pool-5-thread-3] Test testRemoveContainer(org.jclouds.docker.features.ContainerApiMockTest) succeeded: 4447ms
Test suite progress: tests succeeded: 26, failed: 0, skipped: 0.
Starting test testWaitContainer(org.jclouds.docker.features.ContainerApiMockTest)
[pool-5-thread-4] Test testUnpauseContainer(org.jclouds.docker.features.ContainerApiMockTest) succeeded: 3926ms
Test suite progress: tests succeeded: 27, failed: 0, skipped: 0.
Nov 26, 2014 3:29:52 PM com.squareup.okhttp.mockwebserver.MockWebServer$3 processOneRequest
INFO: Received request: POST /containers/1/unpause HTTP/1.1 and responded: HTTP/1.1 204 OK
[pool-5-thread-1] Test testStartContainer(org.jclouds.docker.features.ContainerApiMockTest) succeeded: 5081ms
Test suite progress: tests succeeded: 28, failed: 0, skipped: 0.
Nov 26, 2014 3:29:52 PM com.squareup.okhttp.mockwebserver.MockWebServer$3 processOneRequest
INFO: Received request: POST /containers/1/start HTTP/1.1 and responded: HTTP/1.1 200 OK
[pool-5-thread-2] Test testRestartContainer(org.jclouds.docker.features.ContainerApiMockTest) succeeded: 5604ms
Test suite progress: tests succeeded: 29, failed: 0, skipped: 0.
Nov 26, 2014 3:29:53 PM com.squareup.okhttp.mockwebserver.MockWebServer$3 processOneRequest
INFO: Received request: POST /containers/1/restart HTTP/1.1 and responded: HTTP/1.1 204 OK
Nov 26, 2014 3:29:53 PM com.squareup.okhttp.mockwebserver.MockWebServer$3 processOneRequest
INFO: Received request: POST /containers/1/stop HTTP/1.1 and responded: HTTP/1.1 200 OK
[pool-5-thread-5] Test testStopContainer(org.jclouds.docker.features.ContainerApiMockTest) succeeded: 5764ms
Test suite progress: tests succeeded: 30, failed: 0, skipped: 0.
[pool-5-thread-3] Test testWaitContainer(org.jclouds.docker.features.ContainerApiMockTest) succeeded: 3940ms
Test suite progress: tests succeeded: 31, failed: 0, skipped: 0.
Nov 26, 2014 3:29:54 PM com.squareup.okhttp.mockwebserver.MockWebServer$3 processOneRequest
INFO: Received request: POST /containers/1/wait HTTP/1.1 and responded: HTTP/1.1 200 OK
Starting test test(org.jclouds.docker.parse.ContainerParseTest)
Starting test test(org.jclouds.docker.parse.InfoParseTest)
Starting test test(org.jclouds.docker.parse.ContainersParseTest)
Starting test test(org.jclouds.docker.parse.ImageParseTest)
Starting test test(org.jclouds.docker.parse.ImagesParseTest)
[pool-6-thread-2] Test test(org.jclouds.docker.parse.ContainersParseTest) succeeded: 432ms
Test suite progress: tests succeeded: 32, failed: 0, skipped: 0.
Starting test test(org.jclouds.docker.parse.VersionParseTest)
[pool-6-thread-4] Test test(org.jclouds.docker.parse.ImagesParseTest) succeeded: 579ms
Test suite progress: tests succeeded: 33, failed: 0, skipped: 0.
[pool-6-thread-5] Test test(org.jclouds.docker.parse.InfoParseTest) succeeded: 581ms
Test suite progress: tests succeeded: 34, failed: 0, skipped: 0.
[pool-6-thread-2] Test test(org.jclouds.docker.parse.VersionParseTest) succeeded: 297ms
Test suite progress: tests succeeded: 35, failed: 0, skipped: 0.
[pool-6-thread-3] Test test(org.jclouds.docker.parse.ImageParseTest) succeeded: 1014ms
Test suite progress: tests succeeded: 36, failed: 0, skipped: 0.
[pool-6-thread-1] Test test(org.jclouds.docker.parse.ContainerParseTest) succeeded: 1279ms
Test suite progress: tests succeeded: 37, failed: 0, skipped: 0.
Starting test testStateNotRunningToStatusTerminated(org.jclouds.docker.compute.functions.StateToStatusTest)
Starting test testStateRunningToStatusRunning(org.jclouds.docker.compute.functions.StateToStatusTest)
[pool-7-thread-1] Test testStateNotRunningToStatusTerminated(org.jclouds.docker.compute.functions.StateToStatusTest) succeeded: 1213ms
Test suite progress: tests succeeded: 38, failed: 0, skipped: 0.
[pool-7-thread-2] Test testStateRunningToStatusRunning(org.jclouds.docker.compute.functions.StateToStatusTest) succeeded: 1350ms
Test suite progress: tests succeeded: 39, failed: 0, skipped: 0.
Starting test testImageToImage(org.jclouds.docker.compute.functions.ImageToImageTest)
[pool-8-thread-1] Test testImageToImage(org.jclouds.docker.compute.functions.ImageToImageTest) succeeded: 49ms
Test suite progress: tests succeeded: 40, failed: 0, skipped: 0.
Starting test testVirtualMachineToNodeMetadata(org.jclouds.docker.compute.functions.ContainerToNodeMetadataTest)
[pool-9-thread-1] Test testVirtualMachineToNodeMetadata(org.jclouds.docker.compute.functions.ContainerToNodeMetadataTest) succeeded: 332ms
Test suite progress: tests succeeded: 41, failed: 0, skipped: 0.
Starting test testDns(org.jclouds.docker.compute.options.DockerTemplateOptionsTest)
[pool-10-thread-2] Test testDns(org.jclouds.docker.compute.options.DockerTemplateOptionsTest) succeeded: 1ms
Test suite progress: tests succeeded: 42, failed: 0, skipped: 0.
Starting test testHostname(org.jclouds.docker.compute.options.DockerTemplateOptionsTest)
Starting test testCpuShares(org.jclouds.docker.compute.options.DockerTemplateOptionsTest)
[pool-10-thread-1] Test testCpuShares(org.jclouds.docker.compute.options.DockerTemplateOptionsTest) succeeded: 25ms
Test suite progress: tests succeeded: 43, failed: 0, skipped: 0.
[pool-10-thread-3] Test testHostname(org.jclouds.docker.compute.options.DockerTemplateOptionsTest) succeeded: 27ms
Test suite progress: tests succeeded: 44, failed: 0, skipped: 0.
Starting test testMemory(org.jclouds.docker.compute.options.DockerTemplateOptionsTest)
[pool-10-thread-4] Test testMemory(org.jclouds.docker.compute.options.DockerTemplateOptionsTest) succeeded: 0ms
Test suite progress: tests succeeded: 45, failed: 0, skipped: 0.
Starting test testVolumes(org.jclouds.docker.compute.options.DockerTemplateOptionsTest)
[pool-10-thread-5] Test testVolumes(org.jclouds.docker.compute.options.DockerTemplateOptionsTest) succeeded: 3ms
Test suite progress: tests succeeded: 46, failed: 0, skipped: 0.
Tests run: 46, Failures: 0, Errors: 0, Skipped: 0, Time elapsed: 41.716 sec - in TestSuite
Results :
Tests run: 46, Failures: 0, Errors: 0, Skipped: 0
[JENKINS] Recording test results
[INFO]
[INFO] --- maven-bundle-plugin:2.3.7:bundle (default-bundle) @ docker ---
[INFO]
[INFO] --- maven-site-plugin:3.3:attach-descriptor (attach-descriptor) @ docker ---
[INFO]
[INFO] --- apache-rat-plugin:0.10:check (default) @ docker ---
[INFO] 51 implicit excludes (use -debug for more details).
[INFO] Exclude: **/src/test/resources/**/*.sh
[INFO] Exclude: **/src/test/resources/**/*.bat
[INFO] Exclude: **/src/test/resources/**/*.cmd
[INFO] Exclude: **/src/test/resources/**/*.txt
[INFO] Exclude: **/src/test/resources/**/*.gz
[INFO] Exclude: **/src/test/resources/**/*.xml
[INFO] Exclude: **/src/test/resources/**/*.iso
[INFO] Exclude: **/LICENSE.txt
[INFO] Exclude: **/header.txt
[INFO] Exclude: **/NOTICE.txt
[INFO] Exclude: **/DISCLAIMER
[INFO] Exclude: **/BUILD.txt
[INFO] Exclude: **/CHANGES.txt
[INFO] Exclude: **/README.md
[INFO] Exclude: **/README.txt
[INFO] Exclude: **/DEPENDENCIES
[INFO] Exclude: **/CONTRIBUTING.md
[INFO] Exclude: **/*json
[INFO] Exclude: **/*readme
[INFO] Exclude: **/*ProviderMetadata
[INFO] Exclude: **/*ApiMetadata
[INFO] Exclude: **/*LoggingModule
[INFO] Exclude: **/*ViewMBeanFactory
[INFO] Exclude: **/target/**
[INFO] Exclude: **/test-output/**
[INFO] Exclude: **/bin/**
[INFO] Exclude: **/.settings/**
[INFO] Exclude: **/.classpath
[INFO] Exclude: **/.dir-locals.el
[INFO] Exclude: **/.project
[INFO] Exclude: **/.idea/**
[INFO] Exclude: **/*.iml
[INFO] Exclude: **/*.eml
[INFO] Exclude: **/*.ipr
[INFO] Exclude: **/*.iws
[INFO] Exclude: **/*.DS_STORE
[INFO] Exclude: **/TAGS
[INFO] Exclude: **/.metadata/**
[INFO] Exclude: **/atlassian-ide-plugin.xml
[INFO] Exclude: **/.DS_Store
[INFO] Exclude: .mailmap
[INFO] Exclude: .git/**
[INFO] Exclude: **/.gitignore
[INFO] Exclude: **/.gitattributes
[INFO] Exclude: .repository/**
[INFO] Exclude: .java-version
[INFO] Exclude: .repository/**
[INFO] Exclude: gc.log
[INFO] 70 resources included (use -debug for more details)
Warning: org.apache.xerces.jaxp.SAXParserImpl$JAXPSAXParser: Property 'http://www.oracle.com/xml/jaxp/properties/entityExpansionLimit' is not recognized.
Compiler warnings:
WARNING: 'org.apache.xerces.jaxp.SAXParserImpl: Property 'http://javax.xml.XMLConstants/property/accessExternalDTD' is not recognized.'
Warning: org.apache.xerces.parsers.SAXParser: Feature 'http://javax.xml.XMLConstants/feature/secure-processing' is not recognized.
Warning: org.apache.xerces.parsers.SAXParser: Property 'http://javax.xml.XMLConstants/property/accessExternalDTD' is not recognized.
Warning: org.apache.xerces.parsers.SAXParser: Property 'http://www.oracle.com/xml/jaxp/properties/entityExpansionLimit' is not recognized.
[INFO] Rat check: Summary of files. Unapproved: 0 unknown: 0 generated: 0 approved: 70 licence.
[INFO]
[INFO] --- maven-jar-plugin:2.4:test-jar (default) @ docker ---
[INFO] Building jar: <https://buildhive.cloudbees.com/job/jclouds/job/jclouds-labs/ws/docker/target/docker-2.0.0-SNAPSHOT-tests.jar>
[INFO]
[INFO] --- maven-surefire-plugin:2.17:test (integration) @ docker ---
[JENKINS] Recording test results[INFO]
[INFO] --- maven-duplicate-finder-plugin:1.0.5:check (default) @ docker ---
[INFO] Checking compile classpath
[INFO] Checking runtime classpath
[INFO] Checking test classpath
[INFO]
[INFO] --- maven-checkstyle-plugin:2.13:check (default) @ docker ---
[INFO]
[WARNING] OverrideProtocolsSSLSocketFactory.java[0] (misc) NewlineAtEndOfFile: File does not end with a newline.
[INFO] ------------------------------------------------------------------------
[INFO] Reactor Summary:
[INFO]
[INFO] Apache jclouds labs ............................... SUCCESS [37.562s]
[INFO] Apache jclouds :: Azure :: Compute API ............ SUCCESS [1:34.523s]
[INFO] jclouds docker API ................................ FAILURE [1:06.484s]
[INFO] jclouds cdmi api .................................. SKIPPED
[INFO] jclouds CloudSigma v2 API ......................... SKIPPED
[INFO] jclouds CloudSigma v2 Honolulu Provider ........... SKIPPED
[INFO] jclouds CloudSigma v2 Las Vegas Provider .......... SKIPPED
[INFO] jclouds CloudSigma v2 San Jose Provider ........... SKIPPED
[INFO] jclouds CloudSigma v2 Washington DC Provider ...... SKIPPED
[INFO] jclouds CloudSigma v2 Zurich Provider ............. SKIPPED
[INFO] jclouds DigitalOcean Provider ..................... SKIPPED
[INFO] jclouds joyent-cloudapi api ....................... SKIPPED
[INFO] jclouds joyentcloud provider ...................... SKIPPED
[INFO] jclouds Abiquo api ................................ SKIPPED
[INFO] ------------------------------------------------------------------------
[INFO] BUILD FAILURE
[INFO] ------------------------------------------------------------------------
[INFO] Total time: 3:30.693s
[INFO] Finished at: Wed Nov 26 15:30:10 UTC 2014
[INFO] Final Memory: 42M/124M
[INFO] ------------------------------------------------------------------------
Waiting for Jenkins to finish collecting data
[ERROR] Failed to execute goal org.apache.maven.plugins:maven-checkstyle-plugin:2.13:check (default) on project docker: You have 1 Checkstyle violation. -> [Help 1]
org.apache.maven.lifecycle.LifecycleExecutionException: Failed to execute goal org.apache.maven.plugins:maven-checkstyle-plugin:2.13:check (default) on project docker: You have 1 Checkstyle violation.
at org.apache.maven.lifecycle.internal.MojoExecutor.execute(MojoExecutor.java:212)
at org.apache.maven.lifecycle.internal.MojoExecutor.execute(MojoExecutor.java:153)
at org.apache.maven.lifecycle.internal.MojoExecutor.execute(MojoExecutor.java:145)
at org.apache.maven.lifecycle.internal.LifecycleModuleBuilder.buildProject(LifecycleModuleBuilder.java:84)
at org.apache.maven.lifecycle.internal.LifecycleModuleBuilder.buildProject(LifecycleModuleBuilder.java:59)
at org.apache.maven.lifecycle.internal.LifecycleStarter.singleThreadedBuild(LifecycleStarter.java:183)
at org.apache.maven.lifecycle.internal.LifecycleStarter.execute(LifecycleStarter.java:161)
at org.apache.maven.DefaultMaven.doExecute(DefaultMaven.java:317)
at org.apache.maven.DefaultMaven.execute(DefaultMaven.java:152)
at org.jvnet.hudson.maven3.launcher.Maven31Launcher.main(Maven31Launcher.java:132)
at sun.reflect.NativeMethodAccessorImpl.invoke0(Native Method)
at sun.reflect.NativeMethodAccessorImpl.invoke(NativeMethodAccessorImpl.java:57)
at sun.reflect.DelegatingMethodAccessorImpl.invoke(DelegatingMethodAccessorImpl.java:43)
at java.lang.reflect.Method.invoke(Method.java:606)
at org.codehaus.plexus.classworlds.launcher.Launcher.launchStandard(Launcher.java:330)
at org.codehaus.plexus.classworlds.launcher.Launcher.launch(Launcher.java:238)
at jenkins.maven3.agent.Maven31Main.launch(Maven31Main.java:181)
at sun.reflect.NativeMethodAccessorImpl.invoke0(Native Method)
at sun.reflect.NativeMethodAccessorImpl.invoke(NativeMethodAccessorImpl.java:57)
at sun.reflect.DelegatingMethodAccessorImpl.invoke(DelegatingMethodAccessorImpl.java:43)
at java.lang.reflect.Method.invoke(Method.java:606)
at hudson.maven.Maven3Builder.call(Maven3Builder.java:134)
at hudson.maven.Maven3Builder.call(Maven3Builder.java:69)
at hudson.remoting.UserRequest.perform(UserRequest.java:118)
at hudson.remoting.UserRequest.perform(UserRequest.java:48)
at hudson.remoting.Request$2.run(Request.java:328)
at hudson.remoting.InterceptingExecutorService$1.call(InterceptingExecutorService.java:72)
at java.util.concurrent.FutureTask.run(FutureTask.java:262)
at java.util.concurrent.ThreadPoolExecutor.runWorker(ThreadPoolExecutor.java:1145)
at java.util.concurrent.ThreadPoolExecutor$Worker.run(ThreadPoolExecutor.java:615)
at java.lang.Thread.run(Thread.java:744)
Caused by: org.apache.maven.plugin.MojoFailureException: You have 1 Checkstyle violation.
at org.apache.maven.plugin.checkstyle.CheckstyleViolationCheckMojo.execute(CheckstyleViolationCheckMojo.java:582)
at org.apache.maven.plugin.DefaultBuildPluginManager.executeMojo(DefaultBuildPluginManager.java:106)
at org.apache.maven.lifecycle.internal.MojoExecutor.execute(MojoExecutor.java:208)
... 30 more
[ERROR]
[ERROR] Re-run Maven using the -X switch to enable full debug logging.
[ERROR]
[ERROR] For more information about the errors and possible solutions, please read the following articles:
[JENKINS] Archiving <https://buildhive.cloudbees.com/job/jclouds/job/jclouds-labs/ws/cloudsigma2/pom.xml> to org.apache.jclouds.labs/cloudsigma2/2.0.0-SNAPSHOT/cloudsigma2-2.0.0-SNAPSHOT.pom
[ERROR] [Help 1] http://cwiki.apache.org/confluence/display/MAVEN/MojoFailureException
[ERROR]
[ERROR] After correcting the problems, you can resume the build with the command
[ERROR] mvn <goals> -rf :docker
[JENKINS] Archiving <https://buildhive.cloudbees.com/job/jclouds/job/jclouds-labs/ws/cloudsigma2-zrh/pom.xml> to org.apache.jclouds.labs/cloudsigma2-zrh/2.0.0-SNAPSHOT/cloudsigma2-zrh-2.0.0-SNAPSHOT.pom
[JENKINS] Archiving <https://buildhive.cloudbees.com/job/jclouds/job/jclouds-labs/ws/joyent-cloudapi/pom.xml> to org.apache.jclouds.labs/joyent-cloudapi/2.0.0-SNAPSHOT/joyent-cloudapi-2.0.0-SNAPSHOT.pom
[JENKINS] Archiving <https://buildhive.cloudbees.com/job/jclouds/job/jclouds-labs/ws/pom.xml> to org.apache.jclouds.labs/jclouds-labs/2.0.0-SNAPSHOT/jclouds-labs-2.0.0-SNAPSHOT.pom
[JENKINS] Archiving <https://buildhive.cloudbees.com/job/jclouds/job/jclouds-labs/ws/target/jclouds-labs-2.0.0-SNAPSHOT-tests.jar> to org.apache.jclouds.labs/jclouds-labs/2.0.0-SNAPSHOT/jclouds-labs-2.0.0-SNAPSHOT-tests.jar
[JENKINS] Archiving <https://buildhive.cloudbees.com/job/jclouds/job/jclouds-labs/ws/docker/pom.xml> to org.apache.jclouds.labs/docker/2.0.0-SNAPSHOT/docker-2.0.0-SNAPSHOT.pom
[JENKINS] Archiving <https://buildhive.cloudbees.com/job/jclouds/job/jclouds-labs/ws/docker/target/docker-2.0.0-SNAPSHOT.jar> to org.apache.jclouds.labs/docker/2.0.0-SNAPSHOT/docker-2.0.0-SNAPSHOT.jar
[JENKINS] Archiving <https://buildhive.cloudbees.com/job/jclouds/job/jclouds-labs/ws/docker/target/docker-2.0.0-SNAPSHOT-tests.jar> to org.apache.jclouds.labs/docker/2.0.0-SNAPSHOT/docker-2.0.0-SNAPSHOT-tests.jar
[JENKINS] Archiving <https://buildhive.cloudbees.com/job/jclouds/job/jclouds-labs/ws/cloudsigma2-wdc/pom.xml> to org.apache.jclouds.labs/cloudsigma2-wdc/2.0.0-SNAPSHOT/cloudsigma2-wdc-2.0.0-SNAPSHOT.pom
[JENKINS] Archiving <https://buildhive.cloudbees.com/job/jclouds/job/jclouds-labs/ws/cloudsigma2-sjc/pom.xml> to org.apache.jclouds.labs/cloudsigma2-sjc/2.0.0-SNAPSHOT/cloudsigma2-sjc-2.0.0-SNAPSHOT.pom
[JENKINS] Archiving <https://buildhive.cloudbees.com/job/jclouds/job/jclouds-labs/ws/digitalocean/pom.xml> to org.apache.jclouds.labs/digitalocean/2.0.0-SNAPSHOT/digitalocean-2.0.0-SNAPSHOT.pom
[JENKINS] Archiving <https://buildhive.cloudbees.com/job/jclouds/job/jclouds-labs/ws/azurecompute/pom.xml> to org.apache.jclouds.labs/azurecompute/2.0.0-SNAPSHOT/azurecompute-2.0.0-SNAPSHOT.pom
[JENKINS] Archiving <https://buildhive.cloudbees.com/job/jclouds/job/jclouds-labs/ws/azurecompute/target/azurecompute-2.0.0-SNAPSHOT.jar> to org.apache.jclouds.labs/azurecompute/2.0.0-SNAPSHOT/azurecompute-2.0.0-SNAPSHOT.jar
[JENKINS] Archiving <https://buildhive.cloudbees.com/job/jclouds/job/jclouds-labs/ws/azurecompute/target/azurecompute-2.0.0-SNAPSHOT-tests.jar> to org.apache.jclouds.labs/azurecompute/2.0.0-SNAPSHOT/azurecompute-2.0.0-SNAPSHOT-tests.jar
[JENKINS] Archiving <https://buildhive.cloudbees.com/job/jclouds/job/jclouds-labs/ws/joyentcloud/pom.xml> to org.apache.jclouds.labs/joyentcloud/2.0.0-SNAPSHOT/joyentcloud-2.0.0-SNAPSHOT.pom
[JENKINS] Archiving <https://buildhive.cloudbees.com/job/jclouds/job/jclouds-labs/ws/cloudsigma2-lvs/pom.xml> to org.apache.jclouds.labs/cloudsigma2-lvs/2.0.0-SNAPSHOT/cloudsigma2-lvs-2.0.0-SNAPSHOT.pom
[JENKINS] Archiving <https://buildhive.cloudbees.com/job/jclouds/job/jclouds-labs/ws/abiquo/pom.xml> to org.apache.jclouds.labs/abiquo/2.0.0-SNAPSHOT/abiquo-2.0.0-SNAPSHOT.pom
[JENKINS] Archiving <https://buildhive.cloudbees.com/job/jclouds/job/jclouds-labs/ws/cloudsigma2-hnl/pom.xml> to org.apache.jclouds.labs/cloudsigma2-hnl/2.0.0-SNAPSHOT/cloudsigma2-hnl-2.0.0-SNAPSHOT.pom
[JENKINS] Archiving <https://buildhive.cloudbees.com/job/jclouds/job/jclouds-labs/ws/cdmi/pom.xml> to org.apache.jclouds.labs/cdmi/2.0.0-SNAPSHOT/cdmi-2.0.0-SNAPSHOT.pom
channel stopped