You are viewing a plain text version of this content. The canonical link for it is here.
Posted to dev@pdfbox.apache.org by Apache Jenkins Server <je...@builds.apache.org> on 2019/07/05 01:16:59 UTC
Build failed in Jenkins: PDFBox-2.0.x-jdk6 #106
See <https://builds.apache.org/job/PDFBox-2.0.x-jdk6/106/display/redirect>
------------------------------------------
Started by an SCM change
[EnvInject] - Loading node environment variables.
Building remotely on H34 (ubuntu xenial) in workspace <https://builds.apache.org/job/PDFBox-2.0.x-jdk6/ws/>
Cleaning up <https://builds.apache.org/job/PDFBox-2.0.x-jdk6/ws/2.0>
Deleting <https://builds.apache.org/job/PDFBox-2.0.x-jdk6/ws/2.0/app/target>
Deleting <https://builds.apache.org/job/PDFBox-2.0.x-jdk6/ws/2.0/parent/target>
Deleting <https://builds.apache.org/job/PDFBox-2.0.x-jdk6/ws/2.0/debugger-app/target>
Deleting <https://builds.apache.org/job/PDFBox-2.0.x-jdk6/ws/2.0/debugger/target>
Deleting <https://builds.apache.org/job/PDFBox-2.0.x-jdk6/ws/2.0/xmpbox/target>
Deleting <https://builds.apache.org/job/PDFBox-2.0.x-jdk6/ws/2.0/tools/target>
Deleting <https://builds.apache.org/job/PDFBox-2.0.x-jdk6/ws/2.0/preflight/target>
Deleting <https://builds.apache.org/job/PDFBox-2.0.x-jdk6/ws/2.0/target>
Deleting <https://builds.apache.org/job/PDFBox-2.0.x-jdk6/ws/2.0/examples/target>
Deleting <https://builds.apache.org/job/PDFBox-2.0.x-jdk6/ws/2.0/fontbox/target>
Deleting <https://builds.apache.org/job/PDFBox-2.0.x-jdk6/ws/2.0/pdfbox/target>
Deleting <https://builds.apache.org/job/PDFBox-2.0.x-jdk6/ws/2.0/preflight-app/target>
Updating http://svn.apache.org/repos/asf/pdfbox/branches/2.0 at revision '2019-07-05T01:16:11.547 +0000'
U pdfbox/src/main/java/org/apache/pdfbox/rendering/PageDrawer.java
U pdfbox/src/main/java/org/apache/pdfbox/pdmodel/graphics/color/PDDeviceNAttributes.java
U pdfbox/src/main/java/org/apache/pdfbox/pdmodel/interactive/digitalsignature/PDSeedValue.java
U pdfbox/src/main/java/org/apache/pdfbox/pdmodel/interactive/digitalsignature/PDPropBuild.java
U pdfbox/src/main/java/org/apache/pdfbox/pdmodel/interactive/digitalsignature/PDSignature.java
D preflight/src/test/java/org/apache/pdfbox/preflight/TestPDFBox3743.java
AU preflight/src/test/java/org/apache/pdfbox/preflight/TestPDFBox3741.java
D preflight/src/test/resources/PDFBOX-3743.pdf
AU preflight/src/test/resources/PDFBOX-3741.pdf
U preflight/src/main/java/org/apache/pdfbox/preflight/graphic/StandardColorSpaceHelper.java
At revision 1862577
org.tmatesoft.svn.core.SVNException: svn: E130003: Parser configuration problem: namespace reporting is not enabled
at org.tmatesoft.svn.core.internal.wc.SVNErrorManager.error(SVNErrorManager.java:70)
at org.tmatesoft.svn.core.internal.wc.SVNErrorManager.error(SVNErrorManager.java:57)
at org.tmatesoft.svn.core.internal.io.dav.http.HTTPConnection.request(HTTPConnection.java:760)
at org.tmatesoft.svn.core.internal.io.dav.http.HTTPConnection.request(HTTPConnection.java:352)
at org.tmatesoft.svn.core.internal.io.dav.http.HTTPConnection.request(HTTPConnection.java:340)
at org.tmatesoft.svn.core.internal.io.dav.DAVConnection.performHttpRequest(DAVConnection.java:910)
at org.tmatesoft.svn.core.internal.io.dav.DAVConnection.doReport(DAVConnection.java:363)
at org.tmatesoft.svn.core.internal.io.dav.DAVConnection.doReport(DAVConnection.java:353)
at org.tmatesoft.svn.core.internal.io.dav.DAVRepository.logImpl(DAVRepository.java:1003)
at org.tmatesoft.svn.core.io.SVNRepository.log(SVNRepository.java:1041)
at org.tmatesoft.svn.core.internal.wc2.remote.SvnRemoteLog.run(SvnRemoteLog.java:181)
at org.tmatesoft.svn.core.internal.wc2.remote.SvnRemoteLog.run(SvnRemoteLog.java:35)
at org.tmatesoft.svn.core.internal.wc2.SvnOperationRunner.run(SvnOperationRunner.java:21)
at org.tmatesoft.svn.core.wc2.SvnOperationFactory.run(SvnOperationFactory.java:1239)
at org.tmatesoft.svn.core.wc2.SvnOperation.run(SvnOperation.java:294)
at org.tmatesoft.svn.core.wc.SVNLogClient.doLog(SVNLogClient.java:968)
at org.tmatesoft.svn.core.wc.SVNLogClient.doLog(SVNLogClient.java:873)
at hudson.scm.SubversionChangeLogBuilder.buildModule(SubversionChangeLogBuilder.java:190)
Caused: hudson.util.IOException2: revision check failed on http://svn.apache.org/repos/asf/pdfbox/branches/2.0
at hudson.scm.SubversionChangeLogBuilder.buildModule(SubversionChangeLogBuilder.java:204)
at hudson.scm.SubversionChangeLogBuilder.run(SubversionChangeLogBuilder.java:124)
at hudson.scm.SubversionSCM.calcChangeLog(SubversionSCM.java:757)
at hudson.scm.SubversionSCM.checkout(SubversionSCM.java:898)
at hudson.scm.SCM.checkout(SCM.java:504)
at hudson.model.AbstractProject.checkout(AbstractProject.java:1208)
at hudson.model.AbstractBuild$AbstractBuildExecution.defaultCheckout(AbstractBuild.java:574)
at jenkins.scm.SCMCheckoutStrategy.checkout(SCMCheckoutStrategy.java:86)
at hudson.model.AbstractBuild$AbstractBuildExecution.run(AbstractBuild.java:499)
at hudson.model.Run.execute(Run.java:1810)
at hudson.maven.MavenModuleSetBuild.run(MavenModuleSetBuild.java:543)
at hudson.model.ResourceController.execute(ResourceController.java:97)
at hudson.model.Executor.run(Executor.java:429)
Retrying after 10 seconds
Cleaning up <https://builds.apache.org/job/PDFBox-2.0.x-jdk6/ws/2.0>
Updating http://svn.apache.org/repos/asf/pdfbox/branches/2.0 at revision '2019-07-05T01:16:11.547 +0000'
At revision 1862577
org.tmatesoft.svn.core.SVNException: svn: E130003: Parser configuration problem: namespace reporting is not enabled
at org.tmatesoft.svn.core.internal.wc.SVNErrorManager.error(SVNErrorManager.java:70)
at org.tmatesoft.svn.core.internal.wc.SVNErrorManager.error(SVNErrorManager.java:57)
at org.tmatesoft.svn.core.internal.io.dav.http.HTTPConnection.request(HTTPConnection.java:760)
at org.tmatesoft.svn.core.internal.io.dav.http.HTTPConnection.request(HTTPConnection.java:352)
at org.tmatesoft.svn.core.internal.io.dav.http.HTTPConnection.request(HTTPConnection.java:340)
at org.tmatesoft.svn.core.internal.io.dav.DAVConnection.performHttpRequest(DAVConnection.java:910)
at org.tmatesoft.svn.core.internal.io.dav.DAVConnection.doReport(DAVConnection.java:363)
at org.tmatesoft.svn.core.internal.io.dav.DAVConnection.doReport(DAVConnection.java:353)
at org.tmatesoft.svn.core.internal.io.dav.DAVRepository.logImpl(DAVRepository.java:1003)
at org.tmatesoft.svn.core.io.SVNRepository.log(SVNRepository.java:1041)
at org.tmatesoft.svn.core.internal.wc2.remote.SvnRemoteLog.run(SvnRemoteLog.java:181)
at org.tmatesoft.svn.core.internal.wc2.remote.SvnRemoteLog.run(SvnRemoteLog.java:35)
at org.tmatesoft.svn.core.internal.wc2.SvnOperationRunner.run(SvnOperationRunner.java:21)
at org.tmatesoft.svn.core.wc2.SvnOperationFactory.run(SvnOperationFactory.java:1239)
at org.tmatesoft.svn.core.wc2.SvnOperation.run(SvnOperation.java:294)
at org.tmatesoft.svn.core.wc.SVNLogClient.doLog(SVNLogClient.java:968)
at org.tmatesoft.svn.core.wc.SVNLogClient.doLog(SVNLogClient.java:873)
at hudson.scm.SubversionChangeLogBuilder.buildModule(SubversionChangeLogBuilder.java:190)
Caused: hudson.util.IOException2: revision check failed on http://svn.apache.org/repos/asf/pdfbox/branches/2.0
at hudson.scm.SubversionChangeLogBuilder.buildModule(SubversionChangeLogBuilder.java:204)
at hudson.scm.SubversionChangeLogBuilder.run(SubversionChangeLogBuilder.java:124)
at hudson.scm.SubversionSCM.calcChangeLog(SubversionSCM.java:757)
at hudson.scm.SubversionSCM.checkout(SubversionSCM.java:898)
at hudson.scm.SCM.checkout(SCM.java:504)
at hudson.model.AbstractProject.checkout(AbstractProject.java:1208)
at hudson.model.AbstractBuild$AbstractBuildExecution.defaultCheckout(AbstractBuild.java:574)
at jenkins.scm.SCMCheckoutStrategy.checkout(SCMCheckoutStrategy.java:86)
at hudson.model.AbstractBuild$AbstractBuildExecution.run(AbstractBuild.java:499)
at hudson.model.Run.execute(Run.java:1810)
at hudson.maven.MavenModuleSetBuild.run(MavenModuleSetBuild.java:543)
at hudson.model.ResourceController.execute(ResourceController.java:97)
at hudson.model.Executor.run(Executor.java:429)
Retrying after 10 seconds
Cleaning up <https://builds.apache.org/job/PDFBox-2.0.x-jdk6/ws/2.0>
Updating http://svn.apache.org/repos/asf/pdfbox/branches/2.0 at revision '2019-07-05T01:16:11.547 +0000'
At revision 1862577
org.tmatesoft.svn.core.SVNException: svn: E130003: Parser configuration problem: namespace reporting is not enabled
at org.tmatesoft.svn.core.internal.wc.SVNErrorManager.error(SVNErrorManager.java:70)
at org.tmatesoft.svn.core.internal.wc.SVNErrorManager.error(SVNErrorManager.java:57)
at org.tmatesoft.svn.core.internal.io.dav.http.HTTPConnection.request(HTTPConnection.java:760)
at org.tmatesoft.svn.core.internal.io.dav.http.HTTPConnection.request(HTTPConnection.java:352)
at org.tmatesoft.svn.core.internal.io.dav.http.HTTPConnection.request(HTTPConnection.java:340)
at org.tmatesoft.svn.core.internal.io.dav.DAVConnection.performHttpRequest(DAVConnection.java:910)
at org.tmatesoft.svn.core.internal.io.dav.DAVConnection.doReport(DAVConnection.java:363)
at org.tmatesoft.svn.core.internal.io.dav.DAVConnection.doReport(DAVConnection.java:353)
at org.tmatesoft.svn.core.internal.io.dav.DAVRepository.logImpl(DAVRepository.java:1003)
at org.tmatesoft.svn.core.io.SVNRepository.log(SVNRepository.java:1041)
at org.tmatesoft.svn.core.internal.wc2.remote.SvnRemoteLog.run(SvnRemoteLog.java:181)
at org.tmatesoft.svn.core.internal.wc2.remote.SvnRemoteLog.run(SvnRemoteLog.java:35)
at org.tmatesoft.svn.core.internal.wc2.SvnOperationRunner.run(SvnOperationRunner.java:21)
at org.tmatesoft.svn.core.wc2.SvnOperationFactory.run(SvnOperationFactory.java:1239)
at org.tmatesoft.svn.core.wc2.SvnOperation.run(SvnOperation.java:294)
at org.tmatesoft.svn.core.wc.SVNLogClient.doLog(SVNLogClient.java:968)
at org.tmatesoft.svn.core.wc.SVNLogClient.doLog(SVNLogClient.java:873)
at hudson.scm.SubversionChangeLogBuilder.buildModule(SubversionChangeLogBuilder.java:190)
Caused: hudson.util.IOException2: revision check failed on http://svn.apache.org/repos/asf/pdfbox/branches/2.0
at hudson.scm.SubversionChangeLogBuilder.buildModule(SubversionChangeLogBuilder.java:204)
at hudson.scm.SubversionChangeLogBuilder.run(SubversionChangeLogBuilder.java:124)
at hudson.scm.SubversionSCM.calcChangeLog(SubversionSCM.java:757)
at hudson.scm.SubversionSCM.checkout(SubversionSCM.java:898)
at hudson.scm.SCM.checkout(SCM.java:504)
at hudson.model.AbstractProject.checkout(AbstractProject.java:1208)
at hudson.model.AbstractBuild$AbstractBuildExecution.defaultCheckout(AbstractBuild.java:574)
at jenkins.scm.SCMCheckoutStrategy.checkout(SCMCheckoutStrategy.java:86)
at hudson.model.AbstractBuild$AbstractBuildExecution.run(AbstractBuild.java:499)
at hudson.model.Run.execute(Run.java:1810)
at hudson.maven.MavenModuleSetBuild.run(MavenModuleSetBuild.java:543)
at hudson.model.ResourceController.execute(ResourceController.java:97)
at hudson.model.Executor.run(Executor.java:429)
Archiving artifacts
---------------------------------------------------------------------
To unsubscribe, e-mail: dev-unsubscribe@pdfbox.apache.org
For additional commands, e-mail: dev-help@pdfbox.apache.org
Jenkins build is back to normal : PDFBox-2.0.x-jdk6 #107
Posted by Apache Jenkins Server <je...@builds.apache.org>.
See <https://builds.apache.org/job/PDFBox-2.0.x-jdk6/107/display/redirect>
---------------------------------------------------------------------
To unsubscribe, e-mail: dev-unsubscribe@pdfbox.apache.org
For additional commands, e-mail: dev-help@pdfbox.apache.org