You are viewing a plain text version of this content. The canonical link for it is here.
Posted to dev@ws.apache.org by Apache Jenkins Server <je...@builds.apache.org> on 2026/10/23 16:10:45 UTC
Build failed in Jenkins: webservices » Apache WSS4J - master JDK17 #174
See <https://ci-builds.apache.org/job/webservices/job/Apache%20WSS4J%20-%20master%20JDK17/174/display/redirect?page=changes>
Changes:
[github] Make ReplayCache atomic by adding addIfAbsent (#762)
------------------------------------------
Started by an SCM change
Running as SYSTEM
[EnvInject] - Loading node environment variables.
Building remotely on builds40 (ubuntu) in workspace <https://ci-builds.apache.org/job/webservices/job/Apache%20WSS4J%20-%20master%20JDK17/ws/>
The recommended git tool is: NONE
No credentials specified
> git rev-parse --resolve-git-dir <https://ci-builds.apache.org/job/webservices/job/Apache%20WSS4J%20-%20master%20JDK17/ws/.git> # timeout=10
Fetching changes from the remote Git repository
> git config remote.origin.url https://gitbox.apache.org/repos/asf/ws-wss4j.git # timeout=10
Fetching upstream changes from https://gitbox.apache.org/repos/asf/ws-wss4j.git
> git --version # timeout=10
> git --version # 'git version 2.34.1'
> git fetch --tags --force --progress -- https://gitbox.apache.org/repos/asf/ws-wss4j.git +refs/heads/*:refs/remotes/origin/* # timeout=10
> git rev-parse refs/remotes/origin/master^{commit} # timeout=10
Checking out Revision ebaa5751f2107daf86c44dc95b264b76a3c50b70 (refs/remotes/origin/master)
> git config core.sparsecheckout # timeout=10
> git checkout -f ebaa5751f2107daf86c44dc95b264b76a3c50b70 # timeout=10
Commit message: "Make ReplayCache atomic by adding addIfAbsent (#762)"
> git rev-list --no-walk 82012acfb56e9679fcd40e59f7f9482dd07ff532 # timeout=10
Parsing POMs
Established TCP socket on 42457
maven35-agent.jar already up to date
maven35-interceptor.jar already up to date
maven3-interceptor-commons.jar already up to date
[Apache WSS4J - master JDK17] $ /home/jenkins/tools/java/latest17/bin/java -cp /home/jenkins/jenkins-agent/maven35-agent.jar:/home/jenkins/tools/maven/latest3/boot/plexus-classworlds-2.12.1.jar:/home/jenkins/tools/maven/latest3/conf/logging jenkins.maven3.agent.Maven35Main /home/jenkins/tools/maven/latest3 /home/jenkins/jenkins-agent/agent.jar /home/jenkins/jenkins-agent/maven35-interceptor.jar /home/jenkins/jenkins-agent/maven3-interceptor-commons.jar 42457
<===[JENKINS REMOTING CAPACITY]===> channel started
Executing Maven: -B -f <https://ci-builds.apache.org/job/webservices/job/Apache%20WSS4J%20-%20master%20JDK17/ws/pom.xml> -Papache-release -Dgpg.skip=true clean deploy
java.lang.reflect.InvocationTargetException
at java.base/jdk.internal.reflect.NativeMethodAccessorImpl.invoke0(Native Method)
at java.base/jdk.internal.reflect.NativeMethodAccessorImpl.invoke(NativeMethodAccessorImpl.java:77)
at java.base/jdk.internal.reflect.DelegatingMethodAccessorImpl.invoke(DelegatingMethodAccessorImpl.java:43)
at java.base/java.lang.reflect.Method.invoke(Method.java:569)
at org.codehaus.plexus.classworlds.launcher.Launcher.launchEnhanced(Launcher.java:255)
at org.codehaus.plexus.classworlds.launcher.Launcher.launch(Launcher.java:201)
at jenkins.maven3.agent.Maven35Main.launch(Maven35Main.java:179)
at java.base/jdk.internal.reflect.NativeMethodAccessorImpl.invoke0(Native Method)
at java.base/jdk.internal.reflect.NativeMethodAccessorImpl.invoke(NativeMethodAccessorImpl.java:77)
at java.base/jdk.internal.reflect.DelegatingMethodAccessorImpl.invoke(DelegatingMethodAccessorImpl.java:43)
at java.base/java.lang.reflect.Method.invoke(Method.java:569)
at PluginClassLoader for maven-plugin//hudson.maven.Maven3Builder.call(Maven3Builder.java:140)
at PluginClassLoader for maven-plugin//hudson.maven.Maven3Builder.call(Maven3Builder.java:71)
at hudson.remoting.UserRequest.perform(UserRequest.java:225)
at hudson.remoting.UserRequest.perform(UserRequest.java:50)
at hudson.remoting.Request$2.run(Request.java:391)
at hudson.remoting.InterceptingExecutorService.lambda$wrap$0(InterceptingExecutorService.java:81)
at java.base/java.util.concurrent.FutureTask.run(FutureTask.java:264)
at java.base/java.util.concurrent.ThreadPoolExecutor.runWorker(ThreadPoolExecutor.java:1136)
at java.base/java.util.concurrent.ThreadPoolExecutor$Worker.run(ThreadPoolExecutor.java:635)
at java.base/java.lang.Thread.run(Thread.java:840)
Caused by: java.lang.UnsupportedOperationException
at org.eclipse.sisu.wire.EntryListAdapter$ValueListIterator.add(EntryListAdapter.java:185)
at java.base/java.util.AbstractSequentialList.add(AbstractSequentialList.java:146)
at java.base/java.util.AbstractList.add(AbstractList.java:111)
at java.base/java.util.AbstractCollection.addAll(AbstractCollection.java:336)
at org.jvnet.hudson.maven3.launcher.Maven35Launcher.main(Maven35Launcher.java:127)
... 21 more
No mail will be sent out, as 'webservices » Apache WSS4J - master JDK17 » Apache WSS4J WS-Security Bindings #174' does not have a result yet. Please make sure you set a proper result in case of pipeline/build scripts.
No mail will be sent out, as 'webservices » Apache WSS4J - master JDK17 » Apache WSS4J Streaming WS-SecurityPolicy #174' does not have a result yet. Please make sure you set a proper result in case of pipeline/build scripts.
No mail will be sent out, as 'webservices » Apache WSS4J - master JDK17 » Apache WSS4J WS-Security Common #174' does not have a result yet. Please make sure you set a proper result in case of pipeline/build scripts.
No mail will be sent out, as 'webservices » Apache WSS4J - master JDK17 » Apache WSS4J DOM WS-Security #174' does not have a result yet. Please make sure you set a proper result in case of pipeline/build scripts.
No mail will be sent out, as 'webservices » Apache WSS4J - master JDK17 » Apache WSS4J WS-SecurityPolicy model #174' does not have a result yet. Please make sure you set a proper result in case of pipeline/build scripts.
No mail will be sent out, as 'webservices » Apache WSS4J - master JDK17 » Apache WSS4J WS-Security Integration #174' does not have a result yet. Please make sure you set a proper result in case of pipeline/build scripts.
No mail will be sent out, as 'webservices » Apache WSS4J - master JDK17 » Apache WSS4J Streaming WS-Security #174' does not have a result yet. Please make sure you set a proper result in case of pipeline/build scripts.
No mail will be sent out, as 'webservices » Apache WSS4J - master JDK17 » Apache WSS4J parent #174' does not have a result yet. Please make sure you set a proper result in case of pipeline/build scripts.
No mail will be sent out, as 'webservices » Apache WSS4J - master JDK17 » Apache WSS4J #174' does not have a result yet. Please make sure you set a proper result in case of pipeline/build scripts.
No mail will be sent out, as 'webservices » Apache WSS4J - master JDK17 » Apache WSS4J Web WS-Security #174' does not have a result yet. Please make sure you set a proper result in case of pipeline/build scripts.
ERROR: Failed to parse POMs
java.io.IOException: java.lang.reflect.InvocationTargetException
at PluginClassLoader for maven-plugin//hudson.maven.Maven3Builder.call(Maven3Builder.java:178)
at PluginClassLoader for maven-plugin//hudson.maven.Maven3Builder.call(Maven3Builder.java:71)
at hudson.remoting.UserRequest.perform(UserRequest.java:225)
at hudson.remoting.UserRequest.perform(UserRequest.java:50)
at hudson.remoting.Request$2.run(Request.java:391)
at hudson.remoting.InterceptingExecutorService.lambda$wrap$0(InterceptingExecutorService.java:81)
at java.base/java.util.concurrent.FutureTask.run(FutureTask.java:264)
at java.base/java.util.concurrent.ThreadPoolExecutor.runWorker(ThreadPoolExecutor.java:1136)
at java.base/java.util.concurrent.ThreadPoolExecutor$Worker.run(ThreadPoolExecutor.java:635)
at java.base/java.lang.Thread.run(Thread.java:840)
Suppressed: hudson.remoting.Channel$CallSiteStackTrace: Remote call to Channel to Maven [/home/jenkins/tools/java/latest17/bin/java, -cp, /home/jenkins/jenkins-agent/maven35-agent.jar:/home/jenkins/tools/maven/latest3/boot/plexus-classworlds-2.12.1.jar:/home/jenkins/tools/maven/latest3/conf/logging, jenkins.maven3.agent.Maven35Main, /home/jenkins/tools/maven/latest3, /home/jenkins/jenkins-agent/agent.jar, /home/jenkins/jenkins-agent/maven35-interceptor.jar, /home/jenkins/jenkins-agent/maven3-interceptor-commons.jar, 42457]
at hudson.remoting.Channel.attachCallSiteStackTrace(Channel.java:1923)
at hudson.remoting.UserRequest$ExceptionResponse.retrieve(UserRequest.java:384)
at hudson.remoting.Channel.call(Channel.java:1112)
at PluginClassLoader for maven-plugin//hudson.maven.ProcessCache$MavenProcess.call(ProcessCache.java:161)
at PluginClassLoader for maven-plugin//hudson.maven.MavenModuleSetBuild$MavenModuleSetBuildExecution.doRun(MavenModuleSetBuild.java:877)
at hudson.model.AbstractBuild$AbstractBuildExecution.run(AbstractBuild.java:527)
at hudson.model.Run.execute(Run.java:1833)
at PluginClassLoader for maven-plugin//hudson.maven.MavenModuleSetBuild.run(MavenModuleSetBuild.java:543)
at hudson.model.ResourceController.execute(ResourceController.java:101)
at hudson.model.Executor.run(Executor.java:446)
Caused by: java.lang.reflect.InvocationTargetException
at java.base/jdk.internal.reflect.NativeMethodAccessorImpl.invoke0(Native Method)
at java.base/jdk.internal.reflect.NativeMethodAccessorImpl.invoke(NativeMethodAccessorImpl.java:77)
at java.base/jdk.internal.reflect.DelegatingMethodAccessorImpl.invoke(DelegatingMethodAccessorImpl.java:43)
at java.base/java.lang.reflect.Method.invoke(Method.java:569)
at PluginClassLoader for maven-plugin//hudson.maven.Maven3Builder.call(Maven3Builder.java:140)
... 9 more
Caused by: java.lang.Exception: java.lang.reflect.InvocationTargetException
at jenkins.maven3.agent.Maven35Main.launch(Maven35Main.java:182)
... 14 more
Caused by: java.lang.reflect.InvocationTargetException
at java.base/jdk.internal.reflect.NativeMethodAccessorImpl.invoke0(Native Method)
at java.base/jdk.internal.reflect.NativeMethodAccessorImpl.invoke(NativeMethodAccessorImpl.java:77)
at java.base/jdk.internal.reflect.DelegatingMethodAccessorImpl.invoke(DelegatingMethodAccessorImpl.java:43)
at java.base/java.lang.reflect.Method.invoke(Method.java:569)
at org.codehaus.plexus.classworlds.launcher.Launcher.launchEnhanced(Launcher.java:255)
at org.codehaus.plexus.classworlds.launcher.Launcher.launch(Launcher.java:201)
at jenkins.maven3.agent.Maven35Main.launch(Maven35Main.java:179)
... 14 more
Caused by: java.lang.UnsupportedOperationException
at org.eclipse.sisu.wire.EntryListAdapter$ValueListIterator.add(EntryListAdapter.java:185)
at java.base/java.util.AbstractSequentialList.add(AbstractSequentialList.java:146)
at java.base/java.util.AbstractList.add(AbstractList.java:111)
at java.base/java.util.AbstractCollection.addAll(AbstractCollection.java:336)
at org.jvnet.hudson.maven3.launcher.Maven35Launcher.main(Maven35Launcher.java:127)
... 21 more
channel stopped
---------------------------------------------------------------------
To unsubscribe, e-mail: dev-unsubscribe@ws.apache.org
For additional commands, e-mail: dev-help@ws.apache.org
Build failed in Jenkins: webservices » Apache WSS4J - master JDK17 #175
Posted by Apache Jenkins Server <je...@builds.apache.org>.
See <https://ci-builds.apache.org/job/webservices/job/Apache%20WSS4J%20-%20master%20JDK17/175/display/redirect?page=changes>
Changes:
[github] Bump org.apache.maven.plugins:maven-surefire-plugin from 3.6.0 to 3.6.1 (#763)
[github] Bump the codeql-action group with 3 updates (#764)
------------------------------------------
Started by an SCM change
Running as SYSTEM
[EnvInject] - Loading node environment variables.
Building remotely on builds60 (ubuntu ubuntu-avx) in workspace <https://ci-builds.apache.org/job/webservices/job/Apache%20WSS4J%20-%20master%20JDK17/ws/>
The recommended git tool is: NONE
No credentials specified
> git rev-parse --resolve-git-dir <https://ci-builds.apache.org/job/webservices/job/Apache%20WSS4J%20-%20master%20JDK17/ws/.git> # timeout=10
Fetching changes from the remote Git repository
> git config remote.origin.url https://gitbox.apache.org/repos/asf/ws-wss4j.git # timeout=10
Fetching upstream changes from https://gitbox.apache.org/repos/asf/ws-wss4j.git
> git --version # timeout=10
> git --version # 'git version 2.34.1'
> git fetch --tags --force --progress -- https://gitbox.apache.org/repos/asf/ws-wss4j.git +refs/heads/*:refs/remotes/origin/* # timeout=10
> git rev-parse refs/remotes/origin/master^{commit} # timeout=10
Checking out Revision b4ee62a7870079de9d695025d8f972844252645e (refs/remotes/origin/master)
> git config core.sparsecheckout # timeout=10
> git checkout -f b4ee62a7870079de9d695025d8f972844252645e # timeout=10
Commit message: "Bump the codeql-action group with 3 updates (#764)"
> git rev-list --no-walk ebaa5751f2107daf86c44dc95b264b76a3c50b70 # timeout=10
Parsing POMs
Modules changed, recalculating dependency graph
Established TCP socket on 35723
maven35-agent.jar already up to date
maven35-interceptor.jar already up to date
maven3-interceptor-commons.jar already up to date
[Apache WSS4J - master JDK17] $ /home/jenkins/tools/java/latest17/bin/java -cp /home/jenkins/jenkins-agent/maven35-agent.jar:/home/jenkins/tools/maven/latest3/boot/plexus-classworlds-2.12.1.jar:/home/jenkins/tools/maven/latest3/conf/logging jenkins.maven3.agent.Maven35Main /home/jenkins/tools/maven/latest3 /home/jenkins/jenkins-agent/agent.jar /home/jenkins/jenkins-agent/maven35-interceptor.jar /home/jenkins/jenkins-agent/maven3-interceptor-commons.jar 35723
<===[JENKINS REMOTING CAPACITY]===> channel started
Executing Maven: -B -f <https://ci-builds.apache.org/job/webservices/job/Apache%20WSS4J%20-%20master%20JDK17/ws/pom.xml> -Papache-release -Dgpg.skip=true clean deploy
java.lang.reflect.InvocationTargetException
at java.base/jdk.internal.reflect.NativeMethodAccessorImpl.invoke0(Native Method)
at java.base/jdk.internal.reflect.NativeMethodAccessorImpl.invoke(NativeMethodAccessorImpl.java:77)
at java.base/jdk.internal.reflect.DelegatingMethodAccessorImpl.invoke(DelegatingMethodAccessorImpl.java:43)
at java.base/java.lang.reflect.Method.invoke(Method.java:569)
at org.codehaus.plexus.classworlds.launcher.Launcher.launchEnhanced(Launcher.java:255)
at org.codehaus.plexus.classworlds.launcher.Launcher.launch(Launcher.java:201)
at jenkins.maven3.agent.Maven35Main.launch(Maven35Main.java:179)
at java.base/jdk.internal.reflect.NativeMethodAccessorImpl.invoke0(Native Method)
at java.base/jdk.internal.reflect.NativeMethodAccessorImpl.invoke(NativeMethodAccessorImpl.java:77)
at java.base/jdk.internal.reflect.DelegatingMethodAccessorImpl.invoke(DelegatingMethodAccessorImpl.java:43)
at java.base/java.lang.reflect.Method.invoke(Method.java:569)
at PluginClassLoader for maven-plugin//hudson.maven.Maven3Builder.call(Maven3Builder.java:140)
at PluginClassLoader for maven-plugin//hudson.maven.Maven3Builder.call(Maven3Builder.java:71)
at hudson.remoting.UserRequest.perform(UserRequest.java:225)
at hudson.remoting.UserRequest.perform(UserRequest.java:50)
at hudson.remoting.Request$2.run(Request.java:391)
at hudson.remoting.InterceptingExecutorService.lambda$wrap$0(InterceptingExecutorService.java:81)
at java.base/java.util.concurrent.FutureTask.run(FutureTask.java:264)
at java.base/java.util.concurrent.ThreadPoolExecutor.runWorker(ThreadPoolExecutor.java:1136)
at java.base/java.util.concurrent.ThreadPoolExecutor$Worker.run(ThreadPoolExecutor.java:635)
at java.base/java.lang.Thread.run(Thread.java:840)
Caused by: java.lang.UnsupportedOperationException
at org.eclipse.sisu.wire.EntryListAdapter$ValueListIterator.add(EntryListAdapter.java:185)
at java.base/java.util.AbstractSequentialList.add(AbstractSequentialList.java:146)
at java.base/java.util.AbstractList.add(AbstractList.java:111)
at java.base/java.util.AbstractCollection.addAll(AbstractCollection.java:336)
at org.jvnet.hudson.maven3.launcher.Maven35Launcher.main(Maven35Launcher.java:127)
... 21 more
No mail will be sent out, as 'webservices » Apache WSS4J - master JDK17 » Apache WSS4J WS-Security Bindings #175' does not have a result yet. Please make sure you set a proper result in case of pipeline/build scripts.
No mail will be sent out, as 'webservices » Apache WSS4J - master JDK17 » Apache WSS4J Streaming WS-SecurityPolicy #175' does not have a result yet. Please make sure you set a proper result in case of pipeline/build scripts.
No mail will be sent out, as 'webservices » Apache WSS4J - master JDK17 » Apache WSS4J WS-Security Common #175' does not have a result yet. Please make sure you set a proper result in case of pipeline/build scripts.
No mail will be sent out, as 'webservices » Apache WSS4J - master JDK17 » Apache WSS4J DOM WS-Security #175' does not have a result yet. Please make sure you set a proper result in case of pipeline/build scripts.
No mail will be sent out, as 'webservices » Apache WSS4J - master JDK17 » Apache WSS4J WS-SecurityPolicy model #175' does not have a result yet. Please make sure you set a proper result in case of pipeline/build scripts.
No mail will be sent out, as 'webservices » Apache WSS4J - master JDK17 » Apache WSS4J WS-Security Integration #175' does not have a result yet. Please make sure you set a proper result in case of pipeline/build scripts.
No mail will be sent out, as 'webservices » Apache WSS4J - master JDK17 » Apache WSS4J Streaming WS-Security #175' does not have a result yet. Please make sure you set a proper result in case of pipeline/build scripts.
No mail will be sent out, as 'webservices » Apache WSS4J - master JDK17 » Apache WSS4J parent #175' does not have a result yet. Please make sure you set a proper result in case of pipeline/build scripts.
No mail will be sent out, as 'webservices » Apache WSS4J - master JDK17 » Apache WSS4J #175' does not have a result yet. Please make sure you set a proper result in case of pipeline/build scripts.
No mail will be sent out, as 'webservices » Apache WSS4J - master JDK17 » Apache WSS4J Web WS-Security #175' does not have a result yet. Please make sure you set a proper result in case of pipeline/build scripts.
ERROR: Failed to parse POMs
java.io.IOException: java.lang.reflect.InvocationTargetException
at PluginClassLoader for maven-plugin//hudson.maven.Maven3Builder.call(Maven3Builder.java:178)
at PluginClassLoader for maven-plugin//hudson.maven.Maven3Builder.call(Maven3Builder.java:71)
at hudson.remoting.UserRequest.perform(UserRequest.java:225)
at hudson.remoting.UserRequest.perform(UserRequest.java:50)
at hudson.remoting.Request$2.run(Request.java:391)
at hudson.remoting.InterceptingExecutorService.lambda$wrap$0(InterceptingExecutorService.java:81)
at java.base/java.util.concurrent.FutureTask.run(FutureTask.java:264)
at java.base/java.util.concurrent.ThreadPoolExecutor.runWorker(ThreadPoolExecutor.java:1136)
at java.base/java.util.concurrent.ThreadPoolExecutor$Worker.run(ThreadPoolExecutor.java:635)
at java.base/java.lang.Thread.run(Thread.java:840)
Suppressed: hudson.remoting.Channel$CallSiteStackTrace: Remote call to Channel to Maven [/home/jenkins/tools/java/latest17/bin/java, -cp, /home/jenkins/jenkins-agent/maven35-agent.jar:/home/jenkins/tools/maven/latest3/boot/plexus-classworlds-2.12.1.jar:/home/jenkins/tools/maven/latest3/conf/logging, jenkins.maven3.agent.Maven35Main, /home/jenkins/tools/maven/latest3, /home/jenkins/jenkins-agent/agent.jar, /home/jenkins/jenkins-agent/maven35-interceptor.jar, /home/jenkins/jenkins-agent/maven3-interceptor-commons.jar, 35723]
at hudson.remoting.Channel.attachCallSiteStackTrace(Channel.java:1923)
at hudson.remoting.UserRequest$ExceptionResponse.retrieve(UserRequest.java:384)
at hudson.remoting.Channel.call(Channel.java:1112)
at PluginClassLoader for maven-plugin//hudson.maven.ProcessCache$MavenProcess.call(ProcessCache.java:161)
at PluginClassLoader for maven-plugin//hudson.maven.MavenModuleSetBuild$MavenModuleSetBuildExecution.doRun(MavenModuleSetBuild.java:877)
at hudson.model.AbstractBuild$AbstractBuildExecution.run(AbstractBuild.java:527)
at hudson.model.Run.execute(Run.java:1833)
at PluginClassLoader for maven-plugin//hudson.maven.MavenModuleSetBuild.run(MavenModuleSetBuild.java:543)
at hudson.model.ResourceController.execute(ResourceController.java:101)
at hudson.model.Executor.run(Executor.java:446)
Caused by: java.lang.reflect.InvocationTargetException
at java.base/jdk.internal.reflect.NativeMethodAccessorImpl.invoke0(Native Method)
at java.base/jdk.internal.reflect.NativeMethodAccessorImpl.invoke(NativeMethodAccessorImpl.java:77)
at java.base/jdk.internal.reflect.DelegatingMethodAccessorImpl.invoke(DelegatingMethodAccessorImpl.java:43)
at java.base/java.lang.reflect.Method.invoke(Method.java:569)
at PluginClassLoader for maven-plugin//hudson.maven.Maven3Builder.call(Maven3Builder.java:140)
... 9 more
Caused by: java.lang.Exception: java.lang.reflect.InvocationTargetException
at jenkins.maven3.agent.Maven35Main.launch(Maven35Main.java:182)
... 14 more
Caused by: java.lang.reflect.InvocationTargetException
at java.base/jdk.internal.reflect.NativeMethodAccessorImpl.invoke0(Native Method)
at java.base/jdk.internal.reflect.NativeMethodAccessorImpl.invoke(NativeMethodAccessorImpl.java:77)
at java.base/jdk.internal.reflect.DelegatingMethodAccessorImpl.invoke(DelegatingMethodAccessorImpl.java:43)
at java.base/java.lang.reflect.Method.invoke(Method.java:569)
at org.codehaus.plexus.classworlds.launcher.Launcher.launchEnhanced(Launcher.java:255)
at org.codehaus.plexus.classworlds.launcher.Launcher.launch(Launcher.java:201)
at jenkins.maven3.agent.Maven35Main.launch(Maven35Main.java:179)
... 14 more
Caused by: java.lang.UnsupportedOperationException
at org.eclipse.sisu.wire.EntryListAdapter$ValueListIterator.add(EntryListAdapter.java:185)
at java.base/java.util.AbstractSequentialList.add(AbstractSequentialList.java:146)
at java.base/java.util.AbstractList.add(AbstractList.java:111)
at java.base/java.util.AbstractCollection.addAll(AbstractCollection.java:336)
at org.jvnet.hudson.maven3.launcher.Maven35Launcher.main(Maven35Launcher.java:127)
... 21 more
channel stopped
---------------------------------------------------------------------
To unsubscribe, e-mail: dev-unsubscribe@ws.apache.org
For additional commands, e-mail: dev-help@ws.apache.org