You are viewing a plain text version of this content. The canonical link for it is here.
Posted to dev@thrift.apache.org by Apache Jenkins Server <je...@builds.apache.org> on 2014/03/18 23:57:45 UTC

Build failed in Jenkins: Thrift #1086

See <https://builds.apache.org/job/Thrift/1086/changes>

Changes:

[jensg] THRIFT-2339 Uncaught exception in thrift c# driver

------------------------------------------
[...truncated 9241 lines...]
.localhost - - [18/Mar/2014 22:57:20] "POST / HTTP/1.0" 200 -
localhost - - [18/Mar/2014 22:57:20] "POST / HTTP/1.0" 200 -
.localhost - - [18/Mar/2014 22:57:20] "POST / HTTP/1.0" 200 -
.localhost - - [18/Mar/2014 22:57:20] "POST / HTTP/1.0" 200 -
localhost - - [18/Mar/2014 22:57:20] "POST / HTTP/1.0" 200 -
.localhost - - [18/Mar/2014 22:57:20] "POST / HTTP/1.0" 200 -
.localhost - - [18/Mar/2014 22:57:20] "POST / HTTP/1.0" 200 -
.localhost - - [18/Mar/2014 22:57:20] "POST / HTTP/1.0" 200 -
.
----------------------------------------------------------------------
Ran 18 tests in 0.703s

OK
localhost - - [18/Mar/2014 22:57:20] "POST / HTTP/1.0" 200 -
localhost - - [18/Mar/2014 22:57:20] "POST / HTTP/1.0" 200 -
.localhost - - [18/Mar/2014 22:57:20] "POST / HTTP/1.0" 200 -
localhost - - [18/Mar/2014 22:57:20] "POST / HTTP/1.0" 200 -
localhost - - [18/Mar/2014 22:57:20] "POST / HTTP/1.0" 200 -
.localhost - - [18/Mar/2014 22:57:20] "POST / HTTP/1.0" 200 -
.localhost - - [18/Mar/2014 22:57:20] "POST / HTTP/1.0" 200 -
localhost - - [18/Mar/2014 22:57:20] "POST / HTTP/1.0" 200 -
localhost - - [18/Mar/2014 22:57:20] "POST / HTTP/1.0" 200 -
.localhost - - [18/Mar/2014 22:57:20] "POST / HTTP/1.0" 200 -
localhost - - [18/Mar/2014 22:57:20] "POST / HTTP/1.0" 200 -
.localhost - - [18/Mar/2014 22:57:20] "POST / HTTP/1.0" 200 -
localhost - - [18/Mar/2014 22:57:20] "POST / HTTP/1.0" 200 -
.localhost - - [18/Mar/2014 22:57:20] "POST / HTTP/1.0" 200 -
.localhost - - [18/Mar/2014 22:57:20] "POST / HTTP/1.0" 200 -
..localhost - - [18/Mar/2014 22:57:20] "POST / HTTP/1.0" 200 -
.localhost - - [18/Mar/2014 22:57:20] "POST / HTTP/1.0" 200 -
.localhost - - [18/Mar/2014 22:57:20] "POST / HTTP/1.0" 200 -
.localhost - - [18/Mar/2014 22:57:20] "POST / HTTP/1.0" 200 -
localhost - - [18/Mar/2014 22:57:20] "POST / HTTP/1.0" 200 -
.localhost - - [18/Mar/2014 22:57:20] "POST / HTTP/1.0" 200 -
.localhost - - [18/Mar/2014 22:57:20] "POST / HTTP/1.0" 200 -
localhost - - [18/Mar/2014 22:57:20] "POST / HTTP/1.0" 200 -
.localhost - - [18/Mar/2014 22:57:20] "POST / HTTP/1.0" 200 -
.localhost - - [18/Mar/2014 22:57:20] "POST / HTTP/1.0" 200 -
.localhost - - [18/Mar/2014 22:57:20] "POST / HTTP/1.0" 200 -
.
----------------------------------------------------------------------
Ran 18 tests in 0.705s

OK
localhost - - [18/Mar/2014 22:57:21] "POST / HTTP/1.0" 200 -
localhost - - [18/Mar/2014 22:57:21] "POST / HTTP/1.0" 200 -
.localhost - - [18/Mar/2014 22:57:21] "POST / HTTP/1.0" 200 -
localhost - - [18/Mar/2014 22:57:21] "POST / HTTP/1.0" 200 -
localhost - - [18/Mar/2014 22:57:21] "POST / HTTP/1.0" 200 -
.localhost - - [18/Mar/2014 22:57:21] "POST / HTTP/1.0" 200 -
.localhost - - [18/Mar/2014 22:57:21] "POST / HTTP/1.0" 200 -
localhost - - [18/Mar/2014 22:57:21] "POST / HTTP/1.0" 200 -
localhost - - [18/Mar/2014 22:57:21] "POST / HTTP/1.0" 200 -
.localhost - - [18/Mar/2014 22:57:21] "POST / HTTP/1.0" 200 -
localhost - - [18/Mar/2014 22:57:21] "POST / HTTP/1.0" 200 -
.localhost - - [18/Mar/2014 22:57:21] "POST / HTTP/1.0" 200 -
localhost - - [18/Mar/2014 22:57:21] "POST / HTTP/1.0" 200 -
.localhost - - [18/Mar/2014 22:57:21] "POST / HTTP/1.0" 200 -
.localhost - - [18/Mar/2014 22:57:21] "POST / HTTP/1.0" 200 -
..localhost - - [18/Mar/2014 22:57:21] "POST / HTTP/1.0" 200 -
.localhost - - [18/Mar/2014 22:57:21] "POST / HTTP/1.0" 200 -
.localhost - - [18/Mar/2014 22:57:21] "POST / HTTP/1.0" 200 -
.localhost - - [18/Mar/2014 22:57:21] "POST / HTTP/1.0" 200 -
localhost - - [18/Mar/2014 22:57:21] "POST / HTTP/1.0" 200 -
.localhost - - [18/Mar/2014 22:57:21] "POST / HTTP/1.0" 200 -
.localhost - - [18/Mar/2014 22:57:21] "POST / HTTP/1.0" 200 -
localhost - - [18/Mar/2014 22:57:21] "POST / HTTP/1.0" 200 -
.localhost - - [18/Mar/2014 22:57:21] "POST / HTTP/1.0" 200 -
.localhost - - [18/Mar/2014 22:57:21] "POST / HTTP/1.0" 200 -
.localhost - - [18/Mar/2014 22:57:21] "POST / HTTP/1.0" 200 -
.
----------------------------------------------------------------------
Ran 18 tests in 0.716s

OK
localhost - - [18/Mar/2014 22:57:22] "POST / HTTP/1.0" 200 -
localhost - - [18/Mar/2014 22:57:22] "POST / HTTP/1.0" 200 -
.localhost - - [18/Mar/2014 22:57:22] "POST / HTTP/1.0" 200 -
localhost - - [18/Mar/2014 22:57:22] "POST / HTTP/1.0" 200 -
localhost - - [18/Mar/2014 22:57:22] "POST / HTTP/1.0" 200 -
.localhost - - [18/Mar/2014 22:57:22] "POST / HTTP/1.0" 200 -
.localhost - - [18/Mar/2014 22:57:22] "POST / HTTP/1.0" 200 -
localhost - - [18/Mar/2014 22:57:22] "POST / HTTP/1.0" 200 -
localhost - - [18/Mar/2014 22:57:22] "POST / HTTP/1.0" 200 -
.localhost - - [18/Mar/2014 22:57:22] "POST / HTTP/1.0" 200 -
localhost - - [18/Mar/2014 22:57:22] "POST / HTTP/1.0" 200 -
.localhost - - [18/Mar/2014 22:57:22] "POST / HTTP/1.0" 200 -
localhost - - [18/Mar/2014 22:57:22] "POST / HTTP/1.0" 200 -
.localhost - - [18/Mar/2014 22:57:22] "POST / HTTP/1.0" 200 -
.localhost - - [18/Mar/2014 22:57:22] "POST / HTTP/1.0" 200 -
..localhost - - [18/Mar/2014 22:57:22] "POST / HTTP/1.0" 200 -
.localhost - - [18/Mar/2014 22:57:22] "POST / HTTP/1.0" 200 -
.localhost - - [18/Mar/2014 22:57:22] "POST / HTTP/1.0" 200 -
.localhost - - [18/Mar/2014 22:57:22] "POST / HTTP/1.0" 200 -
localhost - - [18/Mar/2014 22:57:22] "POST / HTTP/1.0" 200 -
.localhost - - [18/Mar/2014 22:57:22] "POST / HTTP/1.0" 200 -
.localhost - - [18/Mar/2014 22:57:22] "POST / HTTP/1.0" 200 -
localhost - - [18/Mar/2014 22:57:22] "POST / HTTP/1.0" 200 -
.localhost - - [18/Mar/2014 22:57:22] "POST / HTTP/1.0" 200 -
.localhost - - [18/Mar/2014 22:57:22] "POST / HTTP/1.0" 200 -
.localhost - - [18/Mar/2014 22:57:22] "POST / HTTP/1.0" 200 -
.
----------------------------------------------------------------------
Ran 18 tests in 0.716s

OK
localhost - - [18/Mar/2014 22:57:23] "POST / HTTP/1.0" 200 -
localhost - - [18/Mar/2014 22:57:23] "POST / HTTP/1.0" 200 -
.localhost - - [18/Mar/2014 22:57:23] "POST / HTTP/1.0" 200 -
localhost - - [18/Mar/2014 22:57:23] "POST / HTTP/1.0" 200 -
localhost - - [18/Mar/2014 22:57:23] "POST / HTTP/1.0" 200 -
.localhost - - [18/Mar/2014 22:57:23] "POST / HTTP/1.0" 200 -
.localhost - - [18/Mar/2014 22:57:23] "POST / HTTP/1.0" 200 -
localhost - - [18/Mar/2014 22:57:23] "POST / HTTP/1.0" 200 -
localhost - - [18/Mar/2014 22:57:23] "POST / HTTP/1.0" 200 -
.localhost - - [18/Mar/2014 22:57:23] "POST / HTTP/1.0" 200 -
localhost - - [18/Mar/2014 22:57:23] "POST / HTTP/1.0" 200 -
.localhost - - [18/Mar/2014 22:57:23] "POST / HTTP/1.0" 200 -
localhost - - [18/Mar/2014 22:57:23] "POST / HTTP/1.0" 200 -
.localhost - - [18/Mar/2014 22:57:23] "POST / HTTP/1.0" 200 -
.localhost - - [18/Mar/2014 22:57:23] "POST / HTTP/1.0" 200 -
..localhost - - [18/Mar/2014 22:57:23] "POST / HTTP/1.0" 200 -
.localhost - - [18/Mar/2014 22:57:23] "POST / HTTP/1.0" 200 -
.localhost - - [18/Mar/2014 22:57:23] "POST / HTTP/1.0" 200 -
.localhost - - [18/Mar/2014 22:57:23] "POST / HTTP/1.0" 200 -
localhost - - [18/Mar/2014 22:57:23] "POST / HTTP/1.0" 200 -
.localhost - - [18/Mar/2014 22:57:23] "POST / HTTP/1.0" 200 -
.localhost - - [18/Mar/2014 22:57:23] "POST / HTTP/1.0" 200 -
localhost - - [18/Mar/2014 22:57:23] "POST / HTTP/1.0" 200 -
.localhost - - [18/Mar/2014 22:57:23] "POST / HTTP/1.0" 200 -
.localhost - - [18/Mar/2014 22:57:23] "POST / HTTP/1.0" 200 -
.localhost - - [18/Mar/2014 22:57:23] "POST / HTTP/1.0" 200 -
.
----------------------------------------------------------------------
Ran 18 tests in 0.712s

OK
localhost - - [18/Mar/2014 22:57:24] "POST / HTTP/1.0" 200 -
localhost - - [18/Mar/2014 22:57:24] "POST / HTTP/1.0" 200 -
.localhost - - [18/Mar/2014 22:57:24] "POST / HTTP/1.0" 200 -
localhost - - [18/Mar/2014 22:57:24] "POST / HTTP/1.0" 200 -
localhost - - [18/Mar/2014 22:57:24] "POST / HTTP/1.0" 200 -
.localhost - - [18/Mar/2014 22:57:24] "POST / HTTP/1.0" 200 -
.localhost - - [18/Mar/2014 22:57:24] "POST / HTTP/1.0" 200 -
localhost - - [18/Mar/2014 22:57:24] "POST / HTTP/1.0" 200 -
localhost - - [18/Mar/2014 22:57:24] "POST / HTTP/1.0" 200 -
.localhost - - [18/Mar/2014 22:57:24] "POST / HTTP/1.0" 200 -
localhost - - [18/Mar/2014 22:57:24] "POST / HTTP/1.0" 200 -
.localhost - - [18/Mar/2014 22:57:24] "POST / HTTP/1.0" 200 -
localhost - - [18/Mar/2014 22:57:24] "POST / HTTP/1.0" 200 -
.localhost - - [18/Mar/2014 22:57:24] "POST / HTTP/1.0" 200 -
.localhost - - [18/Mar/2014 22:57:24] "POST / HTTP/1.0" 200 -
..localhost - - [18/Mar/2014 22:57:24] "POST / HTTP/1.0" 200 -
.localhost - - [18/Mar/2014 22:57:24] "POST / HTTP/1.0" 200 -
.localhost - - [18/Mar/2014 22:57:24] "POST / HTTP/1.0" 200 -
.localhost - - [18/Mar/2014 22:57:24] "POST / HTTP/1.0" 200 -
localhost - - [18/Mar/2014 22:57:24] "POST / HTTP/1.0" 200 -
.localhost - - [18/Mar/2014 22:57:24] "POST / HTTP/1.0" 200 -
.localhost - - [18/Mar/2014 22:57:24] "POST / HTTP/1.0" 200 -
localhost - - [18/Mar/2014 22:57:24] "POST / HTTP/1.0" 200 -
.localhost - - [18/Mar/2014 22:57:24] "POST / HTTP/1.0" 200 -
.localhost - - [18/Mar/2014 22:57:24] "POST / HTTP/1.0" 200 -
.localhost - - [18/Mar/2014 22:57:24] "POST / HTTP/1.0" 200 -
.
----------------------------------------------------------------------
Ran 18 tests in 0.701s

OK
l --port=9090 --http=/
OK: Finished (includes gen-py-dynamic)  THttpServer / accel proto / zlib=False / SSL=False.   391 combinations tested.

Test run #392:  (includes gen-py-dynamic) Server=THttpServer,  Proto=binary,  zlib=False,  SSL=False
Testing server THttpServer: /usr/bin/python ./TestServer.py --genpydir=gen-py-dynamic --proto=binary --port=9090 THttpServer
Testing client: /usr/bin/python ./TestClient.py --genpydir=gen-py-dynamic --proto=binary --port=9090 --http=/
OK: Finished (includes gen-py-dynamic)  THttpServer / binary proto / zlib=False / SSL=False.   392 combinations tested.

Test run #393:  (includes gen-py-dynamic) Server=THttpServer,  Proto=compact,  zlib=False,  SSL=False
Testing server THttpServer: /usr/bin/python ./TestServer.py --genpydir=gen-py-dynamic --proto=compact --port=9090 THttpServer
Testing client: /usr/bin/python ./TestClient.py --genpydir=gen-py-dynamic --proto=compact --port=9090 --http=/
OK: Finished (includes gen-py-dynamic)  THttpServer / compact proto / zlib=False / SSL=False.   393 combinations tested.

Test run #394:  (includes gen-py-dynamicslots) Server=THttpServer,  Proto=accel,  zlib=False,  SSL=False
Testing server THttpServer: /usr/bin/python ./TestServer.py --genpydir=gen-py-dynamicslots --proto=accel --port=9090 THttpServer
Testing client: /usr/bin/python ./TestClient.py --genpydir=gen-py-dynamicslots --proto=accel --port=9090 --http=/
OK: Finished (includes gen-py-dynamicslots)  THttpServer / accel proto / zlib=False / SSL=False.   394 combinations tested.

Test run #395:  (includes gen-py-dynamicslots) Server=THttpServer,  Proto=binary,  zlib=False,  SSL=False
Testing server THttpServer: /usr/bin/python ./TestServer.py --genpydir=gen-py-dynamicslots --proto=binary --port=9090 THttpServer
Testing client: /usr/bin/python ./TestClient.py --genpydir=gen-py-dynamicslots --proto=binary --port=9090 --http=/
OK: Finished (includes gen-py-dynamicslots)  THttpServer / binary proto / zlib=False / SSL=False.   395 combinations tested.

Test run #396:  (includes gen-py-dynamicslots) Server=THttpServer,  Proto=compact,  zlib=False,  SSL=False
Testing server THttpServer: /usr/bin/python ./TestServer.py --genpydir=gen-py-dynamicslots --proto=compact --port=9090 THttpServer
Testing client: /usr/bin/python ./TestClient.py --genpydir=gen-py-dynamicslots --proto=compact --port=9090 --http=/
OK: Finished (includes gen-py-dynamicslots)  THttpServer / compact proto / zlib=False / SSL=False.   396 combinations tested.
PASS: RunClientServer.py
=============
1 test passed
=============
make[3]: Leaving directory `/x1/jenkins/jenkins-slave/workspace/Thrift/test/py'
make[2]: Leaving directory `/x1/jenkins/jenkins-slave/workspace/Thrift/test/py'
Making check in py.twisted
make[2]: Entering directory `/x1/jenkins/jenkins-slave/workspace/Thrift/test/py.twisted'
../../compiler/cpp/thrift --gen py:twisted ../ThriftTest.thrift
[WARNING:/x1/jenkins/jenkins-slave/workspace/Thrift/test/ThriftTest.thrift:41] No generator named 'noexist' could be found!
[WARNING:/x1/jenkins/jenkins-slave/workspace/Thrift/test/ThriftTest.thrift:42] cpp generator does not accept 'noexist' as sub-namespace!
../../compiler/cpp/thrift --gen py:twisted ../SmallTest.thrift
[WARNING:/x1/jenkins/jenkins-slave/workspace/Thrift/test/SmallTest.thrift:27] "senum" is deprecated and will be removed in a future compiler version.  This type should be replaced with "string".

[WARNING:/x1/jenkins/jenkins-slave/workspace/Thrift/test/SmallTest.thrift:27] "senum" is deprecated and will be removed in a future compiler version.  This type should be replaced with "string".

/usr/bin/trial test_suite.py
test_suite
  ThriftTestCase
    testByte ...                                                           [OK]
    testDouble ...                                                         [OK]
    testException ...                                                      [OK]
    testI32 ...                                                            [OK]
    testI64 ...                                                            [OK]
    testOneway ...                                                       [FAIL]
    testString ...                                                         [OK]
    testStruct ...                                                         [OK]
    testVoid ...                                                           [OK]

===============================================================================
[FAIL]
Traceback (most recent call last):
  File "/usr/lib/python2.7/dist-packages/twisted/internet/defer.py", line 1039, in _inlineCallbacks
    result = g.send(result)
  File "/x1/jenkins/jenkins-slave/workspace/Thrift/test/py.twisted/test_suite.py", line 184, in testOneway
    self.assertAlmostEquals(seconds, (end - start), places=2)
twisted.trial.unittest.FailTest: 2 != 2.006664991378784 within 2 places

test_suite.ThriftTestCase.testOneway
-------------------------------------------------------------------------------
Ran 9 tests in 2.049s

FAILED (failures=1, successes=8)
make[2]: *** [check] Error 1
make[2]: Leaving directory `/x1/jenkins/jenkins-slave/workspace/Thrift/test/py.twisted'
make[1]: *** [check-recursive] Error 1
make[1]: Leaving directory `/x1/jenkins/jenkins-slave/workspace/Thrift/test'
make: *** [check-recursive] Error 1
Build step 'Execute shell' marked build as failure
[WARNINGS] Skipping publisher since build result is FAILURE
[TASKS] Skipping publisher since build result is FAILURE
Archiving artifacts
Publishing Javadoc
Updating THRIFT-2339

Jenkins build is back to normal : Thrift #1089

Posted by Apache Jenkins Server <je...@builds.apache.org>.
See <https://builds.apache.org/job/Thrift/1089/changes>


Build failed in Jenkins: Thrift #1088

Posted by Apache Jenkins Server <je...@builds.apache.org>.
See <https://builds.apache.org/job/Thrift/1088/changes>

Changes:

[roger] THRIFT-2407 use markdown (rename README => README.md)

------------------------------------------
[...truncated 7083 lines...]
  File "./../../lib/py/build/lib.linux-x86_64-2.7/thrift/transport/TTransport.py", line 149, in open
    return self.__trans.open()
  File "./../../lib/py/build/lib.linux-x86_64-2.7/thrift/transport/TSocket.py", line 101, in open
    message=message)
TTransportException: Could not connect to localhost:9090

======================================================================
ERROR: testDouble (__main__.AcceleratedBinaryTest)
----------------------------------------------------------------------
Traceback (most recent call last):
  File "./TestClient.py", line 85, in setUp
    self.transport.open()
  File "./../../lib/py/build/lib.linux-x86_64-2.7/thrift/transport/TTransport.py", line 149, in open
    return self.__trans.open()
  File "./../../lib/py/build/lib.linux-x86_64-2.7/thrift/transport/TSocket.py", line 101, in open
    message=message)
TTransportException: Could not connect to localhost:9090

======================================================================
ERROR: testEnum (__main__.AcceleratedBinaryTest)
----------------------------------------------------------------------
Traceback (most recent call last):
  File "./TestClient.py", line 85, in setUp
    self.transport.open()
  File "./../../lib/py/build/lib.linux-x86_64-2.7/thrift/transport/TTransport.py", line 149, in open
    return self.__trans.open()
  File "./../../lib/py/build/lib.linux-x86_64-2.7/thrift/transport/TSocket.py", line 101, in open
    message=message)
TTransportException: Could not connect to localhost:9090

======================================================================
ERROR: testException (__main__.AcceleratedBinaryTest)
----------------------------------------------------------------------
Traceback (most recent call last):
  File "./TestClient.py", line 85, in setUp
    self.transport.open()
  File "./../../lib/py/build/lib.linux-x86_64-2.7/thrift/transport/TTransport.py", line 149, in open
    return self.__trans.open()
  File "./../../lib/py/build/lib.linux-x86_64-2.7/thrift/transport/TSocket.py", line 101, in open
    message=message)
TTransportException: Could not connect to localhost:9090

======================================================================
ERROR: testI32 (__main__.AcceleratedBinaryTest)
----------------------------------------------------------------------
Traceback (most recent call last):
  File "./TestClient.py", line 85, in setUp
    self.transport.open()
  File "./../../lib/py/build/lib.linux-x86_64-2.7/thrift/transport/TTransport.py", line 149, in open
    return self.__trans.open()
  File "./../../lib/py/build/lib.linux-x86_64-2.7/thrift/transport/TSocket.py", line 101, in open
    message=message)
TTransportException: Could not connect to localhost:9090

======================================================================
ERROR: testI64 (__main__.AcceleratedBinaryTest)
----------------------------------------------------------------------
Traceback (most recent call last):
  File "./TestClient.py", line 85, in setUp
    self.transport.open()
  File "./../../lib/py/build/lib.linux-x86_64-2.7/thrift/transport/TTransport.py", line 149, in open
    return self.__trans.open()
  File "./../../lib/py/build/lib.linux-x86_64-2.7/thrift/transport/TSocket.py", line 101, in open
    message=message)
TTransportException: Could not connect to localhost:9090

======================================================================
ERROR: testList (__main__.AcceleratedBinaryTest)
----------------------------------------------------------------------
Traceback (most recent call last):
  File "./TestClient.py", line 85, in setUp
    self.transport.open()
  File "./../../lib/py/build/lib.linux-x86_64-2.7/thrift/transport/TTransport.py", line 149, in open
    return self.__trans.open()
  File "./../../lib/py/build/lib.linux-x86_64-2.7/thrift/transport/TSocket.py", line 101, in open
    message=message)
TTransportException: Could not connect to localhost:9090

======================================================================
ERROR: testMap (__main__.AcceleratedBinaryTest)
----------------------------------------------------------------------
Traceback (most recent call last):
  File "./TestClient.py", line 85, in setUp
    self.transport.open()
  File "./../../lib/py/build/lib.linux-x86_64-2.7/thrift/transport/TTransport.py", line 149, in open
    return self.__trans.open()
  File "./../../lib/py/build/lib.linux-x86_64-2.7/thrift/transport/TSocket.py", line 101, in open
    message=message)
TTransportException: Could not connect to localhost:9090

======================================================================
ERROR: testMapMap (__main__.AcceleratedBinaryTest)
----------------------------------------------------------------------
Traceback (most recent call last):
  File "./TestClient.py", line 85, in setUp
    self.transport.open()
  File "./../../lib/py/build/lib.linux-x86_64-2.7/thrift/transport/TTransport.py", line 149, in open
    return self.__trans.open()
  File "./../../lib/py/build/lib.linux-x86_64-2.7/thrift/transport/TSocket.py", line 101, in open
    message=message)
TTransportException: Could not connect to localhost:9090

======================================================================
ERROR: testMulti (__main__.AcceleratedBinaryTest)
----------------------------------------------------------------------
Traceback (most recent call last):
  File "./TestClient.py", line 85, in setUp
    self.transport.open()
  File "./../../lib/py/build/lib.linux-x86_64-2.7/thrift/transport/TTransport.py", line 149, in open
    return self.__trans.open()
  File "./../../lib/py/build/lib.linux-x86_64-2.7/thrift/transport/TSocket.py", line 101, in open
    message=message)
TTransportException: Could not connect to localhost:9090

======================================================================
ERROR: testNest (__main__.AcceleratedBinaryTest)
----------------------------------------------------------------------
Traceback (most recent call last):
  File "./TestClient.py", line 85, in setUp
    self.transport.open()
  File "./../../lib/py/build/lib.linux-x86_64-2.7/thrift/transport/TTransport.py", line 149, in open
    return self.__trans.open()
  File "./../../lib/py/build/lib.linux-x86_64-2.7/thrift/transport/TSocket.py", line 101, in open
    message=message)
TTransportException: Could not connect to localhost:9090

======================================================================
ERROR: testOneway (__main__.AcceleratedBinaryTest)
----------------------------------------------------------------------
Traceback (most recent call last):
  File "./TestClient.py", line 85, in setUp
    self.transport.open()
  File "./../../lib/py/build/lib.linux-x86_64-2.7/thrift/transport/TTransport.py", line 149, in open
    return self.__trans.open()
  File "./../../lib/py/build/lib.linux-x86_64-2.7/thrift/transport/TSocket.py", line 101, in open
    message=message)
TTransportException: Could not connect to localhost:9090

======================================================================
ERROR: testOnewayThenNormal (__main__.AcceleratedBinaryTest)
----------------------------------------------------------------------
Traceback (most recent call last):
  File "./TestClient.py", line 85, in setUp
    self.transport.open()
  File "./../../lib/py/build/lib.linux-x86_64-2.7/thrift/transport/TTransport.py", line 149, in open
    return self.__trans.open()
  File "./../../lib/py/build/lib.linux-x86_64-2.7/thrift/transport/TSocket.py", line 101, in open
    message=message)
TTransportException: Could not connect to localhost:9090

======================================================================
ERROR: testSet (__main__.AcceleratedBinaryTest)
----------------------------------------------------------------------
Traceback (most recent call last):
  File "./TestClient.py", line 85, in setUp
    self.transport.open()
  File "./../../lib/py/build/lib.linux-x86_64-2.7/thrift/transport/TTransport.py", line 149, in open
    return self.__trans.open()
  File "./../../lib/py/build/lib.linux-x86_64-2.7/thrift/transport/TSocket.py", line 101, in open
    message=message)
TTransportException: Could not connect to localhost:9090

======================================================================
ERROR: testString (__main__.AcceleratedBinaryTest)
----------------------------------------------------------------------
Traceback (most recent call last):
  File "./TestClient.py", line 85, in setUp
    self.transport.open()
  File "./../../lib/py/build/lib.linux-x86_64-2.7/thrift/transport/TTransport.py", line 149, in open
    return self.__trans.open()
  File "./../../lib/py/build/lib.linux-x86_64-2.7/thrift/transport/TSocket.py", line 101, in open
    message=message)
TTransportException: Could not connect to localhost:9090

======================================================================
ERROR: testStruct (__main__.AcceleratedBinaryTest)
----------------------------------------------------------------------
Traceback (most recent call last):
  File "./TestClient.py", line 85, in setUp
    self.transport.open()
  File "./../../lib/py/build/lib.linux-x86_64-2.7/thrift/transport/TTransport.py", line 149, in open
    return self.__trans.open()
  File "./../../lib/py/build/lib.linux-x86_64-2.7/thrift/transport/TSocket.py", line 101, in open
    message=message)
TTransportException: Could not connect to localhost:9090

======================================================================
ERROR: testTypedef (__main__.AcceleratedBinaryTest)
----------------------------------------------------------------------
Traceback (most recent call last):
  File "./TestClient.py", line 85, in setUp
    self.transport.open()
  File "./../../lib/py/build/lib.linux-x86_64-2.7/thrift/transport/TTransport.py", line 149, in open
    return self.__trans.open()
  File "./../../lib/py/build/lib.linux-x86_64-2.7/thrift/transport/TSocket.py", line 101, in open
    message=message)
TTransportException: Could not connect to localhost:9090

======================================================================
ERROR: testVoid (__main__.AcceleratedBinaryTest)
----------------------------------------------------------------------
Traceback (most recent call last):
  File "./TestClient.py", line 85, in setUp
    self.transport.open()
  File "./../../lib/py/build/lib.linux-x86_64-2.7/thrift/transport/TTransport.py", line 149, in open
    return self.__trans.open()
  File "./../../lib/py/build/lib.linux-x86_64-2.7/thrift/transport/TSocket.py", line 101, in open
    message=message)
TTransportException: Could not connect to localhost:9090

----------------------------------------------------------------------
Ran 18 tests in 0.005s

FAILED (errors=18)
npydir=gen-py-dynamicslots --proto=compact --port=9090 --zlib
OK: Finished (includes gen-py-dynamicslots)  TThreadPoolServer / compact proto / zlib=True / SSL=False.   215 combinations tested.

Test run #216:  (includes gen-py-dynamicslots) Server=TThreadPoolServer,  Proto=compact,  zlib=True,  SSL=True
Testing server TThreadPoolServer: /usr/bin/python ./TestServer.py --genpydir=gen-py-dynamicslots --proto=compact --port=9090 --zlib --ssl TThreadPoolServer
Testing client: /usr/bin/python ./TestClient.py --genpydir=gen-py-dynamicslots --proto=compact --port=9090 --zlib --ssl
OK: Finished (includes gen-py-dynamicslots)  TThreadPoolServer / compact proto / zlib=True / SSL=True.   216 combinations tested.

Test run #217:  (includes gen-py-default) Server=TProcessPoolServer,  Proto=accel,  zlib=False,  SSL=False
Testing server TProcessPoolServer: /usr/bin/python ./TestServer.py --genpydir=gen-py-default --proto=accel --port=9090 TProcessPoolServer
Testing client: /usr/bin/python ./TestClient.py --genpydir=gen-py-default --proto=accel --port=9090
Giving TProcessPoolServer (proto=accel,zlib=False,ssl=False) an extra 3 seconds for child processes to terminate via alarm
Traceback (most recent call last):
  File "./RunClientServer.py", line 191, in <module>
    runServiceTest(genpydir, try_server, try_proto, options.port, with_zlib, with_ssl)
  File "./RunClientServer.py", line 142, in runServiceTest
    raise Exception("Client subprocess failed, retcode=%d, args: %s" % (ret, ' '.join(cli_args)))
Exception: Client subprocess failed, retcode=1, args: /usr/bin/python ./TestClient.py --genpydir=gen-py-default --proto=accel --port=9090
FAIL: RunClientServer.py
==================
1 of 1 test failed
==================
make[3]: *** [check-TESTS] Error 1
make[3]: Leaving directory `<https://builds.apache.org/job/Thrift/ws/test/py'>
make[2]: *** [check-am] Error 2
make[2]: Leaving directory `<https://builds.apache.org/job/Thrift/ws/test/py'>
make[1]: *** [check-recursive] Error 1
make[1]: Leaving directory `<https://builds.apache.org/job/Thrift/ws/test'>
make: *** [check-recursive] Error 1
Build step 'Execute shell' marked build as failure
[WARNINGS] Skipping publisher since build result is FAILURE
[TASKS] Skipping publisher since build result is FAILURE
Archiving artifacts
Publishing Javadoc
Updating THRIFT-2407

Build failed in Jenkins: Thrift #1087

Posted by Apache Jenkins Server <je...@builds.apache.org>.
See <https://builds.apache.org/job/Thrift/1087/changes>

Changes:

[jensg] THRIFT-2377 Allow addition of custom HTTP Headers to an HTTP Transport

------------------------------------------
[...truncated 4988 lines...]

======================================================================
ERROR: testException (__main__.AcceleratedBinaryTest)
----------------------------------------------------------------------
Traceback (most recent call last):
  File "./TestClient.py", line 85, in setUp
    self.transport.open()
  File "./../../lib/py/build/lib.linux-x86_64-2.7/thrift/transport/TZlibTransport.py", line 165, in open
    return self.__trans.open()
  File "./../../lib/py/build/lib.linux-x86_64-2.7/thrift/transport/TTransport.py", line 149, in open
    return self.__trans.open()
  File "./../../lib/py/build/lib.linux-x86_64-2.7/thrift/transport/TSSLSocket.py", line 112, in open
    message=message)
TTransportException: Could not connect to localhost:9090: [Errno 111] Connection refused

======================================================================
ERROR: testI32 (__main__.AcceleratedBinaryTest)
----------------------------------------------------------------------
Traceback (most recent call last):
  File "./TestClient.py", line 85, in setUp
    self.transport.open()
  File "./../../lib/py/build/lib.linux-x86_64-2.7/thrift/transport/TZlibTransport.py", line 165, in open
    return self.__trans.open()
  File "./../../lib/py/build/lib.linux-x86_64-2.7/thrift/transport/TTransport.py", line 149, in open
    return self.__trans.open()
  File "./../../lib/py/build/lib.linux-x86_64-2.7/thrift/transport/TSSLSocket.py", line 112, in open
    message=message)
TTransportException: Could not connect to localhost:9090: [Errno 111] Connection refused

======================================================================
ERROR: testI64 (__main__.AcceleratedBinaryTest)
----------------------------------------------------------------------
Traceback (most recent call last):
  File "./TestClient.py", line 85, in setUp
    self.transport.open()
  File "./../../lib/py/build/lib.linux-x86_64-2.7/thrift/transport/TZlibTransport.py", line 165, in open
    return self.__trans.open()
  File "./../../lib/py/build/lib.linux-x86_64-2.7/thrift/transport/TTransport.py", line 149, in open
    return self.__trans.open()
  File "./../../lib/py/build/lib.linux-x86_64-2.7/thrift/transport/TSSLSocket.py", line 112, in open
    message=message)
TTransportException: Could not connect to localhost:9090: [Errno 111] Connection refused

======================================================================
ERROR: testList (__main__.AcceleratedBinaryTest)
----------------------------------------------------------------------
Traceback (most recent call last):
  File "./TestClient.py", line 85, in setUp
    self.transport.open()
  File "./../../lib/py/build/lib.linux-x86_64-2.7/thrift/transport/TZlibTransport.py", line 165, in open
    return self.__trans.open()
  File "./../../lib/py/build/lib.linux-x86_64-2.7/thrift/transport/TTransport.py", line 149, in open
    return self.__trans.open()
  File "./../../lib/py/build/lib.linux-x86_64-2.7/thrift/transport/TSSLSocket.py", line 112, in open
    message=message)
TTransportException: Could not connect to localhost:9090: [Errno 111] Connection refused

======================================================================
ERROR: testMap (__main__.AcceleratedBinaryTest)
----------------------------------------------------------------------
Traceback (most recent call last):
  File "./TestClient.py", line 85, in setUp
    self.transport.open()
  File "./../../lib/py/build/lib.linux-x86_64-2.7/thrift/transport/TZlibTransport.py", line 165, in open
    return self.__trans.open()
  File "./../../lib/py/build/lib.linux-x86_64-2.7/thrift/transport/TTransport.py", line 149, in open
    return self.__trans.open()
  File "./../../lib/py/build/lib.linux-x86_64-2.7/thrift/transport/TSSLSocket.py", line 112, in open
    message=message)
TTransportException: Could not connect to localhost:9090: [Errno 111] Connection refused

======================================================================
ERROR: testMapMap (__main__.AcceleratedBinaryTest)
----------------------------------------------------------------------
Traceback (most recent call last):
  File "./TestClient.py", line 85, in setUp
    self.transport.open()
  File "./../../lib/py/build/lib.linux-x86_64-2.7/thrift/transport/TZlibTransport.py", line 165, in open
    return self.__trans.open()
  File "./../../lib/py/build/lib.linux-x86_64-2.7/thrift/transport/TTransport.py", line 149, in open
    return self.__trans.open()
  File "./../../lib/py/build/lib.linux-x86_64-2.7/thrift/transport/TSSLSocket.py", line 112, in open
    message=message)
TTransportException: Could not connect to localhost:9090: [Errno 111] Connection refused

======================================================================
ERROR: testMulti (__main__.AcceleratedBinaryTest)
----------------------------------------------------------------------
Traceback (most recent call last):
  File "./TestClient.py", line 85, in setUp
    self.transport.open()
  File "./../../lib/py/build/lib.linux-x86_64-2.7/thrift/transport/TZlibTransport.py", line 165, in open
    return self.__trans.open()
  File "./../../lib/py/build/lib.linux-x86_64-2.7/thrift/transport/TTransport.py", line 149, in open
    return self.__trans.open()
  File "./../../lib/py/build/lib.linux-x86_64-2.7/thrift/transport/TSSLSocket.py", line 112, in open
    message=message)
TTransportException: Could not connect to localhost:9090: [Errno 111] Connection refused

======================================================================
ERROR: testNest (__main__.AcceleratedBinaryTest)
----------------------------------------------------------------------
Traceback (most recent call last):
  File "./TestClient.py", line 85, in setUp
    self.transport.open()
  File "./../../lib/py/build/lib.linux-x86_64-2.7/thrift/transport/TZlibTransport.py", line 165, in open
    return self.__trans.open()
  File "./../../lib/py/build/lib.linux-x86_64-2.7/thrift/transport/TTransport.py", line 149, in open
    return self.__trans.open()
  File "./../../lib/py/build/lib.linux-x86_64-2.7/thrift/transport/TSSLSocket.py", line 112, in open
    message=message)
TTransportException: Could not connect to localhost:9090: [Errno 111] Connection refused

======================================================================
ERROR: testOneway (__main__.AcceleratedBinaryTest)
----------------------------------------------------------------------
Traceback (most recent call last):
  File "./TestClient.py", line 85, in setUp
    self.transport.open()
  File "./../../lib/py/build/lib.linux-x86_64-2.7/thrift/transport/TZlibTransport.py", line 165, in open
    return self.__trans.open()
  File "./../../lib/py/build/lib.linux-x86_64-2.7/thrift/transport/TTransport.py", line 149, in open
    return self.__trans.open()
  File "./../../lib/py/build/lib.linux-x86_64-2.7/thrift/transport/TSSLSocket.py", line 112, in open
    message=message)
TTransportException: Could not connect to localhost:9090: [Errno 111] Connection refused

======================================================================
ERROR: testOnewayThenNormal (__main__.AcceleratedBinaryTest)
----------------------------------------------------------------------
Traceback (most recent call last):
  File "./TestClient.py", line 85, in setUp
    self.transport.open()
  File "./../../lib/py/build/lib.linux-x86_64-2.7/thrift/transport/TZlibTransport.py", line 165, in open
    return self.__trans.open()
  File "./../../lib/py/build/lib.linux-x86_64-2.7/thrift/transport/TTransport.py", line 149, in open
    return self.__trans.open()
  File "./../../lib/py/build/lib.linux-x86_64-2.7/thrift/transport/TSSLSocket.py", line 112, in open
    message=message)
TTransportException: Could not connect to localhost:9090: [Errno 111] Connection refused

======================================================================
ERROR: testSet (__main__.AcceleratedBinaryTest)
----------------------------------------------------------------------
Traceback (most recent call last):
  File "./TestClient.py", line 85, in setUp
    self.transport.open()
  File "./../../lib/py/build/lib.linux-x86_64-2.7/thrift/transport/TZlibTransport.py", line 165, in open
    return self.__trans.open()
  File "./../../lib/py/build/lib.linux-x86_64-2.7/thrift/transport/TTransport.py", line 149, in open
    return self.__trans.open()
  File "./../../lib/py/build/lib.linux-x86_64-2.7/thrift/transport/TSSLSocket.py", line 112, in open
    message=message)
TTransportException: Could not connect to localhost:9090: [Errno 111] Connection refused

======================================================================
ERROR: testString (__main__.AcceleratedBinaryTest)
----------------------------------------------------------------------
Traceback (most recent call last):
  File "./TestClient.py", line 85, in setUp
    self.transport.open()
  File "./../../lib/py/build/lib.linux-x86_64-2.7/thrift/transport/TZlibTransport.py", line 165, in open
    return self.__trans.open()
  File "./../../lib/py/build/lib.linux-x86_64-2.7/thrift/transport/TTransport.py", line 149, in open
    return self.__trans.open()
  File "./../../lib/py/build/lib.linux-x86_64-2.7/thrift/transport/TSSLSocket.py", line 112, in open
    message=message)
TTransportException: Could not connect to localhost:9090: [Errno 111] Connection refused

======================================================================
ERROR: testStruct (__main__.AcceleratedBinaryTest)
----------------------------------------------------------------------
Traceback (most recent call last):
  File "./TestClient.py", line 85, in setUp
    self.transport.open()
  File "./../../lib/py/build/lib.linux-x86_64-2.7/thrift/transport/TZlibTransport.py", line 165, in open
    return self.__trans.open()
  File "./../../lib/py/build/lib.linux-x86_64-2.7/thrift/transport/TTransport.py", line 149, in open
    return self.__trans.open()
  File "./../../lib/py/build/lib.linux-x86_64-2.7/thrift/transport/TSSLSocket.py", line 112, in open
    message=message)
TTransportException: Could not connect to localhost:9090: [Errno 111] Connection refused

======================================================================
ERROR: testTypedef (__main__.AcceleratedBinaryTest)
----------------------------------------------------------------------
Traceback (most recent call last):
  File "./TestClient.py", line 85, in setUp
    self.transport.open()
  File "./../../lib/py/build/lib.linux-x86_64-2.7/thrift/transport/TZlibTransport.py", line 165, in open
    return self.__trans.open()
  File "./../../lib/py/build/lib.linux-x86_64-2.7/thrift/transport/TTransport.py", line 149, in open
    return self.__trans.open()
  File "./../../lib/py/build/lib.linux-x86_64-2.7/thrift/transport/TSSLSocket.py", line 112, in open
    message=message)
TTransportException: Could not connect to localhost:9090: [Errno 111] Connection refused

======================================================================
ERROR: testVoid (__main__.AcceleratedBinaryTest)
----------------------------------------------------------------------
Traceback (most recent call last):
  File "./TestClient.py", line 85, in setUp
    self.transport.open()
  File "./../../lib/py/build/lib.linux-x86_64-2.7/thrift/transport/TZlibTransport.py", line 165, in open
    return self.__trans.open()
  File "./../../lib/py/build/lib.linux-x86_64-2.7/thrift/transport/TTransport.py", line 149, in open
    return self.__trans.open()
  File "./../../lib/py/build/lib.linux-x86_64-2.7/thrift/transport/TSSLSocket.py", line 112, in open
    message=message)
TTransportException: Could not connect to localhost:9090: [Errno 111] Connection refused

----------------------------------------------------------------------
Ran 18 tests in 0.013s

FAILED (errors=18)
 ./TestClient.py --genpydir=gen-py-default --proto=accel --port=9090 --ssl
OK: Finished (includes gen-py-default)  TSimpleServer / accel proto / zlib=False / SSL=True.   2 combinations tested.

Test run #3:  (includes gen-py-default) Server=TSimpleServer,  Proto=accel,  zlib=True,  SSL=False
Testing server TSimpleServer: /usr/bin/python ./TestServer.py --genpydir=gen-py-default --proto=accel --port=9090 --zlib TSimpleServer
Testing client: /usr/bin/python ./TestClient.py --genpydir=gen-py-default --proto=accel --port=9090 --zlib
OK: Finished (includes gen-py-default)  TSimpleServer / accel proto / zlib=True / SSL=False.   3 combinations tested.

Test run #4:  (includes gen-py-default) Server=TSimpleServer,  Proto=accel,  zlib=True,  SSL=True
Testing server TSimpleServer: /usr/bin/python ./TestServer.py --genpydir=gen-py-default --proto=accel --port=9090 --zlib --ssl TSimpleServer
Testing client: /usr/bin/python ./TestClient.py --genpydir=gen-py-default --proto=accel --port=9090 --zlib --ssl
Traceback (most recent call last):
  File "./RunClientServer.py", line 191, in <module>
    runServiceTest(genpydir, try_server, try_proto, options.port, with_zlib, with_ssl)
  File "./RunClientServer.py", line 142, in runServiceTest
    raise Exception("Client subprocess failed, retcode=%d, args: %s" % (ret, ' '.join(cli_args)))
Exception: Client subprocess failed, retcode=1, args: /usr/bin/python ./TestClient.py --genpydir=gen-py-default --proto=accel --port=9090 --zlib --ssl
FAIL: RunClientServer.py
==================
1 of 1 test failed
==================
make[3]: *** [check-TESTS] Error 1
make[3]: Leaving directory `<https://builds.apache.org/job/Thrift/ws/test/py'>
make[2]: *** [check-am] Error 2
make[2]: Leaving directory `<https://builds.apache.org/job/Thrift/ws/test/py'>
make[1]: *** [check-recursive] Error 1
make[1]: Leaving directory `<https://builds.apache.org/job/Thrift/ws/test'>
make: *** [check-recursive] Error 1
Build step 'Execute shell' marked build as failure
[WARNINGS] Skipping publisher since build result is FAILURE
[TASKS] Skipping publisher since build result is FAILURE
Archiving artifacts
Publishing Javadoc
Updating THRIFT-2377