You are viewing a plain text version of this content. The canonical link for it is here.
Posted to builds@beam.apache.org by Apache Jenkins Server <je...@builds.apache.org> on 2023/04/01 00:50:58 UTC

Build failed in Jenkins: beam_PostCommit_Java_DataflowV2 #2865

See <https://ci-beam.apache.org/job/beam_PostCommit_Java_DataflowV2/2865/display/redirect>

Changes:


------------------------------------------
[...truncated 68.49 KB...]

#7 [ 3/18] ADD target/slf4j-jdk14.jar /opt/apache/beam/jars/
#7 DONE 0.1s

#8 [ 4/18] ADD target/jcl-over-slf4j.jar /opt/apache/beam/jars/
#8 DONE 0.1s

#9 [ 5/18] ADD target/log4j-over-slf4j.jar /opt/apache/beam/jars/
#9 DONE 0.1s

#10 [ 6/18] ADD target/log4j-to-slf4j.jar /opt/apache/beam/jars/
#10 DONE 0.1s

#4 [ 1/18] FROM docker.io/library/eclipse-temurin:8@sha256:005d3189b2ec1612c3ade6eadabd1935c312f03aa7905cf0528e9d71980ad512
#4 ...

#11 [ 7/18] ADD target/beam-sdks-java-harness.jar /opt/apache/beam/jars/
#11 DONE 0.1s

#12 [ 8/18] COPY target/jamm.jar target/open-module-agent*.jar /opt/apache/beam/jars/
#12 DONE 0.1s

#13 [ 9/18] COPY target/linux_amd64/boot /opt/apache/beam/
#13 DONE 0.2s

#4 [ 1/18] FROM docker.io/library/eclipse-temurin:8@sha256:005d3189b2ec1612c3ade6eadabd1935c312f03aa7905cf0528e9d71980ad512
#4 ...

#14 [10/18] COPY target/LICENSE /opt/apache/beam/
#14 DONE 0.1s

#15 [11/18] COPY target/NOTICE /opt/apache/beam/
#15 DONE 0.1s

#16 [12/18] ADD target/third_party_licenses /opt/apache/beam/third_party_licenses/
#16 DONE 0.2s

#17 [13/18] COPY target/LICENSE target/options/* /opt/apache/beam/options/
#17 DONE 0.1s

#18 [14/18] RUN rm /opt/apache/beam/options/LICENSE
#18 DONE 0.4s

#19 [15/18] COPY target/LICENSE target/go-licenses/* /opt/apache/beam/third_party_licenses/golang/
#19 DONE 0.0s

#4 [ 1/18] FROM docker.io/library/eclipse-temurin:8@sha256:005d3189b2ec1612c3ade6eadabd1935c312f03aa7905cf0528e9d71980ad512
#4 ...

#20 [16/18] RUN rm /opt/apache/beam/third_party_licenses/golang/LICENSE
#20 DONE 0.4s

#21 [17/18] RUN if [ "true" = "false" ] ; then     rm -rf /opt/apache/beam/third_party_licenses ;    fi
#21 DONE 0.5s

#22 [18/18] COPY target/profiler/* /opt/google_cloud_profiler/
#22 DONE 0.1s

#4 [ 1/18] FROM docker.io/library/eclipse-temurin:8@sha256:005d3189b2ec1612c3ade6eadabd1935c312f03aa7905cf0528e9d71980ad512
#4 ...

#23 exporting to image
#23 exporting layers 0.2s done
#23 writing image sha256:5a581f0167c227f1dddfa88bd42049b0a026bc919d07efec87f41f9b92a6560b done
#23 naming to docker.io/apache/beam_java8_sdk:2.47.0.dev done
#23 DONE 0.3s

> Task :runners:google-cloud-dataflow-java:buildAndPushDockerJavaContainer
WARNING: `gcloud docker` will not be supported for Docker client versions above 18.03.

As an alternative, use `gcloud auth configure-docker` to configure `docker` to
use `gcloud` as a credential helper, then use `docker` as you would for non-GCR
registries, e.g. `docker pull gcr.io/project-id/my-image`. Add
`--verbosity=error` to silence this warning: `gcloud docker
--verbosity=error -- pull gcr.io/project-id/my-image`.

See: https://cloud.google.com/container-registry/docs/support/deprecation-notices#gcloud-docker

The push refers to repository [us.gcr.io/apache-beam-testing/java-postcommit-it/java]
4ff4f1e47e18: Preparing
5f70bf18a086: Preparing
e13694de1875: Preparing
53010a142f10: Preparing
489ee1fc49dd: Preparing
5f9508d26681: Preparing
f9f63b44e8c9: Preparing
86f5424d8685: Preparing
7b9a4d99e8e8: Preparing
17587ddc8551: Preparing
3b472ebab961: Preparing
be9407a68d88: Preparing
736f967d7960: Preparing
f3326297cea1: Preparing
7bd82c67cec9: Preparing
0f307a930110: Preparing
058031b79041: Preparing
533af4d05d89: Preparing
d09fdd9ad3ef: Preparing
04d1dcab20cb: Preparing
b93c1bd012ab: Preparing
7b9a4d99e8e8: Waiting
5f9508d26681: Waiting
17587ddc8551: Waiting
058031b79041: Waiting
f9f63b44e8c9: Waiting
86f5424d8685: Waiting
533af4d05d89: Waiting
d09fdd9ad3ef: Waiting
3b472ebab961: Waiting
b93c1bd012ab: Waiting
0f307a930110: Waiting
04d1dcab20cb: Waiting
be9407a68d88: Waiting
7bd82c67cec9: Waiting
f3326297cea1: Waiting
736f967d7960: Waiting
5f70bf18a086: Layer already exists
53010a142f10: Pushed
5f9508d26681: Pushed
489ee1fc49dd: Pushed
e13694de1875: Pushed
4ff4f1e47e18: Pushed
86f5424d8685: Pushed
7b9a4d99e8e8: Pushed
f9f63b44e8c9: Pushed
3b472ebab961: Pushed
17587ddc8551: Pushed
736f967d7960: Pushed
be9407a68d88: Pushed
533af4d05d89: Layer already exists
d09fdd9ad3ef: Layer already exists
04d1dcab20cb: Layer already exists
b93c1bd012ab: Layer already exists
7bd82c67cec9: Pushed
f3326297cea1: Pushed
0f307a930110: Pushed
058031b79041: Pushed
20230331215728: digest: sha256:31b5d54860df2e50170cd365f92b85b16a99b15c78a21b4a00d60bdf2f056da5 size: 4710

> Task :runners:google-cloud-dataflow-java:coreSDKJavaRunnerV2IntegrationTest NO-SOURCE
> Task :runners:google-cloud-dataflow-java:examplesJavaRunnerV2IntegrationTest

***********************************************************
***********************************************************
**********************Set Up Pubsub************************
The Pub/Sub topic has been set up for this example: projects/apache-beam-testing/topics/testpipeline-jenkins-0331215818-f01e9a00
The Pub/Sub subscription has been set up for this example: projects/apache-beam-testing/subscriptions/testpipeline-jenkins-0331215818-f01e9a00
*************************Tear Down*************************
The Pub/Sub topic has been deleted: projects/apache-beam-testing/topics/testpipeline-jenkins-0331215818-f01e9a00
The Pub/Sub subscription has been deleted: projects/apache-beam-testing/subscriptions/testpipeline-jenkins-0331215818-f01e9a00
***********************************************************
***********************************************************

***********************************************************
***********************************************************
**********************Set Up Pubsub************************
The Pub/Sub topic has been set up for this example: projects/apache-beam-testing/topics/testpipeline-jenkins-0331215818-fadb61d6
The Pub/Sub subscription has been set up for this example: projects/apache-beam-testing/subscriptions/testpipeline-jenkins-0331215818-fadb61d6
*************************Tear Down*************************
The Pub/Sub topic has been deleted: projects/apache-beam-testing/topics/testpipeline-jenkins-0331215818-fadb61d6
The Pub/Sub subscription has been deleted: projects/apache-beam-testing/subscriptions/testpipeline-jenkins-0331215818-fadb61d6
***********************************************************
***********************************************************

> Task :runners:google-cloud-dataflow-java:googleCloudPlatformRunnerV2IntegrationTest

org.apache.beam.sdk.io.gcp.bigquery.BigQueryIOStorageWriteIT > testBigQueryStorageWrite30MProtoALO FAILED
    java.lang.RuntimeException at BigQueryIOStorageWriteIT.java:114

org.apache.beam.sdk.io.gcp.firestore.it.FirestoreV1IT > batchWrite_partialFailureOutputsToDeadLetterQueue FAILED
    java.util.concurrent.ExecutionException at FirestoreV1IT.java:96
        Caused by: com.google.api.gax.rpc.InvalidArgumentException at ApiExceptionFactory.java:92
            Caused by: io.grpc.StatusRuntimeException at Status.java:539

org.apache.beam.sdk.io.gcp.firestore.it.FirestoreV1IT > batchGet FAILED
    java.util.concurrent.ExecutionException at AbstractFuture.java:588
        Caused by: com.google.api.gax.rpc.InvalidArgumentException at ApiExceptionFactory.java:92
            Caused by: io.grpc.StatusRuntimeException at Status.java:539

org.apache.beam.sdk.io.gcp.firestore.it.FirestoreV1IT > partitionQuery FAILED
    java.util.concurrent.ExecutionException at AbstractFuture.java:588
        Caused by: com.google.api.gax.rpc.InvalidArgumentException at ApiExceptionFactory.java:92
            Caused by: io.grpc.StatusRuntimeException at Status.java:539

org.apache.beam.sdk.io.gcp.firestore.it.FirestoreV1IT > listCollections FAILED
    java.util.concurrent.ExecutionException at AbstractFuture.java:588
        Caused by: com.google.api.gax.rpc.InvalidArgumentException at ApiExceptionFactory.java:92
            Caused by: io.grpc.StatusRuntimeException at Status.java:539

org.apache.beam.sdk.io.gcp.firestore.it.FirestoreV1IT > write FAILED
    java.lang.RuntimeException at TestDataflowRunner.java:141

org.apache.beam.sdk.io.gcp.firestore.it.FirestoreV1IT > listDocuments FAILED
    java.util.concurrent.ExecutionException at AbstractFuture.java:588
        Caused by: com.google.api.gax.rpc.InvalidArgumentException at ApiExceptionFactory.java:92
            Caused by: io.grpc.StatusRuntimeException at Status.java:539

org.apache.beam.sdk.io.gcp.firestore.it.FirestoreV1IT > runQuery FAILED
    java.util.concurrent.ExecutionException at AbstractFuture.java:588
        Caused by: com.google.api.gax.rpc.InvalidArgumentException at ApiExceptionFactory.java:92
            Caused by: io.grpc.StatusRuntimeException at Status.java:539

93 tests completed, 8 failed, 2 skipped

> Task :runners:google-cloud-dataflow-java:googleCloudPlatformRunnerV2IntegrationTest FAILED

> Task :runners:google-cloud-dataflow-java:cleanUpDockerJavaImages
Untagged: us.gcr.io/apache-beam-testing/java-postcommit-it/java:20230331215728
Untagged: us.gcr.io/apache-beam-testing/java-postcommit-it/java@sha256:31b5d54860df2e50170cd365f92b85b16a99b15c78a21b4a00d60bdf2f056da5
Deleted: sha256:5a581f0167c227f1dddfa88bd42049b0a026bc919d07efec87f41f9b92a6560b
WARNING: Successfully resolved tag to sha256, but it is recommended to use sha256 directly.
Tag: [us.gcr.io/apache-beam-testing/java-postcommit-it/java:20230331215728]
- referencing digest: [us.gcr.io/apache-beam-testing/java-postcommit-it/java@sha256:31b5d54860df2e50170cd365f92b85b16a99b15c78a21b4a00d60bdf2f056da5]

Deleted [[us.gcr.io/apache-beam-testing/java-postcommit-it/java:20230331215728] (referencing [us.gcr.io/apache-beam-testing/java-postcommit-it/java@sha256:31b5d54860df2e50170cd365f92b85b16a99b15c78a21b4a00d60bdf2f056da5])].
Removing untagged image us.gcr.io/apache-beam-testing/java-postcommit-it/java@sha256:31b5d54860df2e50170cd365f92b85b16a99b15c78a21b4a00d60bdf2f056da5
Digests:
- us.gcr.io/apache-beam-testing/java-postcommit-it/java@sha256:31b5d54860df2e50170cd365f92b85b16a99b15c78a21b4a00d60bdf2f056da5
Deleted [us.gcr.io/apache-beam-testing/java-postcommit-it/java@sha256:31b5d54860df2e50170cd365f92b85b16a99b15c78a21b4a00d60bdf2f056da5].

FAILURE: Build failed with an exception.

* What went wrong:
Execution failed for task ':runners:google-cloud-dataflow-java:googleCloudPlatformRunnerV2IntegrationTest'.
> There were failing tests. See the report at: file://<https://ci-beam.apache.org/job/beam_PostCommit_Java_DataflowV2/ws/src/runners/google-cloud-dataflow-java/build/reports/tests/googleCloudPlatformRunnerV2IntegrationTest/index.html>

* Try:
> Run with --stacktrace option to get the stack trace.
> Run with --info or --debug option to get more log output.

* Get more help at https://help.gradle.org

Deprecated Gradle features were used in this build, making it incompatible with Gradle 8.0.

You can use '--warning-mode all' to show the individual deprecation warnings and determine if they come from your own scripts or plugins.

See https://docs.gradle.org/7.5.1/userguide/command_line_interface.html#sec:command_line_warnings

Execution optimizations have been disabled for 1 invalid unit(s) of work during this build to ensure correctness.
Please consult deprecation warnings for more details.

BUILD FAILED in 2h 53m 42s
152 actionable tasks: 98 executed, 50 from cache, 4 up-to-date

Publishing build scan...
https://gradle.com/s/w64eahyxpvoka

Build step 'Invoke Gradle script' changed build result to FAILURE
Build step 'Invoke Gradle script' marked build as failure

---------------------------------------------------------------------
To unsubscribe, e-mail: builds-unsubscribe@beam.apache.org
For additional commands, e-mail: builds-help@beam.apache.org


Jenkins build is back to normal : beam_PostCommit_Java_DataflowV2 #2881

Posted by Apache Jenkins Server <je...@builds.apache.org>.
See <https://ci-beam.apache.org/job/beam_PostCommit_Java_DataflowV2/2881/display/redirect>


---------------------------------------------------------------------
To unsubscribe, e-mail: builds-unsubscribe@beam.apache.org
For additional commands, e-mail: builds-help@beam.apache.org


Build failed in Jenkins: beam_PostCommit_Java_DataflowV2 #2880

Posted by Apache Jenkins Server <je...@builds.apache.org>.
See <https://ci-beam.apache.org/job/beam_PostCommit_Java_DataflowV2/2880/display/redirect?page=changes>

Changes:

[noreply] [#26061][Go SDK] Return server error on stream close for artifact


------------------------------------------
[...truncated 62.80 KB...]
> Task :sdks:java:container:java8:copySdkHarnessLauncher
Execution optimizations have been disabled for task ':sdks:java:container:java8:copySdkHarnessLauncher' to ensure correctness due to the following reasons:
  - Gradle detected a problem with the following location: '<https://ci-beam.apache.org/job/beam_PostCommit_Java_DataflowV2/ws/src/sdks/java/container/build/target'.> Reason: Task ':sdks:java:container:java8:copySdkHarnessLauncher' uses this output of task ':sdks:java:container:downloadCloudProfilerAgent' without declaring an explicit or implicit dependency. This can lead to incorrect results being produced, depending on what order the tasks are executed. Please refer to https://docs.gradle.org/7.5.1/userguide/validation_problems.html#implicit_dependency for more details about this problem.
  - Gradle detected a problem with the following location: '<https://ci-beam.apache.org/job/beam_PostCommit_Java_DataflowV2/ws/src/sdks/java/container/build/target'.> Reason: Task ':sdks:java:container:java8:copySdkHarnessLauncher' uses this output of task ':sdks:java:container:pullLicenses' without declaring an explicit or implicit dependency. This can lead to incorrect results being produced, depending on what order the tasks are executed. Please refer to https://docs.gradle.org/7.5.1/userguide/validation_problems.html#implicit_dependency for more details about this problem.

> Task :release:go-licenses:java:dockerRun
W0404 15:58:13.700669      78 library.go:101] "golang.org/x/sys/unix" contains non-Go code that can't be inspected for further dependencies:
/go/pkg/mod/golang.org/x/sys@v0.5.0/unix/asm_linux_amd64.s
github.com/apache/beam/sdks/v2/go/pkg/beam,https://github.com/apache/beam/blob/sdks/v2.46.0/sdks/go/README.md,Apache-2.0
github.com/apache/beam/sdks/v2/java/container,https://github.com/apache/beam/blob/sdks/v2.46.0/sdks/LICENSE,Apache-2.0
github.com/golang/protobuf,https://github.com/golang/protobuf/blob/v1.5.2/LICENSE,BSD-3-Clause
golang.org/x/net,https://cs.opensource.google/go/x/net/+/v0.5.0:LICENSE,BSD-3-Clause
golang.org/x/sys/unix,https://cs.opensource.google/go/x/sys/+/v0.5.0:LICENSE,BSD-3-Clause
golang.org/x/text,https://cs.opensource.google/go/x/text/+/v0.7.0:LICENSE,BSD-3-Clause
google.golang.org/genproto/googleapis/rpc/status,https://github.com/googleapis/go-genproto/blob/76db0878b65f/LICENSE,Apache-2.0
google.golang.org/grpc,https://github.com/grpc/grpc-go/blob/v1.52.3/LICENSE,Apache-2.0
google.golang.org/protobuf,https://github.com/protocolbuffers/protobuf-go/blob/v1.28.1/LICENSE,BSD-3-Clause
+ chmod -R a+w /output/licenses

> Task :release:go-licenses:java:createLicenses
> Task :sdks:java:container:java8:copyGolangLicenses
> Task :sdks:java:container:java8:dockerPrepare

> Task :sdks:java:container:java8:docker
#1 [internal] load build definition from Dockerfile
#1 transferring dockerfile: 2.85kB done
#1 DONE 0.0s

#2 [internal] load .dockerignore
#2 transferring context: 2B done
#2 DONE 0.0s

#3 [internal] load metadata for docker.io/library/eclipse-temurin:8
#3 DONE 0.3s

#4 [ 1/18] FROM docker.io/library/eclipse-temurin:8@sha256:005d3189b2ec1612c3ade6eadabd1935c312f03aa7905cf0528e9d71980ad512
#4 resolve docker.io/library/eclipse-temurin:8@sha256:005d3189b2ec1612c3ade6eadabd1935c312f03aa7905cf0528e9d71980ad512 0.0s done
#4 CACHED

#5 [internal] load build context
#5 transferring context: 46.73MB 0.5s done
#5 DONE 0.5s

#6 [ 2/18] ADD target/slf4j-api.jar /opt/apache/beam/jars/
#6 DONE 4.6s

#7 [ 3/18] ADD target/slf4j-jdk14.jar /opt/apache/beam/jars/
#7 DONE 0.1s

#8 [ 4/18] ADD target/jcl-over-slf4j.jar /opt/apache/beam/jars/
#8 DONE 0.1s

#9 [ 5/18] ADD target/log4j-over-slf4j.jar /opt/apache/beam/jars/
#9 DONE 0.0s

#10 [ 6/18] ADD target/log4j-to-slf4j.jar /opt/apache/beam/jars/
#10 DONE 0.1s

#11 [ 7/18] ADD target/beam-sdks-java-harness.jar /opt/apache/beam/jars/
#11 DONE 0.1s

#12 [ 8/18] COPY target/jamm.jar target/open-module-agent*.jar /opt/apache/beam/jars/
#12 DONE 0.1s

#13 [ 9/18] COPY target/linux_amd64/boot /opt/apache/beam/
#13 DONE 0.2s

#14 [10/18] COPY target/LICENSE /opt/apache/beam/
#14 DONE 0.1s

#15 [11/18] COPY target/NOTICE /opt/apache/beam/
#15 DONE 0.1s

#16 [12/18] ADD target/third_party_licenses /opt/apache/beam/third_party_licenses/
#16 DONE 0.3s

#17 [13/18] COPY target/LICENSE target/options/* /opt/apache/beam/options/
#17 DONE 0.1s

#18 [14/18] RUN rm /opt/apache/beam/options/LICENSE
#18 DONE 0.4s

#19 [15/18] COPY target/LICENSE target/go-licenses/* /opt/apache/beam/third_party_licenses/golang/
#19 DONE 0.1s

#20 [16/18] RUN rm /opt/apache/beam/third_party_licenses/golang/LICENSE
#20 DONE 0.5s

#21 [17/18] RUN if [ "true" = "false" ] ; then     rm -rf /opt/apache/beam/third_party_licenses ;    fi
#21 DONE 1.1s

#22 [18/18] COPY target/profiler/* /opt/google_cloud_profiler/
#22 DONE 0.2s

#23 exporting to image
#23 exporting layers
#23 exporting layers 0.3s done
#23 writing image sha256:1f6392c759953d7e3880cdb61bbf71ac410adbb3657ae8ffba1a1069428e0abb done
#23 naming to docker.io/apache/beam_java8_sdk:2.47.0.dev done
#23 DONE 0.3s

> Task :runners:google-cloud-dataflow-java:buildAndPushDockerJavaContainer
WARNING: `gcloud docker` will not be supported for Docker client versions above 18.03.

As an alternative, use `gcloud auth configure-docker` to configure `docker` to
use `gcloud` as a credential helper, then use `docker` as you would for non-GCR
registries, e.g. `docker pull gcr.io/project-id/my-image`. Add
`--verbosity=error` to silence this warning: `gcloud docker
--verbosity=error -- pull gcr.io/project-id/my-image`.

See: https://cloud.google.com/container-registry/docs/support/deprecation-notices#gcloud-docker

The push refers to repository [us.gcr.io/apache-beam-testing/java-postcommit-it/java]
7207a0658359: Preparing
5f70bf18a086: Preparing
8ccb214a2866: Preparing
04fb8b818b56: Preparing
e1df9e9ce384: Preparing
81e8d95d1dfe: Preparing
7f7715589336: Preparing
e1b255483794: Preparing
77bed0c1e2c4: Preparing
d5b5c166f1ff: Preparing
e6207b6b59d9: Preparing
b3a6aa8234fe: Preparing
a772b364e93b: Preparing
fd9369ec3c9c: Preparing
16e2732448d1: Preparing
2a5473f217d9: Preparing
9afb3a000a04: Preparing
533af4d05d89: Preparing
d09fdd9ad3ef: Preparing
04d1dcab20cb: Preparing
b93c1bd012ab: Preparing
77bed0c1e2c4: Waiting
2a5473f217d9: Waiting
d5b5c166f1ff: Waiting
9afb3a000a04: Waiting
e6207b6b59d9: Waiting
533af4d05d89: Waiting
b3a6aa8234fe: Waiting
d09fdd9ad3ef: Waiting
a772b364e93b: Waiting
04d1dcab20cb: Waiting
16e2732448d1: Waiting
b93c1bd012ab: Waiting
fd9369ec3c9c: Waiting
7f7715589336: Waiting
e1b255483794: Waiting
5f70bf18a086: Layer already exists
04fb8b818b56: Pushed
8ccb214a2866: Pushed
81e8d95d1dfe: Pushed
e1df9e9ce384: Pushed
7207a0658359: Pushed
77bed0c1e2c4: Pushed
e1b255483794: Pushed
e6207b6b59d9: Pushed
d5b5c166f1ff: Pushed
7f7715589336: Pushed
a772b364e93b: Pushed
b3a6aa8234fe: Pushed
533af4d05d89: Layer already exists
d09fdd9ad3ef: Layer already exists
04d1dcab20cb: Layer already exists
b93c1bd012ab: Layer already exists
16e2732448d1: Pushed
fd9369ec3c9c: Pushed
2a5473f217d9: Pushed
9afb3a000a04: Pushed
20230404155744: digest: sha256:fa1a3be2078bcd7c89143efd0d4320641d4bd1ef40acb40e0cf78d6e7a1889ec size: 4710

> Task :runners:google-cloud-dataflow-java:coreSDKJavaRunnerV2IntegrationTest NO-SOURCE
> Task :runners:google-cloud-dataflow-java:examplesJavaRunnerV2IntegrationTest

***********************************************************
***********************************************************
**********************Set Up Pubsub************************
The Pub/Sub topic has been set up for this example: projects/apache-beam-testing/topics/testpipeline-jenkins-0404155901-2a5497a6
The Pub/Sub subscription has been set up for this example: projects/apache-beam-testing/subscriptions/testpipeline-jenkins-0404155901-2a5497a6
*************************Tear Down*************************
The Pub/Sub topic has been deleted: projects/apache-beam-testing/topics/testpipeline-jenkins-0404155901-2a5497a6
The Pub/Sub subscription has been deleted: projects/apache-beam-testing/subscriptions/testpipeline-jenkins-0404155901-2a5497a6
***********************************************************
***********************************************************

***********************************************************
***********************************************************
**********************Set Up Pubsub************************
The Pub/Sub topic has been set up for this example: projects/apache-beam-testing/topics/testpipeline-jenkins-0404155901-6e7819d8
The Pub/Sub subscription has been set up for this example: projects/apache-beam-testing/subscriptions/testpipeline-jenkins-0404155901-6e7819d8
*************************Tear Down*************************
The Pub/Sub topic has been deleted: projects/apache-beam-testing/topics/testpipeline-jenkins-0404155901-6e7819d8
The Pub/Sub subscription has been deleted: projects/apache-beam-testing/subscriptions/testpipeline-jenkins-0404155901-6e7819d8
***********************************************************
***********************************************************

> Task :runners:google-cloud-dataflow-java:googleCloudPlatformRunnerV2IntegrationTest

org.apache.beam.sdk.io.gcp.bigquery.BigQueryIOStorageWriteIT > testBigQueryStorageWrite30MProtoALO FAILED
    java.lang.RuntimeException at BigQueryIOStorageWriteIT.java:114

86 tests completed, 1 failed, 2 skipped

> Task :runners:google-cloud-dataflow-java:googleCloudPlatformRunnerV2IntegrationTest FAILED

> Task :runners:google-cloud-dataflow-java:cleanUpDockerJavaImages
Untagged: us.gcr.io/apache-beam-testing/java-postcommit-it/java:20230404155744
Untagged: us.gcr.io/apache-beam-testing/java-postcommit-it/java@sha256:fa1a3be2078bcd7c89143efd0d4320641d4bd1ef40acb40e0cf78d6e7a1889ec
Deleted: sha256:1f6392c759953d7e3880cdb61bbf71ac410adbb3657ae8ffba1a1069428e0abb
WARNING: Successfully resolved tag to sha256, but it is recommended to use sha256 directly.
Tag: [us.gcr.io/apache-beam-testing/java-postcommit-it/java:20230404155744]
- referencing digest: [us.gcr.io/apache-beam-testing/java-postcommit-it/java@sha256:fa1a3be2078bcd7c89143efd0d4320641d4bd1ef40acb40e0cf78d6e7a1889ec]

Deleted [[us.gcr.io/apache-beam-testing/java-postcommit-it/java:20230404155744] (referencing [us.gcr.io/apache-beam-testing/java-postcommit-it/java@sha256:fa1a3be2078bcd7c89143efd0d4320641d4bd1ef40acb40e0cf78d6e7a1889ec])].
Removing untagged image us.gcr.io/apache-beam-testing/java-postcommit-it/java@sha256:fa1a3be2078bcd7c89143efd0d4320641d4bd1ef40acb40e0cf78d6e7a1889ec
Digests:
- us.gcr.io/apache-beam-testing/java-postcommit-it/java@sha256:fa1a3be2078bcd7c89143efd0d4320641d4bd1ef40acb40e0cf78d6e7a1889ec
Deleted [us.gcr.io/apache-beam-testing/java-postcommit-it/java@sha256:fa1a3be2078bcd7c89143efd0d4320641d4bd1ef40acb40e0cf78d6e7a1889ec].

FAILURE: Build failed with an exception.

* What went wrong:
Execution failed for task ':runners:google-cloud-dataflow-java:googleCloudPlatformRunnerV2IntegrationTest'.
> There were failing tests. See the report at: file://<https://ci-beam.apache.org/job/beam_PostCommit_Java_DataflowV2/ws/src/runners/google-cloud-dataflow-java/build/reports/tests/googleCloudPlatformRunnerV2IntegrationTest/index.html>

* Try:
> Run with --stacktrace option to get the stack trace.
> Run with --info or --debug option to get more log output.

* Get more help at https://help.gradle.org

Deprecated Gradle features were used in this build, making it incompatible with Gradle 8.0.

You can use '--warning-mode all' to show the individual deprecation warnings and determine if they come from your own scripts or plugins.

See https://docs.gradle.org/7.5.1/userguide/command_line_interface.html#sec:command_line_warnings

Execution optimizations have been disabled for 1 invalid unit(s) of work during this build to ensure correctness.
Please consult deprecation warnings for more details.

BUILD FAILED in 3h 24m 17s
152 actionable tasks: 98 executed, 50 from cache, 4 up-to-date

Publishing build scan...
https://gradle.com/s/l2n4jyjb3d5ui

Build step 'Invoke Gradle script' changed build result to FAILURE
Build step 'Invoke Gradle script' marked build as failure

---------------------------------------------------------------------
To unsubscribe, e-mail: builds-unsubscribe@beam.apache.org
For additional commands, e-mail: builds-help@beam.apache.org


Build failed in Jenkins: beam_PostCommit_Java_DataflowV2 #2879

Posted by Apache Jenkins Server <je...@builds.apache.org>.
See <https://ci-beam.apache.org/job/beam_PostCommit_Java_DataflowV2/2879/display/redirect>

Changes:


------------------------------------------
[...truncated 64.44 KB...]
go: added google.golang.org/protobuf v1.28.1
+ go-licenses save github.com/apache/beam/sdks/v2/java/container --save_path=/output/licenses
W0404 09:58:11.799487      39 library.go:101] "golang.org/x/sys/unix" contains non-Go code that can't be inspected for further dependencies:
/go/pkg/mod/golang.org/x/sys@v0.5.0/unix/asm_linux_amd64.s
+ go-licenses csv github.com/apache/beam/sdks/v2/java/container
+ tee /output/licenses/list.csv
W0404 09:58:15.839948      84 library.go:101] "golang.org/x/sys/unix" contains non-Go code that can't be inspected for further dependencies:
/go/pkg/mod/golang.org/x/sys@v0.5.0/unix/asm_linux_amd64.s
github.com/apache/beam/sdks/v2/go/pkg/beam,https://github.com/apache/beam/blob/sdks/v2.46.0/sdks/go/README.md,Apache-2.0
github.com/apache/beam/sdks/v2/java/container,https://github.com/apache/beam/blob/sdks/v2.46.0/sdks/LICENSE,Apache-2.0
github.com/golang/protobuf,https://github.com/golang/protobuf/blob/v1.5.2/LICENSE,BSD-3-Clause
golang.org/x/net,https://cs.opensource.google/go/x/net/+/v0.5.0:LICENSE,BSD-3-Clause
golang.org/x/sys/unix,https://cs.opensource.google/go/x/sys/+/v0.5.0:LICENSE,BSD-3-Clause
golang.org/x/text,https://cs.opensource.google/go/x/text/+/v0.7.0:LICENSE,BSD-3-Clause
google.golang.org/genproto/googleapis/rpc/status,https://github.com/googleapis/go-genproto/blob/76db0878b65f/LICENSE,Apache-2.0
google.golang.org/grpc,https://github.com/grpc/grpc-go/blob/v1.52.3/LICENSE,Apache-2.0
google.golang.org/protobuf,https://github.com/protocolbuffers/protobuf-go/blob/v1.28.1/LICENSE,BSD-3-Clause
+ chmod -R a+w /output/licenses

> Task :release:go-licenses:java:createLicenses
> Task :sdks:java:container:java8:copyGolangLicenses
> Task :sdks:java:container:java8:dockerPrepare

> Task :sdks:java:container:java8:docker
#1 [internal] load build definition from Dockerfile
#1 transferring dockerfile: 2.85kB done
#1 DONE 0.0s

#2 [internal] load .dockerignore
#2 transferring context: 2B done
#2 DONE 0.0s

#3 [internal] load metadata for docker.io/library/eclipse-temurin:8
#3 DONE 0.3s

#4 [ 1/18] FROM docker.io/library/eclipse-temurin:8@sha256:005d3189b2ec1612c3ade6eadabd1935c312f03aa7905cf0528e9d71980ad512
#4 resolve docker.io/library/eclipse-temurin:8@sha256:005d3189b2ec1612c3ade6eadabd1935c312f03aa7905cf0528e9d71980ad512 0.0s done
#4 CACHED

#5 [internal] load build context
#5 transferring context: 46.73MB 0.3s done
#5 DONE 0.4s

#6 [ 2/18] ADD target/slf4j-api.jar /opt/apache/beam/jars/
#6 DONE 1.0s

#7 [ 3/18] ADD target/slf4j-jdk14.jar /opt/apache/beam/jars/
#7 DONE 0.1s

#8 [ 4/18] ADD target/jcl-over-slf4j.jar /opt/apache/beam/jars/
#8 DONE 0.1s

#9 [ 5/18] ADD target/log4j-over-slf4j.jar /opt/apache/beam/jars/
#9 DONE 0.1s

#10 [ 6/18] ADD target/log4j-to-slf4j.jar /opt/apache/beam/jars/
#10 DONE 0.1s

#11 [ 7/18] ADD target/beam-sdks-java-harness.jar /opt/apache/beam/jars/
#11 DONE 0.1s

#12 [ 8/18] COPY target/jamm.jar target/open-module-agent*.jar /opt/apache/beam/jars/
#12 DONE 0.1s

#13 [ 9/18] COPY target/linux_amd64/boot /opt/apache/beam/
#13 DONE 0.2s

#14 [10/18] COPY target/LICENSE /opt/apache/beam/
#14 DONE 0.1s

#15 [11/18] COPY target/NOTICE /opt/apache/beam/
#15 DONE 0.1s

#16 [12/18] ADD target/third_party_licenses /opt/apache/beam/third_party_licenses/
#16 DONE 0.2s

#17 [13/18] COPY target/LICENSE target/options/* /opt/apache/beam/options/
#17 DONE 0.1s

#18 [14/18] RUN rm /opt/apache/beam/options/LICENSE
#18 DONE 0.3s

#19 [15/18] COPY target/LICENSE target/go-licenses/* /opt/apache/beam/third_party_licenses/golang/
#19 DONE 0.0s

#20 [16/18] RUN rm /opt/apache/beam/third_party_licenses/golang/LICENSE
#20 DONE 0.4s

#21 [17/18] RUN if [ "true" = "false" ] ; then     rm -rf /opt/apache/beam/third_party_licenses ;    fi
#21 DONE 0.4s

#22 [18/18] COPY target/profiler/* /opt/google_cloud_profiler/
#22 DONE 0.1s

#23 exporting to image
#23 exporting layers
#23 exporting layers 0.3s done
#23 writing image sha256:97640463cadcc19f09c8f1656bf6b2d925e327bb8f800e01477d9103aa7db13f done
#23 naming to docker.io/apache/beam_java8_sdk:2.47.0.dev done
#23 DONE 0.3s

> Task :runners:google-cloud-dataflow-java:buildAndPushDockerJavaContainer
WARNING: `gcloud docker` will not be supported for Docker client versions above 18.03.

As an alternative, use `gcloud auth configure-docker` to configure `docker` to
use `gcloud` as a credential helper, then use `docker` as you would for non-GCR
registries, e.g. `docker pull gcr.io/project-id/my-image`. Add
`--verbosity=error` to silence this warning: `gcloud docker
--verbosity=error -- pull gcr.io/project-id/my-image`.

See: https://cloud.google.com/container-registry/docs/support/deprecation-notices#gcloud-docker

The push refers to repository [us.gcr.io/apache-beam-testing/java-postcommit-it/java]
f56e73638e78: Preparing
5f70bf18a086: Preparing
2d94d67d05c5: Preparing
d83bc0755244: Preparing
971306a334ed: Preparing
8f72b3af633f: Preparing
a6c6b94b92c6: Preparing
63a7fea6e530: Preparing
a7da8104cfa2: Preparing
c08ca20d0803: Preparing
43ff8d84a18c: Preparing
d024e14c5221: Preparing
517183ab698d: Preparing
1c258e2dce12: Preparing
63a7fea6e530: Waiting
8f72b3af633f: Waiting
86dbd6064310: Preparing
1a08cbc15c92: Preparing
a6c6b94b92c6: Waiting
4ee10f503cf6: Preparing
a7da8104cfa2: Waiting
533af4d05d89: Preparing
c08ca20d0803: Waiting
d09fdd9ad3ef: Preparing
04d1dcab20cb: Preparing
b93c1bd012ab: Preparing
d024e14c5221: Waiting
517183ab698d: Waiting
43ff8d84a18c: Waiting
86dbd6064310: Waiting
1a08cbc15c92: Waiting
4ee10f503cf6: Waiting
04d1dcab20cb: Waiting
533af4d05d89: Waiting
b93c1bd012ab: Waiting
d09fdd9ad3ef: Waiting
5f70bf18a086: Layer already exists
2d94d67d05c5: Pushed
d83bc0755244: Pushed
971306a334ed: Pushed
8f72b3af633f: Pushed
f56e73638e78: Pushed
a7da8104cfa2: Pushed
63a7fea6e530: Pushed
43ff8d84a18c: Pushed
a6c6b94b92c6: Pushed
c08ca20d0803: Pushed
517183ab698d: Pushed
d024e14c5221: Pushed
533af4d05d89: Layer already exists
d09fdd9ad3ef: Layer already exists
04d1dcab20cb: Layer already exists
b93c1bd012ab: Layer already exists
1c258e2dce12: Pushed
86dbd6064310: Pushed
1a08cbc15c92: Pushed
4ee10f503cf6: Pushed
20230404095742: digest: sha256:66e473e184dbb41a78478a881e7aed7302c1bfd6e2535c7c8e414c00cb9187a1 size: 4710

> Task :runners:google-cloud-dataflow-java:coreSDKJavaRunnerV2IntegrationTest NO-SOURCE
> Task :runners:google-cloud-dataflow-java:examplesJavaRunnerV2IntegrationTest

***********************************************************
***********************************************************
**********************Set Up Pubsub************************
The Pub/Sub topic has been set up for this example: projects/apache-beam-testing/topics/testpipeline-jenkins-0404095844-32a8666e
The Pub/Sub subscription has been set up for this example: projects/apache-beam-testing/subscriptions/testpipeline-jenkins-0404095844-32a8666e
*************************Tear Down*************************
The Pub/Sub topic has been deleted: projects/apache-beam-testing/topics/testpipeline-jenkins-0404095844-32a8666e
The Pub/Sub subscription has been deleted: projects/apache-beam-testing/subscriptions/testpipeline-jenkins-0404095844-32a8666e
***********************************************************
***********************************************************

***********************************************************
***********************************************************
**********************Set Up Pubsub************************
The Pub/Sub topic has been set up for this example: projects/apache-beam-testing/topics/testpipeline-jenkins-0404095844-e3755f6e
The Pub/Sub subscription has been set up for this example: projects/apache-beam-testing/subscriptions/testpipeline-jenkins-0404095844-e3755f6e
*************************Tear Down*************************
The Pub/Sub topic has been deleted: projects/apache-beam-testing/topics/testpipeline-jenkins-0404095844-e3755f6e
The Pub/Sub subscription has been deleted: projects/apache-beam-testing/subscriptions/testpipeline-jenkins-0404095844-e3755f6e
***********************************************************
***********************************************************

> Task :runners:google-cloud-dataflow-java:googleCloudPlatformRunnerV2IntegrationTest

org.apache.beam.sdk.io.gcp.bigquery.BigQueryIOStorageWriteIT > testBigQueryStorageWrite30MProtoALO FAILED
    java.lang.RuntimeException at BigQueryIOStorageWriteIT.java:114

86 tests completed, 1 failed, 2 skipped

> Task :runners:google-cloud-dataflow-java:googleCloudPlatformRunnerV2IntegrationTest FAILED

> Task :runners:google-cloud-dataflow-java:cleanUpDockerJavaImages
Untagged: us.gcr.io/apache-beam-testing/java-postcommit-it/java:20230404095742
Untagged: us.gcr.io/apache-beam-testing/java-postcommit-it/java@sha256:66e473e184dbb41a78478a881e7aed7302c1bfd6e2535c7c8e414c00cb9187a1
Deleted: sha256:97640463cadcc19f09c8f1656bf6b2d925e327bb8f800e01477d9103aa7db13f
WARNING: Successfully resolved tag to sha256, but it is recommended to use sha256 directly.
Tag: [us.gcr.io/apache-beam-testing/java-postcommit-it/java:20230404095742]
- referencing digest: [us.gcr.io/apache-beam-testing/java-postcommit-it/java@sha256:66e473e184dbb41a78478a881e7aed7302c1bfd6e2535c7c8e414c00cb9187a1]

Deleted [[us.gcr.io/apache-beam-testing/java-postcommit-it/java:20230404095742] (referencing [us.gcr.io/apache-beam-testing/java-postcommit-it/java@sha256:66e473e184dbb41a78478a881e7aed7302c1bfd6e2535c7c8e414c00cb9187a1])].
Removing untagged image us.gcr.io/apache-beam-testing/java-postcommit-it/java@sha256:66e473e184dbb41a78478a881e7aed7302c1bfd6e2535c7c8e414c00cb9187a1
Digests:
- us.gcr.io/apache-beam-testing/java-postcommit-it/java@sha256:66e473e184dbb41a78478a881e7aed7302c1bfd6e2535c7c8e414c00cb9187a1
Deleted [us.gcr.io/apache-beam-testing/java-postcommit-it/java@sha256:66e473e184dbb41a78478a881e7aed7302c1bfd6e2535c7c8e414c00cb9187a1].

FAILURE: Build failed with an exception.

* What went wrong:
Execution failed for task ':runners:google-cloud-dataflow-java:googleCloudPlatformRunnerV2IntegrationTest'.
> There were failing tests. See the report at: file://<https://ci-beam.apache.org/job/beam_PostCommit_Java_DataflowV2/ws/src/runners/google-cloud-dataflow-java/build/reports/tests/googleCloudPlatformRunnerV2IntegrationTest/index.html>

* Try:
> Run with --stacktrace option to get the stack trace.
> Run with --info or --debug option to get more log output.

* Get more help at https://help.gradle.org

Deprecated Gradle features were used in this build, making it incompatible with Gradle 8.0.

You can use '--warning-mode all' to show the individual deprecation warnings and determine if they come from your own scripts or plugins.

See https://docs.gradle.org/7.5.1/userguide/command_line_interface.html#sec:command_line_warnings

Execution optimizations have been disabled for 1 invalid unit(s) of work during this build to ensure correctness.
Please consult deprecation warnings for more details.

BUILD FAILED in 3h 33m 57s
152 actionable tasks: 98 executed, 50 from cache, 4 up-to-date

Publishing build scan...
https://gradle.com/s/shw5nv3csf3fq

Build step 'Invoke Gradle script' changed build result to FAILURE
Build step 'Invoke Gradle script' marked build as failure

---------------------------------------------------------------------
To unsubscribe, e-mail: builds-unsubscribe@beam.apache.org
For additional commands, e-mail: builds-help@beam.apache.org


beam_PostCommit_Java_DataflowV2 - Build # 2878 - Aborted!

Posted by Apache Jenkins Server <je...@builds.apache.org>.
beam_PostCommit_Java_DataflowV2 - Build # 2878 - Aborted:

Check console output at https://ci-beam.apache.org/job/beam_PostCommit_Java_DataflowV2/2878/ to view the results.

Build failed in Jenkins: beam_PostCommit_Java_DataflowV2 #2877

Posted by Apache Jenkins Server <je...@builds.apache.org>.
See <https://ci-beam.apache.org/job/beam_PostCommit_Java_DataflowV2/2877/display/redirect>

Changes:


------------------------------------------
[...truncated 63.32 KB...]
W0403 21:58:03.426775      85 library.go:101] "golang.org/x/sys/unix" contains non-Go code that can't be inspected for further dependencies:
/go/pkg/mod/golang.org/x/sys@v0.5.0/unix/asm_linux_amd64.s

> Task :sdks:java:container:java8:copySdkHarnessLauncher
Execution optimizations have been disabled for task ':sdks:java:container:java8:copySdkHarnessLauncher' to ensure correctness due to the following reasons:
  - Gradle detected a problem with the following location: '<https://ci-beam.apache.org/job/beam_PostCommit_Java_DataflowV2/ws/src/sdks/java/container/build/target'.> Reason: Task ':sdks:java:container:java8:copySdkHarnessLauncher' uses this output of task ':sdks:java:container:downloadCloudProfilerAgent' without declaring an explicit or implicit dependency. This can lead to incorrect results being produced, depending on what order the tasks are executed. Please refer to https://docs.gradle.org/7.5.1/userguide/validation_problems.html#implicit_dependency for more details about this problem.
  - Gradle detected a problem with the following location: '<https://ci-beam.apache.org/job/beam_PostCommit_Java_DataflowV2/ws/src/sdks/java/container/build/target'.> Reason: Task ':sdks:java:container:java8:copySdkHarnessLauncher' uses this output of task ':sdks:java:container:pullLicenses' without declaring an explicit or implicit dependency. This can lead to incorrect results being produced, depending on what order the tasks are executed. Please refer to https://docs.gradle.org/7.5.1/userguide/validation_problems.html#implicit_dependency for more details about this problem.

> Task :release:go-licenses:java:dockerRun
github.com/apache/beam/sdks/v2/go/pkg/beam,https://github.com/apache/beam/blob/sdks/v2.46.0/sdks/go/README.md,Apache-2.0
github.com/apache/beam/sdks/v2/java/container,https://github.com/apache/beam/blob/sdks/v2.46.0/sdks/LICENSE,Apache-2.0
github.com/golang/protobuf,https://github.com/golang/protobuf/blob/v1.5.2/LICENSE,BSD-3-Clause
golang.org/x/net,https://cs.opensource.google/go/x/net/+/v0.5.0:LICENSE,BSD-3-Clause
golang.org/x/sys/unix,https://cs.opensource.google/go/x/sys/+/v0.5.0:LICENSE,BSD-3-Clause
golang.org/x/text,https://cs.opensource.google/go/x/text/+/v0.7.0:LICENSE,BSD-3-Clause
google.golang.org/genproto/googleapis/rpc/status,https://github.com/googleapis/go-genproto/blob/76db0878b65f/LICENSE,Apache-2.0
google.golang.org/grpc,https://github.com/grpc/grpc-go/blob/v1.52.3/LICENSE,Apache-2.0
google.golang.org/protobuf,https://github.com/protocolbuffers/protobuf-go/blob/v1.28.1/LICENSE,BSD-3-Clause
+ chmod -R a+w /output/licenses

> Task :release:go-licenses:java:createLicenses
> Task :sdks:java:container:java8:copyGolangLicenses
> Task :sdks:java:container:java8:dockerPrepare

> Task :sdks:java:container:java8:docker
#1 [internal] load build definition from Dockerfile
#1 transferring dockerfile: 2.85kB done
#1 DONE 0.0s

#2 [internal] load .dockerignore
#2 transferring context: 2B done
#2 DONE 0.1s

#3 [internal] load metadata for docker.io/library/eclipse-temurin:8
#3 DONE 0.3s

#4 [ 1/18] FROM docker.io/library/eclipse-temurin:8@sha256:005d3189b2ec1612c3ade6eadabd1935c312f03aa7905cf0528e9d71980ad512
#4 resolve docker.io/library/eclipse-temurin:8@sha256:005d3189b2ec1612c3ade6eadabd1935c312f03aa7905cf0528e9d71980ad512 0.0s done
#4 CACHED

#5 [internal] load build context
#5 transferring context: 46.73MB 0.3s done
#5 DONE 0.4s

#6 [ 2/18] ADD target/slf4j-api.jar /opt/apache/beam/jars/
#6 DONE 1.1s

#7 [ 3/18] ADD target/slf4j-jdk14.jar /opt/apache/beam/jars/
#7 DONE 0.1s

#8 [ 4/18] ADD target/jcl-over-slf4j.jar /opt/apache/beam/jars/
#8 DONE 0.1s

#9 [ 5/18] ADD target/log4j-over-slf4j.jar /opt/apache/beam/jars/
#9 DONE 0.1s

#10 [ 6/18] ADD target/log4j-to-slf4j.jar /opt/apache/beam/jars/
#10 DONE 0.1s

#11 [ 7/18] ADD target/beam-sdks-java-harness.jar /opt/apache/beam/jars/
#11 DONE 0.1s

#12 [ 8/18] COPY target/jamm.jar target/open-module-agent*.jar /opt/apache/beam/jars/
#12 DONE 0.1s

#13 [ 9/18] COPY target/linux_amd64/boot /opt/apache/beam/
#13 DONE 0.2s

#14 [10/18] COPY target/LICENSE /opt/apache/beam/
#14 DONE 0.1s

#15 [11/18] COPY target/NOTICE /opt/apache/beam/
#15 DONE 0.1s

#16 [12/18] ADD target/third_party_licenses /opt/apache/beam/third_party_licenses/
#16 DONE 0.2s

#17 [13/18] COPY target/LICENSE target/options/* /opt/apache/beam/options/
#17 DONE 0.1s

#18 [14/18] RUN rm /opt/apache/beam/options/LICENSE
#18 DONE 0.4s

#19 [15/18] COPY target/LICENSE target/go-licenses/* /opt/apache/beam/third_party_licenses/golang/
#19 DONE 0.0s

#20 [16/18] RUN rm /opt/apache/beam/third_party_licenses/golang/LICENSE
#20 DONE 0.4s

#21 [17/18] RUN if [ "true" = "false" ] ; then     rm -rf /opt/apache/beam/third_party_licenses ;    fi
#21 DONE 0.4s

#22 [18/18] COPY target/profiler/* /opt/google_cloud_profiler/
#22 DONE 0.1s

#23 exporting to image
#23 exporting layers
#23 exporting layers 0.2s done
#23 writing image sha256:da8c3701938dec016965050865ce6212e6a488c54c9769ccd161705458bb9f21 done
#23 naming to docker.io/apache/beam_java8_sdk:2.47.0.dev done
#23 DONE 0.3s

> Task :runners:google-cloud-dataflow-java:buildAndPushDockerJavaContainer
WARNING: `gcloud docker` will not be supported for Docker client versions above 18.03.

As an alternative, use `gcloud auth configure-docker` to configure `docker` to
use `gcloud` as a credential helper, then use `docker` as you would for non-GCR
registries, e.g. `docker pull gcr.io/project-id/my-image`. Add
`--verbosity=error` to silence this warning: `gcloud docker
--verbosity=error -- pull gcr.io/project-id/my-image`.

See: https://cloud.google.com/container-registry/docs/support/deprecation-notices#gcloud-docker

The push refers to repository [us.gcr.io/apache-beam-testing/java-postcommit-it/java]
d7935e9c12cc: Preparing
5f70bf18a086: Preparing
8933fc509485: Preparing
713764641c06: Preparing
c9c1402296a8: Preparing
abec47cfed6b: Preparing
f47e08a5b1e8: Preparing
6ace64f1ba7d: Preparing
63b8a333aa52: Preparing
f184e7ca1c66: Preparing
cfbe38571339: Preparing
e8eb2e41ff9d: Preparing
463741a25eb9: Preparing
04e7ff278fd8: Preparing
65a5c04a843e: Preparing
649f2d622e5a: Preparing
11b394522050: Preparing
6ace64f1ba7d: Waiting
533af4d05d89: Preparing
d09fdd9ad3ef: Preparing
63b8a333aa52: Waiting
04d1dcab20cb: Preparing
b93c1bd012ab: Preparing
e8eb2e41ff9d: Waiting
cfbe38571339: Waiting
f184e7ca1c66: Waiting
04e7ff278fd8: Waiting
65a5c04a843e: Waiting
463741a25eb9: Waiting
649f2d622e5a: Waiting
abec47cfed6b: Waiting
11b394522050: Waiting
533af4d05d89: Waiting
d09fdd9ad3ef: Waiting
04d1dcab20cb: Waiting
5f70bf18a086: Layer already exists
713764641c06: Pushed
8933fc509485: Pushed
c9c1402296a8: Pushed
abec47cfed6b: Pushed
d7935e9c12cc: Pushed
6ace64f1ba7d: Pushed
63b8a333aa52: Pushed
f47e08a5b1e8: Pushed
cfbe38571339: Pushed
f184e7ca1c66: Pushed
463741a25eb9: Pushed
e8eb2e41ff9d: Pushed
533af4d05d89: Layer already exists
d09fdd9ad3ef: Layer already exists
04d1dcab20cb: Layer already exists
b93c1bd012ab: Layer already exists
04e7ff278fd8: Pushed
65a5c04a843e: Pushed
649f2d622e5a: Pushed
11b394522050: Pushed
20230403215741: digest: sha256:894d6164bf6eede45a4c9eb1b8bcd8c47fc45c9ae73041ddd6433b097be2b4aa size: 4710

> Task :runners:google-cloud-dataflow-java:coreSDKJavaRunnerV2IntegrationTest NO-SOURCE
> Task :runners:google-cloud-dataflow-java:examplesJavaRunnerV2IntegrationTest

***********************************************************
***********************************************************
**********************Set Up Pubsub************************
The Pub/Sub topic has been set up for this example: projects/apache-beam-testing/topics/testpipeline-jenkins-0403215832-5a3c6e18
The Pub/Sub subscription has been set up for this example: projects/apache-beam-testing/subscriptions/testpipeline-jenkins-0403215832-5a3c6e18
*************************Tear Down*************************
The Pub/Sub topic has been deleted: projects/apache-beam-testing/topics/testpipeline-jenkins-0403215832-5a3c6e18
The Pub/Sub subscription has been deleted: projects/apache-beam-testing/subscriptions/testpipeline-jenkins-0403215832-5a3c6e18
***********************************************************
***********************************************************

***********************************************************
***********************************************************
**********************Set Up Pubsub************************
The Pub/Sub topic has been set up for this example: projects/apache-beam-testing/topics/testpipeline-jenkins-0403215833-c171a44a
The Pub/Sub subscription has been set up for this example: projects/apache-beam-testing/subscriptions/testpipeline-jenkins-0403215833-c171a44a
*************************Tear Down*************************
The Pub/Sub topic has been deleted: projects/apache-beam-testing/topics/testpipeline-jenkins-0403215833-c171a44a
The Pub/Sub subscription has been deleted: projects/apache-beam-testing/subscriptions/testpipeline-jenkins-0403215833-c171a44a
***********************************************************
***********************************************************

> Task :runners:google-cloud-dataflow-java:googleCloudPlatformRunnerV2IntegrationTest

org.apache.beam.sdk.io.gcp.bigquery.BigQueryIOStorageWriteIT > testBigQueryStorageWrite30MProtoALO FAILED
    java.lang.RuntimeException at BigQueryIOStorageWriteIT.java:114

86 tests completed, 1 failed, 2 skipped

> Task :runners:google-cloud-dataflow-java:googleCloudPlatformRunnerV2IntegrationTest FAILED

> Task :runners:google-cloud-dataflow-java:cleanUpDockerJavaImages
Untagged: us.gcr.io/apache-beam-testing/java-postcommit-it/java:20230403215741
Untagged: us.gcr.io/apache-beam-testing/java-postcommit-it/java@sha256:894d6164bf6eede45a4c9eb1b8bcd8c47fc45c9ae73041ddd6433b097be2b4aa
Deleted: sha256:da8c3701938dec016965050865ce6212e6a488c54c9769ccd161705458bb9f21
WARNING: Successfully resolved tag to sha256, but it is recommended to use sha256 directly.
Tag: [us.gcr.io/apache-beam-testing/java-postcommit-it/java:20230403215741]
- referencing digest: [us.gcr.io/apache-beam-testing/java-postcommit-it/java@sha256:894d6164bf6eede45a4c9eb1b8bcd8c47fc45c9ae73041ddd6433b097be2b4aa]

Deleted [[us.gcr.io/apache-beam-testing/java-postcommit-it/java:20230403215741] (referencing [us.gcr.io/apache-beam-testing/java-postcommit-it/java@sha256:894d6164bf6eede45a4c9eb1b8bcd8c47fc45c9ae73041ddd6433b097be2b4aa])].
Removing untagged image us.gcr.io/apache-beam-testing/java-postcommit-it/java@sha256:894d6164bf6eede45a4c9eb1b8bcd8c47fc45c9ae73041ddd6433b097be2b4aa
Digests:
- us.gcr.io/apache-beam-testing/java-postcommit-it/java@sha256:894d6164bf6eede45a4c9eb1b8bcd8c47fc45c9ae73041ddd6433b097be2b4aa
Deleted [us.gcr.io/apache-beam-testing/java-postcommit-it/java@sha256:894d6164bf6eede45a4c9eb1b8bcd8c47fc45c9ae73041ddd6433b097be2b4aa].

FAILURE: Build failed with an exception.

* What went wrong:
Execution failed for task ':runners:google-cloud-dataflow-java:googleCloudPlatformRunnerV2IntegrationTest'.
> There were failing tests. See the report at: file://<https://ci-beam.apache.org/job/beam_PostCommit_Java_DataflowV2/ws/src/runners/google-cloud-dataflow-java/build/reports/tests/googleCloudPlatformRunnerV2IntegrationTest/index.html>

* Try:
> Run with --stacktrace option to get the stack trace.
> Run with --info or --debug option to get more log output.

* Get more help at https://help.gradle.org

Deprecated Gradle features were used in this build, making it incompatible with Gradle 8.0.

You can use '--warning-mode all' to show the individual deprecation warnings and determine if they come from your own scripts or plugins.

See https://docs.gradle.org/7.5.1/userguide/command_line_interface.html#sec:command_line_warnings

Execution optimizations have been disabled for 1 invalid unit(s) of work during this build to ensure correctness.
Please consult deprecation warnings for more details.

BUILD FAILED in 3h 31m 55s
152 actionable tasks: 98 executed, 50 from cache, 4 up-to-date

Publishing build scan...
https://gradle.com/s/jka3hkf2ks7qe

Build step 'Invoke Gradle script' changed build result to FAILURE
Build step 'Invoke Gradle script' marked build as failure

---------------------------------------------------------------------
To unsubscribe, e-mail: builds-unsubscribe@beam.apache.org
For additional commands, e-mail: builds-help@beam.apache.org


Build failed in Jenkins: beam_PostCommit_Java_DataflowV2 #2876

Posted by Apache Jenkins Server <je...@builds.apache.org>.
See <https://ci-beam.apache.org/job/beam_PostCommit_Java_DataflowV2/2876/display/redirect?page=changes>

Changes:

[noreply] Bump github.com/aws/aws-sdk-go-v2/feature/s3/manager in /sdks (#26071)


------------------------------------------
[...truncated 63.92 KB...]
+ go-licenses save github.com/apache/beam/sdks/v2/java/container --save_path=/output/licenses
W0403 15:58:10.461300      37 library.go:101] "golang.org/x/sys/unix" contains non-Go code that can't be inspected for further dependencies:
/go/pkg/mod/golang.org/x/sys@v0.5.0/unix/asm_linux_amd64.s
+ go-licenses csv github.com/apache/beam/sdks/v2/java/container
+ tee /output/licenses/list.csv
W0403 15:58:14.603340      83 library.go:101] "golang.org/x/sys/unix" contains non-Go code that can't be inspected for further dependencies:
/go/pkg/mod/golang.org/x/sys@v0.5.0/unix/asm_linux_amd64.s
github.com/apache/beam/sdks/v2/go/pkg/beam,https://github.com/apache/beam/blob/sdks/v2.46.0/sdks/go/README.md,Apache-2.0
github.com/apache/beam/sdks/v2/java/container,https://github.com/apache/beam/blob/sdks/v2.46.0/sdks/LICENSE,Apache-2.0
github.com/golang/protobuf,https://github.com/golang/protobuf/blob/v1.5.2/LICENSE,BSD-3-Clause
golang.org/x/net,https://cs.opensource.google/go/x/net/+/v0.5.0:LICENSE,BSD-3-Clause
golang.org/x/sys/unix,https://cs.opensource.google/go/x/sys/+/v0.5.0:LICENSE,BSD-3-Clause
golang.org/x/text,https://cs.opensource.google/go/x/text/+/v0.7.0:LICENSE,BSD-3-Clause
google.golang.org/genproto/googleapis/rpc/status,https://github.com/googleapis/go-genproto/blob/76db0878b65f/LICENSE,Apache-2.0
google.golang.org/grpc,https://github.com/grpc/grpc-go/blob/v1.52.3/LICENSE,Apache-2.0
google.golang.org/protobuf,https://github.com/protocolbuffers/protobuf-go/blob/v1.28.1/LICENSE,BSD-3-Clause
+ chmod -R a+w /output/licenses

> Task :release:go-licenses:java:createLicenses
> Task :sdks:java:container:java8:copyGolangLicenses
> Task :sdks:java:container:java8:dockerPrepare

> Task :sdks:java:container:java8:docker
#1 [internal] load build definition from Dockerfile
#1 transferring dockerfile: 2.85kB done
#1 DONE 0.0s

#2 [internal] load .dockerignore
#2 transferring context: 2B done
#2 DONE 0.0s

#3 [internal] load metadata for docker.io/library/eclipse-temurin:8
#3 DONE 0.3s

#4 [ 1/18] FROM docker.io/library/eclipse-temurin:8@sha256:005d3189b2ec1612c3ade6eadabd1935c312f03aa7905cf0528e9d71980ad512
#4 resolve docker.io/library/eclipse-temurin:8@sha256:005d3189b2ec1612c3ade6eadabd1935c312f03aa7905cf0528e9d71980ad512 0.0s done
#4 CACHED

#5 [internal] load build context
#5 transferring context: 46.73MB 0.4s done
#5 DONE 0.4s

#6 [ 2/18] ADD target/slf4j-api.jar /opt/apache/beam/jars/
#6 DONE 2.9s

#7 [ 3/18] ADD target/slf4j-jdk14.jar /opt/apache/beam/jars/
#7 DONE 0.1s

#8 [ 4/18] ADD target/jcl-over-slf4j.jar /opt/apache/beam/jars/
#8 DONE 0.1s

#9 [ 5/18] ADD target/log4j-over-slf4j.jar /opt/apache/beam/jars/
#9 DONE 0.1s

#10 [ 6/18] ADD target/log4j-to-slf4j.jar /opt/apache/beam/jars/
#10 DONE 0.1s

#11 [ 7/18] ADD target/beam-sdks-java-harness.jar /opt/apache/beam/jars/
#11 DONE 0.1s

#12 [ 8/18] COPY target/jamm.jar target/open-module-agent*.jar /opt/apache/beam/jars/
#12 DONE 0.1s

#13 [ 9/18] COPY target/linux_amd64/boot /opt/apache/beam/
#13 DONE 0.2s

#14 [10/18] COPY target/LICENSE /opt/apache/beam/
#14 DONE 0.1s

#15 [11/18] COPY target/NOTICE /opt/apache/beam/
#15 DONE 0.1s

#16 [12/18] ADD target/third_party_licenses /opt/apache/beam/third_party_licenses/
#16 DONE 0.2s

#17 [13/18] COPY target/LICENSE target/options/* /opt/apache/beam/options/
#17 DONE 0.1s

#18 [14/18] RUN rm /opt/apache/beam/options/LICENSE
#18 DONE 0.3s

#19 [15/18] COPY target/LICENSE target/go-licenses/* /opt/apache/beam/third_party_licenses/golang/
#19 DONE 0.0s

#20 [16/18] RUN rm /opt/apache/beam/third_party_licenses/golang/LICENSE
#20 DONE 0.4s

#21 [17/18] RUN if [ "true" = "false" ] ; then     rm -rf /opt/apache/beam/third_party_licenses ;    fi
#21 DONE 0.4s

#22 [18/18] COPY target/profiler/* /opt/google_cloud_profiler/
#22 DONE 0.1s

#23 exporting to image
#23 exporting layers
#23 exporting layers 0.3s done
#23 writing image sha256:d4343b1767ef2c5d5ce7078a1addaceedd1f10cd2a0589987ff125e1b83eff30 done
#23 naming to docker.io/apache/beam_java8_sdk:2.47.0.dev done
#23 DONE 0.3s

> Task :runners:google-cloud-dataflow-java:buildAndPushDockerJavaContainer
WARNING: `gcloud docker` will not be supported for Docker client versions above 18.03.

As an alternative, use `gcloud auth configure-docker` to configure `docker` to
use `gcloud` as a credential helper, then use `docker` as you would for non-GCR
registries, e.g. `docker pull gcr.io/project-id/my-image`. Add
`--verbosity=error` to silence this warning: `gcloud docker
--verbosity=error -- pull gcr.io/project-id/my-image`.

See: https://cloud.google.com/container-registry/docs/support/deprecation-notices#gcloud-docker

The push refers to repository [us.gcr.io/apache-beam-testing/java-postcommit-it/java]
7ed1193345cd: Preparing
5f70bf18a086: Preparing
a5ccf24605d2: Preparing
9b85677facea: Preparing
6b21fac36d03: Preparing
770b4ea443dc: Preparing
443f1a9bede9: Preparing
f7ec70425afd: Preparing
b17972331106: Preparing
adab03ca0447: Preparing
a2cac9bb3b24: Preparing
6b24cb9859f8: Preparing
3d5321180c90: Preparing
ce2cc8c2e845: Preparing
d5f265c98280: Preparing
dcf79abb8345: Preparing
14ae269cf1d6: Preparing
533af4d05d89: Preparing
d09fdd9ad3ef: Preparing
04d1dcab20cb: Preparing
b93c1bd012ab: Preparing
770b4ea443dc: Waiting
adab03ca0447: Waiting
a2cac9bb3b24: Waiting
533af4d05d89: Waiting
ce2cc8c2e845: Waiting
d09fdd9ad3ef: Waiting
04d1dcab20cb: Waiting
6b24cb9859f8: Waiting
443f1a9bede9: Waiting
d5f265c98280: Waiting
b93c1bd012ab: Waiting
f7ec70425afd: Waiting
b17972331106: Waiting
3d5321180c90: Waiting
14ae269cf1d6: Waiting
dcf79abb8345: Waiting
5f70bf18a086: Layer already exists
9b85677facea: Pushed
6b21fac36d03: Pushed
a5ccf24605d2: Pushed
770b4ea443dc: Pushed
7ed1193345cd: Pushed
f7ec70425afd: Pushed
b17972331106: Pushed
a2cac9bb3b24: Pushed
443f1a9bede9: Pushed
adab03ca0447: Pushed
3d5321180c90: Pushed
6b24cb9859f8: Pushed
533af4d05d89: Layer already exists
d09fdd9ad3ef: Layer already exists
04d1dcab20cb: Layer already exists
b93c1bd012ab: Layer already exists
ce2cc8c2e845: Pushed
d5f265c98280: Pushed
dcf79abb8345: Pushed
14ae269cf1d6: Pushed
20230403155742: digest: sha256:717e97d811184de4eb7d3d49bbbf68deff8eba88e93b0e51d99052872d10eda2 size: 4710

> Task :runners:google-cloud-dataflow-java:coreSDKJavaRunnerV2IntegrationTest NO-SOURCE
> Task :runners:google-cloud-dataflow-java:examplesJavaRunnerV2IntegrationTest

***********************************************************
***********************************************************
**********************Set Up Pubsub************************
The Pub/Sub topic has been set up for this example: projects/apache-beam-testing/topics/testpipeline-jenkins-0403155847-b1b8336c
The Pub/Sub subscription has been set up for this example: projects/apache-beam-testing/subscriptions/testpipeline-jenkins-0403155847-b1b8336c
*************************Tear Down*************************
The Pub/Sub topic has been deleted: projects/apache-beam-testing/topics/testpipeline-jenkins-0403155847-b1b8336c
The Pub/Sub subscription has been deleted: projects/apache-beam-testing/subscriptions/testpipeline-jenkins-0403155847-b1b8336c
***********************************************************
***********************************************************

***********************************************************
***********************************************************
**********************Set Up Pubsub************************
The Pub/Sub topic has been set up for this example: projects/apache-beam-testing/topics/testpipeline-jenkins-0403155847-ac6fac3c
The Pub/Sub subscription has been set up for this example: projects/apache-beam-testing/subscriptions/testpipeline-jenkins-0403155847-ac6fac3c
*************************Tear Down*************************
The Pub/Sub topic has been deleted: projects/apache-beam-testing/topics/testpipeline-jenkins-0403155847-ac6fac3c
The Pub/Sub subscription has been deleted: projects/apache-beam-testing/subscriptions/testpipeline-jenkins-0403155847-ac6fac3c
***********************************************************
***********************************************************

> Task :runners:google-cloud-dataflow-java:googleCloudPlatformRunnerV2IntegrationTest

org.apache.beam.sdk.io.gcp.bigquery.BigQueryIOStorageWriteIT > testBigQueryStorageWrite30MProtoALO FAILED
    java.lang.RuntimeException at BigQueryIOStorageWriteIT.java:114

86 tests completed, 1 failed, 2 skipped

> Task :runners:google-cloud-dataflow-java:googleCloudPlatformRunnerV2IntegrationTest FAILED

> Task :runners:google-cloud-dataflow-java:cleanUpDockerJavaImages
Untagged: us.gcr.io/apache-beam-testing/java-postcommit-it/java:20230403155742
Untagged: us.gcr.io/apache-beam-testing/java-postcommit-it/java@sha256:717e97d811184de4eb7d3d49bbbf68deff8eba88e93b0e51d99052872d10eda2
Deleted: sha256:d4343b1767ef2c5d5ce7078a1addaceedd1f10cd2a0589987ff125e1b83eff30
WARNING: Successfully resolved tag to sha256, but it is recommended to use sha256 directly.
Tag: [us.gcr.io/apache-beam-testing/java-postcommit-it/java:20230403155742]
- referencing digest: [us.gcr.io/apache-beam-testing/java-postcommit-it/java@sha256:717e97d811184de4eb7d3d49bbbf68deff8eba88e93b0e51d99052872d10eda2]

Deleted [[us.gcr.io/apache-beam-testing/java-postcommit-it/java:20230403155742] (referencing [us.gcr.io/apache-beam-testing/java-postcommit-it/java@sha256:717e97d811184de4eb7d3d49bbbf68deff8eba88e93b0e51d99052872d10eda2])].
Removing untagged image us.gcr.io/apache-beam-testing/java-postcommit-it/java@sha256:717e97d811184de4eb7d3d49bbbf68deff8eba88e93b0e51d99052872d10eda2
Digests:
- us.gcr.io/apache-beam-testing/java-postcommit-it/java@sha256:717e97d811184de4eb7d3d49bbbf68deff8eba88e93b0e51d99052872d10eda2
Deleted [us.gcr.io/apache-beam-testing/java-postcommit-it/java@sha256:717e97d811184de4eb7d3d49bbbf68deff8eba88e93b0e51d99052872d10eda2].

FAILURE: Build failed with an exception.

* What went wrong:
Execution failed for task ':runners:google-cloud-dataflow-java:googleCloudPlatformRunnerV2IntegrationTest'.
> There were failing tests. See the report at: file://<https://ci-beam.apache.org/job/beam_PostCommit_Java_DataflowV2/ws/src/runners/google-cloud-dataflow-java/build/reports/tests/googleCloudPlatformRunnerV2IntegrationTest/index.html>

* Try:
> Run with --stacktrace option to get the stack trace.
> Run with --info or --debug option to get more log output.

* Get more help at https://help.gradle.org

Deprecated Gradle features were used in this build, making it incompatible with Gradle 8.0.

You can use '--warning-mode all' to show the individual deprecation warnings and determine if they come from your own scripts or plugins.

See https://docs.gradle.org/7.5.1/userguide/command_line_interface.html#sec:command_line_warnings

Execution optimizations have been disabled for 1 invalid unit(s) of work during this build to ensure correctness.
Please consult deprecation warnings for more details.

BUILD FAILED in 3h 31m 18s
152 actionable tasks: 98 executed, 50 from cache, 4 up-to-date

Publishing build scan...
https://gradle.com/s/k6nlpka4s5wc4

Build step 'Invoke Gradle script' changed build result to FAILURE
Build step 'Invoke Gradle script' marked build as failure

---------------------------------------------------------------------
To unsubscribe, e-mail: builds-unsubscribe@beam.apache.org
For additional commands, e-mail: builds-help@beam.apache.org


Build failed in Jenkins: beam_PostCommit_Java_DataflowV2 #2875

Posted by Apache Jenkins Server <je...@builds.apache.org>.
See <https://ci-beam.apache.org/job/beam_PostCommit_Java_DataflowV2/2875/display/redirect>

Changes:


------------------------------------------
[...truncated 66.11 KB...]
#3 DONE 0.1s

#4 [ 1/18] FROM docker.io/library/eclipse-temurin:8@sha256:005d3189b2ec1612c3ade6eadabd1935c312f03aa7905cf0528e9d71980ad512
#4 resolve docker.io/library/eclipse-temurin:8@sha256:005d3189b2ec1612c3ade6eadabd1935c312f03aa7905cf0528e9d71980ad512 0.0s done
#4 CACHED

#5 [internal] load build context
#5 transferring context: 46.71MB 0.4s done
#5 DONE 1.3s

#6 [ 8/18] COPY target/jamm.jar target/open-module-agent*.jar /opt/apache/beam/jars/
#6 CACHED

#7 [ 2/18] ADD target/slf4j-api.jar /opt/apache/beam/jars/
#7 CACHED

#8 [ 3/18] ADD target/slf4j-jdk14.jar /opt/apache/beam/jars/
#8 CACHED

#9 [ 4/18] ADD target/jcl-over-slf4j.jar /opt/apache/beam/jars/
#9 CACHED

#10 [ 5/18] ADD target/log4j-over-slf4j.jar /opt/apache/beam/jars/
#10 CACHED

#11 [ 6/18] ADD target/log4j-to-slf4j.jar /opt/apache/beam/jars/
#11 CACHED

#12 [ 7/18] ADD target/beam-sdks-java-harness.jar /opt/apache/beam/jars/
#12 CACHED

#13 [ 9/18] COPY target/linux_amd64/boot /opt/apache/beam/
#13 DONE 0.4s

#14 [10/18] COPY target/LICENSE /opt/apache/beam/
#14 DONE 0.1s

#15 [11/18] COPY target/NOTICE /opt/apache/beam/
#15 DONE 0.1s

#16 [12/18] ADD target/third_party_licenses /opt/apache/beam/third_party_licenses/
#16 DONE 0.4s

#17 [13/18] COPY target/LICENSE target/options/* /opt/apache/beam/options/
#17 DONE 0.2s

#18 [14/18] RUN rm /opt/apache/beam/options/LICENSE
#18 DONE 0.5s

#19 [15/18] COPY target/LICENSE target/go-licenses/* /opt/apache/beam/third_party_licenses/golang/
#19 DONE 0.2s

#20 [16/18] RUN rm /opt/apache/beam/third_party_licenses/golang/LICENSE
#20 DONE 0.5s

#21 [17/18] RUN if [ "true" = "false" ] ; then     rm -rf /opt/apache/beam/third_party_licenses ;    fi
#21 DONE 0.8s

#22 [18/18] COPY target/profiler/* /opt/google_cloud_profiler/
#22 DONE 0.3s

#23 exporting to image
#23 exporting layers
#23 exporting layers 0.5s done
#23 writing image sha256:7930ceba1319c4a37aa856837d728c6863bf832332e8b590fc9de825a9b07b46 done
#23 naming to docker.io/apache/beam_java8_sdk:2.47.0.dev done
#23 DONE 0.5s

> Task :runners:google-cloud-dataflow-java:buildAndPushDockerJavaContainer
WARNING: `gcloud docker` will not be supported for Docker client versions above 18.03.

As an alternative, use `gcloud auth configure-docker` to configure `docker` to
use `gcloud` as a credential helper, then use `docker` as you would for non-GCR
registries, e.g. `docker pull gcr.io/project-id/my-image`. Add
`--verbosity=error` to silence this warning: `gcloud docker
--verbosity=error -- pull gcr.io/project-id/my-image`.

See: https://cloud.google.com/container-registry/docs/support/deprecation-notices#gcloud-docker

The push refers to repository [us.gcr.io/apache-beam-testing/java-postcommit-it/java]
fb6675b58f65: Preparing
5f70bf18a086: Preparing
04dec3bd5119: Preparing
ef626dc39be0: Preparing
72bc88a81ef2: Preparing
533e8d0baad3: Preparing
be4d207f9b79: Preparing
0da26d7c59ea: Preparing
5a2053338313: Preparing
9a0f9700ef85: Preparing
556318decb5b: Preparing
9f6263cf6bb7: Preparing
5c6095a7a71a: Preparing
5ede4b58f6d0: Preparing
d5e4ae354bec: Preparing
258930ee3d8e: Preparing
e307ac616d33: Preparing
533af4d05d89: Preparing
d09fdd9ad3ef: Preparing
04d1dcab20cb: Preparing
b93c1bd012ab: Preparing
5ede4b58f6d0: Waiting
533e8d0baad3: Waiting
d5e4ae354bec: Waiting
258930ee3d8e: Waiting
be4d207f9b79: Waiting
e307ac616d33: Waiting
533af4d05d89: Waiting
0da26d7c59ea: Waiting
d09fdd9ad3ef: Waiting
5a2053338313: Waiting
04d1dcab20cb: Waiting
9a0f9700ef85: Waiting
556318decb5b: Waiting
b93c1bd012ab: Waiting
5c6095a7a71a: Waiting
9f6263cf6bb7: Waiting
5f70bf18a086: Layer already exists
04dec3bd5119: Pushed
ef626dc39be0: Pushed
533e8d0baad3: Pushed
72bc88a81ef2: Pushed
fb6675b58f65: Pushed
5a2053338313: Pushed
0da26d7c59ea: Pushed
be4d207f9b79: Pushed
556318decb5b: Pushed
9a0f9700ef85: Pushed
5c6095a7a71a: Pushed
9f6263cf6bb7: Pushed
533af4d05d89: Layer already exists
d09fdd9ad3ef: Layer already exists
04d1dcab20cb: Layer already exists
b93c1bd012ab: Layer already exists
5ede4b58f6d0: Pushed
d5e4ae354bec: Pushed
258930ee3d8e: Pushed
e307ac616d33: Pushed
20230403095739: digest: sha256:fc17fceda11aa6acc2cffc15f7a50f6d33fc9ddc4a77334e0038704de24f4dd8 size: 4710

> Task :runners:google-cloud-dataflow-java:coreSDKJavaRunnerV2IntegrationTest NO-SOURCE
> Task :runners:google-cloud-dataflow-java:examplesJavaRunnerV2IntegrationTest

***********************************************************
***********************************************************
**********************Set Up Pubsub************************
The Pub/Sub topic has been set up for this example: projects/apache-beam-testing/topics/testpipeline-jenkins-0403095934-61fb8a17
The Pub/Sub subscription has been set up for this example: projects/apache-beam-testing/subscriptions/testpipeline-jenkins-0403095934-61fb8a17
*************************Tear Down*************************
The Pub/Sub topic has been deleted: projects/apache-beam-testing/topics/testpipeline-jenkins-0403095934-61fb8a17
The Pub/Sub subscription has been deleted: projects/apache-beam-testing/subscriptions/testpipeline-jenkins-0403095934-61fb8a17
***********************************************************
***********************************************************

***********************************************************
***********************************************************
**********************Set Up Pubsub************************
The Pub/Sub topic has been set up for this example: projects/apache-beam-testing/topics/testpipeline-jenkins-0403095934-a26d1e7c
The Pub/Sub subscription has been set up for this example: projects/apache-beam-testing/subscriptions/testpipeline-jenkins-0403095934-a26d1e7c
*************************Tear Down*************************
The Pub/Sub topic has been deleted: projects/apache-beam-testing/topics/testpipeline-jenkins-0403095934-a26d1e7c
The Pub/Sub subscription has been deleted: projects/apache-beam-testing/subscriptions/testpipeline-jenkins-0403095934-a26d1e7c
***********************************************************
***********************************************************

> Task :runners:google-cloud-dataflow-java:googleCloudPlatformRunnerV2IntegrationTest

org.apache.beam.sdk.io.gcp.bigquery.BigQueryIOStorageWriteIT > testBigQueryStorageWrite30MProtoALO FAILED
    java.lang.RuntimeException at BigQueryIOStorageWriteIT.java:114

org.apache.beam.sdk.io.gcp.firestore.it.FirestoreV1IT > batchWrite_partialFailureOutputsToDeadLetterQueue FAILED
    java.util.concurrent.ExecutionException at FirestoreV1IT.java:96
        Caused by: com.google.api.gax.rpc.InvalidArgumentException at ApiExceptionFactory.java:92
            Caused by: io.grpc.StatusRuntimeException at Status.java:539

org.apache.beam.sdk.io.gcp.firestore.it.FirestoreV1IT > batchGet FAILED
    java.util.concurrent.ExecutionException at AbstractFuture.java:588
        Caused by: com.google.api.gax.rpc.InvalidArgumentException at ApiExceptionFactory.java:92
            Caused by: io.grpc.StatusRuntimeException at Status.java:539

org.apache.beam.sdk.io.gcp.firestore.it.FirestoreV1IT > partitionQuery FAILED
    java.util.concurrent.ExecutionException at AbstractFuture.java:588
        Caused by: com.google.api.gax.rpc.InvalidArgumentException at ApiExceptionFactory.java:92
            Caused by: io.grpc.StatusRuntimeException at Status.java:539

org.apache.beam.sdk.io.gcp.firestore.it.FirestoreV1IT > listCollections FAILED
    java.util.concurrent.ExecutionException at AbstractFuture.java:588
        Caused by: com.google.api.gax.rpc.InvalidArgumentException at ApiExceptionFactory.java:92
            Caused by: io.grpc.StatusRuntimeException at Status.java:539

org.apache.beam.sdk.io.gcp.firestore.it.FirestoreV1IT > write FAILED
    java.lang.RuntimeException at TestDataflowRunner.java:141

org.apache.beam.sdk.io.gcp.firestore.it.FirestoreV1IT > listDocuments FAILED
    java.util.concurrent.ExecutionException at AbstractFuture.java:588
        Caused by: com.google.api.gax.rpc.InvalidArgumentException at ApiExceptionFactory.java:92
            Caused by: io.grpc.StatusRuntimeException at Status.java:539

org.apache.beam.sdk.io.gcp.firestore.it.FirestoreV1IT > runQuery FAILED
    java.util.concurrent.ExecutionException at AbstractFuture.java:588
        Caused by: com.google.api.gax.rpc.InvalidArgumentException at ApiExceptionFactory.java:92
            Caused by: io.grpc.StatusRuntimeException at Status.java:539

93 tests completed, 8 failed, 2 skipped

> Task :runners:google-cloud-dataflow-java:googleCloudPlatformRunnerV2IntegrationTest FAILED

> Task :runners:google-cloud-dataflow-java:cleanUpDockerJavaImages
Untagged: us.gcr.io/apache-beam-testing/java-postcommit-it/java:20230403095739
Untagged: us.gcr.io/apache-beam-testing/java-postcommit-it/java@sha256:fc17fceda11aa6acc2cffc15f7a50f6d33fc9ddc4a77334e0038704de24f4dd8
WARNING: Successfully resolved tag to sha256, but it is recommended to use sha256 directly.
Tag: [us.gcr.io/apache-beam-testing/java-postcommit-it/java:20230403095739]
- referencing digest: [us.gcr.io/apache-beam-testing/java-postcommit-it/java@sha256:fc17fceda11aa6acc2cffc15f7a50f6d33fc9ddc4a77334e0038704de24f4dd8]

Deleted [[us.gcr.io/apache-beam-testing/java-postcommit-it/java:20230403095739] (referencing [us.gcr.io/apache-beam-testing/java-postcommit-it/java@sha256:fc17fceda11aa6acc2cffc15f7a50f6d33fc9ddc4a77334e0038704de24f4dd8])].
Removing untagged image us.gcr.io/apache-beam-testing/java-postcommit-it/java@sha256:fc17fceda11aa6acc2cffc15f7a50f6d33fc9ddc4a77334e0038704de24f4dd8
Digests:
- us.gcr.io/apache-beam-testing/java-postcommit-it/java@sha256:fc17fceda11aa6acc2cffc15f7a50f6d33fc9ddc4a77334e0038704de24f4dd8
Deleted [us.gcr.io/apache-beam-testing/java-postcommit-it/java@sha256:fc17fceda11aa6acc2cffc15f7a50f6d33fc9ddc4a77334e0038704de24f4dd8].

FAILURE: Build failed with an exception.

* What went wrong:
Execution failed for task ':runners:google-cloud-dataflow-java:googleCloudPlatformRunnerV2IntegrationTest'.
> There were failing tests. See the report at: file://<https://ci-beam.apache.org/job/beam_PostCommit_Java_DataflowV2/ws/src/runners/google-cloud-dataflow-java/build/reports/tests/googleCloudPlatformRunnerV2IntegrationTest/index.html>

* Try:
> Run with --stacktrace option to get the stack trace.
> Run with --info or --debug option to get more log output.

* Get more help at https://help.gradle.org

Deprecated Gradle features were used in this build, making it incompatible with Gradle 8.0.

You can use '--warning-mode all' to show the individual deprecation warnings and determine if they come from your own scripts or plugins.

See https://docs.gradle.org/7.5.1/userguide/command_line_interface.html#sec:command_line_warnings

Execution optimizations have been disabled for 1 invalid unit(s) of work during this build to ensure correctness.
Please consult deprecation warnings for more details.

BUILD FAILED in 2h 53m 58s
152 actionable tasks: 98 executed, 50 from cache, 4 up-to-date

Publishing build scan...
https://gradle.com/s/gzw3tmh2frzc4

Build step 'Invoke Gradle script' changed build result to FAILURE
Build step 'Invoke Gradle script' marked build as failure

---------------------------------------------------------------------
To unsubscribe, e-mail: builds-unsubscribe@beam.apache.org
For additional commands, e-mail: builds-help@beam.apache.org


Build failed in Jenkins: beam_PostCommit_Java_DataflowV2 #2874

Posted by Apache Jenkins Server <je...@builds.apache.org>.
See <https://ci-beam.apache.org/job/beam_PostCommit_Java_DataflowV2/2874/display/redirect>

Changes:


------------------------------------------
[...truncated 66.58 KB...]
#3 DONE 0.3s

#4 [ 1/18] FROM docker.io/library/eclipse-temurin:8@sha256:005d3189b2ec1612c3ade6eadabd1935c312f03aa7905cf0528e9d71980ad512
#4 resolve docker.io/library/eclipse-temurin:8@sha256:005d3189b2ec1612c3ade6eadabd1935c312f03aa7905cf0528e9d71980ad512 0.0s done
#4 CACHED

#5 [internal] load build context
#5 transferring context: 46.71MB 0.5s done
#5 DONE 0.5s

#6 [ 2/18] ADD target/slf4j-api.jar /opt/apache/beam/jars/
#6 DONE 4.5s

#7 [ 3/18] ADD target/slf4j-jdk14.jar /opt/apache/beam/jars/
#7 DONE 0.1s

#8 [ 4/18] ADD target/jcl-over-slf4j.jar /opt/apache/beam/jars/
#8 DONE 0.1s

#9 [ 5/18] ADD target/log4j-over-slf4j.jar /opt/apache/beam/jars/
#9 DONE 0.1s

#10 [ 6/18] ADD target/log4j-to-slf4j.jar /opt/apache/beam/jars/
#10 DONE 0.1s

#11 [ 7/18] ADD target/beam-sdks-java-harness.jar /opt/apache/beam/jars/
#11 DONE 0.1s

#12 [ 8/18] COPY target/jamm.jar target/open-module-agent*.jar /opt/apache/beam/jars/
#12 DONE 0.1s

#13 [ 9/18] COPY target/linux_amd64/boot /opt/apache/beam/
#13 DONE 0.4s

#14 [10/18] COPY target/LICENSE /opt/apache/beam/
#14 DONE 0.1s

#15 [11/18] COPY target/NOTICE /opt/apache/beam/
#15 DONE 0.1s

#16 [12/18] ADD target/third_party_licenses /opt/apache/beam/third_party_licenses/
#16 DONE 0.4s

#17 [13/18] COPY target/LICENSE target/options/* /opt/apache/beam/options/
#17 DONE 0.2s

#18 [14/18] RUN rm /opt/apache/beam/options/LICENSE
#18 DONE 0.4s

#19 [15/18] COPY target/LICENSE target/go-licenses/* /opt/apache/beam/third_party_licenses/golang/
#19 DONE 0.1s

#20 [16/18] RUN rm /opt/apache/beam/third_party_licenses/golang/LICENSE
#20 DONE 0.8s

#21 [17/18] RUN if [ "true" = "false" ] ; then     rm -rf /opt/apache/beam/third_party_licenses ;    fi
#21 DONE 0.7s

#22 [18/18] COPY target/profiler/* /opt/google_cloud_profiler/
#22 DONE 0.2s

#23 exporting to image
#23 exporting layers
#23 exporting layers 0.2s done
#23 writing image sha256:6baa5e207376c18e9930655529b5b6eaf5beb5e7d092def47a53ccb1029237c1 done
#23 naming to docker.io/apache/beam_java8_sdk:2.47.0.dev done
#23 DONE 0.3s

> Task :runners:google-cloud-dataflow-java:buildAndPushDockerJavaContainer
WARNING: `gcloud docker` will not be supported for Docker client versions above 18.03.

As an alternative, use `gcloud auth configure-docker` to configure `docker` to
use `gcloud` as a credential helper, then use `docker` as you would for non-GCR
registries, e.g. `docker pull gcr.io/project-id/my-image`. Add
`--verbosity=error` to silence this warning: `gcloud docker
--verbosity=error -- pull gcr.io/project-id/my-image`.

See: https://cloud.google.com/container-registry/docs/support/deprecation-notices#gcloud-docker

The push refers to repository [us.gcr.io/apache-beam-testing/java-postcommit-it/java]
990299f817dc: Preparing
5f70bf18a086: Preparing
370cdd013fa5: Preparing
159057a89978: Preparing
37b256f34da0: Preparing
29dfb2bf8172: Preparing
b240bb35308b: Preparing
4e902d74e21c: Preparing
d17a030b1c73: Preparing
75419abaa333: Preparing
e2c004bd16f2: Preparing
ea31c0071fe9: Preparing
47ddf379a582: Preparing
be8e6617ea71: Preparing
0ac23f34e2f5: Preparing
259f4daaddcc: Preparing
f032e91500c2: Preparing
533af4d05d89: Preparing
d09fdd9ad3ef: Preparing
04d1dcab20cb: Preparing
b93c1bd012ab: Preparing
47ddf379a582: Waiting
be8e6617ea71: Waiting
0ac23f34e2f5: Waiting
259f4daaddcc: Waiting
f032e91500c2: Waiting
533af4d05d89: Waiting
d09fdd9ad3ef: Waiting
04d1dcab20cb: Waiting
b93c1bd012ab: Waiting
29dfb2bf8172: Waiting
d17a030b1c73: Waiting
b240bb35308b: Waiting
ea31c0071fe9: Waiting
4e902d74e21c: Waiting
e2c004bd16f2: Waiting
5f70bf18a086: Layer already exists
159057a89978: Pushed
370cdd013fa5: Pushed
37b256f34da0: Pushed
29dfb2bf8172: Pushed
4e902d74e21c: Pushed
b240bb35308b: Pushed
d17a030b1c73: Pushed
990299f817dc: Pushed
e2c004bd16f2: Pushed
ea31c0071fe9: Pushed
75419abaa333: Pushed
47ddf379a582: Pushed
533af4d05d89: Layer already exists
d09fdd9ad3ef: Layer already exists
04d1dcab20cb: Layer already exists
be8e6617ea71: Pushed
b93c1bd012ab: Layer already exists
0ac23f34e2f5: Pushed
259f4daaddcc: Pushed
f032e91500c2: Pushed
20230403035738: digest: sha256:e6a173516fbc9faca01ab79b5032a8da7dc4ce3e17fec9b36c9895b4d64c5a3e size: 4710

> Task :runners:google-cloud-dataflow-java:coreSDKJavaRunnerV2IntegrationTest NO-SOURCE
> Task :runners:google-cloud-dataflow-java:examplesJavaRunnerV2IntegrationTest

***********************************************************
***********************************************************
**********************Set Up Pubsub************************
The Pub/Sub topic has been set up for this example: projects/apache-beam-testing/topics/testpipeline-jenkins-0403035929-e308f805
The Pub/Sub subscription has been set up for this example: projects/apache-beam-testing/subscriptions/testpipeline-jenkins-0403035929-e308f805
*************************Tear Down*************************
The Pub/Sub topic has been deleted: projects/apache-beam-testing/topics/testpipeline-jenkins-0403035929-e308f805
The Pub/Sub subscription has been deleted: projects/apache-beam-testing/subscriptions/testpipeline-jenkins-0403035929-e308f805
***********************************************************
***********************************************************

***********************************************************
***********************************************************
**********************Set Up Pubsub************************
The Pub/Sub topic has been set up for this example: projects/apache-beam-testing/topics/testpipeline-jenkins-0403035929-9f7bf240
The Pub/Sub subscription has been set up for this example: projects/apache-beam-testing/subscriptions/testpipeline-jenkins-0403035929-9f7bf240
*************************Tear Down*************************
The Pub/Sub topic has been deleted: projects/apache-beam-testing/topics/testpipeline-jenkins-0403035929-9f7bf240
The Pub/Sub subscription has been deleted: projects/apache-beam-testing/subscriptions/testpipeline-jenkins-0403035929-9f7bf240
***********************************************************
***********************************************************

> Task :runners:google-cloud-dataflow-java:googleCloudPlatformRunnerV2IntegrationTest

org.apache.beam.sdk.io.gcp.bigquery.BigQueryIOStorageWriteIT > testBigQueryStorageWrite30MProtoALO FAILED
    java.lang.RuntimeException at BigQueryIOStorageWriteIT.java:114

org.apache.beam.sdk.io.gcp.firestore.it.FirestoreV1IT > batchWrite_partialFailureOutputsToDeadLetterQueue FAILED
    java.util.concurrent.ExecutionException at FirestoreV1IT.java:96
        Caused by: com.google.api.gax.rpc.InvalidArgumentException at ApiExceptionFactory.java:92
            Caused by: io.grpc.StatusRuntimeException at Status.java:539

org.apache.beam.sdk.io.gcp.firestore.it.FirestoreV1IT > batchGet FAILED
    java.util.concurrent.ExecutionException at AbstractFuture.java:588
        Caused by: com.google.api.gax.rpc.InvalidArgumentException at ApiExceptionFactory.java:92
            Caused by: io.grpc.StatusRuntimeException at Status.java:539

org.apache.beam.sdk.io.gcp.firestore.it.FirestoreV1IT > partitionQuery FAILED
    java.util.concurrent.ExecutionException at AbstractFuture.java:588
        Caused by: com.google.api.gax.rpc.InvalidArgumentException at ApiExceptionFactory.java:92
            Caused by: io.grpc.StatusRuntimeException at Status.java:539

org.apache.beam.sdk.io.gcp.firestore.it.FirestoreV1IT > listCollections FAILED
    java.util.concurrent.ExecutionException at AbstractFuture.java:588
        Caused by: com.google.api.gax.rpc.InvalidArgumentException at ApiExceptionFactory.java:92
            Caused by: io.grpc.StatusRuntimeException at Status.java:539

org.apache.beam.sdk.io.gcp.firestore.it.FirestoreV1IT > write FAILED
    java.lang.RuntimeException at TestDataflowRunner.java:141

org.apache.beam.sdk.io.gcp.firestore.it.FirestoreV1IT > listDocuments FAILED
    java.util.concurrent.ExecutionException at AbstractFuture.java:588
        Caused by: com.google.api.gax.rpc.InvalidArgumentException at ApiExceptionFactory.java:92
            Caused by: io.grpc.StatusRuntimeException at Status.java:539

org.apache.beam.sdk.io.gcp.firestore.it.FirestoreV1IT > runQuery FAILED
    java.util.concurrent.ExecutionException at AbstractFuture.java:588
        Caused by: com.google.api.gax.rpc.InvalidArgumentException at ApiExceptionFactory.java:92
            Caused by: io.grpc.StatusRuntimeException at Status.java:539

93 tests completed, 8 failed, 2 skipped

> Task :runners:google-cloud-dataflow-java:googleCloudPlatformRunnerV2IntegrationTest FAILED

> Task :runners:google-cloud-dataflow-java:cleanUpDockerJavaImages
Untagged: us.gcr.io/apache-beam-testing/java-postcommit-it/java:20230403035738
Untagged: us.gcr.io/apache-beam-testing/java-postcommit-it/java@sha256:e6a173516fbc9faca01ab79b5032a8da7dc4ce3e17fec9b36c9895b4d64c5a3e
Deleted: sha256:6baa5e207376c18e9930655529b5b6eaf5beb5e7d092def47a53ccb1029237c1
WARNING: Successfully resolved tag to sha256, but it is recommended to use sha256 directly.
Tag: [us.gcr.io/apache-beam-testing/java-postcommit-it/java:20230403035738]
- referencing digest: [us.gcr.io/apache-beam-testing/java-postcommit-it/java@sha256:e6a173516fbc9faca01ab79b5032a8da7dc4ce3e17fec9b36c9895b4d64c5a3e]

Deleted [[us.gcr.io/apache-beam-testing/java-postcommit-it/java:20230403035738] (referencing [us.gcr.io/apache-beam-testing/java-postcommit-it/java@sha256:e6a173516fbc9faca01ab79b5032a8da7dc4ce3e17fec9b36c9895b4d64c5a3e])].
Removing untagged image us.gcr.io/apache-beam-testing/java-postcommit-it/java@sha256:e6a173516fbc9faca01ab79b5032a8da7dc4ce3e17fec9b36c9895b4d64c5a3e
Digests:
- us.gcr.io/apache-beam-testing/java-postcommit-it/java@sha256:e6a173516fbc9faca01ab79b5032a8da7dc4ce3e17fec9b36c9895b4d64c5a3e
Deleted [us.gcr.io/apache-beam-testing/java-postcommit-it/java@sha256:e6a173516fbc9faca01ab79b5032a8da7dc4ce3e17fec9b36c9895b4d64c5a3e].

FAILURE: Build failed with an exception.

* What went wrong:
Execution failed for task ':runners:google-cloud-dataflow-java:googleCloudPlatformRunnerV2IntegrationTest'.
> There were failing tests. See the report at: file://<https://ci-beam.apache.org/job/beam_PostCommit_Java_DataflowV2/ws/src/runners/google-cloud-dataflow-java/build/reports/tests/googleCloudPlatformRunnerV2IntegrationTest/index.html>

* Try:
> Run with --stacktrace option to get the stack trace.
> Run with --info or --debug option to get more log output.

* Get more help at https://help.gradle.org

Deprecated Gradle features were used in this build, making it incompatible with Gradle 8.0.

You can use '--warning-mode all' to show the individual deprecation warnings and determine if they come from your own scripts or plugins.

See https://docs.gradle.org/7.5.1/userguide/command_line_interface.html#sec:command_line_warnings

Execution optimizations have been disabled for 1 invalid unit(s) of work during this build to ensure correctness.
Please consult deprecation warnings for more details.

BUILD FAILED in 2h 49m 42s
152 actionable tasks: 98 executed, 50 from cache, 4 up-to-date

Publishing build scan...
https://gradle.com/s/vsdate6lsfe32

Build step 'Invoke Gradle script' changed build result to FAILURE
Build step 'Invoke Gradle script' marked build as failure

---------------------------------------------------------------------
To unsubscribe, e-mail: builds-unsubscribe@beam.apache.org
For additional commands, e-mail: builds-help@beam.apache.org


Build failed in Jenkins: beam_PostCommit_Java_DataflowV2 #2873

Posted by Apache Jenkins Server <je...@builds.apache.org>.
See <https://ci-beam.apache.org/job/beam_PostCommit_Java_DataflowV2/2873/display/redirect>

Changes:


------------------------------------------
[...truncated 68.10 KB...]

#4 [ 1/18] FROM docker.io/library/eclipse-temurin:8@sha256:005d3189b2ec1612c3ade6eadabd1935c312f03aa7905cf0528e9d71980ad512
#4 resolve docker.io/library/eclipse-temurin:8@sha256:005d3189b2ec1612c3ade6eadabd1935c312f03aa7905cf0528e9d71980ad512 0.0s done
#4 CACHED

#5 [internal] load build context
#5 transferring context: 46.71MB 0.6s done
#5 DONE 0.6s

#6 [ 2/18] ADD target/slf4j-api.jar /opt/apache/beam/jars/
#6 DONE 2.2s

#7 [ 3/18] ADD target/slf4j-jdk14.jar /opt/apache/beam/jars/
#7 DONE 0.1s

#8 [ 4/18] ADD target/jcl-over-slf4j.jar /opt/apache/beam/jars/
#8 DONE 0.1s

#9 [ 5/18] ADD target/log4j-over-slf4j.jar /opt/apache/beam/jars/
#9 DONE 0.1s

#10 [ 6/18] ADD target/log4j-to-slf4j.jar /opt/apache/beam/jars/
#10 DONE 0.1s

#11 [ 7/18] ADD target/beam-sdks-java-harness.jar /opt/apache/beam/jars/
#11 DONE 0.1s

#12 [ 8/18] COPY target/jamm.jar target/open-module-agent*.jar /opt/apache/beam/jars/
#12 DONE 0.1s

#13 [ 9/18] COPY target/linux_amd64/boot /opt/apache/beam/
#13 DONE 0.3s

#14 [10/18] COPY target/LICENSE /opt/apache/beam/
#14 DONE 0.1s

#15 [11/18] COPY target/NOTICE /opt/apache/beam/
#15 DONE 0.1s

#16 [12/18] ADD target/third_party_licenses /opt/apache/beam/third_party_licenses/
#16 DONE 0.4s

#17 [13/18] COPY target/LICENSE target/options/* /opt/apache/beam/options/
#17 DONE 0.5s

#18 [14/18] RUN rm /opt/apache/beam/options/LICENSE
#18 DONE 0.6s

#19 [15/18] COPY target/LICENSE target/go-licenses/* /opt/apache/beam/third_party_licenses/golang/
#19 DONE 0.1s

#20 [16/18] RUN rm /opt/apache/beam/third_party_licenses/golang/LICENSE
#20 DONE 0.6s

#21 [17/18] RUN if [ "true" = "false" ] ; then     rm -rf /opt/apache/beam/third_party_licenses ;    fi
#21 DONE 0.6s

#22 [18/18] COPY target/profiler/* /opt/google_cloud_profiler/
#22 DONE 0.1s

#23 exporting to image
#23 exporting layers
#23 exporting layers 0.3s done
#23 writing image sha256:8072353579ff7bdd7f8a1ac95afdda2a454c157f6fb3c8ea629ee0c1252d2f6d done
#23 naming to docker.io/apache/beam_java8_sdk:2.47.0.dev done
#23 DONE 0.3s

> Task :runners:google-cloud-dataflow-java:buildAndPushDockerJavaContainer
WARNING: `gcloud docker` will not be supported for Docker client versions above 18.03.

As an alternative, use `gcloud auth configure-docker` to configure `docker` to
use `gcloud` as a credential helper, then use `docker` as you would for non-GCR
registries, e.g. `docker pull gcr.io/project-id/my-image`. Add
`--verbosity=error` to silence this warning: `gcloud docker
--verbosity=error -- pull gcr.io/project-id/my-image`.

See: https://cloud.google.com/container-registry/docs/support/deprecation-notices#gcloud-docker

The push refers to repository [us.gcr.io/apache-beam-testing/java-postcommit-it/java]
f2cee4f84c16: Preparing
5f70bf18a086: Preparing
ebafc64c3014: Preparing
58c4b9f170d8: Preparing
6892cd7ac3a8: Preparing
cd0f716b2b0d: Preparing
5820a0d65b88: Preparing
39b069a1685e: Preparing
76ca7ca59e5e: Preparing
8b7589215eb9: Preparing
3b9d6c6d9d12: Preparing
380f6d5c9f12: Preparing
152bd0cf13e7: Preparing
e4aee811e4ab: Preparing
1f68349b68b0: Preparing
1a1d76667698: Preparing
83fac9ae7c4a: Preparing
533af4d05d89: Preparing
d09fdd9ad3ef: Preparing
04d1dcab20cb: Preparing
b93c1bd012ab: Preparing
380f6d5c9f12: Waiting
152bd0cf13e7: Waiting
e4aee811e4ab: Waiting
1f68349b68b0: Waiting
1a1d76667698: Waiting
83fac9ae7c4a: Waiting
533af4d05d89: Waiting
d09fdd9ad3ef: Waiting
04d1dcab20cb: Waiting
cd0f716b2b0d: Waiting
5820a0d65b88: Waiting
39b069a1685e: Waiting
b93c1bd012ab: Waiting
76ca7ca59e5e: Waiting
8b7589215eb9: Waiting
3b9d6c6d9d12: Waiting
5f70bf18a086: Layer already exists
ebafc64c3014: Pushed
6892cd7ac3a8: Pushed
cd0f716b2b0d: Pushed
58c4b9f170d8: Pushed
f2cee4f84c16: Pushed
76ca7ca59e5e: Pushed
39b069a1685e: Pushed
5820a0d65b88: Pushed
3b9d6c6d9d12: Pushed
152bd0cf13e7: Pushed
380f6d5c9f12: Pushed
8b7589215eb9: Pushed
533af4d05d89: Layer already exists
d09fdd9ad3ef: Layer already exists
04d1dcab20cb: Layer already exists
b93c1bd012ab: Layer already exists
e4aee811e4ab: Pushed
1f68349b68b0: Pushed
83fac9ae7c4a: Pushed
1a1d76667698: Pushed
20230402215737: digest: sha256:b95052df740e4f70ac6d5b66fdf9a38ed09f7096ffef82a650ab1b952c1a6985 size: 4710

> Task :runners:google-cloud-dataflow-java:coreSDKJavaRunnerV2IntegrationTest NO-SOURCE
> Task :runners:google-cloud-dataflow-java:examplesJavaRunnerV2IntegrationTest

***********************************************************
***********************************************************
**********************Set Up Pubsub************************
The Pub/Sub topic has been set up for this example: projects/apache-beam-testing/topics/testpipeline-jenkins-0402215931-982bf8e9
The Pub/Sub subscription has been set up for this example: projects/apache-beam-testing/subscriptions/testpipeline-jenkins-0402215931-982bf8e9
*************************Tear Down*************************
The Pub/Sub topic has been deleted: projects/apache-beam-testing/topics/testpipeline-jenkins-0402215931-982bf8e9
The Pub/Sub subscription has been deleted: projects/apache-beam-testing/subscriptions/testpipeline-jenkins-0402215931-982bf8e9
***********************************************************
***********************************************************

***********************************************************
***********************************************************
**********************Set Up Pubsub************************
The Pub/Sub topic has been set up for this example: projects/apache-beam-testing/topics/testpipeline-jenkins-0402215931-94f09419
The Pub/Sub subscription has been set up for this example: projects/apache-beam-testing/subscriptions/testpipeline-jenkins-0402215931-94f09419
*************************Tear Down*************************
The Pub/Sub topic has been deleted: projects/apache-beam-testing/topics/testpipeline-jenkins-0402215931-94f09419
The Pub/Sub subscription has been deleted: projects/apache-beam-testing/subscriptions/testpipeline-jenkins-0402215931-94f09419
***********************************************************
***********************************************************

> Task :runners:google-cloud-dataflow-java:googleCloudPlatformRunnerV2IntegrationTest

org.apache.beam.sdk.io.gcp.bigquery.BigQueryIOStorageWriteIT > testBigQueryStorageWrite30MProtoALO FAILED
    java.lang.RuntimeException at BigQueryIOStorageWriteIT.java:114

org.apache.beam.sdk.io.gcp.firestore.it.FirestoreV1IT > batchWrite_partialFailureOutputsToDeadLetterQueue FAILED
    java.util.concurrent.ExecutionException at FirestoreV1IT.java:96
        Caused by: com.google.api.gax.rpc.InvalidArgumentException at ApiExceptionFactory.java:92
            Caused by: io.grpc.StatusRuntimeException at Status.java:539

org.apache.beam.sdk.io.gcp.firestore.it.FirestoreV1IT > batchGet FAILED
    java.util.concurrent.ExecutionException at AbstractFuture.java:588
        Caused by: com.google.api.gax.rpc.InvalidArgumentException at ApiExceptionFactory.java:92
            Caused by: io.grpc.StatusRuntimeException at Status.java:539

org.apache.beam.sdk.io.gcp.firestore.it.FirestoreV1IT > partitionQuery FAILED
    java.util.concurrent.ExecutionException at AbstractFuture.java:588
        Caused by: com.google.api.gax.rpc.InvalidArgumentException at ApiExceptionFactory.java:92
            Caused by: io.grpc.StatusRuntimeException at Status.java:539

org.apache.beam.sdk.io.gcp.firestore.it.FirestoreV1IT > listCollections FAILED
    java.util.concurrent.ExecutionException at AbstractFuture.java:588
        Caused by: com.google.api.gax.rpc.InvalidArgumentException at ApiExceptionFactory.java:92
            Caused by: io.grpc.StatusRuntimeException at Status.java:539

org.apache.beam.sdk.io.gcp.firestore.it.FirestoreV1IT > write FAILED
    java.lang.RuntimeException at TestDataflowRunner.java:141

org.apache.beam.sdk.io.gcp.firestore.it.FirestoreV1IT > listDocuments FAILED
    java.util.concurrent.ExecutionException at AbstractFuture.java:588
        Caused by: com.google.api.gax.rpc.InvalidArgumentException at ApiExceptionFactory.java:92
            Caused by: io.grpc.StatusRuntimeException at Status.java:539

org.apache.beam.sdk.io.gcp.firestore.it.FirestoreV1IT > runQuery FAILED
    java.util.concurrent.ExecutionException at AbstractFuture.java:588
        Caused by: com.google.api.gax.rpc.InvalidArgumentException at ApiExceptionFactory.java:92
            Caused by: io.grpc.StatusRuntimeException at Status.java:539

93 tests completed, 8 failed, 2 skipped

> Task :runners:google-cloud-dataflow-java:googleCloudPlatformRunnerV2IntegrationTest FAILED

> Task :runners:google-cloud-dataflow-java:cleanUpDockerJavaImages
Untagged: us.gcr.io/apache-beam-testing/java-postcommit-it/java:20230402215737
Untagged: us.gcr.io/apache-beam-testing/java-postcommit-it/java@sha256:b95052df740e4f70ac6d5b66fdf9a38ed09f7096ffef82a650ab1b952c1a6985
Deleted: sha256:8072353579ff7bdd7f8a1ac95afdda2a454c157f6fb3c8ea629ee0c1252d2f6d
WARNING: Successfully resolved tag to sha256, but it is recommended to use sha256 directly.
Tag: [us.gcr.io/apache-beam-testing/java-postcommit-it/java:20230402215737]
- referencing digest: [us.gcr.io/apache-beam-testing/java-postcommit-it/java@sha256:b95052df740e4f70ac6d5b66fdf9a38ed09f7096ffef82a650ab1b952c1a6985]

Deleted [[us.gcr.io/apache-beam-testing/java-postcommit-it/java:20230402215737] (referencing [us.gcr.io/apache-beam-testing/java-postcommit-it/java@sha256:b95052df740e4f70ac6d5b66fdf9a38ed09f7096ffef82a650ab1b952c1a6985])].
Removing untagged image us.gcr.io/apache-beam-testing/java-postcommit-it/java@sha256:b95052df740e4f70ac6d5b66fdf9a38ed09f7096ffef82a650ab1b952c1a6985
Digests:
- us.gcr.io/apache-beam-testing/java-postcommit-it/java@sha256:b95052df740e4f70ac6d5b66fdf9a38ed09f7096ffef82a650ab1b952c1a6985
Deleted [us.gcr.io/apache-beam-testing/java-postcommit-it/java@sha256:b95052df740e4f70ac6d5b66fdf9a38ed09f7096ffef82a650ab1b952c1a6985].

FAILURE: Build failed with an exception.

* What went wrong:
Execution failed for task ':runners:google-cloud-dataflow-java:googleCloudPlatformRunnerV2IntegrationTest'.
> There were failing tests. See the report at: file://<https://ci-beam.apache.org/job/beam_PostCommit_Java_DataflowV2/ws/src/runners/google-cloud-dataflow-java/build/reports/tests/googleCloudPlatformRunnerV2IntegrationTest/index.html>

* Try:
> Run with --stacktrace option to get the stack trace.
> Run with --info or --debug option to get more log output.

* Get more help at https://help.gradle.org

Deprecated Gradle features were used in this build, making it incompatible with Gradle 8.0.

You can use '--warning-mode all' to show the individual deprecation warnings and determine if they come from your own scripts or plugins.

See https://docs.gradle.org/7.5.1/userguide/command_line_interface.html#sec:command_line_warnings

Execution optimizations have been disabled for 1 invalid unit(s) of work during this build to ensure correctness.
Please consult deprecation warnings for more details.

BUILD FAILED in 2h 47m 53s
152 actionable tasks: 108 executed, 40 from cache, 4 up-to-date

Publishing build scan...
https://gradle.com/s/pnqacssqkaipa

Build step 'Invoke Gradle script' changed build result to FAILURE
Build step 'Invoke Gradle script' marked build as failure

---------------------------------------------------------------------
To unsubscribe, e-mail: builds-unsubscribe@beam.apache.org
For additional commands, e-mail: builds-help@beam.apache.org


Build failed in Jenkins: beam_PostCommit_Java_DataflowV2 #2872

Posted by Apache Jenkins Server <je...@builds.apache.org>.
See <https://ci-beam.apache.org/job/beam_PostCommit_Java_DataflowV2/2872/display/redirect>

Changes:


------------------------------------------
[...truncated 67.59 KB...]
#3 DONE 0.3s

#4 [ 1/18] FROM docker.io/library/eclipse-temurin:8@sha256:005d3189b2ec1612c3ade6eadabd1935c312f03aa7905cf0528e9d71980ad512
#4 resolve docker.io/library/eclipse-temurin:8@sha256:005d3189b2ec1612c3ade6eadabd1935c312f03aa7905cf0528e9d71980ad512 0.0s done
#4 CACHED

#5 [internal] load build context
#5 transferring context: 46.43MB 0.3s done
#5 DONE 0.3s

#6 [ 2/18] ADD target/slf4j-api.jar /opt/apache/beam/jars/
#6 DONE 1.0s

#7 [ 3/18] ADD target/slf4j-jdk14.jar /opt/apache/beam/jars/
#7 DONE 0.1s

#8 [ 4/18] ADD target/jcl-over-slf4j.jar /opt/apache/beam/jars/
#8 DONE 0.1s

#9 [ 5/18] ADD target/log4j-over-slf4j.jar /opt/apache/beam/jars/
#9 DONE 0.1s

#10 [ 6/18] ADD target/log4j-to-slf4j.jar /opt/apache/beam/jars/
#10 DONE 0.1s

#11 [ 7/18] ADD target/beam-sdks-java-harness.jar /opt/apache/beam/jars/
#11 DONE 0.1s

#12 [ 8/18] COPY target/jamm.jar target/open-module-agent*.jar /opt/apache/beam/jars/
#12 DONE 0.1s

#13 [ 9/18] COPY target/linux_amd64/boot /opt/apache/beam/
#13 DONE 0.2s

#14 [10/18] COPY target/LICENSE /opt/apache/beam/
#14 DONE 0.1s

#15 [11/18] COPY target/NOTICE /opt/apache/beam/
#15 DONE 0.1s

#16 [12/18] ADD target/third_party_licenses /opt/apache/beam/third_party_licenses/
#16 DONE 0.2s

#17 [13/18] COPY target/LICENSE target/options/* /opt/apache/beam/options/
#17 DONE 0.1s

#18 [14/18] RUN rm /opt/apache/beam/options/LICENSE
#18 DONE 0.6s

#19 [15/18] COPY target/LICENSE target/go-licenses/* /opt/apache/beam/third_party_licenses/golang/
#19 DONE 0.1s

#20 [16/18] RUN rm /opt/apache/beam/third_party_licenses/golang/LICENSE
#20 DONE 0.4s

#21 [17/18] RUN if [ "true" = "false" ] ; then     rm -rf /opt/apache/beam/third_party_licenses ;    fi
#21 DONE 0.4s

#22 [18/18] COPY target/profiler/* /opt/google_cloud_profiler/
#22 DONE 0.1s

#23 exporting to image
#23 exporting layers
#23 exporting layers 0.3s done
#23 writing image sha256:fa2455ae79511d16c35075cbb8f7fb0cd388e4f1685ee4806069f1690bfa9ad1 done
#23 naming to docker.io/apache/beam_java8_sdk:2.47.0.dev done
#23 DONE 0.3s

> Task :runners:google-cloud-dataflow-java:buildAndPushDockerJavaContainer
WARNING: `gcloud docker` will not be supported for Docker client versions above 18.03.

As an alternative, use `gcloud auth configure-docker` to configure `docker` to
use `gcloud` as a credential helper, then use `docker` as you would for non-GCR
registries, e.g. `docker pull gcr.io/project-id/my-image`. Add
`--verbosity=error` to silence this warning: `gcloud docker
--verbosity=error -- pull gcr.io/project-id/my-image`.

See: https://cloud.google.com/container-registry/docs/support/deprecation-notices#gcloud-docker

The push refers to repository [us.gcr.io/apache-beam-testing/java-postcommit-it/java]
cfcef8284147: Preparing
5f70bf18a086: Preparing
90e2afcd0469: Preparing
dbb60509ca18: Preparing
aa9f49c541fc: Preparing
88a2c38a0954: Preparing
765501c77e1c: Preparing
d56dd3d26859: Preparing
24c59429179e: Preparing
ded6700d5c5c: Preparing
d4699a0e6f58: Preparing
0189166208a3: Preparing
2e56616f3847: Preparing
76ff57739a15: Preparing
5d2ee03f018d: Preparing
df7190d2ea00: Preparing
992af7777ba4: Preparing
533af4d05d89: Preparing
d09fdd9ad3ef: Preparing
04d1dcab20cb: Preparing
b93c1bd012ab: Preparing
2e56616f3847: Waiting
76ff57739a15: Waiting
5d2ee03f018d: Waiting
df7190d2ea00: Waiting
992af7777ba4: Waiting
88a2c38a0954: Waiting
533af4d05d89: Waiting
765501c77e1c: Waiting
d09fdd9ad3ef: Waiting
24c59429179e: Waiting
04d1dcab20cb: Waiting
d56dd3d26859: Waiting
ded6700d5c5c: Waiting
b93c1bd012ab: Waiting
0189166208a3: Waiting
5f70bf18a086: Layer already exists
aa9f49c541fc: Pushed
88a2c38a0954: Pushed
90e2afcd0469: Pushed
dbb60509ca18: Pushed
d56dd3d26859: Pushed
24c59429179e: Pushed
cfcef8284147: Pushed
2e56616f3847: Pushed
d4699a0e6f58: Pushed
0189166208a3: Pushed
ded6700d5c5c: Pushed
5d2ee03f018d: Pushed
76ff57739a15: Pushed
533af4d05d89: Layer already exists
d09fdd9ad3ef: Layer already exists
b93c1bd012ab: Layer already exists
04d1dcab20cb: Layer already exists
df7190d2ea00: Pushed
992af7777ba4: Pushed
765501c77e1c: Pushed
20230402155741: digest: sha256:670e774996d69cdd9485d4d215d0016f9c64dcbca1da30e803073320461da1ea size: 4710

> Task :runners:google-cloud-dataflow-java:coreSDKJavaRunnerV2IntegrationTest NO-SOURCE
> Task :runners:google-cloud-dataflow-java:examplesJavaRunnerV2IntegrationTest

***********************************************************
***********************************************************
**********************Set Up Pubsub************************
The Pub/Sub topic has been set up for this example: projects/apache-beam-testing/topics/testpipeline-jenkins-0402155834-4f5c150f
The Pub/Sub subscription has been set up for this example: projects/apache-beam-testing/subscriptions/testpipeline-jenkins-0402155834-4f5c150f
*************************Tear Down*************************
The Pub/Sub topic has been deleted: projects/apache-beam-testing/topics/testpipeline-jenkins-0402155834-4f5c150f
The Pub/Sub subscription has been deleted: projects/apache-beam-testing/subscriptions/testpipeline-jenkins-0402155834-4f5c150f
***********************************************************
***********************************************************

***********************************************************
***********************************************************
**********************Set Up Pubsub************************
The Pub/Sub topic has been set up for this example: projects/apache-beam-testing/topics/testpipeline-jenkins-0402155834-e3e0a560
The Pub/Sub subscription has been set up for this example: projects/apache-beam-testing/subscriptions/testpipeline-jenkins-0402155834-e3e0a560
*************************Tear Down*************************
The Pub/Sub topic has been deleted: projects/apache-beam-testing/topics/testpipeline-jenkins-0402155834-e3e0a560
The Pub/Sub subscription has been deleted: projects/apache-beam-testing/subscriptions/testpipeline-jenkins-0402155834-e3e0a560
***********************************************************
***********************************************************

> Task :runners:google-cloud-dataflow-java:googleCloudPlatformRunnerV2IntegrationTest

org.apache.beam.sdk.io.gcp.bigquery.BigQueryIOStorageWriteIT > testBigQueryStorageWrite30MProtoALO FAILED
    java.lang.RuntimeException at BigQueryIOStorageWriteIT.java:114

org.apache.beam.sdk.io.gcp.firestore.it.FirestoreV1IT > batchWrite_partialFailureOutputsToDeadLetterQueue FAILED
    java.util.concurrent.ExecutionException at FirestoreV1IT.java:96
        Caused by: com.google.api.gax.rpc.InvalidArgumentException at ApiExceptionFactory.java:92
            Caused by: io.grpc.StatusRuntimeException at Status.java:539

org.apache.beam.sdk.io.gcp.firestore.it.FirestoreV1IT > batchGet FAILED
    java.util.concurrent.ExecutionException at AbstractFuture.java:588
        Caused by: com.google.api.gax.rpc.InvalidArgumentException at ApiExceptionFactory.java:92
            Caused by: io.grpc.StatusRuntimeException at Status.java:539

org.apache.beam.sdk.io.gcp.firestore.it.FirestoreV1IT > partitionQuery FAILED
    java.util.concurrent.ExecutionException at AbstractFuture.java:588
        Caused by: com.google.api.gax.rpc.InvalidArgumentException at ApiExceptionFactory.java:92
            Caused by: io.grpc.StatusRuntimeException at Status.java:539

org.apache.beam.sdk.io.gcp.firestore.it.FirestoreV1IT > listCollections FAILED
    java.util.concurrent.ExecutionException at AbstractFuture.java:588
        Caused by: com.google.api.gax.rpc.InvalidArgumentException at ApiExceptionFactory.java:92
            Caused by: io.grpc.StatusRuntimeException at Status.java:539

org.apache.beam.sdk.io.gcp.firestore.it.FirestoreV1IT > write FAILED
    java.lang.RuntimeException at TestDataflowRunner.java:141

org.apache.beam.sdk.io.gcp.firestore.it.FirestoreV1IT > listDocuments FAILED
    java.util.concurrent.ExecutionException at AbstractFuture.java:588
        Caused by: com.google.api.gax.rpc.InvalidArgumentException at ApiExceptionFactory.java:92
            Caused by: io.grpc.StatusRuntimeException at Status.java:539

org.apache.beam.sdk.io.gcp.firestore.it.FirestoreV1IT > runQuery FAILED
    java.util.concurrent.ExecutionException at AbstractFuture.java:588
        Caused by: com.google.api.gax.rpc.InvalidArgumentException at ApiExceptionFactory.java:92
            Caused by: io.grpc.StatusRuntimeException at Status.java:539

93 tests completed, 8 failed, 2 skipped

> Task :runners:google-cloud-dataflow-java:googleCloudPlatformRunnerV2IntegrationTest FAILED

> Task :runners:google-cloud-dataflow-java:cleanUpDockerJavaImages
Untagged: us.gcr.io/apache-beam-testing/java-postcommit-it/java:20230402155741
Untagged: us.gcr.io/apache-beam-testing/java-postcommit-it/java@sha256:670e774996d69cdd9485d4d215d0016f9c64dcbca1da30e803073320461da1ea
Deleted: sha256:fa2455ae79511d16c35075cbb8f7fb0cd388e4f1685ee4806069f1690bfa9ad1
WARNING: Successfully resolved tag to sha256, but it is recommended to use sha256 directly.
Tag: [us.gcr.io/apache-beam-testing/java-postcommit-it/java:20230402155741]
- referencing digest: [us.gcr.io/apache-beam-testing/java-postcommit-it/java@sha256:670e774996d69cdd9485d4d215d0016f9c64dcbca1da30e803073320461da1ea]

Deleted [[us.gcr.io/apache-beam-testing/java-postcommit-it/java:20230402155741] (referencing [us.gcr.io/apache-beam-testing/java-postcommit-it/java@sha256:670e774996d69cdd9485d4d215d0016f9c64dcbca1da30e803073320461da1ea])].
Removing untagged image us.gcr.io/apache-beam-testing/java-postcommit-it/java@sha256:670e774996d69cdd9485d4d215d0016f9c64dcbca1da30e803073320461da1ea
Digests:
- us.gcr.io/apache-beam-testing/java-postcommit-it/java@sha256:670e774996d69cdd9485d4d215d0016f9c64dcbca1da30e803073320461da1ea
Deleted [us.gcr.io/apache-beam-testing/java-postcommit-it/java@sha256:670e774996d69cdd9485d4d215d0016f9c64dcbca1da30e803073320461da1ea].

FAILURE: Build failed with an exception.

* What went wrong:
Execution failed for task ':runners:google-cloud-dataflow-java:googleCloudPlatformRunnerV2IntegrationTest'.
> There were failing tests. See the report at: file://<https://ci-beam.apache.org/job/beam_PostCommit_Java_DataflowV2/ws/src/runners/google-cloud-dataflow-java/build/reports/tests/googleCloudPlatformRunnerV2IntegrationTest/index.html>

* Try:
> Run with --stacktrace option to get the stack trace.
> Run with --info or --debug option to get more log output.

* Get more help at https://help.gradle.org

Deprecated Gradle features were used in this build, making it incompatible with Gradle 8.0.

You can use '--warning-mode all' to show the individual deprecation warnings and determine if they come from your own scripts or plugins.

See https://docs.gradle.org/7.5.1/userguide/command_line_interface.html#sec:command_line_warnings

Execution optimizations have been disabled for 1 invalid unit(s) of work during this build to ensure correctness.
Please consult deprecation warnings for more details.

BUILD FAILED in 2h 48m 9s
152 actionable tasks: 98 executed, 50 from cache, 4 up-to-date

Publishing build scan...
https://gradle.com/s/nne4g2dp64gk6

Build step 'Invoke Gradle script' changed build result to FAILURE
Build step 'Invoke Gradle script' marked build as failure

---------------------------------------------------------------------
To unsubscribe, e-mail: builds-unsubscribe@beam.apache.org
For additional commands, e-mail: builds-help@beam.apache.org


Build failed in Jenkins: beam_PostCommit_Java_DataflowV2 #2871

Posted by Apache Jenkins Server <je...@builds.apache.org>.
See <https://ci-beam.apache.org/job/beam_PostCommit_Java_DataflowV2/2871/display/redirect>

Changes:


------------------------------------------
[...truncated 66.36 KB...]
#3 [internal] load metadata for docker.io/library/eclipse-temurin:8
#3 DONE 0.3s

#4 [ 1/18] FROM docker.io/library/eclipse-temurin:8@sha256:005d3189b2ec1612c3ade6eadabd1935c312f03aa7905cf0528e9d71980ad512
#4 resolve docker.io/library/eclipse-temurin:8@sha256:005d3189b2ec1612c3ade6eadabd1935c312f03aa7905cf0528e9d71980ad512 0.0s done
#4 CACHED

#5 [internal] load build context
#5 transferring context: 46.43MB 0.3s done
#5 DONE 0.4s

#6 [ 2/18] ADD target/slf4j-api.jar /opt/apache/beam/jars/
#6 DONE 1.0s

#7 [ 3/18] ADD target/slf4j-jdk14.jar /opt/apache/beam/jars/
#7 DONE 0.1s

#8 [ 4/18] ADD target/jcl-over-slf4j.jar /opt/apache/beam/jars/
#8 DONE 0.1s

#9 [ 5/18] ADD target/log4j-over-slf4j.jar /opt/apache/beam/jars/
#9 DONE 0.1s

#10 [ 6/18] ADD target/log4j-to-slf4j.jar /opt/apache/beam/jars/
#10 DONE 0.1s

#11 [ 7/18] ADD target/beam-sdks-java-harness.jar /opt/apache/beam/jars/
#11 DONE 0.1s

#12 [ 8/18] COPY target/jamm.jar target/open-module-agent*.jar /opt/apache/beam/jars/
#12 DONE 0.1s

#13 [ 9/18] COPY target/linux_amd64/boot /opt/apache/beam/
#13 DONE 0.2s

#14 [10/18] COPY target/LICENSE /opt/apache/beam/
#14 DONE 0.1s

#15 [11/18] COPY target/NOTICE /opt/apache/beam/
#15 DONE 0.1s

#16 [12/18] ADD target/third_party_licenses /opt/apache/beam/third_party_licenses/
#16 DONE 0.2s

#17 [13/18] COPY target/LICENSE target/options/* /opt/apache/beam/options/
#17 DONE 0.1s

#18 [14/18] RUN rm /opt/apache/beam/options/LICENSE
#18 DONE 0.3s

#19 [15/18] COPY target/LICENSE target/go-licenses/* /opt/apache/beam/third_party_licenses/golang/
#19 DONE 0.0s

#20 [16/18] RUN rm /opt/apache/beam/third_party_licenses/golang/LICENSE
#20 DONE 0.4s

#21 [17/18] RUN if [ "true" = "false" ] ; then     rm -rf /opt/apache/beam/third_party_licenses ;    fi
#21 DONE 0.4s

#22 [18/18] COPY target/profiler/* /opt/google_cloud_profiler/
#22 DONE 0.1s

#23 exporting to image
#23 exporting layers
#23 exporting layers 0.2s done
#23 writing image sha256:7f7e6c77eb7cc0358fac86e7711ff748c6cc9b8b2bc66792a1e2b15d5fbddcc2 done
#23 naming to docker.io/apache/beam_java8_sdk:2.47.0.dev done
#23 DONE 0.2s

> Task :runners:google-cloud-dataflow-java:buildAndPushDockerJavaContainer
WARNING: `gcloud docker` will not be supported for Docker client versions above 18.03.

As an alternative, use `gcloud auth configure-docker` to configure `docker` to
use `gcloud` as a credential helper, then use `docker` as you would for non-GCR
registries, e.g. `docker pull gcr.io/project-id/my-image`. Add
`--verbosity=error` to silence this warning: `gcloud docker
--verbosity=error -- pull gcr.io/project-id/my-image`.

See: https://cloud.google.com/container-registry/docs/support/deprecation-notices#gcloud-docker

The push refers to repository [us.gcr.io/apache-beam-testing/java-postcommit-it/java]
ccd3ed5bf2f1: Preparing
5f70bf18a086: Preparing
06998f38dac9: Preparing
58f459c86627: Preparing
e3e135d60842: Preparing
fa09a63c817c: Preparing
f092d5c91903: Preparing
80e5596b580a: Preparing
36c4595b0787: Preparing
f511f33e39c2: Preparing
18218d0f2c61: Preparing
2f98155857b2: Preparing
78f29bfca95b: Preparing
589e11d2a874: Preparing
d93a51677782: Preparing
d7eaa57e135f: Preparing
1605bcede3e5: Preparing
533af4d05d89: Preparing
d09fdd9ad3ef: Preparing
04d1dcab20cb: Preparing
b93c1bd012ab: Preparing
36c4595b0787: Waiting
78f29bfca95b: Waiting
d7eaa57e135f: Waiting
589e11d2a874: Waiting
1605bcede3e5: Waiting
d93a51677782: Waiting
533af4d05d89: Waiting
fa09a63c817c: Waiting
b93c1bd012ab: Waiting
f092d5c91903: Waiting
d09fdd9ad3ef: Waiting
18218d0f2c61: Waiting
f511f33e39c2: Waiting
2f98155857b2: Waiting
80e5596b580a: Waiting
5f70bf18a086: Layer already exists
e3e135d60842: Pushed
06998f38dac9: Pushed
fa09a63c817c: Pushed
58f459c86627: Pushed
ccd3ed5bf2f1: Pushed
80e5596b580a: Pushed
36c4595b0787: Pushed
18218d0f2c61: Pushed
f092d5c91903: Pushed
f511f33e39c2: Pushed
78f29bfca95b: Pushed
2f98155857b2: Pushed
533af4d05d89: Layer already exists
d09fdd9ad3ef: Layer already exists
04d1dcab20cb: Layer already exists
b93c1bd012ab: Layer already exists
589e11d2a874: Pushed
d93a51677782: Pushed
d7eaa57e135f: Pushed
1605bcede3e5: Pushed
20230402095740: digest: sha256:9cd23d0a3164b172de8850ed47434b8a2fe3e77308772f5acfcf340d9394b6d8 size: 4710

> Task :runners:google-cloud-dataflow-java:coreSDKJavaRunnerV2IntegrationTest NO-SOURCE
> Task :runners:google-cloud-dataflow-java:examplesJavaRunnerV2IntegrationTest

***********************************************************
***********************************************************
**********************Set Up Pubsub************************
The Pub/Sub topic has been set up for this example: projects/apache-beam-testing/topics/testpipeline-jenkins-0402095915-84fb7ca8
The Pub/Sub subscription has been set up for this example: projects/apache-beam-testing/subscriptions/testpipeline-jenkins-0402095915-84fb7ca8
*************************Tear Down*************************
The Pub/Sub topic has been deleted: projects/apache-beam-testing/topics/testpipeline-jenkins-0402095915-84fb7ca8
The Pub/Sub subscription has been deleted: projects/apache-beam-testing/subscriptions/testpipeline-jenkins-0402095915-84fb7ca8
***********************************************************
***********************************************************

***********************************************************
***********************************************************
**********************Set Up Pubsub************************
The Pub/Sub topic has been set up for this example: projects/apache-beam-testing/topics/testpipeline-jenkins-0402095915-4c85bbd1
The Pub/Sub subscription has been set up for this example: projects/apache-beam-testing/subscriptions/testpipeline-jenkins-0402095915-4c85bbd1
*************************Tear Down*************************
The Pub/Sub topic has been deleted: projects/apache-beam-testing/topics/testpipeline-jenkins-0402095915-4c85bbd1
The Pub/Sub subscription has been deleted: projects/apache-beam-testing/subscriptions/testpipeline-jenkins-0402095915-4c85bbd1
***********************************************************
***********************************************************

> Task :runners:google-cloud-dataflow-java:googleCloudPlatformRunnerV2IntegrationTest

org.apache.beam.sdk.io.gcp.bigquery.BigQueryIOStorageWriteIT > testBigQueryStorageWrite30MProtoALO FAILED
    java.lang.RuntimeException at BigQueryIOStorageWriteIT.java:114

org.apache.beam.sdk.io.gcp.firestore.it.FirestoreV1IT > batchWrite_partialFailureOutputsToDeadLetterQueue FAILED
    java.util.concurrent.ExecutionException at FirestoreV1IT.java:96
        Caused by: com.google.api.gax.rpc.InvalidArgumentException at ApiExceptionFactory.java:92
            Caused by: io.grpc.StatusRuntimeException at Status.java:539

org.apache.beam.sdk.io.gcp.firestore.it.FirestoreV1IT > batchGet FAILED
    java.util.concurrent.ExecutionException at AbstractFuture.java:588
        Caused by: com.google.api.gax.rpc.InvalidArgumentException at ApiExceptionFactory.java:92
            Caused by: io.grpc.StatusRuntimeException at Status.java:539

org.apache.beam.sdk.io.gcp.firestore.it.FirestoreV1IT > partitionQuery FAILED
    java.util.concurrent.ExecutionException at AbstractFuture.java:588
        Caused by: com.google.api.gax.rpc.InvalidArgumentException at ApiExceptionFactory.java:92
            Caused by: io.grpc.StatusRuntimeException at Status.java:539

org.apache.beam.sdk.io.gcp.firestore.it.FirestoreV1IT > listCollections FAILED
    java.util.concurrent.ExecutionException at AbstractFuture.java:588
        Caused by: com.google.api.gax.rpc.InvalidArgumentException at ApiExceptionFactory.java:92
            Caused by: io.grpc.StatusRuntimeException at Status.java:539

org.apache.beam.sdk.io.gcp.firestore.it.FirestoreV1IT > write FAILED
    java.lang.RuntimeException at TestDataflowRunner.java:141

org.apache.beam.sdk.io.gcp.firestore.it.FirestoreV1IT > listDocuments FAILED
    java.util.concurrent.ExecutionException at AbstractFuture.java:588
        Caused by: com.google.api.gax.rpc.InvalidArgumentException at ApiExceptionFactory.java:92
            Caused by: io.grpc.StatusRuntimeException at Status.java:539

org.apache.beam.sdk.io.gcp.firestore.it.FirestoreV1IT > runQuery FAILED
    java.util.concurrent.ExecutionException at AbstractFuture.java:588
        Caused by: com.google.api.gax.rpc.InvalidArgumentException at ApiExceptionFactory.java:92
            Caused by: io.grpc.StatusRuntimeException at Status.java:539

93 tests completed, 8 failed, 2 skipped

> Task :runners:google-cloud-dataflow-java:googleCloudPlatformRunnerV2IntegrationTest FAILED

> Task :runners:google-cloud-dataflow-java:cleanUpDockerJavaImages
Untagged: us.gcr.io/apache-beam-testing/java-postcommit-it/java:20230402095740
Untagged: us.gcr.io/apache-beam-testing/java-postcommit-it/java@sha256:9cd23d0a3164b172de8850ed47434b8a2fe3e77308772f5acfcf340d9394b6d8
WARNING: Successfully resolved tag to sha256, but it is recommended to use sha256 directly.
Tag: [us.gcr.io/apache-beam-testing/java-postcommit-it/java:20230402095740]
- referencing digest: [us.gcr.io/apache-beam-testing/java-postcommit-it/java@sha256:9cd23d0a3164b172de8850ed47434b8a2fe3e77308772f5acfcf340d9394b6d8]

Deleted [[us.gcr.io/apache-beam-testing/java-postcommit-it/java:20230402095740] (referencing [us.gcr.io/apache-beam-testing/java-postcommit-it/java@sha256:9cd23d0a3164b172de8850ed47434b8a2fe3e77308772f5acfcf340d9394b6d8])].
Removing untagged image us.gcr.io/apache-beam-testing/java-postcommit-it/java@sha256:9cd23d0a3164b172de8850ed47434b8a2fe3e77308772f5acfcf340d9394b6d8
Digests:
- us.gcr.io/apache-beam-testing/java-postcommit-it/java@sha256:9cd23d0a3164b172de8850ed47434b8a2fe3e77308772f5acfcf340d9394b6d8
Deleted [us.gcr.io/apache-beam-testing/java-postcommit-it/java@sha256:9cd23d0a3164b172de8850ed47434b8a2fe3e77308772f5acfcf340d9394b6d8].

FAILURE: Build failed with an exception.

* What went wrong:
Execution failed for task ':runners:google-cloud-dataflow-java:googleCloudPlatformRunnerV2IntegrationTest'.
> There were failing tests. See the report at: file://<https://ci-beam.apache.org/job/beam_PostCommit_Java_DataflowV2/ws/src/runners/google-cloud-dataflow-java/build/reports/tests/googleCloudPlatformRunnerV2IntegrationTest/index.html>

* Try:
> Run with --stacktrace option to get the stack trace.
> Run with --info or --debug option to get more log output.

* Get more help at https://help.gradle.org

Deprecated Gradle features were used in this build, making it incompatible with Gradle 8.0.

You can use '--warning-mode all' to show the individual deprecation warnings and determine if they come from your own scripts or plugins.

See https://docs.gradle.org/7.5.1/userguide/command_line_interface.html#sec:command_line_warnings

Execution optimizations have been disabled for 1 invalid unit(s) of work during this build to ensure correctness.
Please consult deprecation warnings for more details.

BUILD FAILED in 2h 57m 57s
152 actionable tasks: 98 executed, 50 from cache, 4 up-to-date

Publishing build scan...
https://gradle.com/s/4dlp2zxcckl52

Build step 'Invoke Gradle script' changed build result to FAILURE
Build step 'Invoke Gradle script' marked build as failure

---------------------------------------------------------------------
To unsubscribe, e-mail: builds-unsubscribe@beam.apache.org
For additional commands, e-mail: builds-help@beam.apache.org


Build failed in Jenkins: beam_PostCommit_Java_DataflowV2 #2870

Posted by Apache Jenkins Server <je...@builds.apache.org>.
See <https://ci-beam.apache.org/job/beam_PostCommit_Java_DataflowV2/2870/display/redirect?page=changes>

Changes:

[noreply] Merge pull request #26006: Google Cloud libraries BOM 26.11.0


------------------------------------------
[...truncated 66.33 KB...]
#19 DONE 0.0s

#20 [16/18] RUN rm /opt/apache/beam/third_party_licenses/golang/LICENSE
#20 DONE 0.6s

#21 [17/18] RUN if [ "true" = "false" ] ; then     rm -rf /opt/apache/beam/third_party_licenses ;    fi
#21 DONE 0.5s

#22 [18/18] COPY target/profiler/* /opt/google_cloud_profiler/
#22 DONE 0.1s

#4 [ 1/18] FROM docker.io/library/eclipse-temurin:8@sha256:005d3189b2ec1612c3ade6eadabd1935c312f03aa7905cf0528e9d71980ad512
#4 ...

#23 exporting to image
#23 exporting layers
#23 exporting layers 0.3s done
#23 writing image sha256:49bf40ce656a2c1bfeff422667770e95dc1b66089b0e29b2e342233da4866f20 done
#23 naming to docker.io/apache/beam_java8_sdk:2.47.0.dev done
#23 DONE 0.3s

#4 [ 1/18] FROM docker.io/library/eclipse-temurin:8@sha256:005d3189b2ec1612c3ade6eadabd1935c312f03aa7905cf0528e9d71980ad512

> Task :runners:google-cloud-dataflow-java:buildAndPushDockerJavaContainer
WARNING: `gcloud docker` will not be supported for Docker client versions above 18.03.

As an alternative, use `gcloud auth configure-docker` to configure `docker` to
use `gcloud` as a credential helper, then use `docker` as you would for non-GCR
registries, e.g. `docker pull gcr.io/project-id/my-image`. Add
`--verbosity=error` to silence this warning: `gcloud docker
--verbosity=error -- pull gcr.io/project-id/my-image`.

See: https://cloud.google.com/container-registry/docs/support/deprecation-notices#gcloud-docker

The push refers to repository [us.gcr.io/apache-beam-testing/java-postcommit-it/java]
75273c5e12b0: Preparing
5f70bf18a086: Preparing
cb10259ae016: Preparing
4509f3382846: Preparing
60bde9dd324d: Preparing
63262bbeec6b: Preparing
afd866825f74: Preparing
d54f3614df91: Preparing
a4ebceeebc61: Preparing
c670e6aad4df: Preparing
e4afe3ddb6f0: Preparing
7d2c9cc58653: Preparing
acbeee363d8b: Preparing
5febe45dab54: Preparing
22072b0101ef: Preparing
955cb93c74e8: Preparing
63edd31a4a1c: Preparing
533af4d05d89: Preparing
d09fdd9ad3ef: Preparing
04d1dcab20cb: Preparing
b93c1bd012ab: Preparing
7d2c9cc58653: Waiting
63edd31a4a1c: Waiting
533af4d05d89: Waiting
d09fdd9ad3ef: Waiting
acbeee363d8b: Waiting
afd866825f74: Waiting
d54f3614df91: Waiting
5febe45dab54: Waiting
63262bbeec6b: Waiting
22072b0101ef: Waiting
a4ebceeebc61: Waiting
c670e6aad4df: Waiting
955cb93c74e8: Waiting
e4afe3ddb6f0: Waiting
04d1dcab20cb: Waiting
5f70bf18a086: Layer already exists
4509f3382846: Pushed
cb10259ae016: Pushed
63262bbeec6b: Pushed
60bde9dd324d: Pushed
75273c5e12b0: Pushed
a4ebceeebc61: Pushed
d54f3614df91: Pushed
afd866825f74: Pushed
e4afe3ddb6f0: Pushed
acbeee363d8b: Pushed
c670e6aad4df: Pushed
7d2c9cc58653: Pushed
533af4d05d89: Layer already exists
d09fdd9ad3ef: Layer already exists
04d1dcab20cb: Layer already exists
b93c1bd012ab: Layer already exists
5febe45dab54: Pushed
22072b0101ef: Pushed
955cb93c74e8: Pushed
63edd31a4a1c: Pushed
20230402035741: digest: sha256:61119b85666022e08cc1146763311272235f37df0513dc28a3253bb9327c0632 size: 4710

> Task :sdks:java:io:google-cloud-platform:compileJava
Note: Some input files use or override a deprecated API.
Note: Recompile with -Xlint:deprecation for details.
Note: Some input files use unchecked or unsafe operations.
Note: Recompile with -Xlint:unchecked for details.

> Task :sdks:java:io:google-cloud-platform:classes
> Task :sdks:java:io:google-cloud-platform:jar
> Task :runners:google-cloud-dataflow-java:compileJava
> Task :examples:java:compileJava
> Task :sdks:java:io:google-cloud-platform:compileTestJava
Note: Some input files use or override a deprecated API.
Note: Recompile with -Xlint:deprecation for details.
Note: Some input files use unchecked or unsafe operations.
Note: Recompile with -Xlint:unchecked for details.

> Task :sdks:java:io:google-cloud-platform:testClasses
> Task :sdks:java:io:google-cloud-platform:testJar

> Task :examples:java:compileJava
Note: Some input files use or override a deprecated API.
Note: Recompile with -Xlint:deprecation for details.
Note: Some input files use unchecked or unsafe operations.
Note: Recompile with -Xlint:unchecked for details.

> Task :examples:java:classes
> Task :examples:java:jar

> Task :runners:google-cloud-dataflow-java:compileJava
Note: Some input files use or override a deprecated API.
Note: Recompile with -Xlint:deprecation for details.
Note: Some input files use unchecked or unsafe operations.
Note: Recompile with -Xlint:unchecked for details.

> Task :runners:google-cloud-dataflow-java:classes

> Task :examples:java:compileTestJava
Note: Some input files use or override a deprecated API.
Note: Recompile with -Xlint:deprecation for details.
Note: Some input files use unchecked or unsafe operations.
Note: Recompile with -Xlint:unchecked for details.

> Task :examples:java:testClasses
> Task :runners:google-cloud-dataflow-java:jar
> Task :examples:java:testJar
> Task :runners:google-cloud-dataflow-java:coreSDKJavaRunnerV2IntegrationTest NO-SOURCE
> Task :runners:google-cloud-dataflow-java:examplesJavaRunnerV2IntegrationTest

***********************************************************
***********************************************************
**********************Set Up Pubsub************************
The Pub/Sub topic has been set up for this example: projects/apache-beam-testing/topics/testpipeline-jenkins-0402040137-ecfc0e76
The Pub/Sub subscription has been set up for this example: projects/apache-beam-testing/subscriptions/testpipeline-jenkins-0402040137-ecfc0e76
*************************Tear Down*************************
The Pub/Sub topic has been deleted: projects/apache-beam-testing/topics/testpipeline-jenkins-0402040137-ecfc0e76
The Pub/Sub subscription has been deleted: projects/apache-beam-testing/subscriptions/testpipeline-jenkins-0402040137-ecfc0e76
***********************************************************
***********************************************************

***********************************************************
***********************************************************
**********************Set Up Pubsub************************
The Pub/Sub topic has been set up for this example: projects/apache-beam-testing/topics/testpipeline-jenkins-0402040137-9e2b1b0
The Pub/Sub subscription has been set up for this example: projects/apache-beam-testing/subscriptions/testpipeline-jenkins-0402040137-9e2b1b0
*************************Tear Down*************************
The Pub/Sub topic has been deleted: projects/apache-beam-testing/topics/testpipeline-jenkins-0402040137-9e2b1b0
The Pub/Sub subscription has been deleted: projects/apache-beam-testing/subscriptions/testpipeline-jenkins-0402040137-9e2b1b0
***********************************************************
***********************************************************

> Task :runners:google-cloud-dataflow-java:googleCloudPlatformRunnerV2IntegrationTest

org.apache.beam.sdk.io.gcp.bigquery.BigQueryIOStorageWriteIT > testBigQueryStorageWrite30MProtoALO FAILED
    java.lang.RuntimeException at BigQueryIOStorageWriteIT.java:114

org.apache.beam.sdk.io.gcp.firestore.it.FirestoreV1IT > batchWrite_partialFailureOutputsToDeadLetterQueue FAILED
    java.util.concurrent.ExecutionException at FirestoreV1IT.java:96
        Caused by: com.google.api.gax.rpc.InvalidArgumentException at ApiExceptionFactory.java:92
            Caused by: io.grpc.StatusRuntimeException at Status.java:539

org.apache.beam.sdk.io.gcp.firestore.it.FirestoreV1IT > batchGet FAILED
    java.util.concurrent.ExecutionException at AbstractFuture.java:588
        Caused by: com.google.api.gax.rpc.InvalidArgumentException at ApiExceptionFactory.java:92
            Caused by: io.grpc.StatusRuntimeException at Status.java:539

org.apache.beam.sdk.io.gcp.firestore.it.FirestoreV1IT > partitionQuery FAILED
    java.util.concurrent.ExecutionException at AbstractFuture.java:588
        Caused by: com.google.api.gax.rpc.InvalidArgumentException at ApiExceptionFactory.java:92
            Caused by: io.grpc.StatusRuntimeException at Status.java:539

org.apache.beam.sdk.io.gcp.firestore.it.FirestoreV1IT > listCollections FAILED
    java.util.concurrent.ExecutionException at AbstractFuture.java:588
        Caused by: com.google.api.gax.rpc.InvalidArgumentException at ApiExceptionFactory.java:92
            Caused by: io.grpc.StatusRuntimeException at Status.java:539

org.apache.beam.sdk.io.gcp.firestore.it.FirestoreV1IT > write FAILED
    java.lang.RuntimeException at TestDataflowRunner.java:141

org.apache.beam.sdk.io.gcp.firestore.it.FirestoreV1IT > listDocuments FAILED
    java.util.concurrent.ExecutionException at AbstractFuture.java:588
        Caused by: com.google.api.gax.rpc.InvalidArgumentException at ApiExceptionFactory.java:92
            Caused by: io.grpc.StatusRuntimeException at Status.java:539

org.apache.beam.sdk.io.gcp.firestore.it.FirestoreV1IT > runQuery FAILED
    java.util.concurrent.ExecutionException at AbstractFuture.java:588
        Caused by: com.google.api.gax.rpc.InvalidArgumentException at ApiExceptionFactory.java:92
            Caused by: io.grpc.StatusRuntimeException at Status.java:539

93 tests completed, 8 failed, 2 skipped

> Task :runners:google-cloud-dataflow-java:googleCloudPlatformRunnerV2IntegrationTest FAILED

> Task :runners:google-cloud-dataflow-java:cleanUpDockerJavaImages
Untagged: us.gcr.io/apache-beam-testing/java-postcommit-it/java:20230402035741
Untagged: us.gcr.io/apache-beam-testing/java-postcommit-it/java@sha256:61119b85666022e08cc1146763311272235f37df0513dc28a3253bb9327c0632
Deleted: sha256:49bf40ce656a2c1bfeff422667770e95dc1b66089b0e29b2e342233da4866f20
WARNING: Successfully resolved tag to sha256, but it is recommended to use sha256 directly.
Tag: [us.gcr.io/apache-beam-testing/java-postcommit-it/java:20230402035741]
- referencing digest: [us.gcr.io/apache-beam-testing/java-postcommit-it/java@sha256:61119b85666022e08cc1146763311272235f37df0513dc28a3253bb9327c0632]

Deleted [[us.gcr.io/apache-beam-testing/java-postcommit-it/java:20230402035741] (referencing [us.gcr.io/apache-beam-testing/java-postcommit-it/java@sha256:61119b85666022e08cc1146763311272235f37df0513dc28a3253bb9327c0632])].
Removing untagged image us.gcr.io/apache-beam-testing/java-postcommit-it/java@sha256:61119b85666022e08cc1146763311272235f37df0513dc28a3253bb9327c0632
Digests:
- us.gcr.io/apache-beam-testing/java-postcommit-it/java@sha256:61119b85666022e08cc1146763311272235f37df0513dc28a3253bb9327c0632
Deleted [us.gcr.io/apache-beam-testing/java-postcommit-it/java@sha256:61119b85666022e08cc1146763311272235f37df0513dc28a3253bb9327c0632].

FAILURE: Build failed with an exception.

* What went wrong:
Execution failed for task ':runners:google-cloud-dataflow-java:googleCloudPlatformRunnerV2IntegrationTest'.
> There were failing tests. See the report at: file://<https://ci-beam.apache.org/job/beam_PostCommit_Java_DataflowV2/ws/src/runners/google-cloud-dataflow-java/build/reports/tests/googleCloudPlatformRunnerV2IntegrationTest/index.html>

* Try:
> Run with --stacktrace option to get the stack trace.
> Run with --info or --debug option to get more log output.

* Get more help at https://help.gradle.org

Deprecated Gradle features were used in this build, making it incompatible with Gradle 8.0.

You can use '--warning-mode all' to show the individual deprecation warnings and determine if they come from your own scripts or plugins.

See https://docs.gradle.org/7.5.1/userguide/command_line_interface.html#sec:command_line_warnings

Execution optimizations have been disabled for 1 invalid unit(s) of work during this build to ensure correctness.
Please consult deprecation warnings for more details.

BUILD FAILED in 2h 56m 23s
152 actionable tasks: 110 executed, 38 from cache, 4 up-to-date

Publishing build scan...
https://gradle.com/s/uotvtzpxdbc4s

Build step 'Invoke Gradle script' changed build result to FAILURE
Build step 'Invoke Gradle script' marked build as failure

---------------------------------------------------------------------
To unsubscribe, e-mail: builds-unsubscribe@beam.apache.org
For additional commands, e-mail: builds-help@beam.apache.org


Build failed in Jenkins: beam_PostCommit_Java_DataflowV2 #2869

Posted by Apache Jenkins Server <je...@builds.apache.org>.
See <https://ci-beam.apache.org/job/beam_PostCommit_Java_DataflowV2/2869/display/redirect>

Changes:


------------------------------------------
[...truncated 68.02 KB...]
#2 DONE 0.0s

#3 [internal] load metadata for docker.io/library/eclipse-temurin:8
#3 DONE 0.3s

#4 [ 1/18] FROM docker.io/library/eclipse-temurin:8@sha256:005d3189b2ec1612c3ade6eadabd1935c312f03aa7905cf0528e9d71980ad512
#4 resolve docker.io/library/eclipse-temurin:8@sha256:005d3189b2ec1612c3ade6eadabd1935c312f03aa7905cf0528e9d71980ad512 0.0s done
#4 CACHED

#5 [internal] load build context
#5 transferring context: 46.43MB 0.3s done
#5 DONE 0.3s

#6 [ 2/18] ADD target/slf4j-api.jar /opt/apache/beam/jars/
#6 DONE 1.1s

#7 [ 3/18] ADD target/slf4j-jdk14.jar /opt/apache/beam/jars/
#7 DONE 0.1s

#8 [ 4/18] ADD target/jcl-over-slf4j.jar /opt/apache/beam/jars/
#8 DONE 0.1s

#9 [ 5/18] ADD target/log4j-over-slf4j.jar /opt/apache/beam/jars/
#9 DONE 0.1s

#10 [ 6/18] ADD target/log4j-to-slf4j.jar /opt/apache/beam/jars/
#10 DONE 0.1s

#11 [ 7/18] ADD target/beam-sdks-java-harness.jar /opt/apache/beam/jars/
#11 DONE 0.1s

#12 [ 8/18] COPY target/jamm.jar target/open-module-agent*.jar /opt/apache/beam/jars/
#12 DONE 0.1s

#13 [ 9/18] COPY target/linux_amd64/boot /opt/apache/beam/
#13 DONE 0.2s

#14 [10/18] COPY target/LICENSE /opt/apache/beam/
#14 DONE 0.1s

#15 [11/18] COPY target/NOTICE /opt/apache/beam/
#15 DONE 0.1s

#16 [12/18] ADD target/third_party_licenses /opt/apache/beam/third_party_licenses/
#16 DONE 0.2s

#17 [13/18] COPY target/LICENSE target/options/* /opt/apache/beam/options/
#17 DONE 0.1s

#18 [14/18] RUN rm /opt/apache/beam/options/LICENSE
#18 DONE 0.4s

#19 [15/18] COPY target/LICENSE target/go-licenses/* /opt/apache/beam/third_party_licenses/golang/
#19 DONE 0.0s

#20 [16/18] RUN rm /opt/apache/beam/third_party_licenses/golang/LICENSE
#20 DONE 0.3s

#21 [17/18] RUN if [ "true" = "false" ] ; then     rm -rf /opt/apache/beam/third_party_licenses ;    fi
#21 DONE 0.5s

#22 [18/18] COPY target/profiler/* /opt/google_cloud_profiler/
#22 DONE 0.1s

#23 exporting to image
#23 exporting layers
#23 exporting layers 0.2s done
#23 writing image sha256:6b60b355065fd573577fa750692bb8311c815679d3dee96caf33e1733b0bcb78 done
#23 naming to docker.io/apache/beam_java8_sdk:2.47.0.dev done
#23 DONE 0.2s

> Task :runners:google-cloud-dataflow-java:buildAndPushDockerJavaContainer
WARNING: `gcloud docker` will not be supported for Docker client versions above 18.03.

As an alternative, use `gcloud auth configure-docker` to configure `docker` to
use `gcloud` as a credential helper, then use `docker` as you would for non-GCR
registries, e.g. `docker pull gcr.io/project-id/my-image`. Add
`--verbosity=error` to silence this warning: `gcloud docker
--verbosity=error -- pull gcr.io/project-id/my-image`.

See: https://cloud.google.com/container-registry/docs/support/deprecation-notices#gcloud-docker

The push refers to repository [us.gcr.io/apache-beam-testing/java-postcommit-it/java]
90c25903047d: Preparing
5f70bf18a086: Preparing
46bdcfae5a35: Preparing
10027b866956: Preparing
df2ae2a413d5: Preparing
c24a30e106d7: Preparing
0890bb66dbdd: Preparing
7bb5aea4460f: Preparing
faa1bdbef57f: Preparing
b4d0d6590b06: Preparing
7911b128fefb: Preparing
157b1ce8dc24: Preparing
6906e3274e6f: Preparing
dac65ffbcbfa: Preparing
49ac1b1ee878: Preparing
faa1bdbef57f: Waiting
50db1cbfb621: Preparing
b4d0d6590b06: Waiting
0890bb66dbdd: Waiting
430a77dcb486: Preparing
533af4d05d89: Preparing
7911b128fefb: Waiting
d09fdd9ad3ef: Preparing
7bb5aea4460f: Waiting
04d1dcab20cb: Preparing
b93c1bd012ab: Preparing
6906e3274e6f: Waiting
157b1ce8dc24: Waiting
c24a30e106d7: Waiting
04d1dcab20cb: Waiting
50db1cbfb621: Waiting
d09fdd9ad3ef: Waiting
dac65ffbcbfa: Waiting
5f70bf18a086: Layer already exists
df2ae2a413d5: Pushed
10027b866956: Pushed
46bdcfae5a35: Pushed
c24a30e106d7: Pushed
faa1bdbef57f: Pushed
90c25903047d: Pushed
7bb5aea4460f: Pushed
0890bb66dbdd: Pushed
b4d0d6590b06: Pushed
7911b128fefb: Pushed
6906e3274e6f: Pushed
157b1ce8dc24: Pushed
533af4d05d89: Layer already exists
d09fdd9ad3ef: Layer already exists
04d1dcab20cb: Layer already exists
b93c1bd012ab: Layer already exists
49ac1b1ee878: Pushed
dac65ffbcbfa: Pushed
50db1cbfb621: Pushed
430a77dcb486: Pushed
20230401215736: digest: sha256:5173261a3ddc93a73d8692f70c74a6412c7ccd87308f10ed373ec309f74286bd size: 4710

> Task :runners:google-cloud-dataflow-java:coreSDKJavaRunnerV2IntegrationTest NO-SOURCE
> Task :runners:google-cloud-dataflow-java:examplesJavaRunnerV2IntegrationTest

***********************************************************
***********************************************************
**********************Set Up Pubsub************************
The Pub/Sub topic has been set up for this example: projects/apache-beam-testing/topics/testpipeline-jenkins-0401215825-a49a57ba
The Pub/Sub subscription has been set up for this example: projects/apache-beam-testing/subscriptions/testpipeline-jenkins-0401215825-a49a57ba
*************************Tear Down*************************
The Pub/Sub topic has been deleted: projects/apache-beam-testing/topics/testpipeline-jenkins-0401215825-a49a57ba
The Pub/Sub subscription has been deleted: projects/apache-beam-testing/subscriptions/testpipeline-jenkins-0401215825-a49a57ba
***********************************************************
***********************************************************

***********************************************************
***********************************************************
**********************Set Up Pubsub************************
The Pub/Sub topic has been set up for this example: projects/apache-beam-testing/topics/testpipeline-jenkins-0401215825-fbf1b5f5
The Pub/Sub subscription has been set up for this example: projects/apache-beam-testing/subscriptions/testpipeline-jenkins-0401215825-fbf1b5f5
*************************Tear Down*************************
The Pub/Sub topic has been deleted: projects/apache-beam-testing/topics/testpipeline-jenkins-0401215825-fbf1b5f5
The Pub/Sub subscription has been deleted: projects/apache-beam-testing/subscriptions/testpipeline-jenkins-0401215825-fbf1b5f5
***********************************************************
***********************************************************

> Task :runners:google-cloud-dataflow-java:googleCloudPlatformRunnerV2IntegrationTest

org.apache.beam.sdk.io.gcp.bigquery.BigQueryIOStorageWriteIT > testBigQueryStorageWrite30MProtoALO FAILED
    java.lang.RuntimeException at BigQueryIOStorageWriteIT.java:114

org.apache.beam.sdk.io.gcp.firestore.it.FirestoreV1IT > batchWrite_partialFailureOutputsToDeadLetterQueue FAILED
    java.util.concurrent.ExecutionException at FirestoreV1IT.java:96
        Caused by: com.google.api.gax.rpc.InvalidArgumentException at ApiExceptionFactory.java:92
            Caused by: io.grpc.StatusRuntimeException at Status.java:539

org.apache.beam.sdk.io.gcp.firestore.it.FirestoreV1IT > batchGet FAILED
    java.util.concurrent.ExecutionException at AbstractFuture.java:588
        Caused by: com.google.api.gax.rpc.InvalidArgumentException at ApiExceptionFactory.java:92
            Caused by: io.grpc.StatusRuntimeException at Status.java:539

org.apache.beam.sdk.io.gcp.firestore.it.FirestoreV1IT > partitionQuery FAILED
    java.util.concurrent.ExecutionException at AbstractFuture.java:588
        Caused by: com.google.api.gax.rpc.InvalidArgumentException at ApiExceptionFactory.java:92
            Caused by: io.grpc.StatusRuntimeException at Status.java:539

org.apache.beam.sdk.io.gcp.firestore.it.FirestoreV1IT > listCollections FAILED
    java.util.concurrent.ExecutionException at AbstractFuture.java:588
        Caused by: com.google.api.gax.rpc.InvalidArgumentException at ApiExceptionFactory.java:92
            Caused by: io.grpc.StatusRuntimeException at Status.java:539

org.apache.beam.sdk.io.gcp.firestore.it.FirestoreV1IT > write FAILED
    java.lang.RuntimeException at TestDataflowRunner.java:141

org.apache.beam.sdk.io.gcp.firestore.it.FirestoreV1IT > listDocuments FAILED
    java.util.concurrent.ExecutionException at AbstractFuture.java:588
        Caused by: com.google.api.gax.rpc.InvalidArgumentException at ApiExceptionFactory.java:92
            Caused by: io.grpc.StatusRuntimeException at Status.java:539

org.apache.beam.sdk.io.gcp.firestore.it.FirestoreV1IT > runQuery FAILED
    java.util.concurrent.ExecutionException at AbstractFuture.java:588
        Caused by: com.google.api.gax.rpc.InvalidArgumentException at ApiExceptionFactory.java:92
            Caused by: io.grpc.StatusRuntimeException at Status.java:539

93 tests completed, 8 failed, 2 skipped

> Task :runners:google-cloud-dataflow-java:googleCloudPlatformRunnerV2IntegrationTest FAILED

> Task :runners:google-cloud-dataflow-java:cleanUpDockerJavaImages
Untagged: us.gcr.io/apache-beam-testing/java-postcommit-it/java:20230401215736
Untagged: us.gcr.io/apache-beam-testing/java-postcommit-it/java@sha256:5173261a3ddc93a73d8692f70c74a6412c7ccd87308f10ed373ec309f74286bd
Deleted: sha256:6b60b355065fd573577fa750692bb8311c815679d3dee96caf33e1733b0bcb78
WARNING: Successfully resolved tag to sha256, but it is recommended to use sha256 directly.
Tag: [us.gcr.io/apache-beam-testing/java-postcommit-it/java:20230401215736]
- referencing digest: [us.gcr.io/apache-beam-testing/java-postcommit-it/java@sha256:5173261a3ddc93a73d8692f70c74a6412c7ccd87308f10ed373ec309f74286bd]

Deleted [[us.gcr.io/apache-beam-testing/java-postcommit-it/java:20230401215736] (referencing [us.gcr.io/apache-beam-testing/java-postcommit-it/java@sha256:5173261a3ddc93a73d8692f70c74a6412c7ccd87308f10ed373ec309f74286bd])].
Removing untagged image us.gcr.io/apache-beam-testing/java-postcommit-it/java@sha256:5173261a3ddc93a73d8692f70c74a6412c7ccd87308f10ed373ec309f74286bd
Digests:
- us.gcr.io/apache-beam-testing/java-postcommit-it/java@sha256:5173261a3ddc93a73d8692f70c74a6412c7ccd87308f10ed373ec309f74286bd
Deleted [us.gcr.io/apache-beam-testing/java-postcommit-it/java@sha256:5173261a3ddc93a73d8692f70c74a6412c7ccd87308f10ed373ec309f74286bd].

FAILURE: Build failed with an exception.

* What went wrong:
Execution failed for task ':runners:google-cloud-dataflow-java:googleCloudPlatformRunnerV2IntegrationTest'.
> There were failing tests. See the report at: file://<https://ci-beam.apache.org/job/beam_PostCommit_Java_DataflowV2/ws/src/runners/google-cloud-dataflow-java/build/reports/tests/googleCloudPlatformRunnerV2IntegrationTest/index.html>

* Try:
> Run with --stacktrace option to get the stack trace.
> Run with --info or --debug option to get more log output.

* Get more help at https://help.gradle.org

Deprecated Gradle features were used in this build, making it incompatible with Gradle 8.0.

You can use '--warning-mode all' to show the individual deprecation warnings and determine if they come from your own scripts or plugins.

See https://docs.gradle.org/7.5.1/userguide/command_line_interface.html#sec:command_line_warnings

Execution optimizations have been disabled for 1 invalid unit(s) of work during this build to ensure correctness.
Please consult deprecation warnings for more details.

BUILD FAILED in 2h 54m 32s
152 actionable tasks: 98 executed, 50 from cache, 4 up-to-date

Publishing build scan...
https://gradle.com/s/qpzkqg47ggaqs

Build step 'Invoke Gradle script' changed build result to FAILURE
Build step 'Invoke Gradle script' marked build as failure

---------------------------------------------------------------------
To unsubscribe, e-mail: builds-unsubscribe@beam.apache.org
For additional commands, e-mail: builds-help@beam.apache.org


Build failed in Jenkins: beam_PostCommit_Java_DataflowV2 #2868

Posted by Apache Jenkins Server <je...@builds.apache.org>.
See <https://ci-beam.apache.org/job/beam_PostCommit_Java_DataflowV2/2868/display/redirect>

Changes:


------------------------------------------
[...truncated 66.85 KB...]
#3 DONE 0.1s

#4 [ 1/18] FROM docker.io/library/eclipse-temurin:8@sha256:005d3189b2ec1612c3ade6eadabd1935c312f03aa7905cf0528e9d71980ad512
#4 resolve docker.io/library/eclipse-temurin:8@sha256:005d3189b2ec1612c3ade6eadabd1935c312f03aa7905cf0528e9d71980ad512 0.0s done
#4 CACHED

#5 [internal] load build context
#5 transferring context: 46.43MB 0.4s done
#5 DONE 1.1s

#6 [ 3/18] ADD target/slf4j-jdk14.jar /opt/apache/beam/jars/
#6 CACHED

#7 [ 4/18] ADD target/jcl-over-slf4j.jar /opt/apache/beam/jars/
#7 CACHED

#8 [ 5/18] ADD target/log4j-over-slf4j.jar /opt/apache/beam/jars/
#8 CACHED

#9 [ 6/18] ADD target/log4j-to-slf4j.jar /opt/apache/beam/jars/
#9 CACHED

#10 [ 7/18] ADD target/beam-sdks-java-harness.jar /opt/apache/beam/jars/
#10 CACHED

#11 [ 8/18] COPY target/jamm.jar target/open-module-agent*.jar /opt/apache/beam/jars/
#11 CACHED

#12 [ 2/18] ADD target/slf4j-api.jar /opt/apache/beam/jars/
#12 CACHED

#13 [ 9/18] COPY target/linux_amd64/boot /opt/apache/beam/
#13 DONE 0.3s

#14 [10/18] COPY target/LICENSE /opt/apache/beam/
#14 DONE 0.1s

#15 [11/18] COPY target/NOTICE /opt/apache/beam/
#15 DONE 0.1s

#16 [12/18] ADD target/third_party_licenses /opt/apache/beam/third_party_licenses/
#16 DONE 0.5s

#17 [13/18] COPY target/LICENSE target/options/* /opt/apache/beam/options/
#17 DONE 0.1s

#18 [14/18] RUN rm /opt/apache/beam/options/LICENSE
#18 DONE 0.5s

#19 [15/18] COPY target/LICENSE target/go-licenses/* /opt/apache/beam/third_party_licenses/golang/
#19 DONE 0.1s

#20 [16/18] RUN rm /opt/apache/beam/third_party_licenses/golang/LICENSE
#20 DONE 0.7s

#21 [17/18] RUN if [ "true" = "false" ] ; then     rm -rf /opt/apache/beam/third_party_licenses ;    fi
#21 DONE 0.7s

#22 [18/18] COPY target/profiler/* /opt/google_cloud_profiler/
#22 DONE 0.2s

#23 exporting to image
#23 exporting layers
#23 exporting layers 0.3s done
#23 writing image sha256:cd0633d4c34aee321ad15bd3d0ed76d856b3a4071a49170a3a3d8ecd4ac080f2 done
#23 naming to docker.io/apache/beam_java8_sdk:2.47.0.dev done
#23 DONE 0.3s

> Task :runners:google-cloud-dataflow-java:buildAndPushDockerJavaContainer
WARNING: `gcloud docker` will not be supported for Docker client versions above 18.03.

As an alternative, use `gcloud auth configure-docker` to configure `docker` to
use `gcloud` as a credential helper, then use `docker` as you would for non-GCR
registries, e.g. `docker pull gcr.io/project-id/my-image`. Add
`--verbosity=error` to silence this warning: `gcloud docker
--verbosity=error -- pull gcr.io/project-id/my-image`.

See: https://cloud.google.com/container-registry/docs/support/deprecation-notices#gcloud-docker

The push refers to repository [us.gcr.io/apache-beam-testing/java-postcommit-it/java]
3734181a9a25: Preparing
5f70bf18a086: Preparing
cbd52bff6b0f: Preparing
b819715d3151: Preparing
cca0097dbe10: Preparing
c93799b8a98e: Preparing
984afb2e3563: Preparing
0a67ffe58ecf: Preparing
c5afa4ee13cd: Preparing
a383e3eb5407: Preparing
cdc7f27c4369: Preparing
551b6b803194: Preparing
3058ed774412: Preparing
d4edceda246a: Preparing
db10f4c5cee6: Preparing
a52985eea95f: Preparing
e0ea82c72701: Preparing
533af4d05d89: Preparing
d09fdd9ad3ef: Preparing
04d1dcab20cb: Preparing
b93c1bd012ab: Preparing
551b6b803194: Waiting
3058ed774412: Waiting
d4edceda246a: Waiting
db10f4c5cee6: Waiting
a52985eea95f: Waiting
e0ea82c72701: Waiting
533af4d05d89: Waiting
d09fdd9ad3ef: Waiting
04d1dcab20cb: Waiting
b93c1bd012ab: Waiting
c93799b8a98e: Waiting
984afb2e3563: Waiting
0a67ffe58ecf: Waiting
c5afa4ee13cd: Waiting
a383e3eb5407: Waiting
cdc7f27c4369: Waiting
5f70bf18a086: Layer already exists
cbd52bff6b0f: Pushed
cca0097dbe10: Pushed
b819715d3151: Pushed
c93799b8a98e: Pushed
0a67ffe58ecf: Pushed
984afb2e3563: Pushed
3734181a9a25: Pushed
c5afa4ee13cd: Pushed
cdc7f27c4369: Pushed
a383e3eb5407: Pushed
551b6b803194: Pushed
3058ed774412: Pushed
533af4d05d89: Layer already exists
d09fdd9ad3ef: Layer already exists
d4edceda246a: Pushed
04d1dcab20cb: Layer already exists
b93c1bd012ab: Layer already exists
db10f4c5cee6: Pushed
a52985eea95f: Pushed
e0ea82c72701: Pushed
20230401155743: digest: sha256:539df36e63ade0aca795027dcb04df4c822338baf5f04e7b6d9a9cc3c3168990 size: 4710

> Task :runners:google-cloud-dataflow-java:coreSDKJavaRunnerV2IntegrationTest NO-SOURCE
> Task :runners:google-cloud-dataflow-java:examplesJavaRunnerV2IntegrationTest

***********************************************************
***********************************************************
**********************Set Up Pubsub************************
The Pub/Sub topic has been set up for this example: projects/apache-beam-testing/topics/testpipeline-jenkins-0401155935-d062f8c7
The Pub/Sub subscription has been set up for this example: projects/apache-beam-testing/subscriptions/testpipeline-jenkins-0401155935-d062f8c7
*************************Tear Down*************************
The Pub/Sub topic has been deleted: projects/apache-beam-testing/topics/testpipeline-jenkins-0401155935-d062f8c7
The Pub/Sub subscription has been deleted: projects/apache-beam-testing/subscriptions/testpipeline-jenkins-0401155935-d062f8c7
***********************************************************
***********************************************************

***********************************************************
***********************************************************
**********************Set Up Pubsub************************
The Pub/Sub topic has been set up for this example: projects/apache-beam-testing/topics/testpipeline-jenkins-0401155935-8e94a6ae
The Pub/Sub subscription has been set up for this example: projects/apache-beam-testing/subscriptions/testpipeline-jenkins-0401155935-8e94a6ae
*************************Tear Down*************************
The Pub/Sub topic has been deleted: projects/apache-beam-testing/topics/testpipeline-jenkins-0401155935-8e94a6ae
The Pub/Sub subscription has been deleted: projects/apache-beam-testing/subscriptions/testpipeline-jenkins-0401155935-8e94a6ae
***********************************************************
***********************************************************

> Task :runners:google-cloud-dataflow-java:googleCloudPlatformRunnerV2IntegrationTest

org.apache.beam.sdk.io.gcp.bigquery.BigQueryIOStorageWriteIT > testBigQueryStorageWrite30MProtoALO FAILED
    java.lang.RuntimeException at BigQueryIOStorageWriteIT.java:114

org.apache.beam.sdk.io.gcp.firestore.it.FirestoreV1IT > batchWrite_partialFailureOutputsToDeadLetterQueue FAILED
    java.util.concurrent.ExecutionException at FirestoreV1IT.java:96
        Caused by: com.google.api.gax.rpc.InvalidArgumentException at ApiExceptionFactory.java:92
            Caused by: io.grpc.StatusRuntimeException at Status.java:539

org.apache.beam.sdk.io.gcp.firestore.it.FirestoreV1IT > batchGet FAILED
    java.util.concurrent.ExecutionException at AbstractFuture.java:588
        Caused by: com.google.api.gax.rpc.InvalidArgumentException at ApiExceptionFactory.java:92
            Caused by: io.grpc.StatusRuntimeException at Status.java:539

org.apache.beam.sdk.io.gcp.firestore.it.FirestoreV1IT > partitionQuery FAILED
    java.util.concurrent.ExecutionException at AbstractFuture.java:588
        Caused by: com.google.api.gax.rpc.InvalidArgumentException at ApiExceptionFactory.java:92
            Caused by: io.grpc.StatusRuntimeException at Status.java:539

org.apache.beam.sdk.io.gcp.firestore.it.FirestoreV1IT > listCollections FAILED
    java.util.concurrent.ExecutionException at AbstractFuture.java:588
        Caused by: com.google.api.gax.rpc.InvalidArgumentException at ApiExceptionFactory.java:92
            Caused by: io.grpc.StatusRuntimeException at Status.java:539

org.apache.beam.sdk.io.gcp.firestore.it.FirestoreV1IT > write FAILED
    java.lang.RuntimeException at TestDataflowRunner.java:141

org.apache.beam.sdk.io.gcp.firestore.it.FirestoreV1IT > listDocuments FAILED
    java.util.concurrent.ExecutionException at AbstractFuture.java:588
        Caused by: com.google.api.gax.rpc.InvalidArgumentException at ApiExceptionFactory.java:92
            Caused by: io.grpc.StatusRuntimeException at Status.java:539

org.apache.beam.sdk.io.gcp.firestore.it.FirestoreV1IT > runQuery FAILED
    java.util.concurrent.ExecutionException at AbstractFuture.java:588
        Caused by: com.google.api.gax.rpc.InvalidArgumentException at ApiExceptionFactory.java:92
            Caused by: io.grpc.StatusRuntimeException at Status.java:539

93 tests completed, 8 failed, 2 skipped

> Task :runners:google-cloud-dataflow-java:googleCloudPlatformRunnerV2IntegrationTest FAILED

> Task :runners:google-cloud-dataflow-java:cleanUpDockerJavaImages
Untagged: us.gcr.io/apache-beam-testing/java-postcommit-it/java:20230401155743
Untagged: us.gcr.io/apache-beam-testing/java-postcommit-it/java@sha256:539df36e63ade0aca795027dcb04df4c822338baf5f04e7b6d9a9cc3c3168990
WARNING: Successfully resolved tag to sha256, but it is recommended to use sha256 directly.
Tag: [us.gcr.io/apache-beam-testing/java-postcommit-it/java:20230401155743]
- referencing digest: [us.gcr.io/apache-beam-testing/java-postcommit-it/java@sha256:539df36e63ade0aca795027dcb04df4c822338baf5f04e7b6d9a9cc3c3168990]

Deleted [[us.gcr.io/apache-beam-testing/java-postcommit-it/java:20230401155743] (referencing [us.gcr.io/apache-beam-testing/java-postcommit-it/java@sha256:539df36e63ade0aca795027dcb04df4c822338baf5f04e7b6d9a9cc3c3168990])].
Removing untagged image us.gcr.io/apache-beam-testing/java-postcommit-it/java@sha256:539df36e63ade0aca795027dcb04df4c822338baf5f04e7b6d9a9cc3c3168990
Digests:
- us.gcr.io/apache-beam-testing/java-postcommit-it/java@sha256:539df36e63ade0aca795027dcb04df4c822338baf5f04e7b6d9a9cc3c3168990
Deleted [us.gcr.io/apache-beam-testing/java-postcommit-it/java@sha256:539df36e63ade0aca795027dcb04df4c822338baf5f04e7b6d9a9cc3c3168990].

FAILURE: Build failed with an exception.

* What went wrong:
Execution failed for task ':runners:google-cloud-dataflow-java:googleCloudPlatformRunnerV2IntegrationTest'.
> There were failing tests. See the report at: file://<https://ci-beam.apache.org/job/beam_PostCommit_Java_DataflowV2/ws/src/runners/google-cloud-dataflow-java/build/reports/tests/googleCloudPlatformRunnerV2IntegrationTest/index.html>

* Try:
> Run with --stacktrace option to get the stack trace.
> Run with --info or --debug option to get more log output.

* Get more help at https://help.gradle.org

Deprecated Gradle features were used in this build, making it incompatible with Gradle 8.0.

You can use '--warning-mode all' to show the individual deprecation warnings and determine if they come from your own scripts or plugins.

See https://docs.gradle.org/7.5.1/userguide/command_line_interface.html#sec:command_line_warnings

Execution optimizations have been disabled for 1 invalid unit(s) of work during this build to ensure correctness.
Please consult deprecation warnings for more details.

BUILD FAILED in 2h 50m 49s
152 actionable tasks: 98 executed, 50 from cache, 4 up-to-date

Publishing build scan...
https://gradle.com/s/ceyprx7imuoaq

Build step 'Invoke Gradle script' changed build result to FAILURE
Build step 'Invoke Gradle script' marked build as failure

---------------------------------------------------------------------
To unsubscribe, e-mail: builds-unsubscribe@beam.apache.org
For additional commands, e-mail: builds-help@beam.apache.org


Build failed in Jenkins: beam_PostCommit_Java_DataflowV2 #2867

Posted by Apache Jenkins Server <je...@builds.apache.org>.
See <https://ci-beam.apache.org/job/beam_PostCommit_Java_DataflowV2/2867/display/redirect>

Changes:


------------------------------------------
[...truncated 66.39 KB...]
#3 DONE 0.3s

#4 [ 1/18] FROM docker.io/library/eclipse-temurin:8@sha256:005d3189b2ec1612c3ade6eadabd1935c312f03aa7905cf0528e9d71980ad512
#4 resolve docker.io/library/eclipse-temurin:8@sha256:005d3189b2ec1612c3ade6eadabd1935c312f03aa7905cf0528e9d71980ad512 0.0s done
#4 CACHED

#5 [internal] load build context
#5 transferring context: 46.43MB 0.4s done
#5 DONE 0.4s

#6 [ 2/18] ADD target/slf4j-api.jar /opt/apache/beam/jars/
#6 DONE 4.5s

#7 [ 3/18] ADD target/slf4j-jdk14.jar /opt/apache/beam/jars/
#7 DONE 0.2s

#8 [ 4/18] ADD target/jcl-over-slf4j.jar /opt/apache/beam/jars/
#8 DONE 0.1s

#9 [ 5/18] ADD target/log4j-over-slf4j.jar /opt/apache/beam/jars/
#9 DONE 0.1s

#10 [ 6/18] ADD target/log4j-to-slf4j.jar /opt/apache/beam/jars/
#10 DONE 0.1s

#11 [ 7/18] ADD target/beam-sdks-java-harness.jar /opt/apache/beam/jars/
#11 DONE 0.1s

#12 [ 8/18] COPY target/jamm.jar target/open-module-agent*.jar /opt/apache/beam/jars/
#12 DONE 0.1s

#13 [ 9/18] COPY target/linux_amd64/boot /opt/apache/beam/
#13 DONE 0.3s

#14 [10/18] COPY target/LICENSE /opt/apache/beam/
#14 DONE 0.1s

#15 [11/18] COPY target/NOTICE /opt/apache/beam/
#15 DONE 0.1s

#16 [12/18] ADD target/third_party_licenses /opt/apache/beam/third_party_licenses/
#16 DONE 0.6s

#17 [13/18] COPY target/LICENSE target/options/* /opt/apache/beam/options/
#17 DONE 0.1s

#18 [14/18] RUN rm /opt/apache/beam/options/LICENSE
#18 DONE 0.5s

#19 [15/18] COPY target/LICENSE target/go-licenses/* /opt/apache/beam/third_party_licenses/golang/
#19 DONE 0.1s

#20 [16/18] RUN rm /opt/apache/beam/third_party_licenses/golang/LICENSE
#20 DONE 0.6s

#21 [17/18] RUN if [ "true" = "false" ] ; then     rm -rf /opt/apache/beam/third_party_licenses ;    fi
#21 DONE 0.9s

#22 [18/18] COPY target/profiler/* /opt/google_cloud_profiler/
#22 DONE 0.2s

#23 exporting to image
#23 exporting layers
#23 exporting layers 0.3s done
#23 writing image sha256:a9ad6895872e9e98b024f2dcd3a7e025f4ae4b5146b22de30fb69b8244384029
#23 writing image sha256:a9ad6895872e9e98b024f2dcd3a7e025f4ae4b5146b22de30fb69b8244384029 done
#23 naming to docker.io/apache/beam_java8_sdk:2.47.0.dev done
#23 DONE 0.4s

> Task :runners:google-cloud-dataflow-java:buildAndPushDockerJavaContainer
WARNING: `gcloud docker` will not be supported for Docker client versions above 18.03.

As an alternative, use `gcloud auth configure-docker` to configure `docker` to
use `gcloud` as a credential helper, then use `docker` as you would for non-GCR
registries, e.g. `docker pull gcr.io/project-id/my-image`. Add
`--verbosity=error` to silence this warning: `gcloud docker
--verbosity=error -- pull gcr.io/project-id/my-image`.

See: https://cloud.google.com/container-registry/docs/support/deprecation-notices#gcloud-docker

The push refers to repository [us.gcr.io/apache-beam-testing/java-postcommit-it/java]
22f42bd948e9: Preparing
5f70bf18a086: Preparing
1e2c135bcba7: Preparing
871143430303: Preparing
13e69308e846: Preparing
e6bcfa9899e5: Preparing
65929a416531: Preparing
9d2f5ed5db8c: Preparing
0798d4738618: Preparing
574e1de6535f: Preparing
01acf5175e73: Preparing
c9800b1bf9fb: Preparing
4e1e2f8c11f4: Preparing
ad5ad7be318c: Preparing
4df3c90918bb: Preparing
9a3971cd5200: Preparing
0ddc65caccbd: Preparing
533af4d05d89: Preparing
d09fdd9ad3ef: Preparing
04d1dcab20cb: Preparing
b93c1bd012ab: Preparing
9a3971cd5200: Waiting
0798d4738618: Waiting
0ddc65caccbd: Waiting
c9800b1bf9fb: Waiting
574e1de6535f: Waiting
4e1e2f8c11f4: Waiting
01acf5175e73: Waiting
533af4d05d89: Waiting
e6bcfa9899e5: Waiting
d09fdd9ad3ef: Waiting
9d2f5ed5db8c: Waiting
04d1dcab20cb: Waiting
b93c1bd012ab: Waiting
4df3c90918bb: Waiting
ad5ad7be318c: Waiting
5f70bf18a086: Layer already exists
13e69308e846: Pushed
871143430303: Pushed
1e2c135bcba7: Pushed
e6bcfa9899e5: Pushed
9d2f5ed5db8c: Pushed
0798d4738618: Pushed
22f42bd948e9: Pushed
65929a416531: Pushed
574e1de6535f: Pushed
01acf5175e73: Pushed
4e1e2f8c11f4: Pushed
c9800b1bf9fb: Pushed
533af4d05d89: Layer already exists
ad5ad7be318c: Pushed
d09fdd9ad3ef: Layer already exists
04d1dcab20cb: Layer already exists
b93c1bd012ab: Layer already exists
4df3c90918bb: Pushed
9a3971cd5200: Pushed
0ddc65caccbd: Pushed
20230401095739: digest: sha256:41dfa34c457cd9b007996e421a45261a509478b16f0af3f93bc13e74cadef2eb size: 4710

> Task :runners:google-cloud-dataflow-java:coreSDKJavaRunnerV2IntegrationTest NO-SOURCE
> Task :runners:google-cloud-dataflow-java:examplesJavaRunnerV2IntegrationTest

***********************************************************
***********************************************************
**********************Set Up Pubsub************************
The Pub/Sub topic has been set up for this example: projects/apache-beam-testing/topics/testpipeline-jenkins-0401095932-197519a2
The Pub/Sub subscription has been set up for this example: projects/apache-beam-testing/subscriptions/testpipeline-jenkins-0401095932-197519a2
*************************Tear Down*************************
The Pub/Sub topic has been deleted: projects/apache-beam-testing/topics/testpipeline-jenkins-0401095932-197519a2
The Pub/Sub subscription has been deleted: projects/apache-beam-testing/subscriptions/testpipeline-jenkins-0401095932-197519a2
***********************************************************
***********************************************************

***********************************************************
***********************************************************
**********************Set Up Pubsub************************
The Pub/Sub topic has been set up for this example: projects/apache-beam-testing/topics/testpipeline-jenkins-0401095932-dfb76f3
The Pub/Sub subscription has been set up for this example: projects/apache-beam-testing/subscriptions/testpipeline-jenkins-0401095932-dfb76f3
*************************Tear Down*************************
The Pub/Sub topic has been deleted: projects/apache-beam-testing/topics/testpipeline-jenkins-0401095932-dfb76f3
The Pub/Sub subscription has been deleted: projects/apache-beam-testing/subscriptions/testpipeline-jenkins-0401095932-dfb76f3
***********************************************************
***********************************************************

> Task :runners:google-cloud-dataflow-java:googleCloudPlatformRunnerV2IntegrationTest

org.apache.beam.sdk.io.gcp.bigquery.BigQueryIOStorageWriteIT > testBigQueryStorageWrite30MProtoALO FAILED
    java.lang.RuntimeException at BigQueryIOStorageWriteIT.java:114

org.apache.beam.sdk.io.gcp.firestore.it.FirestoreV1IT > batchWrite_partialFailureOutputsToDeadLetterQueue FAILED
    java.util.concurrent.ExecutionException at FirestoreV1IT.java:96
        Caused by: com.google.api.gax.rpc.InvalidArgumentException at ApiExceptionFactory.java:92
            Caused by: io.grpc.StatusRuntimeException at Status.java:539

org.apache.beam.sdk.io.gcp.firestore.it.FirestoreV1IT > batchGet FAILED
    java.util.concurrent.ExecutionException at AbstractFuture.java:588
        Caused by: com.google.api.gax.rpc.InvalidArgumentException at ApiExceptionFactory.java:92
            Caused by: io.grpc.StatusRuntimeException at Status.java:539

org.apache.beam.sdk.io.gcp.firestore.it.FirestoreV1IT > partitionQuery FAILED
    java.util.concurrent.ExecutionException at AbstractFuture.java:588
        Caused by: com.google.api.gax.rpc.InvalidArgumentException at ApiExceptionFactory.java:92
            Caused by: io.grpc.StatusRuntimeException at Status.java:539

org.apache.beam.sdk.io.gcp.firestore.it.FirestoreV1IT > listCollections FAILED
    java.util.concurrent.ExecutionException at AbstractFuture.java:588
        Caused by: com.google.api.gax.rpc.InvalidArgumentException at ApiExceptionFactory.java:92
            Caused by: io.grpc.StatusRuntimeException at Status.java:539

org.apache.beam.sdk.io.gcp.firestore.it.FirestoreV1IT > write FAILED
    java.lang.RuntimeException at TestDataflowRunner.java:141

org.apache.beam.sdk.io.gcp.firestore.it.FirestoreV1IT > listDocuments FAILED
    java.util.concurrent.ExecutionException at AbstractFuture.java:588
        Caused by: com.google.api.gax.rpc.InvalidArgumentException at ApiExceptionFactory.java:92
            Caused by: io.grpc.StatusRuntimeException at Status.java:539

org.apache.beam.sdk.io.gcp.firestore.it.FirestoreV1IT > runQuery FAILED
    java.util.concurrent.ExecutionException at AbstractFuture.java:588
        Caused by: com.google.api.gax.rpc.InvalidArgumentException at ApiExceptionFactory.java:92
            Caused by: io.grpc.StatusRuntimeException at Status.java:539

93 tests completed, 8 failed, 2 skipped

> Task :runners:google-cloud-dataflow-java:googleCloudPlatformRunnerV2IntegrationTest FAILED

> Task :runners:google-cloud-dataflow-java:cleanUpDockerJavaImages
Untagged: us.gcr.io/apache-beam-testing/java-postcommit-it/java:20230401095739
Untagged: us.gcr.io/apache-beam-testing/java-postcommit-it/java@sha256:41dfa34c457cd9b007996e421a45261a509478b16f0af3f93bc13e74cadef2eb
WARNING: Successfully resolved tag to sha256, but it is recommended to use sha256 directly.
Tag: [us.gcr.io/apache-beam-testing/java-postcommit-it/java:20230401095739]
- referencing digest: [us.gcr.io/apache-beam-testing/java-postcommit-it/java@sha256:41dfa34c457cd9b007996e421a45261a509478b16f0af3f93bc13e74cadef2eb]

Deleted [[us.gcr.io/apache-beam-testing/java-postcommit-it/java:20230401095739] (referencing [us.gcr.io/apache-beam-testing/java-postcommit-it/java@sha256:41dfa34c457cd9b007996e421a45261a509478b16f0af3f93bc13e74cadef2eb])].
Removing untagged image us.gcr.io/apache-beam-testing/java-postcommit-it/java@sha256:41dfa34c457cd9b007996e421a45261a509478b16f0af3f93bc13e74cadef2eb
Digests:
- us.gcr.io/apache-beam-testing/java-postcommit-it/java@sha256:41dfa34c457cd9b007996e421a45261a509478b16f0af3f93bc13e74cadef2eb
Deleted [us.gcr.io/apache-beam-testing/java-postcommit-it/java@sha256:41dfa34c457cd9b007996e421a45261a509478b16f0af3f93bc13e74cadef2eb].

FAILURE: Build failed with an exception.

* What went wrong:
Execution failed for task ':runners:google-cloud-dataflow-java:googleCloudPlatformRunnerV2IntegrationTest'.
> There were failing tests. See the report at: file://<https://ci-beam.apache.org/job/beam_PostCommit_Java_DataflowV2/ws/src/runners/google-cloud-dataflow-java/build/reports/tests/googleCloudPlatformRunnerV2IntegrationTest/index.html>

* Try:
> Run with --stacktrace option to get the stack trace.
> Run with --info or --debug option to get more log output.

* Get more help at https://help.gradle.org

Deprecated Gradle features were used in this build, making it incompatible with Gradle 8.0.

You can use '--warning-mode all' to show the individual deprecation warnings and determine if they come from your own scripts or plugins.

See https://docs.gradle.org/7.5.1/userguide/command_line_interface.html#sec:command_line_warnings

Execution optimizations have been disabled for 1 invalid unit(s) of work during this build to ensure correctness.
Please consult deprecation warnings for more details.

BUILD FAILED in 2h 58m 51s
152 actionable tasks: 98 executed, 50 from cache, 4 up-to-date

Publishing build scan...
https://gradle.com/s/fypjs4uzdblye

Build step 'Invoke Gradle script' changed build result to FAILURE
Build step 'Invoke Gradle script' marked build as failure

---------------------------------------------------------------------
To unsubscribe, e-mail: builds-unsubscribe@beam.apache.org
For additional commands, e-mail: builds-help@beam.apache.org


Build failed in Jenkins: beam_PostCommit_Java_DataflowV2 #2866

Posted by Apache Jenkins Server <je...@builds.apache.org>.
See <https://ci-beam.apache.org/job/beam_PostCommit_Java_DataflowV2/2866/display/redirect>

Changes:


------------------------------------------
[...truncated 67.46 KB...]

#4 [ 1/18] FROM docker.io/library/eclipse-temurin:8@sha256:005d3189b2ec1612c3ade6eadabd1935c312f03aa7905cf0528e9d71980ad512
#4 resolve docker.io/library/eclipse-temurin:8@sha256:005d3189b2ec1612c3ade6eadabd1935c312f03aa7905cf0528e9d71980ad512 0.0s done
#4 CACHED

#5 [internal] load build context
#5 transferring context: 46.43MB 0.4s done
#5 DONE 0.5s

#6 [ 2/18] ADD target/slf4j-api.jar /opt/apache/beam/jars/
#6 DONE 1.1s

#7 [ 3/18] ADD target/slf4j-jdk14.jar /opt/apache/beam/jars/
#7 DONE 0.1s

#8 [ 4/18] ADD target/jcl-over-slf4j.jar /opt/apache/beam/jars/
#8 DONE 0.1s

#9 [ 5/18] ADD target/log4j-over-slf4j.jar /opt/apache/beam/jars/
#9 DONE 0.1s

#10 [ 6/18] ADD target/log4j-to-slf4j.jar /opt/apache/beam/jars/
#10 DONE 0.1s

#11 [ 7/18] ADD target/beam-sdks-java-harness.jar /opt/apache/beam/jars/
#11 DONE 0.1s

#12 [ 8/18] COPY target/jamm.jar target/open-module-agent*.jar /opt/apache/beam/jars/
#12 DONE 0.1s

#13 [ 9/18] COPY target/linux_amd64/boot /opt/apache/beam/
#13 DONE 0.2s

#14 [10/18] COPY target/LICENSE /opt/apache/beam/
#14 DONE 0.1s

#15 [11/18] COPY target/NOTICE /opt/apache/beam/
#15 DONE 0.1s

#16 [12/18] ADD target/third_party_licenses /opt/apache/beam/third_party_licenses/
#16 DONE 0.2s

#17 [13/18] COPY target/LICENSE target/options/* /opt/apache/beam/options/
#17 DONE 0.1s

#18 [14/18] RUN rm /opt/apache/beam/options/LICENSE
#18 DONE 0.4s

#19 [15/18] COPY target/LICENSE target/go-licenses/* /opt/apache/beam/third_party_licenses/golang/
#19 DONE 0.0s

#20 [16/18] RUN rm /opt/apache/beam/third_party_licenses/golang/LICENSE
#20 DONE 0.4s

#21 [17/18] RUN if [ "true" = "false" ] ; then     rm -rf /opt/apache/beam/third_party_licenses ;    fi
#21 DONE 0.5s

#22 [18/18] COPY target/profiler/* /opt/google_cloud_profiler/
#22 DONE 0.4s

#23 exporting to image
#23 exporting layers
#23 exporting layers 0.7s done
#23 writing image sha256:3287f41050c65b9e491a8622e145dbe84c6226a004e7a190bf22ec4d7491aced done
#23 naming to docker.io/apache/beam_java8_sdk:2.47.0.dev done
#23 DONE 0.7s

> Task :runners:google-cloud-dataflow-java:buildAndPushDockerJavaContainer
WARNING: `gcloud docker` will not be supported for Docker client versions above 18.03.

As an alternative, use `gcloud auth configure-docker` to configure `docker` to
use `gcloud` as a credential helper, then use `docker` as you would for non-GCR
registries, e.g. `docker pull gcr.io/project-id/my-image`. Add
`--verbosity=error` to silence this warning: `gcloud docker
--verbosity=error -- pull gcr.io/project-id/my-image`.

See: https://cloud.google.com/container-registry/docs/support/deprecation-notices#gcloud-docker

The push refers to repository [us.gcr.io/apache-beam-testing/java-postcommit-it/java]
8f8ba878690d: Preparing
5f70bf18a086: Preparing
c2920f416146: Preparing
1cf1aa372d8a: Preparing
9f1dbb913f69: Preparing
f11b10546a51: Preparing
37e034eb2f34: Preparing
bb231667dc88: Preparing
087b6521b538: Preparing
db9e0185b091: Preparing
c291bcbed77e: Preparing
b97848c1daf8: Preparing
b9e8b4b01ae7: Preparing
25cae2879b52: Preparing
1f957cb34656: Preparing
f11b10546a51: Waiting
6d4d7b6d61bf: Preparing
37e034eb2f34: Waiting
1aca40e9229d: Preparing
533af4d05d89: Preparing
bb231667dc88: Waiting
d09fdd9ad3ef: Preparing
db9e0185b091: Waiting
087b6521b538: Waiting
04d1dcab20cb: Preparing
c291bcbed77e: Waiting
b93c1bd012ab: Preparing
b97848c1daf8: Waiting
b9e8b4b01ae7: Waiting
25cae2879b52: Waiting
1aca40e9229d: Waiting
b93c1bd012ab: Waiting
1f957cb34656: Waiting
533af4d05d89: Waiting
04d1dcab20cb: Waiting
d09fdd9ad3ef: Waiting
6d4d7b6d61bf: Waiting
5f70bf18a086: Layer already exists
9f1dbb913f69: Pushed
1cf1aa372d8a: Pushed
c2920f416146: Pushed
f11b10546a51: Pushed
8f8ba878690d: Pushed
bb231667dc88: Pushed
087b6521b538: Pushed
c291bcbed77e: Pushed
37e034eb2f34: Pushed
db9e0185b091: Pushed
b9e8b4b01ae7: Pushed
b97848c1daf8: Pushed
533af4d05d89: Layer already exists
d09fdd9ad3ef: Layer already exists
04d1dcab20cb: Layer already exists
b93c1bd012ab: Layer already exists
25cae2879b52: Pushed
1f957cb34656: Pushed
6d4d7b6d61bf: Pushed
1aca40e9229d: Pushed
20230401035742: digest: sha256:9e5ca50854eb1e379f4ecf3fdeadc4937da226584c9dcfb69a854bcf1c7df6fc size: 4710

> Task :runners:google-cloud-dataflow-java:coreSDKJavaRunnerV2IntegrationTest NO-SOURCE
> Task :runners:google-cloud-dataflow-java:examplesJavaRunnerV2IntegrationTest

***********************************************************
***********************************************************
**********************Set Up Pubsub************************
The Pub/Sub topic has been set up for this example: projects/apache-beam-testing/topics/testpipeline-jenkins-0401035931-f1b798d6
The Pub/Sub subscription has been set up for this example: projects/apache-beam-testing/subscriptions/testpipeline-jenkins-0401035931-f1b798d6
*************************Tear Down*************************
The Pub/Sub topic has been deleted: projects/apache-beam-testing/topics/testpipeline-jenkins-0401035931-f1b798d6
The Pub/Sub subscription has been deleted: projects/apache-beam-testing/subscriptions/testpipeline-jenkins-0401035931-f1b798d6
***********************************************************
***********************************************************

***********************************************************
***********************************************************
**********************Set Up Pubsub************************
The Pub/Sub topic has been set up for this example: projects/apache-beam-testing/topics/testpipeline-jenkins-0401035931-e2e1feb
The Pub/Sub subscription has been set up for this example: projects/apache-beam-testing/subscriptions/testpipeline-jenkins-0401035931-e2e1feb
*************************Tear Down*************************
The Pub/Sub topic has been deleted: projects/apache-beam-testing/topics/testpipeline-jenkins-0401035931-e2e1feb
The Pub/Sub subscription has been deleted: projects/apache-beam-testing/subscriptions/testpipeline-jenkins-0401035931-e2e1feb
***********************************************************
***********************************************************

> Task :runners:google-cloud-dataflow-java:googleCloudPlatformRunnerV2IntegrationTest

org.apache.beam.sdk.io.gcp.bigquery.BigQueryIOStorageWriteIT > testBigQueryStorageWrite30MProtoALO FAILED
    java.lang.RuntimeException at BigQueryIOStorageWriteIT.java:114

org.apache.beam.sdk.io.gcp.firestore.it.FirestoreV1IT > batchWrite_partialFailureOutputsToDeadLetterQueue FAILED
    java.util.concurrent.ExecutionException at FirestoreV1IT.java:96
        Caused by: com.google.api.gax.rpc.InvalidArgumentException at ApiExceptionFactory.java:92
            Caused by: io.grpc.StatusRuntimeException at Status.java:539

org.apache.beam.sdk.io.gcp.firestore.it.FirestoreV1IT > batchGet FAILED
    java.util.concurrent.ExecutionException at AbstractFuture.java:588
        Caused by: com.google.api.gax.rpc.InvalidArgumentException at ApiExceptionFactory.java:92
            Caused by: io.grpc.StatusRuntimeException at Status.java:539

org.apache.beam.sdk.io.gcp.firestore.it.FirestoreV1IT > partitionQuery FAILED
    java.util.concurrent.ExecutionException at AbstractFuture.java:588
        Caused by: com.google.api.gax.rpc.InvalidArgumentException at ApiExceptionFactory.java:92
            Caused by: io.grpc.StatusRuntimeException at Status.java:539

org.apache.beam.sdk.io.gcp.firestore.it.FirestoreV1IT > listCollections FAILED
    java.util.concurrent.ExecutionException at AbstractFuture.java:588
        Caused by: com.google.api.gax.rpc.InvalidArgumentException at ApiExceptionFactory.java:92
            Caused by: io.grpc.StatusRuntimeException at Status.java:539

org.apache.beam.sdk.io.gcp.firestore.it.FirestoreV1IT > write FAILED
    java.lang.RuntimeException at TestDataflowRunner.java:141

org.apache.beam.sdk.io.gcp.firestore.it.FirestoreV1IT > listDocuments FAILED
    java.util.concurrent.ExecutionException at AbstractFuture.java:588
        Caused by: com.google.api.gax.rpc.InvalidArgumentException at ApiExceptionFactory.java:92
            Caused by: io.grpc.StatusRuntimeException at Status.java:539

org.apache.beam.sdk.io.gcp.firestore.it.FirestoreV1IT > runQuery FAILED
    java.util.concurrent.ExecutionException at AbstractFuture.java:588
        Caused by: com.google.api.gax.rpc.InvalidArgumentException at ApiExceptionFactory.java:92
            Caused by: io.grpc.StatusRuntimeException at Status.java:539

93 tests completed, 8 failed, 2 skipped

> Task :runners:google-cloud-dataflow-java:googleCloudPlatformRunnerV2IntegrationTest FAILED

> Task :runners:google-cloud-dataflow-java:cleanUpDockerJavaImages
Untagged: us.gcr.io/apache-beam-testing/java-postcommit-it/java:20230401035742
Untagged: us.gcr.io/apache-beam-testing/java-postcommit-it/java@sha256:9e5ca50854eb1e379f4ecf3fdeadc4937da226584c9dcfb69a854bcf1c7df6fc
Deleted: sha256:3287f41050c65b9e491a8622e145dbe84c6226a004e7a190bf22ec4d7491aced
WARNING: Successfully resolved tag to sha256, but it is recommended to use sha256 directly.
Tag: [us.gcr.io/apache-beam-testing/java-postcommit-it/java:20230401035742]
- referencing digest: [us.gcr.io/apache-beam-testing/java-postcommit-it/java@sha256:9e5ca50854eb1e379f4ecf3fdeadc4937da226584c9dcfb69a854bcf1c7df6fc]

Deleted [[us.gcr.io/apache-beam-testing/java-postcommit-it/java:20230401035742] (referencing [us.gcr.io/apache-beam-testing/java-postcommit-it/java@sha256:9e5ca50854eb1e379f4ecf3fdeadc4937da226584c9dcfb69a854bcf1c7df6fc])].
Removing untagged image us.gcr.io/apache-beam-testing/java-postcommit-it/java@sha256:9e5ca50854eb1e379f4ecf3fdeadc4937da226584c9dcfb69a854bcf1c7df6fc
Digests:
- us.gcr.io/apache-beam-testing/java-postcommit-it/java@sha256:9e5ca50854eb1e379f4ecf3fdeadc4937da226584c9dcfb69a854bcf1c7df6fc
Deleted [us.gcr.io/apache-beam-testing/java-postcommit-it/java@sha256:9e5ca50854eb1e379f4ecf3fdeadc4937da226584c9dcfb69a854bcf1c7df6fc].

FAILURE: Build failed with an exception.

* What went wrong:
Execution failed for task ':runners:google-cloud-dataflow-java:googleCloudPlatformRunnerV2IntegrationTest'.
> There were failing tests. See the report at: file://<https://ci-beam.apache.org/job/beam_PostCommit_Java_DataflowV2/ws/src/runners/google-cloud-dataflow-java/build/reports/tests/googleCloudPlatformRunnerV2IntegrationTest/index.html>

* Try:
> Run with --stacktrace option to get the stack trace.
> Run with --info or --debug option to get more log output.

* Get more help at https://help.gradle.org

Deprecated Gradle features were used in this build, making it incompatible with Gradle 8.0.

You can use '--warning-mode all' to show the individual deprecation warnings and determine if they come from your own scripts or plugins.

See https://docs.gradle.org/7.5.1/userguide/command_line_interface.html#sec:command_line_warnings

Execution optimizations have been disabled for 1 invalid unit(s) of work during this build to ensure correctness.
Please consult deprecation warnings for more details.

BUILD FAILED in 2h 58m 48s
152 actionable tasks: 98 executed, 50 from cache, 4 up-to-date

Publishing build scan...
https://gradle.com/s/l4t6deijxx5mm

Build step 'Invoke Gradle script' changed build result to FAILURE
Build step 'Invoke Gradle script' marked build as failure

---------------------------------------------------------------------
To unsubscribe, e-mail: builds-unsubscribe@beam.apache.org
For additional commands, e-mail: builds-help@beam.apache.org