You are viewing a plain text version of this content. The canonical link for it is here.
Posted to commits@flex.apache.org by Apache Jenkins Server <je...@builds.apache.org> on 2013/12/04 11:19:26 UTC

Build failed in Jenkins: flex-asjs #21

See <https://builds.apache.org/job/flex-asjs/21/>

------------------------------------------
Started by timer
Building remotely on windows1 in workspace <https://builds.apache.org/job/flex-asjs/ws/>
Fetching changes from the remote Git repository
Fetching upstream changes from https://git-wip-us.apache.org/repos/asf/flex-asjs.git
Checking out Revision 50e8a637f8dfcb6a615b54848f358bedc60ba9f4 (origin/develop)
Deleting old artifacts from #19
[flex-asjs] $ cmd.exe /C '"f:\hudson\hudson-slave\tools\hudson.tasks.Ant_AntInstallation\ant-1.8.2\bin\ant.bat -file build.xml release-jenkins package-sdk && exit %%ERRORLEVEL%%"'
Buildfile: <https://builds.apache.org/job/flex-asjs/ws/build.xml>

check-playerglobal-home:
     [echo] PLAYERGLOBAL_HOME is <https://builds.apache.org/job/flex-asjs/ws/../flex-sdk/lib/player>
     [echo] playerglobal.version is 11.1
     [echo] playerglobal.swc is <https://builds.apache.org/job/flex-asjs/ws/../flex-sdk/lib/player/11.1/playerglobal.swc>

check-air-home:
     [echo] AIR_HOME is <https://builds.apache.org/job/flex-asjs/ws/../flex-sdk/air/AIR> Integration Kit

check-flex-home:
     [echo] FLEX_HOME is <https://builds.apache.org/job/flex-asjs/ws/../flex-sdk>

check-falcon-home:
     [echo] FALCON_HOME is <https://builds.apache.org/job/flex-asjs/ws/../flex-falcon/compiler/generated/dist/sdk>

check-falconjx-home:
     [echo] FALCONJX_HOME is <https://builds.apache.org/job/flex-asjs/ws/../flex-falcon/compiler.jx>

BUILD FAILED
<https://builds.apache.org/job/flex-asjs/ws/build.xml>:258: FALCONJX_HOME must be set to a folder with a lib sub-folder containing jsc.jar such as the compiler.jx folder in flex-falcon repo or the js folder if it has been converted into an FB-compatible SDK

Total time: 0 seconds
Build step 'Invoke Ant' marked build as failure
Archiving artifacts

Jenkins build is back to normal : flex-asjs #32

Posted by Apache Jenkins Server <je...@builds.apache.org>.
See <https://builds.apache.org/job/flex-asjs/32/>


Build failed in Jenkins: flex-asjs #31

Posted by Apache Jenkins Server <je...@builds.apache.org>.
See <https://builds.apache.org/job/flex-asjs/31/>

------------------------------------------
Started by timer
Started by timer
Building remotely on windows1 in workspace <https://builds.apache.org/job/flex-asjs/ws/>
Fetching changes from the remote Git repository
Fetching upstream changes from https://git-wip-us.apache.org/repos/asf/flex-asjs.git
Checking out Revision b6afedb614d59cdb5de36fab64f55b04d48874ba (origin/develop)
Deleting old artifacts from #29
[flex-asjs] $ cmd.exe /C '"f:\hudson\hudson-slave\tools\hudson.tasks.Ant_AntInstallation\ant-1.8.2\bin\ant.bat -file build.xml release-jenkins package-sdk && exit %%ERRORLEVEL%%"'
Buildfile: <https://builds.apache.org/job/flex-asjs/ws/build.xml>

check-playerglobal-home:
     [echo] PLAYERGLOBAL_HOME is <https://builds.apache.org/job/flex-asjs/ws/../flex-sdk/lib/player>
     [echo] playerglobal.version is 11.1
     [echo] playerglobal.swc is <https://builds.apache.org/job/flex-asjs/ws/../flex-sdk/lib/player/11.1/playerglobal.swc>

check-air-home:
     [echo] AIR_HOME is <https://builds.apache.org/job/flex-asjs/ws/../flex-sdk/air/AIR> Integration Kit

check-flex-home:
     [echo] FLEX_HOME is <https://builds.apache.org/job/flex-asjs/ws/../flex-sdk>

check-falcon-home:
     [echo] FALCON_HOME is <https://builds.apache.org/job/flex-asjs/ws/../flex-falcon/compiler/generated/dist/sdk>

check-falconjx-home:
     [echo] FALCONJX_HOME is <https://builds.apache.org/job/flex-asjs/ws/../flex-falcon/compiler.jx>

BUILD FAILED
<https://builds.apache.org/job/flex-asjs/ws/build.xml>:258: FALCONJX_HOME must be set to a folder with a lib sub-folder containing jsc.jar such as the compiler.jx folder in flex-falcon repo or the js folder if it has been converted into an FB-compatible SDK

Total time: 0 seconds
Build step 'Invoke Ant' marked build as failure
Archiving artifacts

Build failed in Jenkins: flex-asjs #30

Posted by Apache Jenkins Server <je...@builds.apache.org>.
See <https://builds.apache.org/job/flex-asjs/30/>

------------------------------------------
Started by timer
Building remotely on windows1 in workspace <https://builds.apache.org/job/flex-asjs/ws/>
Fetching changes from the remote Git repository
Fetching upstream changes from https://git-wip-us.apache.org/repos/asf/flex-asjs.git
Checking out Revision b6afedb614d59cdb5de36fab64f55b04d48874ba (origin/develop)
Deleting old artifacts from #28
[flex-asjs] $ cmd.exe /C '"f:\hudson\hudson-slave\tools\hudson.tasks.Ant_AntInstallation\ant-1.8.2\bin\ant.bat -file build.xml release-jenkins package-sdk && exit %%ERRORLEVEL%%"'
Buildfile: <https://builds.apache.org/job/flex-asjs/ws/build.xml>

check-playerglobal-home:
     [echo] PLAYERGLOBAL_HOME is <https://builds.apache.org/job/flex-asjs/ws/../flex-sdk/lib/player>
     [echo] playerglobal.version is 11.1
     [echo] playerglobal.swc is <https://builds.apache.org/job/flex-asjs/ws/../flex-sdk/lib/player/11.1/playerglobal.swc>

check-air-home:
     [echo] AIR_HOME is <https://builds.apache.org/job/flex-asjs/ws/../flex-sdk/air/AIR> Integration Kit

check-flex-home:
     [echo] FLEX_HOME is <https://builds.apache.org/job/flex-asjs/ws/../flex-sdk>

check-falcon-home:
     [echo] FALCON_HOME is <https://builds.apache.org/job/flex-asjs/ws/../flex-falcon/compiler/generated/dist/sdk>

check-falconjx-home:
     [echo] FALCONJX_HOME is <https://builds.apache.org/job/flex-asjs/ws/../flex-falcon/compiler.jx>

BUILD FAILED
<https://builds.apache.org/job/flex-asjs/ws/build.xml>:258: FALCONJX_HOME must be set to a folder with a lib sub-folder containing jsc.jar such as the compiler.jx folder in flex-falcon repo or the js folder if it has been converted into an FB-compatible SDK

Total time: 0 seconds
Build step 'Invoke Ant' marked build as failure
Archiving artifacts

Build failed in Jenkins: flex-asjs #29

Posted by Apache Jenkins Server <je...@builds.apache.org>.
See <https://builds.apache.org/job/flex-asjs/29/>

------------------------------------------
Started by timer
Building remotely on windows1 in workspace <https://builds.apache.org/job/flex-asjs/ws/>
Fetching changes from the remote Git repository
Fetching upstream changes from https://git-wip-us.apache.org/repos/asf/flex-asjs.git
Checking out Revision b6afedb614d59cdb5de36fab64f55b04d48874ba (origin/develop)
Deleting old artifacts from #27
[flex-asjs] $ cmd.exe /C '"f:\hudson\hudson-slave\tools\hudson.tasks.Ant_AntInstallation\ant-1.8.2\bin\ant.bat -file build.xml release-jenkins package-sdk && exit %%ERRORLEVEL%%"'
Buildfile: <https://builds.apache.org/job/flex-asjs/ws/build.xml>

check-playerglobal-home:
     [echo] PLAYERGLOBAL_HOME is <https://builds.apache.org/job/flex-asjs/ws/../flex-sdk/lib/player>
     [echo] playerglobal.version is 11.1
     [echo] playerglobal.swc is <https://builds.apache.org/job/flex-asjs/ws/../flex-sdk/lib/player/11.1/playerglobal.swc>

check-air-home:
     [echo] AIR_HOME is <https://builds.apache.org/job/flex-asjs/ws/../flex-sdk/air/AIR> Integration Kit

check-flex-home:
     [echo] FLEX_HOME is <https://builds.apache.org/job/flex-asjs/ws/../flex-sdk>

check-falcon-home:
     [echo] FALCON_HOME is <https://builds.apache.org/job/flex-asjs/ws/../flex-falcon/compiler/generated/dist/sdk>

check-falconjx-home:
     [echo] FALCONJX_HOME is <https://builds.apache.org/job/flex-asjs/ws/../flex-falcon/compiler.jx>

BUILD FAILED
<https://builds.apache.org/job/flex-asjs/ws/build.xml>:258: FALCONJX_HOME must be set to a folder with a lib sub-folder containing jsc.jar such as the compiler.jx folder in flex-falcon repo or the js folder if it has been converted into an FB-compatible SDK

Total time: 0 seconds
Build step 'Invoke Ant' marked build as failure
Archiving artifacts

Build failed in Jenkins: flex-asjs #28

Posted by Apache Jenkins Server <je...@builds.apache.org>.
See <https://builds.apache.org/job/flex-asjs/28/>

------------------------------------------
Started by timer
Building remotely on windows1 in workspace <https://builds.apache.org/job/flex-asjs/ws/>
Fetching changes from the remote Git repository
Fetching upstream changes from https://git-wip-us.apache.org/repos/asf/flex-asjs.git
Checking out Revision b6afedb614d59cdb5de36fab64f55b04d48874ba (origin/develop)
Deleting old artifacts from #26
[flex-asjs] $ cmd.exe /C '"f:\hudson\hudson-slave\tools\hudson.tasks.Ant_AntInstallation\ant-1.8.2\bin\ant.bat -file build.xml release-jenkins package-sdk && exit %%ERRORLEVEL%%"'
Buildfile: <https://builds.apache.org/job/flex-asjs/ws/build.xml>

check-playerglobal-home:
     [echo] PLAYERGLOBAL_HOME is <https://builds.apache.org/job/flex-asjs/ws/../flex-sdk/lib/player>
     [echo] playerglobal.version is 11.1
     [echo] playerglobal.swc is <https://builds.apache.org/job/flex-asjs/ws/../flex-sdk/lib/player/11.1/playerglobal.swc>

check-air-home:
     [echo] AIR_HOME is <https://builds.apache.org/job/flex-asjs/ws/../flex-sdk/air/AIR> Integration Kit

check-flex-home:
     [echo] FLEX_HOME is <https://builds.apache.org/job/flex-asjs/ws/../flex-sdk>

check-falcon-home:
     [echo] FALCON_HOME is <https://builds.apache.org/job/flex-asjs/ws/../flex-falcon/compiler/generated/dist/sdk>

check-falconjx-home:
     [echo] FALCONJX_HOME is <https://builds.apache.org/job/flex-asjs/ws/../flex-falcon/compiler.jx>

BUILD FAILED
<https://builds.apache.org/job/flex-asjs/ws/build.xml>:258: FALCONJX_HOME must be set to a folder with a lib sub-folder containing jsc.jar such as the compiler.jx folder in flex-falcon repo or the js folder if it has been converted into an FB-compatible SDK

Total time: 1 second
Build step 'Invoke Ant' marked build as failure
Archiving artifacts

Build failed in Jenkins: flex-asjs #27

Posted by Apache Jenkins Server <je...@builds.apache.org>.
See <https://builds.apache.org/job/flex-asjs/27/>

------------------------------------------
Started by timer
Building remotely on windows1 in workspace <https://builds.apache.org/job/flex-asjs/ws/>
Fetching changes from the remote Git repository
Fetching upstream changes from https://git-wip-us.apache.org/repos/asf/flex-asjs.git
Checking out Revision b6afedb614d59cdb5de36fab64f55b04d48874ba (origin/develop)
Deleting old artifacts from #25
[flex-asjs] $ cmd.exe /C '"f:\hudson\hudson-slave\tools\hudson.tasks.Ant_AntInstallation\ant-1.8.2\bin\ant.bat -file build.xml release-jenkins package-sdk && exit %%ERRORLEVEL%%"'
Buildfile: <https://builds.apache.org/job/flex-asjs/ws/build.xml>

check-playerglobal-home:
     [echo] PLAYERGLOBAL_HOME is <https://builds.apache.org/job/flex-asjs/ws/../flex-sdk/lib/player>
     [echo] playerglobal.version is 11.1
     [echo] playerglobal.swc is <https://builds.apache.org/job/flex-asjs/ws/../flex-sdk/lib/player/11.1/playerglobal.swc>

check-air-home:
     [echo] AIR_HOME is <https://builds.apache.org/job/flex-asjs/ws/../flex-sdk/air/AIR> Integration Kit

check-flex-home:
     [echo] FLEX_HOME is <https://builds.apache.org/job/flex-asjs/ws/../flex-sdk>

check-falcon-home:
     [echo] FALCON_HOME is <https://builds.apache.org/job/flex-asjs/ws/../flex-falcon/compiler/generated/dist/sdk>

check-falconjx-home:
     [echo] FALCONJX_HOME is <https://builds.apache.org/job/flex-asjs/ws/../flex-falcon/compiler.jx>

BUILD FAILED
<https://builds.apache.org/job/flex-asjs/ws/build.xml>:258: FALCONJX_HOME must be set to a folder with a lib sub-folder containing jsc.jar such as the compiler.jx folder in flex-falcon repo or the js folder if it has been converted into an FB-compatible SDK

Total time: 1 second
Build step 'Invoke Ant' marked build as failure
Archiving artifacts

Build failed in Jenkins: flex-asjs #26

Posted by Apache Jenkins Server <je...@builds.apache.org>.
See <https://builds.apache.org/job/flex-asjs/26/>

------------------------------------------
Started by timer
Building remotely on windows1 in workspace <https://builds.apache.org/job/flex-asjs/ws/>
Fetching changes from the remote Git repository
Fetching upstream changes from https://git-wip-us.apache.org/repos/asf/flex-asjs.git
Checking out Revision b6afedb614d59cdb5de36fab64f55b04d48874ba (origin/develop)
Deleting old artifacts from #24
[flex-asjs] $ cmd.exe /C '"f:\hudson\hudson-slave\tools\hudson.tasks.Ant_AntInstallation\ant-1.8.2\bin\ant.bat -file build.xml release-jenkins package-sdk && exit %%ERRORLEVEL%%"'
Buildfile: <https://builds.apache.org/job/flex-asjs/ws/build.xml>

check-playerglobal-home:
     [echo] PLAYERGLOBAL_HOME is <https://builds.apache.org/job/flex-asjs/ws/../flex-sdk/lib/player>
     [echo] playerglobal.version is 11.1
     [echo] playerglobal.swc is <https://builds.apache.org/job/flex-asjs/ws/../flex-sdk/lib/player/11.1/playerglobal.swc>

check-air-home:
     [echo] AIR_HOME is <https://builds.apache.org/job/flex-asjs/ws/../flex-sdk/air/AIR> Integration Kit

check-flex-home:
     [echo] FLEX_HOME is <https://builds.apache.org/job/flex-asjs/ws/../flex-sdk>

check-falcon-home:
     [echo] FALCON_HOME is <https://builds.apache.org/job/flex-asjs/ws/../flex-falcon/compiler/generated/dist/sdk>

check-falconjx-home:
     [echo] FALCONJX_HOME is <https://builds.apache.org/job/flex-asjs/ws/../flex-falcon/compiler.jx>

BUILD FAILED
<https://builds.apache.org/job/flex-asjs/ws/build.xml>:258: FALCONJX_HOME must be set to a folder with a lib sub-folder containing jsc.jar such as the compiler.jx folder in flex-falcon repo or the js folder if it has been converted into an FB-compatible SDK

Total time: 0 seconds
Build step 'Invoke Ant' marked build as failure
Archiving artifacts

Build failed in Jenkins: flex-asjs #25

Posted by Apache Jenkins Server <je...@builds.apache.org>.
See <https://builds.apache.org/job/flex-asjs/25/>

------------------------------------------
Started by timer
Building remotely on windows1 in workspace <https://builds.apache.org/job/flex-asjs/ws/>
Fetching changes from the remote Git repository
Fetching upstream changes from https://git-wip-us.apache.org/repos/asf/flex-asjs.git
Checking out Revision b6afedb614d59cdb5de36fab64f55b04d48874ba (origin/develop)
Deleting old artifacts from #23
[flex-asjs] $ cmd.exe /C '"f:\hudson\hudson-slave\tools\hudson.tasks.Ant_AntInstallation\ant-1.8.2\bin\ant.bat -file build.xml release-jenkins package-sdk && exit %%ERRORLEVEL%%"'
Buildfile: <https://builds.apache.org/job/flex-asjs/ws/build.xml>

check-playerglobal-home:
     [echo] PLAYERGLOBAL_HOME is <https://builds.apache.org/job/flex-asjs/ws/../flex-sdk/lib/player>
     [echo] playerglobal.version is 11.1
     [echo] playerglobal.swc is <https://builds.apache.org/job/flex-asjs/ws/../flex-sdk/lib/player/11.1/playerglobal.swc>

check-air-home:
     [echo] AIR_HOME is <https://builds.apache.org/job/flex-asjs/ws/../flex-sdk/air/AIR> Integration Kit

check-flex-home:
     [echo] FLEX_HOME is <https://builds.apache.org/job/flex-asjs/ws/../flex-sdk>

check-falcon-home:
     [echo] FALCON_HOME is <https://builds.apache.org/job/flex-asjs/ws/../flex-falcon/compiler/generated/dist/sdk>

check-falconjx-home:
     [echo] FALCONJX_HOME is <https://builds.apache.org/job/flex-asjs/ws/../flex-falcon/compiler.jx>

BUILD FAILED
<https://builds.apache.org/job/flex-asjs/ws/build.xml>:258: FALCONJX_HOME must be set to a folder with a lib sub-folder containing jsc.jar such as the compiler.jx folder in flex-falcon repo or the js folder if it has been converted into an FB-compatible SDK

Total time: 0 seconds
Build step 'Invoke Ant' marked build as failure
Archiving artifacts

Build failed in Jenkins: flex-asjs #24

Posted by Apache Jenkins Server <je...@builds.apache.org>.
See <https://builds.apache.org/job/flex-asjs/24/changes>

Changes:

[pent] DataGrid cross-compile example.

[pent] Added build.xml to DataGridXcompile example.

------------------------------------------
Started by an SCM change
Building remotely on windows1 in workspace <https://builds.apache.org/job/flex-asjs/ws/>
Fetching changes from the remote Git repository
Fetching upstream changes from https://git-wip-us.apache.org/repos/asf/flex-asjs.git
Checking out Revision b6afedb614d59cdb5de36fab64f55b04d48874ba (origin/develop)
Deleting old artifacts from #22
[flex-asjs] $ cmd.exe /C '"f:\hudson\hudson-slave\tools\hudson.tasks.Ant_AntInstallation\ant-1.8.2\bin\ant.bat -file build.xml release-jenkins package-sdk && exit %%ERRORLEVEL%%"'
Buildfile: <https://builds.apache.org/job/flex-asjs/ws/build.xml>

check-playerglobal-home:
     [echo] PLAYERGLOBAL_HOME is <https://builds.apache.org/job/flex-asjs/ws/../flex-sdk/lib/player>
     [echo] playerglobal.version is 11.1
     [echo] playerglobal.swc is <https://builds.apache.org/job/flex-asjs/ws/../flex-sdk/lib/player/11.1/playerglobal.swc>

check-air-home:
     [echo] AIR_HOME is <https://builds.apache.org/job/flex-asjs/ws/../flex-sdk/air/AIR> Integration Kit

check-flex-home:
     [echo] FLEX_HOME is <https://builds.apache.org/job/flex-asjs/ws/../flex-sdk>

check-falcon-home:
     [echo] FALCON_HOME is <https://builds.apache.org/job/flex-asjs/ws/../flex-falcon/compiler/generated/dist/sdk>

check-falconjx-home:
     [echo] FALCONJX_HOME is <https://builds.apache.org/job/flex-asjs/ws/../flex-falcon/compiler.jx>

BUILD FAILED
<https://builds.apache.org/job/flex-asjs/ws/build.xml>:258: FALCONJX_HOME must be set to a folder with a lib sub-folder containing jsc.jar such as the compiler.jx folder in flex-falcon repo or the js folder if it has been converted into an FB-compatible SDK

Total time: 1 second
Build step 'Invoke Ant' marked build as failure
Archiving artifacts

Build failed in Jenkins: flex-asjs #23

Posted by Apache Jenkins Server <je...@builds.apache.org>.
See <https://builds.apache.org/job/flex-asjs/23/>

------------------------------------------
Started by timer
Building remotely on windows1 in workspace <https://builds.apache.org/job/flex-asjs/ws/>
Fetching changes from the remote Git repository
Fetching upstream changes from https://git-wip-us.apache.org/repos/asf/flex-asjs.git
Checking out Revision 50e8a637f8dfcb6a615b54848f358bedc60ba9f4 (origin/develop)
Deleting old artifacts from #21
[flex-asjs] $ cmd.exe /C '"f:\hudson\hudson-slave\tools\hudson.tasks.Ant_AntInstallation\ant-1.8.2\bin\ant.bat -file build.xml release-jenkins package-sdk && exit %%ERRORLEVEL%%"'
Buildfile: <https://builds.apache.org/job/flex-asjs/ws/build.xml>

check-playerglobal-home:
     [echo] PLAYERGLOBAL_HOME is <https://builds.apache.org/job/flex-asjs/ws/../flex-sdk/lib/player>
     [echo] playerglobal.version is 11.1
     [echo] playerglobal.swc is <https://builds.apache.org/job/flex-asjs/ws/../flex-sdk/lib/player/11.1/playerglobal.swc>

check-air-home:
     [echo] AIR_HOME is <https://builds.apache.org/job/flex-asjs/ws/../flex-sdk/air/AIR> Integration Kit

check-flex-home:
     [echo] FLEX_HOME is <https://builds.apache.org/job/flex-asjs/ws/../flex-sdk>

check-falcon-home:
     [echo] FALCON_HOME is <https://builds.apache.org/job/flex-asjs/ws/../flex-falcon/compiler/generated/dist/sdk>

check-falconjx-home:
     [echo] FALCONJX_HOME is <https://builds.apache.org/job/flex-asjs/ws/../flex-falcon/compiler.jx>

BUILD FAILED
<https://builds.apache.org/job/flex-asjs/ws/build.xml>:258: FALCONJX_HOME must be set to a folder with a lib sub-folder containing jsc.jar such as the compiler.jx folder in flex-falcon repo or the js folder if it has been converted into an FB-compatible SDK

Total time: 0 seconds
Build step 'Invoke Ant' marked build as failure
Archiving artifacts

Re: Build failed in Jenkins: flex-asjs #22

Posted by Erik de Bruin <er...@ixsoftware.nl>.
Still waiting on 'builds@a.o' to correct the issue they created while
messing with the Windows slaves. Sorry about the continued build
failures, I know it's a pain :-(

EdB



On Thu, Dec 5, 2013 at 11:17 AM, Apache Jenkins Server
<je...@builds.apache.org> wrote:
> See <https://builds.apache.org/job/flex-asjs/22/>
>
> ------------------------------------------
> Started by timer
> Building remotely on windows1 in workspace <https://builds.apache.org/job/flex-asjs/ws/>
> Fetching changes from the remote Git repository
> Fetching upstream changes from https://git-wip-us.apache.org/repos/asf/flex-asjs.git
> Checking out Revision 50e8a637f8dfcb6a615b54848f358bedc60ba9f4 (origin/develop)
> Deleting old artifacts from #20
> [flex-asjs] $ cmd.exe /C '"f:\hudson\hudson-slave\tools\hudson.tasks.Ant_AntInstallation\ant-1.8.2\bin\ant.bat -file build.xml release-jenkins package-sdk && exit %%ERRORLEVEL%%"'
> Buildfile: <https://builds.apache.org/job/flex-asjs/ws/build.xml>
>
> check-playerglobal-home:
>      [echo] PLAYERGLOBAL_HOME is <https://builds.apache.org/job/flex-asjs/ws/../flex-sdk/lib/player>
>      [echo] playerglobal.version is 11.1
>      [echo] playerglobal.swc is <https://builds.apache.org/job/flex-asjs/ws/../flex-sdk/lib/player/11.1/playerglobal.swc>
>
> check-air-home:
>      [echo] AIR_HOME is <https://builds.apache.org/job/flex-asjs/ws/../flex-sdk/air/AIR> Integration Kit
>
> check-flex-home:
>      [echo] FLEX_HOME is <https://builds.apache.org/job/flex-asjs/ws/../flex-sdk>
>
> check-falcon-home:
>      [echo] FALCON_HOME is <https://builds.apache.org/job/flex-asjs/ws/../flex-falcon/compiler/generated/dist/sdk>
>
> check-falconjx-home:
>      [echo] FALCONJX_HOME is <https://builds.apache.org/job/flex-asjs/ws/../flex-falcon/compiler.jx>
>
> BUILD FAILED
> <https://builds.apache.org/job/flex-asjs/ws/build.xml>:258: FALCONJX_HOME must be set to a folder with a lib sub-folder containing jsc.jar such as the compiler.jx folder in flex-falcon repo or the js folder if it has been converted into an FB-compatible SDK
>
> Total time: 0 seconds
> Build step 'Invoke Ant' marked build as failure
> Archiving artifacts



-- 
Ix Multimedia Software

Jan Luykenstraat 27
3521 VB Utrecht

T. 06-51952295
I. www.ixsoftware.nl

Build failed in Jenkins: flex-asjs #22

Posted by Apache Jenkins Server <je...@builds.apache.org>.
See <https://builds.apache.org/job/flex-asjs/22/>

------------------------------------------
Started by timer
Building remotely on windows1 in workspace <https://builds.apache.org/job/flex-asjs/ws/>
Fetching changes from the remote Git repository
Fetching upstream changes from https://git-wip-us.apache.org/repos/asf/flex-asjs.git
Checking out Revision 50e8a637f8dfcb6a615b54848f358bedc60ba9f4 (origin/develop)
Deleting old artifacts from #20
[flex-asjs] $ cmd.exe /C '"f:\hudson\hudson-slave\tools\hudson.tasks.Ant_AntInstallation\ant-1.8.2\bin\ant.bat -file build.xml release-jenkins package-sdk && exit %%ERRORLEVEL%%"'
Buildfile: <https://builds.apache.org/job/flex-asjs/ws/build.xml>

check-playerglobal-home:
     [echo] PLAYERGLOBAL_HOME is <https://builds.apache.org/job/flex-asjs/ws/../flex-sdk/lib/player>
     [echo] playerglobal.version is 11.1
     [echo] playerglobal.swc is <https://builds.apache.org/job/flex-asjs/ws/../flex-sdk/lib/player/11.1/playerglobal.swc>

check-air-home:
     [echo] AIR_HOME is <https://builds.apache.org/job/flex-asjs/ws/../flex-sdk/air/AIR> Integration Kit

check-flex-home:
     [echo] FLEX_HOME is <https://builds.apache.org/job/flex-asjs/ws/../flex-sdk>

check-falcon-home:
     [echo] FALCON_HOME is <https://builds.apache.org/job/flex-asjs/ws/../flex-falcon/compiler/generated/dist/sdk>

check-falconjx-home:
     [echo] FALCONJX_HOME is <https://builds.apache.org/job/flex-asjs/ws/../flex-falcon/compiler.jx>

BUILD FAILED
<https://builds.apache.org/job/flex-asjs/ws/build.xml>:258: FALCONJX_HOME must be set to a folder with a lib sub-folder containing jsc.jar such as the compiler.jx folder in flex-falcon repo or the js folder if it has been converted into an FB-compatible SDK

Total time: 0 seconds
Build step 'Invoke Ant' marked build as failure
Archiving artifacts

Re: Build failed in Jenkins: flex-asjs #21

Posted by Erik de Bruin <er...@ixsoftware.nl>.
Don't Panic!

Because Flex-SDK build fails, all dependant jobs also fail.

I'm 'on the phone' with builds@a.o to see what's up with the flex-sdk job.

EdB



On Wed, Dec 4, 2013 at 11:19 AM, Apache Jenkins Server
<je...@builds.apache.org> wrote:
> See <https://builds.apache.org/job/flex-asjs/21/>
>
> ------------------------------------------
> Started by timer
> Building remotely on windows1 in workspace <https://builds.apache.org/job/flex-asjs/ws/>
> Fetching changes from the remote Git repository
> Fetching upstream changes from https://git-wip-us.apache.org/repos/asf/flex-asjs.git
> Checking out Revision 50e8a637f8dfcb6a615b54848f358bedc60ba9f4 (origin/develop)
> Deleting old artifacts from #19
> [flex-asjs] $ cmd.exe /C '"f:\hudson\hudson-slave\tools\hudson.tasks.Ant_AntInstallation\ant-1.8.2\bin\ant.bat -file build.xml release-jenkins package-sdk && exit %%ERRORLEVEL%%"'
> Buildfile: <https://builds.apache.org/job/flex-asjs/ws/build.xml>
>
> check-playerglobal-home:
>      [echo] PLAYERGLOBAL_HOME is <https://builds.apache.org/job/flex-asjs/ws/../flex-sdk/lib/player>
>      [echo] playerglobal.version is 11.1
>      [echo] playerglobal.swc is <https://builds.apache.org/job/flex-asjs/ws/../flex-sdk/lib/player/11.1/playerglobal.swc>
>
> check-air-home:
>      [echo] AIR_HOME is <https://builds.apache.org/job/flex-asjs/ws/../flex-sdk/air/AIR> Integration Kit
>
> check-flex-home:
>      [echo] FLEX_HOME is <https://builds.apache.org/job/flex-asjs/ws/../flex-sdk>
>
> check-falcon-home:
>      [echo] FALCON_HOME is <https://builds.apache.org/job/flex-asjs/ws/../flex-falcon/compiler/generated/dist/sdk>
>
> check-falconjx-home:
>      [echo] FALCONJX_HOME is <https://builds.apache.org/job/flex-asjs/ws/../flex-falcon/compiler.jx>
>
> BUILD FAILED
> <https://builds.apache.org/job/flex-asjs/ws/build.xml>:258: FALCONJX_HOME must be set to a folder with a lib sub-folder containing jsc.jar such as the compiler.jx folder in flex-falcon repo or the js folder if it has been converted into an FB-compatible SDK
>
> Total time: 0 seconds
> Build step 'Invoke Ant' marked build as failure
> Archiving artifacts



-- 
Ix Multimedia Software

Jan Luykenstraat 27
3521 VB Utrecht

T. 06-51952295
I. www.ixsoftware.nl

Re: Build failed in Jenkins: flex-asjs #21

Posted by Erik de Bruin <er...@ixsoftware.nl>.
Don't Panic!

Because Flex-SDK build fails, all dependant jobs also fail.

I'm 'on the phone' with builds@a.o to see what's up with the flex-sdk job.

EdB



On Wed, Dec 4, 2013 at 11:19 AM, Apache Jenkins Server
<je...@builds.apache.org> wrote:
> See <https://builds.apache.org/job/flex-asjs/21/>
>
> ------------------------------------------
> Started by timer
> Building remotely on windows1 in workspace <https://builds.apache.org/job/flex-asjs/ws/>
> Fetching changes from the remote Git repository
> Fetching upstream changes from https://git-wip-us.apache.org/repos/asf/flex-asjs.git
> Checking out Revision 50e8a637f8dfcb6a615b54848f358bedc60ba9f4 (origin/develop)
> Deleting old artifacts from #19
> [flex-asjs] $ cmd.exe /C '"f:\hudson\hudson-slave\tools\hudson.tasks.Ant_AntInstallation\ant-1.8.2\bin\ant.bat -file build.xml release-jenkins package-sdk && exit %%ERRORLEVEL%%"'
> Buildfile: <https://builds.apache.org/job/flex-asjs/ws/build.xml>
>
> check-playerglobal-home:
>      [echo] PLAYERGLOBAL_HOME is <https://builds.apache.org/job/flex-asjs/ws/../flex-sdk/lib/player>
>      [echo] playerglobal.version is 11.1
>      [echo] playerglobal.swc is <https://builds.apache.org/job/flex-asjs/ws/../flex-sdk/lib/player/11.1/playerglobal.swc>
>
> check-air-home:
>      [echo] AIR_HOME is <https://builds.apache.org/job/flex-asjs/ws/../flex-sdk/air/AIR> Integration Kit
>
> check-flex-home:
>      [echo] FLEX_HOME is <https://builds.apache.org/job/flex-asjs/ws/../flex-sdk>
>
> check-falcon-home:
>      [echo] FALCON_HOME is <https://builds.apache.org/job/flex-asjs/ws/../flex-falcon/compiler/generated/dist/sdk>
>
> check-falconjx-home:
>      [echo] FALCONJX_HOME is <https://builds.apache.org/job/flex-asjs/ws/../flex-falcon/compiler.jx>
>
> BUILD FAILED
> <https://builds.apache.org/job/flex-asjs/ws/build.xml>:258: FALCONJX_HOME must be set to a folder with a lib sub-folder containing jsc.jar such as the compiler.jx folder in flex-falcon repo or the js folder if it has been converted into an FB-compatible SDK
>
> Total time: 0 seconds
> Build step 'Invoke Ant' marked build as failure
> Archiving artifacts



-- 
Ix Multimedia Software

Jan Luykenstraat 27
3521 VB Utrecht

T. 06-51952295
I. www.ixsoftware.nl