You are viewing a plain text version of this content. The canonical link for it is here.
Posted to dev@lucene.apache.org by Policeman Jenkins Server <je...@thetaphi.de> on 2016/07/16 08:04:43 UTC
[JENKINS] Lucene-Solr-6.x-Linux (64bit/jdk1.8.0_92) - Build # 1171
- Failure!
Build: http://jenkins.thetaphi.de/job/Lucene-Solr-6.x-Linux/1171/
Java: 64bit/jdk1.8.0_92 -XX:+UseCompressedOops -XX:+UseParallelGC
1 tests failed.
FAILED: org.apache.solr.cloud.ForceLeaderTest.testReplicasInLIRNoLeader
Error Message:
org.apache.solr.client.solrj.SolrServerException: No live SolrServers available to handle this request:[http://127.0.0.1:46628/forceleader_test_collection_shard1_replica2]
Stack Trace:
org.apache.solr.client.solrj.SolrServerException: org.apache.solr.client.solrj.SolrServerException: No live SolrServers available to handle this request:[http://127.0.0.1:46628/forceleader_test_collection_shard1_replica2]
at __randomizedtesting.SeedInfo.seed([4463D8CD8F9C2761:A2F4EC0DB61EDE00]:0)
at org.apache.solr.client.solrj.impl.CloudSolrClient.directUpdate(CloudSolrClient.java:753)
at org.apache.solr.client.solrj.impl.CloudSolrClient.sendRequest(CloudSolrClient.java:1151)
at org.apache.solr.client.solrj.impl.CloudSolrClient.requestWithRetryOnStaleState(CloudSolrClient.java:1040)
at org.apache.solr.client.solrj.impl.CloudSolrClient.request(CloudSolrClient.java:976)
at org.apache.solr.cloud.AbstractFullDistribZkTestBase.sendDocsWithRetry(AbstractFullDistribZkTestBase.java:753)
at org.apache.solr.cloud.AbstractFullDistribZkTestBase.sendDocsWithRetry(AbstractFullDistribZkTestBase.java:741)
at org.apache.solr.cloud.ForceLeaderTest.sendDoc(ForceLeaderTest.java:424)
at org.apache.solr.cloud.ForceLeaderTest.assertSendDocFails(ForceLeaderTest.java:315)
at org.apache.solr.cloud.ForceLeaderTest.testReplicasInLIRNoLeader(ForceLeaderTest.java:110)
at sun.reflect.NativeMethodAccessorImpl.invoke0(Native Method)
at sun.reflect.NativeMethodAccessorImpl.invoke(NativeMethodAccessorImpl.java:62)
at sun.reflect.DelegatingMethodAccessorImpl.invoke(DelegatingMethodAccessorImpl.java:43)
at java.lang.reflect.Method.invoke(Method.java:498)
at com.carrotsearch.randomizedtesting.RandomizedRunner.invoke(RandomizedRunner.java:1764)
at com.carrotsearch.randomizedtesting.RandomizedRunner$8.evaluate(RandomizedRunner.java:871)
at com.carrotsearch.randomizedtesting.RandomizedRunner$9.evaluate(RandomizedRunner.java:907)
at com.carrotsearch.randomizedtesting.RandomizedRunner$10.evaluate(RandomizedRunner.java:921)
at org.apache.solr.BaseDistributedSearchTestCase$ShardsRepeatRule$ShardsFixedStatement.callStatement(BaseDistributedSearchTestCase.java:992)
at org.apache.solr.BaseDistributedSearchTestCase$ShardsRepeatRule$ShardsStatement.evaluate(BaseDistributedSearchTestCase.java:967)
at com.carrotsearch.randomizedtesting.rules.SystemPropertiesRestoreRule$1.evaluate(SystemPropertiesRestoreRule.java:57)
at org.apache.lucene.util.TestRuleSetupTeardownChained$1.evaluate(TestRuleSetupTeardownChained.java:49)
at org.apache.lucene.util.AbstractBeforeAfterRule$1.evaluate(AbstractBeforeAfterRule.java:45)
at org.apache.lucene.util.TestRuleThreadAndTestName$1.evaluate(TestRuleThreadAndTestName.java:48)
at org.apache.lucene.util.TestRuleIgnoreAfterMaxFailures$1.evaluate(TestRuleIgnoreAfterMaxFailures.java:64)
at org.apache.lucene.util.TestRuleMarkFailure$1.evaluate(TestRuleMarkFailure.java:47)
at com.carrotsearch.randomizedtesting.rules.StatementAdapter.evaluate(StatementAdapter.java:36)
at com.carrotsearch.randomizedtesting.ThreadLeakControl$StatementRunner.run(ThreadLeakControl.java:367)
at com.carrotsearch.randomizedtesting.ThreadLeakControl.forkTimeoutingTask(ThreadLeakControl.java:809)
at com.carrotsearch.randomizedtesting.ThreadLeakControl$3.evaluate(ThreadLeakControl.java:460)
at com.carrotsearch.randomizedtesting.RandomizedRunner.runSingleTest(RandomizedRunner.java:880)
at com.carrotsearch.randomizedtesting.RandomizedRunner$5.evaluate(RandomizedRunner.java:781)
at com.carrotsearch.randomizedtesting.RandomizedRunner$6.evaluate(RandomizedRunner.java:816)
at com.carrotsearch.randomizedtesting.RandomizedRunner$7.evaluate(RandomizedRunner.java:827)
at com.carrotsearch.randomizedtesting.rules.StatementAdapter.evaluate(StatementAdapter.java:36)
at com.carrotsearch.randomizedtesting.rules.SystemPropertiesRestoreRule$1.evaluate(SystemPropertiesRestoreRule.java:57)
at org.apache.lucene.util.AbstractBeforeAfterRule$1.evaluate(AbstractBeforeAfterRule.java:45)
at com.carrotsearch.randomizedtesting.rules.StatementAdapter.evaluate(StatementAdapter.java:36)
at org.apache.lucene.util.TestRuleStoreClassName$1.evaluate(TestRuleStoreClassName.java:41)
at com.carrotsearch.randomizedtesting.rules.NoShadowingOrOverridesOnMethodsRule$1.evaluate(NoShadowingOrOverridesOnMethodsRule.java:40)
at com.carrotsearch.randomizedtesting.rules.NoShadowingOrOverridesOnMethodsRule$1.evaluate(NoShadowingOrOverridesOnMethodsRule.java:40)
at com.carrotsearch.randomizedtesting.rules.StatementAdapter.evaluate(StatementAdapter.java:36)
at com.carrotsearch.randomizedtesting.rules.StatementAdapter.evaluate(StatementAdapter.java:36)
at com.carrotsearch.randomizedtesting.rules.StatementAdapter.evaluate(StatementAdapter.java:36)
at org.apache.lucene.util.TestRuleAssertionsRequired$1.evaluate(TestRuleAssertionsRequired.java:53)
at org.apache.lucene.util.TestRuleMarkFailure$1.evaluate(TestRuleMarkFailure.java:47)
at org.apache.lucene.util.TestRuleIgnoreAfterMaxFailures$1.evaluate(TestRuleIgnoreAfterMaxFailures.java:64)
at org.apache.lucene.util.TestRuleIgnoreTestSuites$1.evaluate(TestRuleIgnoreTestSuites.java:54)
at com.carrotsearch.randomizedtesting.rules.StatementAdapter.evaluate(StatementAdapter.java:36)
at com.carrotsearch.randomizedtesting.ThreadLeakControl$StatementRunner.run(ThreadLeakControl.java:367)
at java.lang.Thread.run(Thread.java:745)
Caused by: org.apache.solr.client.solrj.SolrServerException: No live SolrServers available to handle this request:[http://127.0.0.1:46628/forceleader_test_collection_shard1_replica2]
at org.apache.solr.client.solrj.impl.LBHttpSolrClient.request(LBHttpSolrClient.java:383)
at org.apache.solr.client.solrj.impl.CloudSolrClient.directUpdate(CloudSolrClient.java:747)
... 49 more
Caused by: org.apache.solr.client.solrj.SolrServerException: Server refused connection at: http://127.0.0.1:46628/forceleader_test_collection_shard1_replica2
at org.apache.solr.client.solrj.impl.HttpSolrClient.executeMethod(HttpSolrClient.java:597)
at org.apache.solr.client.solrj.impl.HttpSolrClient.request(HttpSolrClient.java:259)
at org.apache.solr.client.solrj.impl.HttpSolrClient.request(HttpSolrClient.java:248)
at org.apache.solr.client.solrj.impl.LBHttpSolrClient.doRequest(LBHttpSolrClient.java:403)
at org.apache.solr.client.solrj.impl.LBHttpSolrClient.request(LBHttpSolrClient.java:372)
... 50 more
Caused by: java.net.ConnectException: Connection refused
at java.net.PlainSocketImpl.socketConnect(Native Method)
at java.net.AbstractPlainSocketImpl.doConnect(AbstractPlainSocketImpl.java:350)
at java.net.AbstractPlainSocketImpl.connectToAddress(AbstractPlainSocketImpl.java:206)
at java.net.AbstractPlainSocketImpl.connect(AbstractPlainSocketImpl.java:188)
at java.net.SocksSocketImpl.connect(SocksSocketImpl.java:392)
at java.net.Socket.connect(Socket.java:589)
at org.apache.http.conn.scheme.PlainSocketFactory.connectSocket(PlainSocketFactory.java:117)
at org.apache.http.impl.conn.DefaultClientConnectionOperator.openConnection(DefaultClientConnectionOperator.java:177)
at org.apache.http.impl.conn.ManagedClientConnectionImpl.open(ManagedClientConnectionImpl.java:304)
at org.apache.http.impl.client.DefaultRequestDirector.tryConnect(DefaultRequestDirector.java:611)
at org.apache.http.impl.client.DefaultRequestDirector.execute(DefaultRequestDirector.java:446)
at org.apache.http.impl.client.AbstractHttpClient.doExecute(AbstractHttpClient.java:882)
at org.apache.http.impl.client.CloseableHttpClient.execute(CloseableHttpClient.java:82)
at org.apache.http.impl.client.CloseableHttpClient.execute(CloseableHttpClient.java:107)
at org.apache.http.impl.client.CloseableHttpClient.execute(CloseableHttpClient.java:55)
at org.apache.solr.client.solrj.impl.HttpSolrClient.executeMethod(HttpSolrClient.java:495)
... 54 more
Build Log:
[...truncated 12076 lines...]
[junit4] Suite: org.apache.solr.cloud.ForceLeaderTest
[junit4] 2> Creating dataDir: /home/jenkins/workspace/Lucene-Solr-6.x-Linux/solr/build/solr-core/test/J1/temp/solr.cloud.ForceLeaderTest_4463D8CD8F9C2761-001/init-core-data-001
[junit4] 2> 1556905 INFO (SUITE-ForceLeaderTest-seed#[4463D8CD8F9C2761]-worker) [ ] o.a.s.SolrTestCaseJ4 Randomized ssl (false) and clientAuth (false) via: @org.apache.solr.SolrTestCaseJ4$SuppressSSL(bugUrl=https://issues.apache.org/jira/browse/SOLR-5776)
[junit4] 2> 1556905 INFO (SUITE-ForceLeaderTest-seed#[4463D8CD8F9C2761]-worker) [ ] o.a.s.BaseDistributedSearchTestCase Setting hostContext system property: /
[junit4] 2> 1556907 INFO (TEST-ForceLeaderTest.testLastPublishedStateIsActive-seed#[4463D8CD8F9C2761]) [ ] o.a.s.c.ZkTestServer STARTING ZK TEST SERVER
[junit4] 2> 1556907 INFO (Thread-2845) [ ] o.a.s.c.ZkTestServer client port:0.0.0.0/0.0.0.0:0
[junit4] 2> 1556907 INFO (Thread-2845) [ ] o.a.s.c.ZkTestServer Starting server
[junit4] 2> 1557007 INFO (TEST-ForceLeaderTest.testLastPublishedStateIsActive-seed#[4463D8CD8F9C2761]) [ ] o.a.s.c.ZkTestServer start zk server on port:40495
[junit4] 2> 1557007 INFO (TEST-ForceLeaderTest.testLastPublishedStateIsActive-seed#[4463D8CD8F9C2761]) [ ] o.a.s.c.c.SolrZkClient Using default ZkCredentialsProvider
[junit4] 2> 1557007 INFO (TEST-ForceLeaderTest.testLastPublishedStateIsActive-seed#[4463D8CD8F9C2761]) [ ] o.a.s.c.c.ConnectionManager Waiting for client to connect to ZooKeeper
[junit4] 2> 1557010 INFO (zkCallback-20078-thread-1) [ ] o.a.s.c.c.ConnectionManager Watcher org.apache.solr.common.cloud.ConnectionManager@4b22a5a4 name:ZooKeeperConnection Watcher:127.0.0.1:40495 got event WatchedEvent state:SyncConnected type:None path:null path:null type:None
[junit4] 2> 1557010 INFO (TEST-ForceLeaderTest.testLastPublishedStateIsActive-seed#[4463D8CD8F9C2761]) [ ] o.a.s.c.c.ConnectionManager Client is connected to ZooKeeper
[junit4] 2> 1557010 INFO (TEST-ForceLeaderTest.testLastPublishedStateIsActive-seed#[4463D8CD8F9C2761]) [ ] o.a.s.c.c.SolrZkClient Using default ZkACLProvider
[junit4] 2> 1557010 INFO (TEST-ForceLeaderTest.testLastPublishedStateIsActive-seed#[4463D8CD8F9C2761]) [ ] o.a.s.c.c.SolrZkClient makePath: /solr
[junit4] 2> 1557011 INFO (TEST-ForceLeaderTest.testLastPublishedStateIsActive-seed#[4463D8CD8F9C2761]) [ ] o.a.s.c.c.SolrZkClient Using default ZkCredentialsProvider
[junit4] 2> 1557011 INFO (TEST-ForceLeaderTest.testLastPublishedStateIsActive-seed#[4463D8CD8F9C2761]) [ ] o.a.s.c.c.ConnectionManager Waiting for client to connect to ZooKeeper
[junit4] 2> 1557012 INFO (zkCallback-20079-thread-1) [ ] o.a.s.c.c.ConnectionManager Watcher org.apache.solr.common.cloud.ConnectionManager@1fb56349 name:ZooKeeperConnection Watcher:127.0.0.1:40495/solr got event WatchedEvent state:SyncConnected type:None path:null path:null type:None
[junit4] 2> 1557012 INFO (TEST-ForceLeaderTest.testLastPublishedStateIsActive-seed#[4463D8CD8F9C2761]) [ ] o.a.s.c.c.ConnectionManager Client is connected to ZooKeeper
[junit4] 2> 1557012 INFO (TEST-ForceLeaderTest.testLastPublishedStateIsActive-seed#[4463D8CD8F9C2761]) [ ] o.a.s.c.c.SolrZkClient Using default ZkACLProvider
[junit4] 2> 1557012 INFO (TEST-ForceLeaderTest.testLastPublishedStateIsActive-seed#[4463D8CD8F9C2761]) [ ] o.a.s.c.c.SolrZkClient makePath: /collections/collection1
[junit4] 2> 1557013 INFO (TEST-ForceLeaderTest.testLastPublishedStateIsActive-seed#[4463D8CD8F9C2761]) [ ] o.a.s.c.c.SolrZkClient makePath: /collections/collection1/shards
[junit4] 2> 1557013 INFO (TEST-ForceLeaderTest.testLastPublishedStateIsActive-seed#[4463D8CD8F9C2761]) [ ] o.a.s.c.c.SolrZkClient makePath: /collections/control_collection
[junit4] 2> 1557014 INFO (TEST-ForceLeaderTest.testLastPublishedStateIsActive-seed#[4463D8CD8F9C2761]) [ ] o.a.s.c.c.SolrZkClient makePath: /collections/control_collection/shards
[junit4] 2> 1557014 INFO (TEST-ForceLeaderTest.testLastPublishedStateIsActive-seed#[4463D8CD8F9C2761]) [ ] o.a.s.c.AbstractZkTestCase put /home/jenkins/workspace/Lucene-Solr-6.x-Linux/solr/core/src/test-files/solr/collection1/conf/solrconfig-tlog.xml to /configs/conf1/solrconfig.xml
[junit4] 2> 1557014 INFO (TEST-ForceLeaderTest.testLastPublishedStateIsActive-seed#[4463D8CD8F9C2761]) [ ] o.a.s.c.c.SolrZkClient makePath: /configs/conf1/solrconfig.xml
[junit4] 2> 1557015 INFO (TEST-ForceLeaderTest.testLastPublishedStateIsActive-seed#[4463D8CD8F9C2761]) [ ] o.a.s.c.AbstractZkTestCase put /home/jenkins/workspace/Lucene-Solr-6.x-Linux/solr/core/src/test-files/solr/collection1/conf/schema.xml to /configs/conf1/schema.xml
[junit4] 2> 1557015 INFO (TEST-ForceLeaderTest.testLastPublishedStateIsActive-seed#[4463D8CD8F9C2761]) [ ] o.a.s.c.c.SolrZkClient makePath: /configs/conf1/schema.xml
[junit4] 2> 1557016 INFO (TEST-ForceLeaderTest.testLastPublishedStateIsActive-seed#[4463D8CD8F9C2761]) [ ] o.a.s.c.AbstractZkTestCase put /home/jenkins/workspace/Lucene-Solr-6.x-Linux/solr/core/src/test-files/solr/collection1/conf/solrconfig.snippet.randomindexconfig.xml to /configs/conf1/solrconfig.snippet.randomindexconfig.xml
[junit4] 2> 1557016 INFO (TEST-ForceLeaderTest.testLastPublishedStateIsActive-seed#[4463D8CD8F9C2761]) [ ] o.a.s.c.c.SolrZkClient makePath: /configs/conf1/solrconfig.snippet.randomindexconfig.xml
[junit4] 2> 1557018 INFO (TEST-ForceLeaderTest.testLastPublishedStateIsActive-seed#[4463D8CD8F9C2761]) [ ] o.a.s.c.AbstractZkTestCase put /home/jenkins/workspace/Lucene-Solr-6.x-Linux/solr/core/src/test-files/solr/collection1/conf/stopwords.txt to /configs/conf1/stopwords.txt
[junit4] 2> 1557018 INFO (TEST-ForceLeaderTest.testLastPublishedStateIsActive-seed#[4463D8CD8F9C2761]) [ ] o.a.s.c.c.SolrZkClient makePath: /configs/conf1/stopwords.txt
[junit4] 2> 1557018 INFO (TEST-ForceLeaderTest.testLastPublishedStateIsActive-seed#[4463D8CD8F9C2761]) [ ] o.a.s.c.AbstractZkTestCase put /home/jenkins/workspace/Lucene-Solr-6.x-Linux/solr/core/src/test-files/solr/collection1/conf/protwords.txt to /configs/conf1/protwords.txt
[junit4] 2> 1557018 INFO (TEST-ForceLeaderTest.testLastPublishedStateIsActive-seed#[4463D8CD8F9C2761]) [ ] o.a.s.c.c.SolrZkClient makePath: /configs/conf1/protwords.txt
[junit4] 2> 1557019 INFO (TEST-ForceLeaderTest.testLastPublishedStateIsActive-seed#[4463D8CD8F9C2761]) [ ] o.a.s.c.AbstractZkTestCase put /home/jenkins/workspace/Lucene-Solr-6.x-Linux/solr/core/src/test-files/solr/collection1/conf/currency.xml to /configs/conf1/currency.xml
[junit4] 2> 1557019 INFO (TEST-ForceLeaderTest.testLastPublishedStateIsActive-seed#[4463D8CD8F9C2761]) [ ] o.a.s.c.c.SolrZkClient makePath: /configs/conf1/currency.xml
[junit4] 2> 1557020 INFO (TEST-ForceLeaderTest.testLastPublishedStateIsActive-seed#[4463D8CD8F9C2761]) [ ] o.a.s.c.AbstractZkTestCase put /home/jenkins/workspace/Lucene-Solr-6.x-Linux/solr/core/src/test-files/solr/collection1/conf/enumsConfig.xml to /configs/conf1/enumsConfig.xml
[junit4] 2> 1557020 INFO (TEST-ForceLeaderTest.testLastPublishedStateIsActive-seed#[4463D8CD8F9C2761]) [ ] o.a.s.c.c.SolrZkClient makePath: /configs/conf1/enumsConfig.xml
[junit4] 2> 1557020 INFO (TEST-ForceLeaderTest.testLastPublishedStateIsActive-seed#[4463D8CD8F9C2761]) [ ] o.a.s.c.AbstractZkTestCase put /home/jenkins/workspace/Lucene-Solr-6.x-Linux/solr/core/src/test-files/solr/collection1/conf/open-exchange-rates.json to /configs/conf1/open-exchange-rates.json
[junit4] 2> 1557020 INFO (TEST-ForceLeaderTest.testLastPublishedStateIsActive-seed#[4463D8CD8F9C2761]) [ ] o.a.s.c.c.SolrZkClient makePath: /configs/conf1/open-exchange-rates.json
[junit4] 2> 1557021 INFO (TEST-ForceLeaderTest.testLastPublishedStateIsActive-seed#[4463D8CD8F9C2761]) [ ] o.a.s.c.AbstractZkTestCase put /home/jenkins/workspace/Lucene-Solr-6.x-Linux/solr/core/src/test-files/solr/collection1/conf/mapping-ISOLatin1Accent.txt to /configs/conf1/mapping-ISOLatin1Accent.txt
[junit4] 2> 1557021 INFO (TEST-ForceLeaderTest.testLastPublishedStateIsActive-seed#[4463D8CD8F9C2761]) [ ] o.a.s.c.c.SolrZkClient makePath: /configs/conf1/mapping-ISOLatin1Accent.txt
[junit4] 2> 1557022 INFO (TEST-ForceLeaderTest.testLastPublishedStateIsActive-seed#[4463D8CD8F9C2761]) [ ] o.a.s.c.AbstractZkTestCase put /home/jenkins/workspace/Lucene-Solr-6.x-Linux/solr/core/src/test-files/solr/collection1/conf/old_synonyms.txt to /configs/conf1/old_synonyms.txt
[junit4] 2> 1557022 INFO (TEST-ForceLeaderTest.testLastPublishedStateIsActive-seed#[4463D8CD8F9C2761]) [ ] o.a.s.c.c.SolrZkClient makePath: /configs/conf1/old_synonyms.txt
[junit4] 2> 1557022 INFO (TEST-ForceLeaderTest.testLastPublishedStateIsActive-seed#[4463D8CD8F9C2761]) [ ] o.a.s.c.AbstractZkTestCase put /home/jenkins/workspace/Lucene-Solr-6.x-Linux/solr/core/src/test-files/solr/collection1/conf/synonyms.txt to /configs/conf1/synonyms.txt
[junit4] 2> 1557022 INFO (TEST-ForceLeaderTest.testLastPublishedStateIsActive-seed#[4463D8CD8F9C2761]) [ ] o.a.s.c.c.SolrZkClient makePath: /configs/conf1/synonyms.txt
[junit4] 2> 1557078 INFO (TEST-ForceLeaderTest.testLastPublishedStateIsActive-seed#[4463D8CD8F9C2761]) [ ] o.a.s.SolrTestCaseJ4 Writing core.properties file to /home/jenkins/workspace/Lucene-Solr-6.x-Linux/solr/build/solr-core/test/J1/temp/solr.cloud.ForceLeaderTest_4463D8CD8F9C2761-001/control-001/cores/collection1
[junit4] 2> 1557079 INFO (TEST-ForceLeaderTest.testLastPublishedStateIsActive-seed#[4463D8CD8F9C2761]) [ ] o.e.j.s.Server jetty-9.3.8.v20160314
[junit4] 2> 1557080 INFO (TEST-ForceLeaderTest.testLastPublishedStateIsActive-seed#[4463D8CD8F9C2761]) [ ] o.e.j.s.h.ContextHandler Started o.e.j.s.ServletContextHandler@cf87a8a{/,null,AVAILABLE}
[junit4] 2> 1557080 INFO (TEST-ForceLeaderTest.testLastPublishedStateIsActive-seed#[4463D8CD8F9C2761]) [ ] o.e.j.s.ServerConnector Started ServerConnector@561e654{HTTP/1.1,[http/1.1]}{127.0.0.1:33075}
[junit4] 2> 1557080 INFO (TEST-ForceLeaderTest.testLastPublishedStateIsActive-seed#[4463D8CD8F9C2761]) [ ] o.e.j.s.Server Started @1558797ms
[junit4] 2> 1557080 INFO (TEST-ForceLeaderTest.testLastPublishedStateIsActive-seed#[4463D8CD8F9C2761]) [ ] o.a.s.c.s.e.JettySolrRunner Jetty properties: {solr.data.dir=/home/jenkins/workspace/Lucene-Solr-6.x-Linux/solr/build/solr-core/test/J1/temp/solr.cloud.ForceLeaderTest_4463D8CD8F9C2761-001/tempDir-001/control/data, hostContext=/, hostPort=34080, coreRootDirectory=/home/jenkins/workspace/Lucene-Solr-6.x-Linux/solr/build/solr-core/test/J1/temp/solr.cloud.ForceLeaderTest_4463D8CD8F9C2761-001/control-001/cores}
[junit4] 2> 1557080 INFO (TEST-ForceLeaderTest.testLastPublishedStateIsActive-seed#[4463D8CD8F9C2761]) [ ] o.a.s.s.SolrDispatchFilter SolrDispatchFilter.init(): sun.misc.Launcher$AppClassLoader@73d16e93
[junit4] 2> 1557080 INFO (TEST-ForceLeaderTest.testLastPublishedStateIsActive-seed#[4463D8CD8F9C2761]) [ ] o.a.s.c.SolrResourceLoader new SolrResourceLoader for directory: '/home/jenkins/workspace/Lucene-Solr-6.x-Linux/solr/build/solr-core/test/J1/temp/solr.cloud.ForceLeaderTest_4463D8CD8F9C2761-001/control-001'
[junit4] 2> 1557080 INFO (TEST-ForceLeaderTest.testLastPublishedStateIsActive-seed#[4463D8CD8F9C2761]) [ ] o.a.s.c.SolrResourceLoader JNDI not configured for solr (NoInitialContextEx)
[junit4] 2> 1557081 INFO (TEST-ForceLeaderTest.testLastPublishedStateIsActive-seed#[4463D8CD8F9C2761]) [ ] o.a.s.c.SolrResourceLoader solr home defaulted to 'solr/' (could not find system property or JNDI)
[junit4] 2> 1557081 INFO (TEST-ForceLeaderTest.testLastPublishedStateIsActive-seed#[4463D8CD8F9C2761]) [ ] o.a.s.c.c.SolrZkClient Using default ZkCredentialsProvider
[junit4] 2> 1557081 INFO (TEST-ForceLeaderTest.testLastPublishedStateIsActive-seed#[4463D8CD8F9C2761]) [ ] o.a.s.c.c.ConnectionManager Waiting for client to connect to ZooKeeper
[junit4] 2> 1557081 INFO (zkCallback-20080-thread-1) [ ] o.a.s.c.c.ConnectionManager Watcher org.apache.solr.common.cloud.ConnectionManager@4585cc3b name:ZooKeeperConnection Watcher:127.0.0.1:40495/solr got event WatchedEvent state:SyncConnected type:None path:null path:null type:None
[junit4] 2> 1557081 INFO (TEST-ForceLeaderTest.testLastPublishedStateIsActive-seed#[4463D8CD8F9C2761]) [ ] o.a.s.c.c.ConnectionManager Client is connected to ZooKeeper
[junit4] 2> 1557082 INFO (TEST-ForceLeaderTest.testLastPublishedStateIsActive-seed#[4463D8CD8F9C2761]) [ ] o.a.s.c.c.SolrZkClient Using default ZkACLProvider
[junit4] 2> 1557082 INFO (TEST-ForceLeaderTest.testLastPublishedStateIsActive-seed#[4463D8CD8F9C2761]) [ ] o.a.s.s.SolrDispatchFilter Loading solr.xml from SolrHome (not found in ZooKeeper)
[junit4] 2> 1557082 INFO (TEST-ForceLeaderTest.testLastPublishedStateIsActive-seed#[4463D8CD8F9C2761]) [ ] o.a.s.c.SolrXmlConfig Loading container configuration from /home/jenkins/workspace/Lucene-Solr-6.x-Linux/solr/build/solr-core/test/J1/temp/solr.cloud.ForceLeaderTest_4463D8CD8F9C2761-001/control-001/solr.xml
[junit4] 2> 1557086 INFO (TEST-ForceLeaderTest.testLastPublishedStateIsActive-seed#[4463D8CD8F9C2761]) [ ] o.a.s.c.CorePropertiesLocator Config-defined core root directory: /home/jenkins/workspace/Lucene-Solr-6.x-Linux/solr/build/solr-core/test/J1/temp/solr.cloud.ForceLeaderTest_4463D8CD8F9C2761-001/control-001/cores
[junit4] 2> 1557086 INFO (TEST-ForceLeaderTest.testLastPublishedStateIsActive-seed#[4463D8CD8F9C2761]) [ ] o.a.s.c.CoreContainer New CoreContainer 1196507344
[junit4] 2> 1557086 INFO (TEST-ForceLeaderTest.testLastPublishedStateIsActive-seed#[4463D8CD8F9C2761]) [ ] o.a.s.c.CoreContainer Loading cores into CoreContainer [instanceDir=/home/jenkins/workspace/Lucene-Solr-6.x-Linux/solr/build/solr-core/test/J1/temp/solr.cloud.ForceLeaderTest_4463D8CD8F9C2761-001/control-001]
[junit4] 2> 1557086 WARN (TEST-ForceLeaderTest.testLastPublishedStateIsActive-seed#[4463D8CD8F9C2761]) [ ] o.a.s.c.CoreContainer Couldn't add files from /home/jenkins/workspace/Lucene-Solr-6.x-Linux/solr/build/solr-core/test/J1/temp/solr.cloud.ForceLeaderTest_4463D8CD8F9C2761-001/control-001/lib to classpath: /home/jenkins/workspace/Lucene-Solr-6.x-Linux/solr/build/solr-core/test/J1/temp/solr.cloud.ForceLeaderTest_4463D8CD8F9C2761-001/control-001/lib
[junit4] 2> 1557086 INFO (TEST-ForceLeaderTest.testLastPublishedStateIsActive-seed#[4463D8CD8F9C2761]) [ ] o.a.s.h.c.HttpShardHandlerFactory created with socketTimeout : 90000,urlScheme : ,connTimeout : 15000,maxConnectionsPerHost : 20,maxConnections : 10000,corePoolSize : 0,maximumPoolSize : 2147483647,maxThreadIdleTime : 5,sizeOfQueue : -1,fairnessPolicy : false,useRetries : false,connectionsEvictorSleepDelay : 5000,maxConnectionIdleTime : 40000,
[junit4] 2> 1557087 INFO (TEST-ForceLeaderTest.testLastPublishedStateIsActive-seed#[4463D8CD8F9C2761]) [ ] o.a.s.u.UpdateShardHandler Creating UpdateShardHandler HTTP client with params: socketTimeout=340000&connTimeout=45000&retry=true
[junit4] 2> 1557087 INFO (TEST-ForceLeaderTest.testLastPublishedStateIsActive-seed#[4463D8CD8F9C2761]) [ ] o.a.s.l.LogWatcher SLF4J impl is org.slf4j.impl.Log4jLoggerFactory
[junit4] 2> 1557087 INFO (TEST-ForceLeaderTest.testLastPublishedStateIsActive-seed#[4463D8CD8F9C2761]) [ ] o.a.s.l.LogWatcher Registering Log Listener [Log4j (org.slf4j.impl.Log4jLoggerFactory)]
[junit4] 2> 1557087 INFO (TEST-ForceLeaderTest.testLastPublishedStateIsActive-seed#[4463D8CD8F9C2761]) [ ] o.a.s.c.ZkContainer Zookeeper client=127.0.0.1:40495/solr
[junit4] 2> 1557087 INFO (TEST-ForceLeaderTest.testLastPublishedStateIsActive-seed#[4463D8CD8F9C2761]) [ ] o.a.s.c.ZkController zkHost includes chroot
[junit4] 2> 1557087 INFO (TEST-ForceLeaderTest.testLastPublishedStateIsActive-seed#[4463D8CD8F9C2761]) [ ] o.a.s.c.c.SolrZkClient Using default ZkCredentialsProvider
[junit4] 2> 1557088 INFO (TEST-ForceLeaderTest.testLastPublishedStateIsActive-seed#[4463D8CD8F9C2761]) [ ] o.a.s.c.c.ConnectionManager Waiting for client to connect to ZooKeeper
[junit4] 2> 1557088 INFO (zkCallback-20083-thread-1) [ ] o.a.s.c.c.ConnectionManager Watcher org.apache.solr.common.cloud.ConnectionManager@5d02bfde name:ZooKeeperConnection Watcher:127.0.0.1:40495 got event WatchedEvent state:SyncConnected type:None path:null path:null type:None
[junit4] 2> 1557088 INFO (TEST-ForceLeaderTest.testLastPublishedStateIsActive-seed#[4463D8CD8F9C2761]) [ ] o.a.s.c.c.ConnectionManager Client is connected to ZooKeeper
[junit4] 2> 1557088 INFO (TEST-ForceLeaderTest.testLastPublishedStateIsActive-seed#[4463D8CD8F9C2761]) [ ] o.a.s.c.c.SolrZkClient Using default ZkACLProvider
[junit4] 2> 1557090 INFO (TEST-ForceLeaderTest.testLastPublishedStateIsActive-seed#[4463D8CD8F9C2761]) [n:127.0.0.1:34080_ ] o.a.s.c.ZkController Added new OnReconnect listener org.apache.solr.cloud.ZkController$$Lambda$12/1795928286@4fba8dcb
[junit4] 2> 1557090 INFO (TEST-ForceLeaderTest.testLastPublishedStateIsActive-seed#[4463D8CD8F9C2761]) [n:127.0.0.1:34080_ ] o.a.s.c.c.ConnectionManager Waiting for client to connect to ZooKeeper
[junit4] 2> 1557090 INFO (zkCallback-20084-thread-1-processing-n:127.0.0.1:34080_) [n:127.0.0.1:34080_ ] o.a.s.c.c.ConnectionManager Watcher org.apache.solr.common.cloud.ConnectionManager@435ec26f name:ZooKeeperConnection Watcher:127.0.0.1:40495/solr got event WatchedEvent state:SyncConnected type:None path:null path:null type:None
[junit4] 2> 1557090 INFO (TEST-ForceLeaderTest.testLastPublishedStateIsActive-seed#[4463D8CD8F9C2761]) [n:127.0.0.1:34080_ ] o.a.s.c.c.ConnectionManager Client is connected to ZooKeeper
[junit4] 2> 1557091 INFO (TEST-ForceLeaderTest.testLastPublishedStateIsActive-seed#[4463D8CD8F9C2761]) [n:127.0.0.1:34080_ ] o.a.s.c.c.SolrZkClient makePath: /overseer/queue
[junit4] 2> 1557091 INFO (TEST-ForceLeaderTest.testLastPublishedStateIsActive-seed#[4463D8CD8F9C2761]) [n:127.0.0.1:34080_ ] o.a.s.c.c.SolrZkClient makePath: /overseer/collection-queue-work
[junit4] 2> 1557092 INFO (TEST-ForceLeaderTest.testLastPublishedStateIsActive-seed#[4463D8CD8F9C2761]) [n:127.0.0.1:34080_ ] o.a.s.c.c.SolrZkClient makePath: /overseer/collection-map-running
[junit4] 2> 1557092 INFO (TEST-ForceLeaderTest.testLastPublishedStateIsActive-seed#[4463D8CD8F9C2761]) [n:127.0.0.1:34080_ ] o.a.s.c.c.SolrZkClient makePath: /overseer/collection-map-completed
[junit4] 2> 1557093 INFO (TEST-ForceLeaderTest.testLastPublishedStateIsActive-seed#[4463D8CD8F9C2761]) [n:127.0.0.1:34080_ ] o.a.s.c.c.SolrZkClient makePath: /overseer/collection-map-failure
[junit4] 2> 1557093 INFO (TEST-ForceLeaderTest.testLastPublishedStateIsActive-seed#[4463D8CD8F9C2761]) [n:127.0.0.1:34080_ ] o.a.s.c.c.SolrZkClient makePath: /live_nodes
[junit4] 2> 1557094 INFO (TEST-ForceLeaderTest.testLastPublishedStateIsActive-seed#[4463D8CD8F9C2761]) [n:127.0.0.1:34080_ ] o.a.s.c.c.SolrZkClient makePath: /aliases.json
[junit4] 2> 1557094 INFO (TEST-ForceLeaderTest.testLastPublishedStateIsActive-seed#[4463D8CD8F9C2761]) [n:127.0.0.1:34080_ ] o.a.s.c.c.SolrZkClient makePath: /clusterstate.json
[junit4] 2> 1557094 INFO (TEST-ForceLeaderTest.testLastPublishedStateIsActive-seed#[4463D8CD8F9C2761]) [n:127.0.0.1:34080_ ] o.a.s.c.c.SolrZkClient makePath: /security.json
[junit4] 2> 1557094 INFO (TEST-ForceLeaderTest.testLastPublishedStateIsActive-seed#[4463D8CD8F9C2761]) [n:127.0.0.1:34080_ ] o.a.s.c.c.ZkStateReader Updating cluster state from ZooKeeper...
[junit4] 2> 1557095 INFO (TEST-ForceLeaderTest.testLastPublishedStateIsActive-seed#[4463D8CD8F9C2761]) [n:127.0.0.1:34080_ ] o.a.s.c.c.ZkStateReader Loaded empty cluster properties
[junit4] 2> 1557095 INFO (TEST-ForceLeaderTest.testLastPublishedStateIsActive-seed#[4463D8CD8F9C2761]) [n:127.0.0.1:34080_ ] o.a.s.c.c.ZkStateReader Updated live nodes from ZooKeeper... (0) -> (0)
[junit4] 2> 1557095 INFO (TEST-ForceLeaderTest.testLastPublishedStateIsActive-seed#[4463D8CD8F9C2761]) [n:127.0.0.1:34080_ ] o.a.s.c.c.SolrZkClient makePath: /overseer_elect
[junit4] 2> 1557096 INFO (TEST-ForceLeaderTest.testLastPublishedStateIsActive-seed#[4463D8CD8F9C2761]) [n:127.0.0.1:34080_ ] o.a.s.c.c.SolrZkClient makePath: /overseer_elect/election
[junit4] 2> 1557096 INFO (TEST-ForceLeaderTest.testLastPublishedStateIsActive-seed#[4463D8CD8F9C2761]) [n:127.0.0.1:34080_ ] o.a.s.c.Overseer Overseer (id=null) closing
[junit4] 2> 1557096 INFO (TEST-ForceLeaderTest.testLastPublishedStateIsActive-seed#[4463D8CD8F9C2761]) [n:127.0.0.1:34080_ ] o.a.s.c.LeaderElector Joined leadership election with path: /overseer_elect/election/96249811452362756-127.0.0.1:34080_-n_0000000000
[junit4] 2> 1557096 INFO (TEST-ForceLeaderTest.testLastPublishedStateIsActive-seed#[4463D8CD8F9C2761]) [n:127.0.0.1:34080_ ] o.a.s.c.OverseerElectionContext I am going to be the leader 127.0.0.1:34080_
[junit4] 2> 1557096 INFO (TEST-ForceLeaderTest.testLastPublishedStateIsActive-seed#[4463D8CD8F9C2761]) [n:127.0.0.1:34080_ ] o.a.s.c.c.SolrZkClient makePath: /overseer_elect/leader
[junit4] 2> 1557097 INFO (TEST-ForceLeaderTest.testLastPublishedStateIsActive-seed#[4463D8CD8F9C2761]) [n:127.0.0.1:34080_ ] o.a.s.c.Overseer Overseer (id=96249811452362756-127.0.0.1:34080_-n_0000000000) starting
[junit4] 2> 1557097 INFO (TEST-ForceLeaderTest.testLastPublishedStateIsActive-seed#[4463D8CD8F9C2761]) [n:127.0.0.1:34080_ ] o.a.s.c.c.SolrZkClient makePath: /overseer/queue-work
[junit4] 2> 1557098 INFO (TEST-ForceLeaderTest.testLastPublishedStateIsActive-seed#[4463D8CD8F9C2761]) [n:127.0.0.1:34080_ ] o.a.s.c.OverseerAutoReplicaFailoverThread Starting OverseerAutoReplicaFailoverThread autoReplicaFailoverWorkLoopDelay=10000 autoReplicaFailoverWaitAfterExpiration=10000 autoReplicaFailoverBadNodeExpiration=60000
[junit4] 2> 1557099 INFO (OverseerCollectionConfigSetProcessor-96249811452362756-127.0.0.1:34080_-n_0000000000) [n:127.0.0.1:34080_ ] o.a.s.c.OverseerTaskProcessor Process current queue of overseer operations
[junit4] 2> 1557099 INFO (TEST-ForceLeaderTest.testLastPublishedStateIsActive-seed#[4463D8CD8F9C2761]) [n:127.0.0.1:34080_ ] o.a.s.c.ZkController Register node as live in ZooKeeper:/live_nodes/127.0.0.1:34080_
[junit4] 2> 1557099 INFO (TEST-ForceLeaderTest.testLastPublishedStateIsActive-seed#[4463D8CD8F9C2761]) [n:127.0.0.1:34080_ ] o.a.s.c.c.SolrZkClient makePath: /live_nodes/127.0.0.1:34080_
[junit4] 2> 1557099 INFO (OverseerStateUpdate-96249811452362756-127.0.0.1:34080_-n_0000000000) [n:127.0.0.1:34080_ ] o.a.s.c.Overseer Starting to work on the main queue
[junit4] 2> 1557099 INFO (zkCallback-20084-thread-1-processing-n:127.0.0.1:34080_) [n:127.0.0.1:34080_ ] o.a.s.c.c.ZkStateReader A live node change: [WatchedEvent state:SyncConnected type:NodeChildrenChanged path:/live_nodes], has occurred - updating... (live nodes size: [0])
[junit4] 2> 1557099 INFO (OverseerStateUpdate-96249811452362756-127.0.0.1:34080_-n_0000000000) [n:127.0.0.1:34080_ ] o.a.s.c.c.ZkStateReader Updated live nodes from ZooKeeper... (0) -> (1)
[junit4] 2> 1557099 INFO (zkCallback-20084-thread-1-processing-n:127.0.0.1:34080_) [n:127.0.0.1:34080_ ] o.a.s.c.c.ZkStateReader Updated live nodes from ZooKeeper... (1) -> (1)
[junit4] 2> 1557107 INFO (TEST-ForceLeaderTest.testLastPublishedStateIsActive-seed#[4463D8CD8F9C2761]) [n:127.0.0.1:34080_ ] o.a.s.c.CoreContainer Security conf doesn't exist. Skipping setup for authorization module.
[junit4] 2> 1557107 INFO (TEST-ForceLeaderTest.testLastPublishedStateIsActive-seed#[4463D8CD8F9C2761]) [n:127.0.0.1:34080_ ] o.a.s.c.CoreContainer No authentication plugin used.
[junit4] 2> 1557107 INFO (TEST-ForceLeaderTest.testLastPublishedStateIsActive-seed#[4463D8CD8F9C2761]) [n:127.0.0.1:34080_ ] o.a.s.c.CorePropertiesLocator Looking for core definitions underneath /home/jenkins/workspace/Lucene-Solr-6.x-Linux/solr/build/solr-core/test/J1/temp/solr.cloud.ForceLeaderTest_4463D8CD8F9C2761-001/control-001/cores
[junit4] 2> 1557108 INFO (TEST-ForceLeaderTest.testLastPublishedStateIsActive-seed#[4463D8CD8F9C2761]) [n:127.0.0.1:34080_ ] o.a.s.c.CoreDescriptor Created CoreDescriptor: {name=collection1, config=solrconfig.xml, transient=false, schema=schema.xml, loadOnStartup=true, configSetProperties=configsetprops.json, collection=control_collection, coreNodeName=, dataDir=data/, shard=}
[junit4] 2> 1557108 INFO (TEST-ForceLeaderTest.testLastPublishedStateIsActive-seed#[4463D8CD8F9C2761]) [n:127.0.0.1:34080_ ] o.a.s.c.CorePropertiesLocator Found core collection1 in /home/jenkins/workspace/Lucene-Solr-6.x-Linux/solr/build/solr-core/test/J1/temp/solr.cloud.ForceLeaderTest_4463D8CD8F9C2761-001/control-001/cores/collection1
[junit4] 2> 1557108 INFO (TEST-ForceLeaderTest.testLastPublishedStateIsActive-seed#[4463D8CD8F9C2761]) [n:127.0.0.1:34080_ ] o.a.s.c.CorePropertiesLocator Found 1 core definitions
[junit4] 2> 1557108 INFO (coreLoadExecutor-8960-thread-1-processing-n:127.0.0.1:34080_) [n:127.0.0.1:34080_ c:control_collection x:collection1] o.a.s.c.ZkController publishing state=down
[junit4] 2> 1557108 INFO (TEST-ForceLeaderTest.testLastPublishedStateIsActive-seed#[4463D8CD8F9C2761]) [n:127.0.0.1:34080_ ] o.a.s.s.SolrDispatchFilter user.dir=/home/jenkins/workspace/Lucene-Solr-6.x-Linux/solr/build/solr-core/test/J1
[junit4] 2> 1557108 INFO (TEST-ForceLeaderTest.testLastPublishedStateIsActive-seed#[4463D8CD8F9C2761]) [n:127.0.0.1:34080_ ] o.a.s.s.SolrDispatchFilter SolrDispatchFilter.init() done
[junit4] 2> 1557108 INFO (coreLoadExecutor-8960-thread-1-processing-n:127.0.0.1:34080_) [n:127.0.0.1:34080_ c:control_collection x:collection1] o.a.s.c.ZkController numShards not found on descriptor - reading it from system property
[junit4] 2> 1557109 INFO (coreLoadExecutor-8960-thread-1-processing-n:127.0.0.1:34080_) [n:127.0.0.1:34080_ c:control_collection x:collection1] o.a.s.c.ZkController Collection control_collection not visible yet, but flagging it so a watch is registered when it becomes visible
[junit4] 2> 1557109 INFO (OverseerStateUpdate-96249811452362756-127.0.0.1:34080_-n_0000000000) [n:127.0.0.1:34080_ ] o.a.s.c.Overseer processMessage: queueSize: 1, message = {
[junit4] 2> "core":"collection1",
[junit4] 2> "roles":null,
[junit4] 2> "base_url":"http://127.0.0.1:34080",
[junit4] 2> "node_name":"127.0.0.1:34080_",
[junit4] 2> "numShards":"1",
[junit4] 2> "state":"down",
[junit4] 2> "shard":null,
[junit4] 2> "collection":"control_collection",
[junit4] 2> "operation":"state"} current state version: 0
[junit4] 2> 1557109 INFO (coreLoadExecutor-8960-thread-1-processing-n:127.0.0.1:34080_) [n:127.0.0.1:34080_ c:control_collection x:collection1] o.a.s.c.c.ZkStateReader Deleting data for [control_collection]
[junit4] 2> 1557109 INFO (OverseerStateUpdate-96249811452362756-127.0.0.1:34080_-n_0000000000) [n:127.0.0.1:34080_ ] o.a.s.c.o.ReplicaMutator Update state numShards=1 message={
[junit4] 2> "core":"collection1",
[junit4] 2> "roles":null,
[junit4] 2> "base_url":"http://127.0.0.1:34080",
[junit4] 2> "node_name":"127.0.0.1:34080_",
[junit4] 2> "numShards":"1",
[junit4] 2> "state":"down",
[junit4] 2> "shard":null,
[junit4] 2> "collection":"control_collection",
[junit4] 2> "operation":"state"}
[junit4] 2> 1557109 INFO (OverseerStateUpdate-96249811452362756-127.0.0.1:34080_-n_0000000000) [n:127.0.0.1:34080_ ] o.a.s.c.o.ClusterStateMutator building a new cName: control_collection
[junit4] 2> 1557109 INFO (coreLoadExecutor-8960-thread-1-processing-n:127.0.0.1:34080_) [n:127.0.0.1:34080_ c:control_collection x:collection1] o.a.s.c.ZkController look for our core node name
[junit4] 2> 1557110 INFO (OverseerStateUpdate-96249811452362756-127.0.0.1:34080_-n_0000000000) [n:127.0.0.1:34080_ ] o.a.s.c.o.ReplicaMutator Assigning new node to shard shard=shard1
[junit4] 2> 1557110 INFO (zkCallback-20084-thread-1-processing-n:127.0.0.1:34080_) [n:127.0.0.1:34080_ ] o.a.s.c.c.ZkStateReader A cluster state change: [WatchedEvent state:SyncConnected type:NodeDataChanged path:/clusterstate.json], has occurred - updating... (live nodes size: [1])
[junit4] 2> 1558110 INFO (coreLoadExecutor-8960-thread-1-processing-n:127.0.0.1:34080_) [n:127.0.0.1:34080_ c:control_collection x:collection1] o.a.s.c.ZkController waiting to find shard id in clusterstate for collection1
[junit4] 2> 1558110 INFO (coreLoadExecutor-8960-thread-1-processing-n:127.0.0.1:34080_) [n:127.0.0.1:34080_ c:control_collection x:collection1] o.a.s.c.ZkController Check for collection zkNode:control_collection
[junit4] 2> 1558110 INFO (coreLoadExecutor-8960-thread-1-processing-n:127.0.0.1:34080_) [n:127.0.0.1:34080_ c:control_collection x:collection1] o.a.s.c.ZkController Collection zkNode exists
[junit4] 2> 1558110 INFO (coreLoadExecutor-8960-thread-1-processing-n:127.0.0.1:34080_) [n:127.0.0.1:34080_ c:control_collection x:collection1] o.a.s.c.c.ZkStateReader Load collection config from: [/collections/control_collection]
[junit4] 2> 1558110 INFO (coreLoadExecutor-8960-thread-1-processing-n:127.0.0.1:34080_) [n:127.0.0.1:34080_ c:control_collection x:collection1] o.a.s.c.c.ZkStateReader path=[/collections/control_collection] [configName]=[conf1] specified config exists in ZooKeeper
[junit4] 2> 1558110 INFO (coreLoadExecutor-8960-thread-1-processing-n:127.0.0.1:34080_) [n:127.0.0.1:34080_ c:control_collection x:collection1] o.a.s.c.SolrResourceLoader new SolrResourceLoader for directory: '/home/jenkins/workspace/Lucene-Solr-6.x-Linux/solr/build/solr-core/test/J1/temp/solr.cloud.ForceLeaderTest_4463D8CD8F9C2761-001/control-001/cores/collection1'
[junit4] 2> 1558110 INFO (coreLoadExecutor-8960-thread-1-processing-n:127.0.0.1:34080_) [n:127.0.0.1:34080_ c:control_collection x:collection1] o.a.s.c.SolrResourceLoader JNDI not configured for solr (NoInitialContextEx)
[junit4] 2> 1558110 INFO (coreLoadExecutor-8960-thread-1-processing-n:127.0.0.1:34080_) [n:127.0.0.1:34080_ c:control_collection x:collection1] o.a.s.c.SolrResourceLoader solr home defaulted to 'solr/' (could not find system property or JNDI)
[junit4] 2> 1558111 INFO (coreLoadExecutor-8960-thread-1-processing-n:127.0.0.1:34080_) [n:127.0.0.1:34080_ c:control_collection x:collection1] o.a.s.c.Config loaded config solrconfig.xml with version 0
[junit4] 2> 1558114 INFO (coreLoadExecutor-8960-thread-1-processing-n:127.0.0.1:34080_) [n:127.0.0.1:34080_ c:control_collection x:collection1] o.a.s.c.SolrConfig current version of requestparams : -1
[junit4] 2> 1558116 WARN (coreLoadExecutor-8960-thread-1-processing-n:127.0.0.1:34080_) [n:127.0.0.1:34080_ c:control_collection x:collection1] o.a.s.c.Config Beginning with Solr 5.5, <mergePolicy> is deprecated, use <mergePolicyFactory> instead.
[junit4] 2> 1558116 INFO (coreLoadExecutor-8960-thread-1-processing-n:127.0.0.1:34080_) [n:127.0.0.1:34080_ c:control_collection x:collection1] o.a.s.c.SolrConfig Using Lucene MatchVersion: 6.2.0
[junit4] 2> 1558123 INFO (coreLoadExecutor-8960-thread-1-processing-n:127.0.0.1:34080_) [n:127.0.0.1:34080_ c:control_collection x:collection1] o.a.s.c.SolrConfig Loaded SolrConfig: solrconfig.xml
[junit4] 2> 1558126 INFO (coreLoadExecutor-8960-thread-1-processing-n:127.0.0.1:34080_) [n:127.0.0.1:34080_ c:control_collection x:collection1] o.a.s.s.IndexSchema [collection1] Schema name=test
[junit4] 2> 1558191 INFO (coreLoadExecutor-8960-thread-1-processing-n:127.0.0.1:34080_) [n:127.0.0.1:34080_ c:control_collection x:collection1] o.a.s.s.OpenExchangeRatesOrgProvider Initialized with rates=open-exchange-rates.json, refreshInterval=1440.
[junit4] 2> 1558195 INFO (coreLoadExecutor-8960-thread-1-processing-n:127.0.0.1:34080_) [n:127.0.0.1:34080_ c:control_collection x:collection1] o.a.s.s.IndexSchema default search field in schema is text
[junit4] 2> 1558196 INFO (coreLoadExecutor-8960-thread-1-processing-n:127.0.0.1:34080_) [n:127.0.0.1:34080_ c:control_collection x:collection1] o.a.s.s.IndexSchema unique key field: id
[junit4] 2> 1558199 INFO (coreLoadExecutor-8960-thread-1-processing-n:127.0.0.1:34080_) [n:127.0.0.1:34080_ c:control_collection x:collection1] o.a.s.s.FileExchangeRateProvider Reloading exchange rates from file currency.xml
[junit4] 2> 1558200 INFO (coreLoadExecutor-8960-thread-1-processing-n:127.0.0.1:34080_) [n:127.0.0.1:34080_ c:control_collection x:collection1] o.a.s.s.FileExchangeRateProvider Reloading exchange rates from file currency.xml
[junit4] 2> 1558201 INFO (coreLoadExecutor-8960-thread-1-processing-n:127.0.0.1:34080_) [n:127.0.0.1:34080_ c:control_collection x:collection1] o.a.s.s.OpenExchangeRatesOrgProvider Reloading exchange rates from open-exchange-rates.json
[junit4] 2> 1558201 INFO (coreLoadExecutor-8960-thread-1-processing-n:127.0.0.1:34080_) [n:127.0.0.1:34080_ c:control_collection x:collection1] o.a.s.s.OpenExchangeRatesOrgProvider Reloading exchange rates from open-exchange-rates.json
[junit4] 2> 1558202 INFO (coreLoadExecutor-8960-thread-1-processing-n:127.0.0.1:34080_) [n:127.0.0.1:34080_ c:control_collection x:collection1] o.a.s.c.ConfigSetProperties Did not find ConfigSet properties, assuming default properties: Can't find resource 'configsetprops.json' in classpath or '/configs/conf1', cwd=/home/jenkins/workspace/Lucene-Solr-6.x-Linux/solr/build/solr-core/test/J1
[junit4] 2> 1558202 INFO (coreLoadExecutor-8960-thread-1-processing-n:127.0.0.1:34080_) [n:127.0.0.1:34080_ c:control_collection x:collection1] o.a.s.c.CoreContainer Creating SolrCore 'collection1' using configuration from collection control_collection
[junit4] 2> 1558202 INFO (coreLoadExecutor-8960-thread-1-processing-n:127.0.0.1:34080_) [n:127.0.0.1:34080_ c:control_collection s:shard1 r:core_node1 x:collection1] o.a.s.c.SolrCore org.apache.solr.core.MockDirectoryFactory
[junit4] 2> 1558202 INFO (coreLoadExecutor-8960-thread-1-processing-n:127.0.0.1:34080_) [n:127.0.0.1:34080_ c:control_collection s:shard1 r:core_node1 x:collection1] o.a.s.c.SolrCore [[collection1] ] Opening new SolrCore at [/home/jenkins/workspace/Lucene-Solr-6.x-Linux/solr/build/solr-core/test/J1/temp/solr.cloud.ForceLeaderTest_4463D8CD8F9C2761-001/control-001/cores/collection1], dataDir=[/home/jenkins/workspace/Lucene-Solr-6.x-Linux/solr/build/solr-core/test/J1/temp/solr.cloud.ForceLeaderTest_4463D8CD8F9C2761-001/control-001/cores/collection1/data/]
[junit4] 2> 1558202 INFO (coreLoadExecutor-8960-thread-1-processing-n:127.0.0.1:34080_) [n:127.0.0.1:34080_ c:control_collection s:shard1 r:core_node1 x:collection1] o.a.s.c.JmxMonitoredMap JMX monitoring is enabled. Adding Solr mbeans to JMX Server: com.sun.jmx.mbeanserver.JmxMBeanServer@3da55aa0
[junit4] 2> 1558202 INFO (coreLoadExecutor-8960-thread-1-processing-n:127.0.0.1:34080_) [n:127.0.0.1:34080_ c:control_collection s:shard1 r:core_node1 x:collection1] o.a.s.c.CachingDirectoryFactory return new directory for /home/jenkins/workspace/Lucene-Solr-6.x-Linux/solr/build/solr-core/test/J1/temp/solr.cloud.ForceLeaderTest_4463D8CD8F9C2761-001/control-001/cores/collection1/data
[junit4] 2> 1558203 INFO (coreLoadExecutor-8960-thread-1-processing-n:127.0.0.1:34080_) [n:127.0.0.1:34080_ c:control_collection s:shard1 r:core_node1 x:collection1] o.a.s.c.SolrCore New index directory detected: old=null new=/home/jenkins/workspace/Lucene-Solr-6.x-Linux/solr/build/solr-core/test/J1/temp/solr.cloud.ForceLeaderTest_4463D8CD8F9C2761-001/control-001/cores/collection1/data/index/
[junit4] 2> 1558203 WARN (coreLoadExecutor-8960-thread-1-processing-n:127.0.0.1:34080_) [n:127.0.0.1:34080_ c:control_collection s:shard1 r:core_node1 x:collection1] o.a.s.c.SolrCore [collection1] Solr index directory '/home/jenkins/workspace/Lucene-Solr-6.x-Linux/solr/build/solr-core/test/J1/temp/solr.cloud.ForceLeaderTest_4463D8CD8F9C2761-001/control-001/cores/collection1/data/index' doesn't exist. Creating new index...
[junit4] 2> 1558203 INFO (coreLoadExecutor-8960-thread-1-processing-n:127.0.0.1:34080_) [n:127.0.0.1:34080_ c:control_collection s:shard1 r:core_node1 x:collection1] o.a.s.c.CachingDirectoryFactory return new directory for /home/jenkins/workspace/Lucene-Solr-6.x-Linux/solr/build/solr-core/test/J1/temp/solr.cloud.ForceLeaderTest_4463D8CD8F9C2761-001/control-001/cores/collection1/data/index
[junit4] 2> 1558203 INFO (coreLoadExecutor-8960-thread-1-processing-n:127.0.0.1:34080_) [n:127.0.0.1:34080_ c:control_collection s:shard1 r:core_node1 x:collection1] o.a.s.u.RandomMergePolicy RandomMergePolicy wrapping class org.apache.lucene.index.TieredMergePolicy: [TieredMergePolicy: maxMergeAtOnce=33, maxMergeAtOnceExplicit=37, maxMergedSegmentMB=58.95703125, floorSegmentMB=1.5859375, forceMergeDeletesPctAllowed=15.011823523787578, segmentsPerTier=28.0, maxCFSSegmentSizeMB=8.796093022207999E12, noCFSRatio=1.0
[junit4] 2> 1558203 INFO (coreLoadExecutor-8960-thread-1-processing-n:127.0.0.1:34080_) [n:127.0.0.1:34080_ c:control_collection s:shard1 r:core_node1 x:collection1] o.a.s.c.SolrDeletionPolicy SolrDeletionPolicy.onCommit: commits: num=1
[junit4] 2> commit{dir=MockDirectoryWrapper(RAMDirectory@4df72d92 lockFactory=org.apache.lucene.store.SingleInstanceLockFactory@763d11cd),segFN=segments_1,generation=1}
[junit4] 2> 1558203 INFO (coreLoadExecutor-8960-thread-1-processing-n:127.0.0.1:34080_) [n:127.0.0.1:34080_ c:control_collection s:shard1 r:core_node1 x:collection1] o.a.s.c.SolrDeletionPolicy newest commit generation = 1
[junit4] 2> 1558204 INFO (OldIndexDirectoryCleanupThreadForCore-collection1) [n:127.0.0.1:34080_ c:control_collection s:shard1 r:core_node1 x:collection1] o.a.s.c.SolrCore Looking for old index directories to cleanup for core collection1 in /home/jenkins/workspace/Lucene-Solr-6.x-Linux/solr/build/solr-core/test/J1/temp/solr.cloud.ForceLeaderTest_4463D8CD8F9C2761-001/control-001/cores/collection1/data/
[junit4] 2> 1558204 WARN (OldIndexDirectoryCleanupThreadForCore-collection1) [n:127.0.0.1:34080_ c:control_collection s:shard1 r:core_node1 x:collection1] o.a.s.c.DirectoryFactory /home/jenkins/workspace/Lucene-Solr-6.x-Linux/solr/build/solr-core/test/J1/temp/solr.cloud.ForceLeaderTest_4463D8CD8F9C2761-001/control-001/cores/collection1/data/ does not point to a valid data directory; skipping clean-up of old index directories.
[junit4] 2> 1558205 INFO (coreLoadExecutor-8960-thread-1-processing-n:127.0.0.1:34080_) [n:127.0.0.1:34080_ c:control_collection s:shard1 r:core_node1 x:collection1] o.a.s.u.p.UpdateRequestProcessorChain creating updateRequestProcessorChain "nodistrib"
[junit4] 2> 1558205 INFO (coreLoadExecutor-8960-thread-1-processing-n:127.0.0.1:34080_) [n:127.0.0.1:34080_ c:control_collection s:shard1 r:core_node1 x:collection1] o.a.s.u.p.UpdateRequestProcessorChain creating updateRequestProcessorChain "dedupe"
[junit4] 2> 1558205 INFO (coreLoadExecutor-8960-thread-1-processing-n:127.0.0.1:34080_) [n:127.0.0.1:34080_ c:control_collection s:shard1 r:core_node1 x:collection1] o.a.s.u.p.UpdateRequestProcessorChain inserting DistributedUpdateProcessorFactory into updateRequestProcessorChain "dedupe"
[junit4] 2> 1558205 INFO (coreLoadExecutor-8960-thread-1-processing-n:127.0.0.1:34080_) [n:127.0.0.1:34080_ c:control_collection s:shard1 r:core_node1 x:collection1] o.a.s.u.p.UpdateRequestProcessorChain creating updateRequestProcessorChain "stored_sig"
[junit4] 2> 1558206 INFO (coreLoadExecutor-8960-thread-1-processing-n:127.0.0.1:34080_) [n:127.0.0.1:34080_ c:control_collection s:shard1 r:core_node1 x:collection1] o.a.s.u.p.UpdateRequestProcessorChain inserting DistributedUpdateProcessorFactory into updateRequestProcessorChain "stored_sig"
[junit4] 2> 1558206 INFO (coreLoadExecutor-8960-thread-1-processing-n:127.0.0.1:34080_) [n:127.0.0.1:34080_ c:control_collection s:shard1 r:core_node1 x:collection1] o.a.s.u.p.UpdateRequestProcessorChain creating updateRequestProcessorChain "distrib-dup-test-chain-explicit"
[junit4] 2> 1558206 INFO (coreLoadExecutor-8960-thread-1-processing-n:127.0.0.1:34080_) [n:127.0.0.1:34080_ c:control_collection s:shard1 r:core_node1 x:collection1] o.a.s.u.p.UpdateRequestProcessorChain creating updateRequestProcessorChain "distrib-dup-test-chain-implicit"
[junit4] 2> 1558206 INFO (coreLoadExecutor-8960-thread-1-processing-n:127.0.0.1:34080_) [n:127.0.0.1:34080_ c:control_collection s:shard1 r:core_node1 x:collection1] o.a.s.u.p.UpdateRequestProcessorChain inserting DistributedUpdateProcessorFactory into updateRequestProcessorChain "distrib-dup-test-chain-implicit"
[junit4] 2> 1558206 INFO (coreLoadExecutor-8960-thread-1-processing-n:127.0.0.1:34080_) [n:127.0.0.1:34080_ c:control_collection s:shard1 r:core_node1 x:collection1] o.a.s.c.SolrCore no updateRequestProcessorChain defined as default, creating implicit default
[junit4] 2> 1558206 WARN (coreLoadExecutor-8960-thread-1-processing-n:127.0.0.1:34080_) [n:127.0.0.1:34080_ c:control_collection s:shard1 r:core_node1 x:collection1] o.a.s.c.RequestHandlers INVALID paramSet a in requestHandler {type = requestHandler,name = /dump,class = DumpRequestHandler,args = {defaults={a=A,b=B}}}
[junit4] 2> 1558207 INFO (coreLoadExecutor-8960-thread-1-processing-n:127.0.0.1:34080_) [n:127.0.0.1:34080_ c:control_collection s:shard1 r:core_node1 x:collection1] o.a.s.h.l.XMLLoader xsltCacheLifetimeSeconds=60
[junit4] 2> 1558207 INFO (coreLoadExecutor-8960-thread-1-processing-n:127.0.0.1:34080_) [n:127.0.0.1:34080_ c:control_collection s:shard1 r:core_node1 x:collection1] o.a.s.h.l.XMLLoader xsltCacheLifetimeSeconds=60
[junit4] 2> 1558208 INFO (coreLoadExecutor-8960-thread-1-processing-n:127.0.0.1:34080_) [n:127.0.0.1:34080_ c:control_collection s:shard1 r:core_node1 x:collection1] o.a.s.h.l.XMLLoader xsltCacheLifetimeSeconds=60
[junit4] 2> 1558208 INFO (coreLoadExecutor-8960-thread-1-processing-n:127.0.0.1:34080_) [n:127.0.0.1:34080_ c:control_collection s:shard1 r:core_node1 x:collection1] o.a.s.h.l.XMLLoader xsltCacheLifetimeSeconds=60
[junit4] 2> 1558210 INFO (coreLoadExecutor-8960-thread-1-processing-n:127.0.0.1:34080_) [n:127.0.0.1:34080_ c:control_collection s:shard1 r:core_node1 x:collection1] o.a.s.c.RequestHandlers Registered paths: /admin/mbeans,standard,/update/json/docs,/admin/luke,/export,/get,/admin/properties,/update/json,/admin/threads,/dump,/update/csv,/sql,/graph,/admin/segments,/admin/system,/replication,/config,/stream,/schema,/admin/plugins,/admin/logging,/admin/ping,/update,/admin/file,/terms
[junit4] 2> 1558210 INFO (coreLoadExecutor-8960-thread-1-processing-n:127.0.0.1:34080_) [n:127.0.0.1:34080_ c:control_collection s:shard1 r:core_node1 x:collection1] o.a.s.c.SolrCore Using default statsCache cache: org.apache.solr.search.stats.LocalStatsCache
[junit4] 2> 1558210 INFO (coreLoadExecutor-8960-thread-1-processing-n:127.0.0.1:34080_) [n:127.0.0.1:34080_ c:control_collection s:shard1 r:core_node1 x:collection1] o.a.s.u.UpdateHandler Using UpdateLog implementation: org.apache.solr.update.UpdateLog
[junit4] 2> 1558210 INFO (coreLoadExecutor-8960-thread-1-processing-n:127.0.0.1:34080_) [n:127.0.0.1:34080_ c:control_collection s:shard1 r:core_node1 x:collection1] o.a.s.u.UpdateLog Initializing UpdateLog: dataDir= defaultSyncLevel=FLUSH numRecordsToKeep=100 maxNumLogsToKeep=10 numVersionBuckets=65536
[junit4] 2> 1558210 INFO (coreLoadExecutor-8960-thread-1-processing-n:127.0.0.1:34080_) [n:127.0.0.1:34080_ c:control_collection s:shard1 r:core_node1 x:collection1] o.a.s.u.CommitTracker Hard AutoCommit: disabled
[junit4] 2> 1558210 INFO (coreLoadExecutor-8960-thread-1-processing-n:127.0.0.1:34080_) [n:127.0.0.1:34080_ c:control_collection s:shard1 r:core_node1 x:collection1] o.a.s.u.CommitTracker Soft AutoCommit: disabled
[junit4] 2> 1558211 INFO (coreLoadExecutor-8960-thread-1-processing-n:127.0.0.1:34080_) [n:127.0.0.1:34080_ c:control_collection s:shard1 r:core_node1 x:collection1] o.a.s.u.RandomMergePolicy RandomMergePolicy wrapping class org.apache.lucene.index.AlcoholicMergePolicy: [AlcoholicMergePolicy: minMergeSize=0, mergeFactor=10, maxMergeSize=255482994, maxMergeSizeForForcedMerge=9223372036854775807, calibrateSizeByDeletes=true, maxMergeDocs=2147483647, maxCFSSegmentSizeMB=8.796093022207999E12, noCFSRatio=0.1]
[junit4] 2> 1558211 INFO (coreLoadExecutor-8960-thread-1-processing-n:127.0.0.1:34080_) [n:127.0.0.1:34080_ c:control_collection s:shard1 r:core_node1 x:collection1] o.a.s.c.SolrDeletionPolicy SolrDeletionPolicy.onInit: commits: num=1
[junit4] 2> commit{dir=MockDirectoryWrapper(RAMDirectory@4df72d92 lockFactory=org.apache.lucene.store.SingleInstanceLockFactory@763d11cd),segFN=segments_1,generation=1}
[junit4] 2> 1558211 INFO (coreLoadExecutor-8960-thread-1-processing-n:127.0.0.1:34080_) [n:127.0.0.1:34080_ c:control_collection s:shard1 r:core_node1 x:collection1] o.a.s.c.SolrDeletionPolicy newest commit generation = 1
[junit4] 2> 1558211 INFO (coreLoadExecutor-8960-thread-1-processing-n:127.0.0.1:34080_) [n:127.0.0.1:34080_ c:control_collection s:shard1 r:core_node1 x:collection1] o.a.s.s.SolrIndexSearcher Opening [Searcher@7c278d6d[collection1] main]
[junit4] 2> 1558211 INFO (coreLoadExecutor-8960-thread-1-processing-n:127.0.0.1:34080_) [n:127.0.0.1:34080_ c:control_collection s:shard1 r:core_node1 x:collection1] o.a.s.c.c.ZkStateReader Load collection config from: [/collections/control_collection]
[junit4] 2> 1558211 INFO (coreLoadExecutor-8960-thread-1-processing-n:127.0.0.1:34080_) [n:127.0.0.1:34080_ c:control_collection s:shard1 r:core_node1 x:collection1] o.a.s.c.c.ZkStateReader path=[/collections/control_collection] [configName]=[conf1] specified config exists in ZooKeeper
[junit4] 2> 1558211 INFO (coreLoadExecutor-8960-thread-1-processing-n:127.0.0.1:34080_) [n:127.0.0.1:34080_ c:control_collection s:shard1 r:core_node1 x:collection1] o.a.s.r.ManagedResourceStorage Setting up ZooKeeper-based storage for the RestManager with znodeBase: /configs/conf1
[junit4] 2> 1558212 INFO (coreLoadExecutor-8960-thread-1-processing-n:127.0.0.1:34080_) [n:127.0.0.1:34080_ c:control_collection s:shard1 r:core_node1 x:collection1] o.a.s.r.ManagedResourceStorage Configured ZooKeeperStorageIO with znodeBase: /configs/conf1
[junit4] 2> 1558212 INFO (coreLoadExecutor-8960-thread-1-processing-n:127.0.0.1:34080_) [n:127.0.0.1:34080_ c:control_collection s:shard1 r:core_node1 x:collection1] o.a.s.r.RestManager Initializing RestManager with initArgs: {}
[junit4] 2> 1558212 INFO (coreLoadExecutor-8960-thread-1-processing-n:127.0.0.1:34080_) [n:127.0.0.1:34080_ c:control_collection s:shard1 r:core_node1 x:collection1] o.a.s.r.ManagedResourceStorage Reading _rest_managed.json using ZooKeeperStorageIO:path=/configs/conf1
[junit4] 2> 1558212 INFO (coreLoadExecutor-8960-thread-1-processing-n:127.0.0.1:34080_) [n:127.0.0.1:34080_ c:control_collection s:shard1 r:core_node1 x:collection1] o.a.s.r.ManagedResourceStorage No data found for znode /configs/conf1/_rest_managed.json
[junit4] 2> 1558212 INFO (coreLoadExecutor-8960-thread-1-processing-n:127.0.0.1:34080_) [n:127.0.0.1:34080_ c:control_collection s:shard1 r:core_node1 x:collection1] o.a.s.r.ManagedResourceStorage Loaded null at path _rest_managed.json using ZooKeeperStorageIO:path=/configs/conf1
[junit4] 2> 1558212 INFO (coreLoadExecutor-8960-thread-1-processing-n:127.0.0.1:34080_) [n:127.0.0.1:34080_ c:control_collection s:shard1 r:core_node1 x:collection1] o.a.s.r.RestManager Initializing 0 registered ManagedResources
[junit4] 2> 1558212 INFO (coreLoadExecutor-8960-thread-1-processing-n:127.0.0.1:34080_) [n:127.0.0.1:34080_ c:control_collection s:shard1 r:core_node1 x:collection1] o.a.s.h.ReplicationHandler Commits will be reserved for 10000
[junit4] 2> 1558212 INFO (searcherExecutor-8961-thread-1-processing-n:127.0.0.1:34080_ x:collection1 s:shard1 c:control_collection r:core_node1) [n:127.0.0.1:34080_ c:control_collection s:shard1 r:core_node1 x:collection1] o.a.s.c.SolrCore [collection1] Registered new searcher Searcher@7c278d6d[collection1] main{ExitableDirectoryReader(UninvertingDirectoryReader())}
[junit4] 2> 1558212 INFO (coreLoadExecutor-8960-thread-1-processing-n:127.0.0.1:34080_) [n:127.0.0.1:34080_ c:control_collection s:shard1 r:core_node1 x:collection1] o.a.s.u.UpdateLog Looking up max value of version field to seed version buckets
[junit4] 2> 1558212 INFO (coreLoadExecutor-8960-thread-1-processing-n:127.0.0.1:34080_) [n:127.0.0.1:34080_ c:control_collection s:shard1 r:core_node1 x:collection1] o.a.s.u.VersionInfo Refreshing highest value of _version_ for 65536 version buckets from index
[junit4] 2> 1558213 INFO (coreLoadExecutor-8960-thread-1-processing-n:127.0.0.1:34080_) [n:127.0.0.1:34080_ c:control_collection s:shard1 r:core_node1 x:collection1] o.a.s.u.VersionInfo No terms found for _version_, cannot seed version bucket highest value from index
[junit4] 2> 1558213 INFO (coreLoadExecutor-8960-thread-1-processing-n:127.0.0.1:34080_) [n:127.0.0.1:34080_ c:control_collection s:shard1 r:core_node1 x:collection1] o.a.s.u.UpdateLog Could not find max version in index or recent updates, using new clock 1539996984606195712
[junit4] 2> 1558214 INFO (coreLoadExecutor-8960-thread-1-processing-n:127.0.0.1:34080_) [n:127.0.0.1:34080_ c:control_collection s:shard1 r:core_node1 x:collection1] o.a.s.u.UpdateLog Took 1.0ms to seed version buckets with highest version 1539996984606195712
[junit4] 2> 1558214 INFO (coreLoadExecutor-8960-thread-1-processing-n:127.0.0.1:34080_) [n:127.0.0.1:34080_ c:control_collection s:shard1 r:core_node1 x:collection1] o.a.s.c.ZkController watch zkdir /configs/conf1
[junit4] 2> 1558214 INFO (coreLoadExecutor-8960-thread-1-processing-n:127.0.0.1:34080_) [n:127.0.0.1:34080_ c:control_collection s:shard1 r:core_node1 x:collection1] o.a.s.c.CoreContainer registering core: collection1
[junit4] 2> 1558215 INFO (coreZkRegister-8954-thread-1-processing-n:127.0.0.1:34080_ x:collection1 s:shard1 c:control_collection r:core_node1) [n:127.0.0.1:34080_ c:control_collection s:shard1 r:core_node1 x:collection1] o.a.s.c.ZkController Register replica - core:collection1 address:http://127.0.0.1:34080 collection:control_collection shard:shard1
[junit4] 2> 1558215 INFO (coreZkRegister-8954-thread-1-processing-n:127.0.0.1:34080_ x:collection1 s:shard1 c:control_collection r:core_node1) [n:127.0.0.1:34080_ c:control_collection s:shard1 r:core_node1 x:collection1] o.a.s.c.c.SolrZkClient makePath: /collections/control_collection/leader_elect/shard1/election
[junit4] 2> 1558216 INFO (coreZkRegister-8954-thread-1-processing-n:127.0.0.1:34080_ x:collection1 s:shard1 c:control_collection r:core_node1) [n:127.0.0.1:34080_ c:control_collection s:shard1 r:core_node1 x:collection1] o.a.s.c.LeaderElector Joined leadership election with path: /collections/control_collection/leader_elect/shard1/election/96249811452362756-core_node1-n_0000000000
[junit4] 2> 1558216 INFO (coreZkRegister-8954-thread-1-processing-n:127.0.0.1:34080_ x:collection1 s:shard1 c:control_collection r:core_node1) [n:127.0.0.1:34080_ c:control_collection s:shard1 r:core_node1 x:collection1] o.a.s.c.ShardLeaderElectionContext Running the leader process for shard=shard1 and weAreReplacement=false and leaderVoteWait=10000
[junit4] 2> 1558217 INFO (coreZkRegister-8954-thread-1-processing-n:127.0.0.1:34080_ x:collection1 s:shard1 c:control_collection r:core_node1) [n:127.0.0.1:34080_ c:control_collection s:shard1 r:core_node1 x:collection1] o.a.s.c.ShardLeaderElectionContext Enough replicas found to continue.
[junit4] 2> 1558217 INFO (coreZkRegister-8954-thread-1-processing-n:127.0.0.1:34080_ x:collection1 s:shard1 c:control_collection r:core_node1) [n:127.0.0.1:34080_ c:control_collection s:shard1 r:core_node1 x:collection1] o.a.s.c.ShardLeaderElectionContext I may be the new leader - try and sync
[junit4] 2> 1558217 INFO (coreZkRegister-8954-thread-1-processing-n:127.0.0.1:34080_ x:collection1 s:shard1 c:control_collection r:core_node1) [n:127.0.0.1:34080_ c:control_collection s:shard1 r:core_node1 x:collection1] o.a.s.c.SyncStrategy Sync replicas to http://127.0.0.1:34080/collection1/
[junit4] 2> 1558217 INFO (OverseerStateUpdate-96249811452362756-127.0.0.1:34080_-n_0000000000) [n:127.0.0.1:34080_ ] o.a.s.c.Overseer processMessage: queueSize: 1, message = {
[junit4] 2> "operation":"leader",
[junit4] 2> "shard":"shard1",
[junit4] 2> "collection":"control_collection"} current state version: 1
[junit4] 2> 1558217 INFO (coreZkRegister-8954-thread-1-processing-n:127.0.0.1:34080_ x:collection1 s:shard1 c:control_collection r:core_node1) [n:127.0.0.1:34080_ c:control_collection s:shard1 r:core_node1 x:collection1] o.a.s.c.SyncStrategy Sync Success - now sync replicas to me
[junit4] 2> 1558217 INFO (coreZkRegister-8954-thread-1-processing-n:127.0.0.1:34080_ x:collection1 s:shard1 c:control_collection r:core_node1) [n:127.0.0.1:34080_ c:control_collection s:shard1 r:core_node1 x:collection1] o.a.s.c.SyncStrategy http://127.0.0.1:34080/collection1/ has no replicas
[junit4] 2> 1558218 INFO (coreZkRegister-8954-thread-1-processing-n:127.0.0.1:34080_ x:collection1 s:shard1 c:control_collection r:core_node1) [n:127.0.0.1:34080_ c:control_collection s:shard1 r:core_node1 x:collection1] o.a.s.c.c.SolrZkClient makePath: /collections/control_collection/leaders/shard1
[junit4] 2> 1558218 INFO (coreZkRegister-8954-thread-1-processing-n:127.0.0.1:34080_ x:collection1 s:shard1 c:control_collection r:core_node1) [n:127.0.0.1:34080_ c:control_collection s:shard1 r:core_node1 x:collection1] o.a.s.c.ShardLeaderElectionContextBase Creating leader registration node /collections/control_collection/leaders/shard1/leader after winning as /collections/control_collection/leader_elect/shard1/election/96249811452362756-core_node1-n_0000000000
[junit4] 2> 1558219 INFO (coreZkRegister-8954-thread-1-processing-n:127.0.0.1:34080_ x:collection1 s:shard1 c:control_collection r:core_node1) [n:127.0.0.1:34080_ c:control_collection s:shard1 r:core_node1 x:collection1] o.a.s.c.ShardLeaderElectionContext I am the new leader: http://127.0.0.1:34080/collection1/ shard1
[junit4] 2> 1558219 INFO (OverseerStateUpdate-96249811452362756-127.0.0.1:34080_-n_0000000000) [n:127.0.0.1:34080_ ] o.a.s.c.Overseer processMessage: queueSize: 1, message = {
[junit4] 2> "operation":"leader",
[junit4] 2> "shard":"shard1",
[junit4] 2> "collection":"control_collection",
[junit4] 2> "base_url":"http://127.0.0.1:34080",
[junit4] 2> "core":"collection1",
[junit4] 2> "state":"active"} current state version: 1
[junit4] 2> 1558320 INFO (zkCallback-20084-thread-1-processing-n:127.0.0.1:34080_) [n:127.0.0.1:34080_ ] o.a.s.c.c.ZkStateReader A cluster state change: [WatchedEvent state:SyncConnected type:NodeDataChanged path:/clusterstate.json], has occurred - updating... (live nodes size: [1])
[junit4] 2> 1558370 INFO (coreZkRegister-8954-thread-1-processing-n:127.0.0.1:34080_ x:collection1 s:shard1 c:control_collection r:core_node1) [n:127.0.0.1:34080_ c:control_collection s:shard1 r:core_node1 x:collection1] o.a.s.c.ZkController We are http://127.0.0.1:34080/collection1/ and leader is http://127.0.0.1:34080/collection1/
[junit4] 2> 1558370 INFO (coreZkRegister-8954-thread-1-processing-n:127.0.0.1:34080_ x:collection1 s:shard1 c:control_collection r:core_node1) [n:127.0.0.1:34080_ c:control_collection s:shard1 r:core_node1 x:collection1] o.a.s.c.ZkController No LogReplay needed for core=collection1 baseURL=http://127.0.0.1:34080
[junit4] 2> 1558370 INFO (coreZkRegister-8954-thread-1-processing-n:127.0.0.1:34080_ x:collection1 s:shard1 c:control_collection r:core_node1) [n:127.0.0.1:34080_ c:control_collection s:shard1 r:core_node1 x:collection1] o.a.s.c.ZkController I am the leader, no recovery necessary
[junit4] 2> 1558370 INFO (coreZkRegister-8954-thread-1-processing-n:127.0.0.1:34080_ x:collection1 s:shard1 c:control_collection r:core_node1) [n:127.0.0.1:34080_ c:control_collection s:shard1 r:core_node1 x:collection1] o.a.s.c.ZkController publishing state=active
[junit4] 2> 1558370 INFO (coreZkRegister-8954-thread-1-processing-n:127.0.0.1:34080_ x:collection1 s:shard1 c:control_collection r:core_node1) [n:127.0.0.1:34080_ c:control_collection s:shard1 r:core_node1 x:collection1] o.a.s.c.ZkController numShards not found on descriptor - reading it from system property
[junit4] 2> 1558370 INFO (coreZkRegister-8954-thread-1-processing-n:127.0.0.1:34080_ x:collection1 s:shard1 c:control_collection r:core_node1) [n:127.0.0.1:34080_ c:control_collection s:shard1 r:core_node1 x:collection1] o.a.s.c.c.ZkStateReader Checking legacy cluster state for collection control_collection
[junit4] 2> 1558370 INFO (OverseerStateUpdate-96249811452362756-127.0.0.1:34080_-n_0000000000) [n:127.0.0.1:34080_ ] o.a.s.c.Overseer processMessage: queueSize: 1, message = {
[junit4] 2> "core":"collection1",
[junit4] 2> "core_node_name":"core_node1",
[junit4] 2> "roles":null,
[junit4] 2> "base_url":"http://127.0.0.1:34080",
[junit4] 2> "node_name":"127.0.0.1:34080_",
[junit4] 2> "numShards":"1",
[junit4] 2> "state":"active",
[junit4] 2> "shard":"shard1",
[junit4] 2> "collection":"control_collection",
[junit4] 2> "operation":"state"} current state version: 2
[junit4] 2> 1558371 INFO (OverseerStateUpdate-96249811452362756-127.0.0.1:34080_-n_0000000000) [n:127.0.0.1:34080_ ] o.a.s.c.o.ReplicaMutator Update state numShards=1 message={
[junit4] 2> "core":"collection1",
[junit4] 2> "core_node_name":"core_node1",
[junit4] 2> "roles":null,
[junit4] 2> "base_url":"http://127.0.0.1:34080",
[junit4] 2> "node_name":"127.0.0.1:34080_",
[junit4] 2> "numShards":"1",
[junit4] 2> "state":"active",
[junit4] 2> "shard":"shard1",
[junit4] 2> "collection":"control_collection",
[junit4] 2> "operation":"state"}
[junit4] 2> 1558471 INFO (zkCallback-20084-thread-2-processing-n:127.0.0.1:34080_) [n:127.0.0.1:34080_ ] o.a.s.c.c.ZkStateReader A cluster state change: [WatchedEvent state:SyncConnected type:NodeDataChanged path:/clusterstate.json], has occurred - updating... (live nodes size: [1])
[junit4] 2> 1558610 INFO (TEST-ForceLeaderTest.testLastPublishedStateIsActive-seed#[4463D8CD8F9C2761]) [ ] o.a.s.c.c.SolrZkClient Using default ZkCredentialsProvider
[junit4] 2> 1558610 INFO (TEST-ForceLeaderTest.testLastPublishedStateIsActive-seed#[4463D8CD8F9C2761]) [ ] o.a.s.c.c.ConnectionManager Waiting for client to connect to ZooKeeper
[junit4] 2> 1558611 INFO (zkCallback-20088-thread-1) [ ] o.a.s.c.c.ConnectionManager Watcher org.apache.solr.common.cloud.ConnectionManager@f832976 name:ZooKeeperConnection Watcher:127.0.0.1:40495/solr got event WatchedEvent state:SyncConnected type:None path:null path:null type:None
[junit4] 2> 1558611 INFO (TEST-ForceLeaderTest.testLastPublishedStateIsActive-seed#[4463D8CD8F9C2761]) [ ] o.a.s.c.c.ConnectionManager Client is connected to ZooKeeper
[junit4] 2> 1558611 INFO (TEST-ForceLeaderTest.testLastPublishedStateIsActive-seed#[4463D8CD8F9C2761]) [ ] o.a.s.c.c.SolrZkClient Using default ZkACLProvider
[junit4] 2> 1558611 INFO (TEST-ForceLeaderTest.testLastPublishedStateIsActive-seed#[4463D8CD8F9C2761]) [ ] o.a.s.c.c.ZkStateReader Updating cluster state from ZooKeeper...
[junit4] 2> 1558611 INFO (TEST-ForceLeaderTest.testLastPublishedStateIsActive-seed#[4463D8CD8F9C2761]) [ ] o.a.s.c.c.ZkStateReader Loaded empty cluster properties
[junit4] 2> 1558611 INFO (TEST-ForceLeaderTest.testLastPublishedStateIsActive-seed#[4463D8CD8F9C2761]) [ ] o.a.s.c.c.ZkStateReader Updated live nodes from ZooKeeper... (0) -> (1)
[junit4] 2> 1558612 INFO (TEST-ForceLeaderTest.testLastPublishedStateIsActive-seed#[4463D8CD8F9C2761]) [ ] o.a.s.c.ChaosMonkey monkey: init - expire sessions:false cause connection loss:false
[junit4] 2> 1558662 INFO (TEST-ForceLeaderTest.testLastPublishedStateIsActive-seed#[4463D8CD8F9C2761]) [ ] o.a.s.SolrTestCaseJ4 Writing core.properties file to /home/jenkins/workspace/Lucene-Solr-6.x-Linux/solr/build/solr-core/test/J1/temp/solr.cloud.ForceLeaderTest_4463D8CD8F9C2761-001/shard-1-001/cores/collection1
[junit4] 2> 1558663 INFO (TEST-ForceLeaderTest.testLastPublishedStateIsActive-seed#[4463D8CD8F9C2761]) [ ] o.a.s.c.AbstractFullDistribZkTestBase create jetty 1 in directory /home/jenkins/workspace/Lucene-Solr-6.x-Linux/solr/build/solr-core/test/J1/temp/solr.cloud.ForceLeaderTest_4463D8CD8F9C2761-001/shard-1-001
[junit4] 2> 1558663 INFO (TEST-ForceLeaderTest.testLastPublishedStateIsActive-seed#[4463D8CD8F9C2761]) [ ] o.e.j.s.Server jetty-9.3.8.v20160314
[junit4] 2> 1558664 INFO (TEST-ForceLeaderTest.testLastPublishedStateIsActive-seed#[4463D8CD8F9C2761]) [ ] o.e.j.s.h.ContextHandler Started o.e.j.s.ServletContextHandler@7570cc1f{/,null,AVAILABLE}
[junit4] 2> 1558664 INFO (TEST-ForceLeaderTest.testLastPublishedStateIsActive-seed#[4463D8CD8F9C2761]) [ ] o.e.j.s.ServerConnector Started ServerConnector@1600fd79{HTTP/1.1,[http/1.1]}{127.0.0.1:34324}
[junit4] 2> 1558664 INFO (TEST-ForceLeaderTest.testLastPublishedStateIsActive-seed#[4463D8CD8F9C2761]) [ ] o.e.j.s.Server Started @1560381ms
[junit4] 2> 1558664 INFO (TEST-ForceLeaderTest.testLastPublishedStateIsActive-seed#[4463D8CD8F9C2761]) [ ] o.a.s.c.s.e.JettySolrRunner Jetty properties: {solr.data.dir=/home/jenkins/workspace/Lucene-Solr-6.x-Linux/solr/build/solr-core/test/J1/temp/solr.cloud.ForceLeaderTest_4463D8CD8F9C2761-001/tempDir-001/jetty1, solrconfig=solrconfig.xml, hostContext=/, hostPort=44230, coreRootDirectory=/home/jenkins/workspace/Lucene-Solr-6.x-Linux/solr/build/solr-core/test/J1/temp/solr.cloud.ForceLeaderTest_4463D8CD8F9C2761-001/shard-1-001/cores}
[junit4] 2> 1558665 INFO (TEST-ForceLeaderTest.testLastPublishedStateIsActive-seed#[4463D8CD8F9C2761]) [ ] o.a.s.s.SolrDispatchFilter SolrDispatchFilter.init(): sun.misc.Launcher$AppClassLoader@73d16e93
[junit4] 2> 1558665 INFO (TEST-ForceLeaderTest.testLastPublishedStateIsActive-seed#[4463D8CD8F9C2761]) [ ] o.a.s.c.SolrResourceLoader new SolrResourceLoader for directory: '/home/jenkins/workspace/Lucene-Solr-6.x-Linux/solr/build/solr-core/test/J1/temp/solr.cloud.ForceLeaderTest_4463D8CD8F9C2761-001/shard-1-001'
[junit4] 2> 1558665 INFO (TEST-ForceLeaderTest.testLastPublishedStateIsActive-seed#[4463D8CD8F9C2761]) [ ] o.a.s.c.SolrResourceLoader JNDI not configured for solr (NoInitialContextEx)
[junit4] 2> 1558665 INFO (TEST-ForceLeaderTest.testLastPublishedStateIsActive-seed#[4463D8CD8F9C2761]) [ ] o.a.s.c.SolrResourceLoader solr home defaulted to 'solr/' (could not find system property or JNDI)
[junit4] 2> 1558665 INFO (TEST-ForceLeaderTest.testLastPublishedStateIsActive-seed#[4463D8CD8F9C2761]) [ ] o.a.s.c.c.SolrZkClient Using default ZkCredentialsProvider
[junit4] 2> 1558665 INFO (TEST-ForceLeaderTest.testLastPublishedStateIsActive-seed#[4463D8CD8F9C2761]) [ ] o.a.s.c.c.ConnectionManager Waiting for client to connect to ZooKeeper
[junit4] 2> 1558666 INFO (zkCallback-20089-thread-1) [ ] o.a.s.c.c.ConnectionManager Watcher org.apache.solr.common.cloud.ConnectionManager@62a0e85 name:ZooKeeperConnection Watcher:127.0.0.1:40495/solr got event WatchedEvent state:SyncConnected type:None path:null path:null type:None
[junit4] 2> 1558666 INFO (TEST-ForceLeaderTest.testLastPublishedStateIsActive-seed#[4463D8CD8F9C2761]) [ ] o.a.s.c.c.ConnectionManager Client is connected to ZooKeeper
[junit4] 2> 1558666 INFO (TEST-ForceLeaderTest.testLastPublishedStateIsActive-seed#[4463D8CD8F9C2761]) [ ] o.a.s.c.c.SolrZkClient Using default ZkACLProvider
[junit4] 2> 1558666 INFO (TEST-ForceLeaderTest.testLastPublishedStateIsActive-seed#[4463D8CD8F9C2761]) [ ] o.a.s.s.SolrDispatchFilter Loading solr.xml from SolrHome (not found in ZooKeeper)
[junit4] 2> 1558666 INFO (TEST-ForceLeaderTest.testLastPublishedStateIsActive-seed#[4463D8CD8F9C2761]) [ ] o.a.s.c.SolrXmlConfig Loading container configuration from /home/jenkins/workspace/Lucene-Solr-6.x-Linux/solr/build/solr-core/test/J1/temp/solr.cloud.ForceLeaderTest_4463D8CD8F9C2761-001/shard-1-001/solr.xml
[junit4] 2> 1558669 INFO (TEST-ForceLeaderTest.testLastPublishedStateIsActive-seed#[4463D8CD8F9C2761]) [ ] o.a.s.c.CorePropertiesLocator Config-defined core root directory: /home/jenkins/workspace/Lucene-Solr-6.x-Linux/solr/build/solr-core/test/J1/temp/solr.cloud.ForceLeaderTest_4463D8CD8F9C2761-001/shard-1-001/cores
[junit4] 2> 1558670 INFO (TEST-ForceLeaderTest.testLastPublishedStateIsActive-seed#[4463D8CD8F9C2761]) [ ] o.a.s.c.CoreContainer New CoreContainer 976009614
[junit4] 2> 1558670 INFO (TEST-ForceLeaderTest.testLastPublishedStateIsActive-seed#[4463D8CD8F9C2761]) [ ] o.a.s.c.CoreContainer Loading cores into CoreContainer [instanceDir=/home/jenkins/workspace/Lucene-Solr-6.x-Linux/solr/build/solr-core/test/J1/temp/solr.cloud.ForceLeaderTest_4463D8CD8F9C2761-001/shard-1-001]
[junit4] 2> 1558670 WARN (TEST-ForceLeaderTest.testLastPublishedStateIsActive-seed#[4463D8CD8F9C2761]) [ ] o.a.s.c.CoreContainer Couldn't add files from /home/jenkins/workspace/Lucene-Solr-6.x-Linux/solr/build/solr-core/test/J1/temp/solr.cloud.ForceLeaderTest_4463D8CD8F9C2761-001/shard-1-001/lib to classpath: /home/jenkins/workspace/Lucene-Solr-6.x-Linux/solr/build/solr-core/test/J1/temp/solr.cloud.ForceLeaderTest_4463D8CD8F9C2761-001/shard-1-001/lib
[junit4] 2> 1558670 INFO (TEST-ForceLeaderTest.testLastPublishedStateIsActive-seed#[4463D8CD8F9C2761]) [ ] o.a.s.h.c.HttpShardHandlerFactory created with socketTimeout : 90000,urlScheme : ,connTimeout : 15000,maxConnectionsPerHost : 20,maxConnections : 10000,corePoolSize : 0,maximumPoolSize : 2147483647,maxThreadIdleTime : 5,sizeOfQueue : -1,fairnessPolicy : false,useRetries : false,connectionsEvictorSleepDelay : 5000,maxConnectionIdleTime : 40000,
[junit4] 2> 1558671 INFO (TEST-ForceLeaderTest.testLastPublishedStateIsActive-seed#[4463D8CD8F9C2761]) [ ] o.a.s.u.UpdateShardHandler Creating UpdateShardHandler HTTP client with params: socketTimeout=340000&connTimeout=45000&retry=true
[junit4] 2> 1558671 INFO (TEST-ForceLeaderTest.testLastPublishedStateIsActive-seed#[4463D8CD8F9C2761]) [ ] o.a.s.l.LogWatcher SLF4J impl is org.slf4j.impl.Log4jLoggerFactory
[junit4] 2> 1558671 INFO (TEST-ForceLeaderTest.testLastPublishedStateIsActive-seed#[4463D8CD8F9C2761]) [ ] o.a.s.l.LogWatcher Registering Log Listener [Log4j (org.slf4j.impl.Log4jLoggerFactory)]
[junit4] 2> 1558671 INFO (TEST-ForceLeaderTest.testLastPublishedStateIsActive-seed#[4463D8CD8F9C2761]) [ ] o.a.s.c.ZkContainer Zookeeper client=127.0.0.1:40495/solr
[junit4] 2> 1558671 INFO (TEST-ForceLeaderTest.testLastPublishedStateIsActive-seed#[4463D8CD8F9C2761]) [ ] o.a.s.c.ZkController zkHost includes chroot
[junit4] 2> 1558671 INFO (TEST-ForceLeaderTest.testLastPublishedStateIsActive-seed#[4463D8CD8F9C2761]) [ ] o.a.s.c.c.SolrZkClient Using default ZkCredentialsProvider
[junit4] 2> 1558671 INFO (TEST-ForceLeaderTest.testLastPublishedStateIsActive-seed#[4463D8CD8F9C2761]) [ ] o.a.s.c.c.ConnectionManager Waiting for client to connect to ZooKeeper
[junit4] 2> 1558672 INFO (zkCallback-20092-thread-1) [ ] o.a.s.c.c.ConnectionManager Watcher org.apache.solr.common.cloud.ConnectionManager@7c2ab3be name:ZooKeeperConnection Watcher:127.0.0.1:40495 got event WatchedEvent state:SyncConnected type:None path:null path:null type:None
[junit4] 2> 1558672 INFO (TEST-ForceLeaderTest.testLastPublishedStateIsActive-seed#[4463D8CD8F9C2761]) [ ] o.a.s.c.c.ConnectionManager Client is connected to ZooKeeper
[junit4] 2> 1558672 INFO (TEST-ForceLeaderTest.testLastPublishedStateIsActive-seed#[4463D8CD8F9C2761]) [ ] o.a.s.c.c.SolrZkClient Using default ZkACLProvider
[junit4] 2> 1558673 INFO (TEST-ForceLeaderTest.testLastPublishedStateIsActive-seed#[4463D8CD8F9C2761]) [n:127.0.0.1:44230_ ] o.a.s.c.ZkController Added new OnReconnect listener org.apache.solr.cloud.ZkController$$Lambda$12/1795928286@484a573f
[junit4] 2> 1558673 INFO (TEST-ForceLeaderTest.testLastPublishedStateIsActive-seed#[4463D8CD8F9C2761]) [n:127.0.0.1:44230_ ] o.a.s.c.c.ConnectionManager Waiting for client to connect to ZooKeeper
[junit4] 2> 1558674 INFO (zkCallback-20093-thread-1-processing-n:127.0.0.1:44230_) [n:127.0.0.1:44230_ ] o.a.s.c.c.ConnectionManager Watcher org.apache.solr.common.cloud.ConnectionManager@5dd343f1 name:ZooKeeperConnection Watcher:127.0.0.1:40495/solr got event WatchedEvent state:SyncConnected type:None path:null path:null type:None
[junit4] 2> 1558674 INFO (TEST-ForceLeaderTest.testLastPublishedStateIsActive-seed#[4463D8CD8F9C2761]) [n:127.0.0.1:44230_ ] o.a.s.c.c.ConnectionManager Client is connected to ZooKeeper
[junit4] 2> 1558675 INFO (TEST-ForceLeaderTest.testLastPublishedStateIsActive-seed#[4463D8CD8F9C2761]) [n:127.0.0.1:44230_ ] o.a.s.c.c.ZkStateReader Updating cluster state from ZooKeeper...
[junit4] 2> 1558676 INFO (TEST-ForceLeaderTest.testLastPublishedStateIsActive-seed#[4463D8CD8F9C2761]) [n:127.0.0.1:44230_ ] o.a.s.c.c.ZkStateReader Loaded empty cluster properties
[junit4] 2> 1558676 INFO (TEST-ForceLeaderTest.testLastPublishedStateIsActive-seed#[4463D8CD8F9C2761]) [n:127.0.0.1:44230_ ] o.a.s.c.c.ZkStateReader Updated live nodes from ZooKeeper... (0) -> (1)
[junit4] 2> 1558676 INFO (TEST-ForceLeaderTest.testLastPublishedStateIsActive-seed#[4463D8CD8F9C2761]) [n:127.0.0.1:44230_ ] o.a.s.c.Overseer Overseer (id=null) closing
[junit4] 2> 1558677 INFO (TEST-ForceLeaderTest.testLastPublishedStateIsActive-seed#[4463D8CD8F9C2761]) [n:127.0.0.1:44230_ ] o.a.s.c.LeaderElector Joined leadership election with path: /overseer_elect/election/96249811452362760-127.0.0.1:44230_-n_0000000001
[junit4] 2> 1558677 INFO (TEST-ForceLeaderTest.testLastPublishedStateIsActive-seed#[4463D8CD8F9C2761]) [n:127.0.0.1:44230_ ] o.a.s.c.LeaderElector Watching path /overseer_elect/election/96249811452362756-127.0.0.1:34080_-n_0000000000 to know if I could be the leader
[junit4] 2> 1558677 INFO (TEST-ForceLeaderTest.testLastPublishedStateIsActive-seed#[4463D8CD8F9C2761]) [n:127.0.0.1:44230_ ] o.a.s.c.ZkController Publish node=127.0.0.1:44230_ as DOWN
[junit4] 2> 1558677 INFO (TEST-ForceLeaderTest.testLastPublishedStateIsActive-seed#[4463D8CD8F9C2761]) [n:127.0.0.1:44230_ ] o.a.s.c.ZkController Register node as live in ZooKeeper:/live_nodes/127.0.0.1:44230_
[junit4] 2> 1558677 INFO (TEST-ForceLeaderTest.testLastPublishedStateIsActive-seed#[4463D8CD8F9C2761]) [n:127.0.0.1:44230_ ] o.a.s.c.c.SolrZkClient makePath: /live_nodes/127.0.0.1:44230_
[junit4] 2> 1558677 INFO (OverseerStateUpdate-96249811452362756-127.0.0.1:34080_-n_0000000000) [n:127.0.0.1:34080_ ] o.a.s.c.Overseer processMessage: queueSize: 1, message = {
[junit4] 2> "operation":"downnode",
[junit4] 2> "node_name":"127.0.0.1:44230_"} current state version: 3
[junit4] 2> 1558678 INFO (OverseerStateUpdate-96249811452362756-127.0.0.1:34080_-n_0000000000) [n:127.0.0.1:34080_ ] o.a.s.c.o.NodeMutator DownNode state invoked for node: 127.0.0.1:44230_
[junit4] 2> 1558678 INFO (zkCallback-20093-thread-1-processing-n:127.0.0.1:44230_) [n:127.0.0.1:44230_ ] o.a.s.c.c.ZkStateReader A live node change: [WatchedEvent state:SyncConnected type:NodeChildrenChanged path:/live_nodes], has occurred - updating... (live nodes size: [1])
[junit4] 2> 1558678 INFO (zkCallback-20088-thread-1) [ ] o.a.s.c.c.ZkStateReader A live node change: [WatchedEvent state:SyncConnected type:NodeChildrenChanged path:/live_nodes], has occurred - updating... (live nodes size: [1])
[junit4] 2> 1558678 INFO (zkCallback-20084-thread-1-processing-n:127.0.0.1:34080_) [n:127.0.0.1:34080_ ] o.a.s.c.c.ZkStateReader A live node change: [WatchedEvent state:SyncConnected type:NodeChildrenChanged path:/live_nodes], has occurred - updating... (live nodes size: [1])
[junit4] 2> 1558678 INFO (zkCallback-20093-thread-1-processing-n:127.0.0.1:44230_) [n:127.0.0.1:44230_ ] o.a.s.c.c.ZkStateReader Updated live nodes from ZooKeeper... (1) -> (2)
[junit4] 2> 1558678 INFO (zkCallback-20088-thread-1) [ ] o.a.s.c.c.ZkStateReader Updated live nodes from ZooKeeper... (1) -> (2)
[junit4] 2> 1558678 INFO (zkCallback-20084-thread-1-processing-n:127.0.0.1:34080_) [n:127.0.0.1:34080_ ] o.a.s.c.c.ZkStateReader Updated live nodes from ZooKeeper... (1) -> (2)
[junit4] 2> 1558684 INFO (TEST-ForceLeaderTest.testLastPublishedStateIsActive-seed#[4463D8CD8F9C2761]) [n:127.0.0.1:44230_ ] o.a.s.c.CoreContainer Security conf doesn't exist. Skipping setup for authorization module.
[junit4] 2> 1558684 INFO (TEST-ForceLeaderTest.testLastPublishedStateIsActive-seed#[4463D8CD8F9C2761]) [n:127.0.0.1:44230_ ] o.a.s.c.CoreContainer No authentication plugin used.
[junit4] 2> 1558686 INFO (TEST-ForceLeaderTest.testLastPublishedStateIsActive-seed#[4463D8CD8F9C2761]) [n:127.0.0.1:44230_ ] o.a.s.c.CorePropertiesLocator Looking for core definitions underneath /home/jenkins/workspace/Lucene-Solr-6.x-Linux/solr/build/solr-core/test/J1/temp/solr.cloud.ForceLeaderTest_4463D8CD8F9C2761-001/shard-1-001/cores
[junit4] 2> 1558686 INFO (TEST-ForceLeaderTest.testLastPublishedStateIsActive-seed#[4463D8CD8F9C2761]) [n:127.0.0.1:44230_ ] o.a.s.c.CoreDescriptor Created CoreDescriptor: {name=collection1, config=solrconfig.xml, transient=false, schema=schema.xml, loadOnStartup=true, configSetProperties=configsetprops.json, collection=collection1, coreNodeName=, dataDir=data/, shard=}
[junit4] 2> 1558686 INFO (TEST-ForceLeaderTest.testLastPublishedStateIsActive-seed#[4463D8CD8F9C2761]) [n:127.0.0.1:44230_ ] o.a.s.c.CorePropertiesLocator Found core collection1 in /home/jenkins/workspace/Lucene-Solr-6.x-Linux/solr/build/solr-core/test/J1/temp/solr.cloud.ForceLeaderTest_4463D8CD8F9C2761-001/shard-1-001/cores/collection1
[junit4] 2> 1558686 INFO (TEST-ForceLeaderTest.testLastPublishedStateIsActive-seed#[4463D8CD8F9C2761]) [n:127.0.0.1:44230_ ] o.a.s.c.CorePropertiesLocator Found 1 core definitions
[junit4] 2> 1558686 INFO (coreLoadExecutor-8971-thread-1-processing-n:127.0.0.1:44230_) [n:127.0.0.1:44230_ c:collection1 x:collection1] o.a.s.c.ZkController publishing state=down
[junit4] 2> 1558686 INFO (TEST-ForceLeaderTest.testLastPublishedStateIsActive-seed#[4463D8CD8F9C2761]) [n:127.0.0.1:44230_ ] o.a.s.s.SolrDispatchFilter user.dir=/home/jenkins/workspace/Lucene-Solr-6.x-Linux/solr/build/solr-core/test/J1
[junit4] 2> 1558686 INFO (coreLoadExecutor-8971-thread-1-processing-n:127.0.0.1:44230_) [n:127.0.0.1:44230_ c:collection1 x:collection1] o.a.s.c.ZkController numShards not found on descriptor - reading it from system property
[junit4] 2> 1558687 INFO (TEST-ForceLeaderTest.testLastPublishedStateIsActive-seed#[4463D8CD8F9C2761]) [n:127.0.0.1:44230_ ] o.a.s.s.SolrDispatchFilter SolrDispatchFilter.init() done
[junit4] 2> 1558687 INFO (coreLoadExecutor-8971-thread-1-processing-n:127.0.0.1:44230_) [n:127.0.0.1:44230_ c:collection1 x:collection1] o.a.s.c.ZkController Collection collection1 not visible yet, but flagging it so a watch is registered when it becomes visible
[junit4] 2> 1558687 INFO (OverseerStateUpdate-96249811452362756-127.0.0.1:34080_-n_0000000000) [n:127.0.0.1:34080_ ] o.a.s.c.Overseer processMessage: queueSize: 1, message = {
[junit4] 2> "core":"collection1",
[junit4] 2> "roles":null,
[junit4] 2> "base_url":"http://127.0.0.1:44230",
[junit4] 2> "node_name":"127.0.0.1:44230_",
[junit4] 2> "numShards":"2",
[junit4] 2> "state":"down",
[junit4] 2> "shard":null,
[junit4] 2> "collection":"collection1",
[junit4] 2> "operation":"state"} current state version: 3
[junit4] 2> 1558687 INFO (OverseerStateUpdate-96249811452362756-127.0.0.1:34080_-n_0000000000) [n:127.0.0.1:34080_ ] o.a.s.c.o.ReplicaMutator Update state numShards=2 message={
[junit4] 2> "core":"collection1",
[junit4] 2> "roles":null,
[junit4] 2> "base_url":"http://127.0.0.1:44230",
[junit4] 2> "node_name":"127.0.0.1:44230_",
[junit4] 2> "numShards":"2",
[junit4] 2> "state":"down",
[junit4] 2> "shard":null,
[junit4] 2> "collection":"collection1",
[junit4] 2> "operation":"state"}
[junit4] 2> 1558687 INFO (coreLoadExecutor-8971-thread-1-processing-n:127.0.0.1:44230_) [n:127.0.0.1:44230_ c:collection1 x:collection1] o.a.s.c.c.ZkStateReader Deleting data for [collection1]
[junit4] 2> 1558687 INFO (OverseerStateUpdate-96249811452362756-127.0.0.1:34080_-n_0000000000) [n:127.0.0.1:34080_ ] o.a.s.c.o.ClusterStateMutator building a new cName: collection1
[junit4] 2> 1558687 INFO (OverseerStateUpdate-96249811452362756-127.0.0.1:34080_-n_0000000000) [n:127.0.0.1:34080_ ] o.a.s.c.o.ReplicaMutator Assigning new node to shard shard=shard2
[junit4] 2> 1558689 INFO (coreLoadExecutor-8971-thread-1-processing-n:127.0.0.1:44230_) [n:127.0.0.1:44230_ c:collection1 x:collection1] o.a.s.c.ZkController look for our core node name
[junit4] 2> 1558788 INFO (zkCallback-20084-thread-1-processing-n:127.0.0.1:34080_) [n:127.0.0.1:34080_ ] o.a.s.c.c.ZkStateReader A cluster state change: [WatchedEvent state:SyncConnected type:NodeDataChanged path:/clusterstate.json], has occurred - updating... (live nodes size: [2])
[junit4] 2> 1558788 INFO (zkCallback-20088-thread-1) [ ] o.a.s.c.c.ZkStateReader A cluster state change: [WatchedEvent state:SyncConnected type:NodeDataChanged path:/clusterstate.json], has occurred - updating... (live nodes size: [2])
[junit4] 2> 1558788 INFO (zkCallback-20093-thread-1-processing-n:127.0.0.1:44230_) [n:127.0.0.1:44230_ ] o.a.s.c.c.ZkStateReader A cluster state change: [WatchedEvent state:SyncConnected type:NodeDataChanged path:/clusterstate.json], has occurred - updating... (live nodes size: [2])
[junit4] 2> 1559689 INFO (coreLoadExecutor-8971-thread-1-processing-n:127.0.0.1:44230_) [n:127.0.0.1:44230_ c:collection1 x:collection1] o.a.s.c.ZkController waiting to find shard id in clusterstate for collection1
[junit4] 2> 1559689 INFO (coreLoadExecutor-8971-thread-1-processing-n:127.0.0.1:44230_) [n:127.0.0.1:44230_ c:collection1 x:collection1] o.a.s.c.ZkController Check for collection zkNode:collection1
[junit4] 2> 1559689 INFO (coreLoadExecutor-8971-thread-1-processing-n:127.0.0.1:44230_) [n:127.0.0.1:44230_ c:collection1 x:collection1] o.a.s.c.ZkController Collection zkNode exists
[junit4] 2> 1559689 INFO (coreLoadExecutor-8971-thread-1-processing-n:127.0.0.1:44230_) [n:127.0.0.1:44230_ c:collection1 x:collection1] o.a.s.c.c.ZkStateReader Load collection config from: [/collections/collection1]
[junit4] 2> 1559689 INFO (coreLoadExecutor-8971-thread-1-processing-n:127.0.0.1:44230_) [n:127.0.0.1:44230_ c:collection1 x:collection1] o.a.s.c.c.ZkStateReader path=[/collections/collection1] [configName]=[conf1] specified config exists in ZooKeeper
[junit4] 2> 1559689 INFO (coreLoadExecutor-8971-thread-1-processing-n:127.0.0.1:44230_) [n:127.0.0.1:44230_ c:collection1 x:collection1] o.a.s.c.SolrResourceLoader new SolrResourceLoader for directory: '/home/jenkins/workspace/Lucene-Solr-6.x-Linux/solr/build/solr-core/test/J1/temp/solr.cloud.ForceLeaderTest_4463D8CD8F9C2761-001/shard-1-001/cores/collection1'
[junit4] 2> 1559689 INFO (coreLoadExecutor-8971-thread-1-processing-n:127.0.0.1:44230_) [n:127.0.0.1:44230_ c:collection1 x:collection1] o.a.s.c.SolrResourceLoader JNDI not configured for solr (NoInitialContextEx)
[junit4] 2> 1559690 INFO (coreLoadExecutor-8971-thread-1-processing-n:127.0.0.1:44230_) [n:127.0.0.1:44230_ c:collection1 x:collection1] o.a.s.c.SolrResourceLoader solr home defaulted to 'solr/' (could not find system property or JNDI)
[junit4] 2> 1559690 INFO (coreLoadExecutor-8971-thread-1-processing-n:127.0.0.1:44230_) [n:127.0.0.1:44230_ c:collection1 x:collection1] o.a.s.c.Config loaded config solrconfig.xml with version 0
[junit4] 2> 1559693 INFO (coreLoadExecutor-8971-thread-1-processing-n:127.0.0.1:44230_) [n:
[...truncated too long message...]
.solrj.impl.CloudSolrClient.directUpdate(CloudSolrClient.java:747)
[junit4] > ... 49 more
[junit4] > Caused by: org.apache.solr.client.solrj.SolrServerException: Server refused connection at: http://127.0.0.1:46628/forceleader_test_collection_shard1_replica2
[junit4] > at org.apache.solr.client.solrj.impl.HttpSolrClient.executeMethod(HttpSolrClient.java:597)
[junit4] > at org.apache.solr.client.solrj.impl.HttpSolrClient.request(HttpSolrClient.java:259)
[junit4] > at org.apache.solr.client.solrj.impl.HttpSolrClient.request(HttpSolrClient.java:248)
[junit4] > at org.apache.solr.client.solrj.impl.LBHttpSolrClient.doRequest(LBHttpSolrClient.java:403)
[junit4] > at org.apache.solr.client.solrj.impl.LBHttpSolrClient.request(LBHttpSolrClient.java:372)
[junit4] > ... 50 more
[junit4] > Caused by: java.net.ConnectException: Connection refused
[junit4] > at java.net.PlainSocketImpl.socketConnect(Native Method)
[junit4] > at java.net.AbstractPlainSocketImpl.doConnect(AbstractPlainSocketImpl.java:350)
[junit4] > at java.net.AbstractPlainSocketImpl.connectToAddress(AbstractPlainSocketImpl.java:206)
[junit4] > at java.net.AbstractPlainSocketImpl.connect(AbstractPlainSocketImpl.java:188)
[junit4] > at java.net.SocksSocketImpl.connect(SocksSocketImpl.java:392)
[junit4] > at java.net.Socket.connect(Socket.java:589)
[junit4] > at org.apache.http.conn.scheme.PlainSocketFactory.connectSocket(PlainSocketFactory.java:117)
[junit4] > at org.apache.http.impl.conn.DefaultClientConnectionOperator.openConnection(DefaultClientConnectionOperator.java:177)
[junit4] > at org.apache.http.impl.conn.ManagedClientConnectionImpl.open(ManagedClientConnectionImpl.java:304)
[junit4] > at org.apache.http.impl.client.DefaultRequestDirector.tryConnect(DefaultRequestDirector.java:611)
[junit4] > at org.apache.http.impl.client.DefaultRequestDirector.execute(DefaultRequestDirector.java:446)
[junit4] > at org.apache.http.impl.client.AbstractHttpClient.doExecute(AbstractHttpClient.java:882)
[junit4] > at org.apache.http.impl.client.CloseableHttpClient.execute(CloseableHttpClient.java:82)
[junit4] > at org.apache.http.impl.client.CloseableHttpClient.execute(CloseableHttpClient.java:107)
[junit4] > at org.apache.http.impl.client.CloseableHttpClient.execute(CloseableHttpClient.java:55)
[junit4] > at org.apache.solr.client.solrj.impl.HttpSolrClient.executeMethod(HttpSolrClient.java:495)
[junit4] > ... 54 more
[junit4] 2> 1658442 INFO (SUITE-ForceLeaderTest-seed#[4463D8CD8F9C2761]-worker) [ ] o.a.s.SolrTestCaseJ4 ###deleteCore
[junit4] 2> NOTE: leaving temporary files on disk at: /home/jenkins/workspace/Lucene-Solr-6.x-Linux/solr/build/solr-core/test/J1/temp/solr.cloud.ForceLeaderTest_4463D8CD8F9C2761-001
[junit4] 2> Jul 16, 2016 7:54:31 AM com.carrotsearch.randomizedtesting.ThreadLeakControl checkThreadLeaks
[junit4] 2> WARNING: Will linger awaiting termination of 1 leaked thread(s).
[junit4] 2> NOTE: test params are: codec=Asserting(Lucene62): {range_facet_l_dv=PostingsFormat(name=LuceneVarGapDocFreqInterval), _version_=PostingsFormat(name=Asserting), multiDefault=PostingsFormat(name=Memory doPackFST= true), a_t=PostingsFormat(name=Memory doPackFST= true), intDefault=PostingsFormat(name=Asserting), id=PostingsFormat(name=LuceneVarGapDocFreqInterval), range_facet_i_dv=PostingsFormat(name=Memory doPackFST= true), text=Lucene50(blocksize=128), range_facet_l=PostingsFormat(name=Memory doPackFST= true), timestamp=PostingsFormat(name=Memory doPackFST= true)}, docValues:{range_facet_l_dv=DocValuesFormat(name=Lucene54), range_facet_i_dv=DocValuesFormat(name=Memory), timestamp=DocValuesFormat(name=Memory)}, maxPointsInLeafNode=294, maxMBSortInHeap=5.8363881672730376, sim=ClassicSimilarity, locale=es-VE, timezone=America/Panama
[junit4] 2> NOTE: Linux 4.4.0-28-generic amd64/Oracle Corporation 1.8.0_92 (64-bit)/cpus=12,threads=1,free=214193280,total=527433728
[junit4] 2> NOTE: All tests run in this JVM: [ConfigSetsAPITest, SolrCLIZkUtilsTest, CollectionsAPIAsyncDistributedZkTest, TestFilteredDocIdSet, TermVectorComponentTest, ChaosMonkeyNothingIsSafeTest, TestTrieFacet, TimeZoneUtilsTest, OverseerModifyCollectionTest, MBeansHandlerTest, OverseerTaskQueueTest, TestConfigSetImmutable, TestFieldCacheVsDocValues, SharedFSAutoReplicaFailoverTest, FastVectorHighlighterTest, SolrPluginUtilsTest, PreAnalyzedUpdateProcessorTest, BlobRepositoryCloudTest, DocExpirationUpdateProcessorFactoryTest, TestSurroundQueryParser, MergeStrategyTest, AsyncMigrateRouteKeyTest, MinimalSchemaTest, DistributedExpandComponentTest, CustomCollectionTest, HttpPartitionTest, TestSchemaNameResource, TestDocumentBuilder, DirectoryFactoryTest, ReplicationFactorTest, HdfsUnloadDistributedZkTest, DistributedTermsComponentTest, BlockJoinFacetSimpleTest, UpdateRequestProcessorFactoryTest, NumericFieldsTest, TestDocTermOrds, DocumentBuilderTest, TestSolrXml, MoreLikeThisHandlerTest, TestSolrCoreProperties, TestHighFrequencyDictionaryFactory, TestExclusionRuleCollectionAccess, TestSubQueryTransformerCrossCore, TestReqParamsAPI, TestCoreContainer, TestManagedSynonymFilterFactory, TestPivotHelperCode, TestStressLiveNodes, TestQuerySenderNoQuery, TestInitQParser, BJQParserTest, SSLMigrationTest, TestFastLRUCache, LoggingHandlerTest, TestAuthenticationFramework, SimpleMLTQParserTest, TestQuerySenderListener, TestExactSharedStatsCache, TestMiniSolrCloudClusterSSL, TestBinaryResponseWriter, TestConfigReload, TestSolrFieldCacheMBean, TestFieldResource, TestSolrQueryParserResource, ZkControllerTest, DistribCursorPagingTest, SuggestComponentTest, UUIDUpdateProcessorFallbackTest, DOMUtilTest, TestRebalanceLeaders, NotRequiredUniqueKeyTest, TestAddFieldRealTimeGet, TestNonDefinedSimilarityFactory, TestStressVersions, OutOfBoxZkACLAndCredentialsProvidersTest, TestComplexPhraseQParserPlugin, TestLFUCache, TestSizeLimitedDistributedMap, TestFiltering, TestLMJelinekMercerSimilarityFactory, TestCloudPivotFacet, TestSchemaManager, TestMiniSolrCloudCluster, TestNumericTerms32, OpenCloseCoreStressTest, TestHashPartitioner, HdfsChaosMonkeySafeLeaderTest, TestEmbeddedSolrServerConstructors, SpatialFilterTest, TestCryptoKeys, HdfsBasicDistributedZk2Test, SolrInfoMBeanTest, SolrIndexSplitterTest, ChangedSchemaMergeTest, TestRTimerTree, HdfsSyncSliceTest, TlogReplayBufferedWhileIndexingTest, BigEndianAscendingWordDeserializerTest, OverseerTest, ShardRoutingTest, ClusterStateUpdateTest, ZkSolrClientTest, ZkCLITest, ShardRoutingCustomTest, TestDistributedSearch, SolrCmdDistributorTest, BadIndexSchemaTest, ConvertedLegacyTest, TestFunctionQuery, BasicFunctionalityTest, DirectUpdateHandlerTest, HighlighterTest, CurrencyFieldOpenExchangeTest, CurrencyFieldXmlFileTest, SimplePostToolTest, AnalysisAfterCoreReloadTest, SignatureUpdateProcessorFactoryTest, SpellCheckCollatorTest, SuggesterFSTTest, SolrRequestParserTest, SuggesterTSTTest, SuggesterTest, TestTrie, SuggesterWFSTTest, TestCSVLoader, PolyFieldTest, NoCacheHeaderTest, SchemaVersionSpecificBehaviorTest, SolrCoreCheckLockOnStartupTest, TestPseudoReturnFields, TestUpdate, TestWordDelimiterFilterFactory, DistanceFunctionTest, IndexBasedSpellCheckerTest, DisMaxRequestHandlerTest, TestWriterPerf, DocumentAnalysisRequestHandlerTest, TermsComponentTest, PathHierarchyTokenizerFactoryTest, FieldAnalysisRequestHandlerTest, IndexSchemaRuntimeFieldTest, TestJmxIntegration, ReturnFieldsTest, UniqFieldsUpdateProcessorFactoryTest, TestPHPSerializedResponseWriter, TestComponentsName, TestSolrIndexConfig, SolrIndexConfigTest, TestMergePolicyConfig, TestSolrDeletionPolicy2, MultiTermTest, SampleTest, TestDocSet, TestSearchPerf, DirectSolrConnectionTest, SpellPossibilityIteratorTest, TestCharFilters, TestCodecSupport, SynonymTokenizerTest, TestSweetSpotSimilarityFactory, TestDFRSimilarityFactory, TestLMDirichletSimilarityFactory, TestIBSimilarityFactory, TestBM25SimilarityFactory, TestJmxMonitoredMap, TestFastOutputStream, ScriptEngineTest, OpenExchangeRatesOrgProviderTest, PreAnalyzedFieldTest, TestSuggestSpellingConverter, DateFieldTest, ClusterStateTest, CircularListTest, TestRTGBase, CursorPagingTest, SolrTestCaseJ4Test, TestCrossCoreJoin, TestCursorMarkWithoutUniqueKey, TestDistributedMissingSort, TestSimpleTrackingShardHandler, ConnectionReuseTest, AliasIntegrationTest, CloudExitableDirectoryReaderTest, CollectionReloadTest, ConcurrentDeleteAndCreateCollectionTest, DeleteInactiveReplicaTest, DeleteStatusTest, DistribDocExpirationUpdateProcessorTest, ForceLeaderTest]
[junit4] Completed [460/621 (1!)] on J1 in 101.80s, 3 tests, 1 error, 1 skipped <<< FAILURES!
[...truncated 583 lines...]
BUILD FAILED
/home/jenkins/workspace/Lucene-Solr-6.x-Linux/build.xml:763: The following error occurred while executing this line:
/home/jenkins/workspace/Lucene-Solr-6.x-Linux/build.xml:707: The following error occurred while executing this line:
/home/jenkins/workspace/Lucene-Solr-6.x-Linux/build.xml:59: The following error occurred while executing this line:
/home/jenkins/workspace/Lucene-Solr-6.x-Linux/solr/build.xml:233: The following error occurred while executing this line:
/home/jenkins/workspace/Lucene-Solr-6.x-Linux/solr/common-build.xml:536: The following error occurred while executing this line:
/home/jenkins/workspace/Lucene-Solr-6.x-Linux/lucene/common-build.xml:1443: The following error occurred while executing this line:
/home/jenkins/workspace/Lucene-Solr-6.x-Linux/lucene/common-build.xml:984: There were test failures: 621 suites (10 ignored), 2642 tests, 1 error, 129 ignored (83 assumptions) [seed: 4463D8CD8F9C2761]
Total time: 61 minutes 3 seconds
Build step 'Invoke Ant' marked build as failure
Archiving artifacts
[WARNINGS] Skipping publisher since build result is FAILURE
Recording test results
Email was triggered for: Failure - Any
Sending email for trigger: Failure - Any
[JENKINS] Lucene-Solr-6.x-Linux (32bit/jdk1.8.0_92) - Build # 1172
- Still Failing!
Posted by Policeman Jenkins Server <je...@thetaphi.de>.
Build: http://jenkins.thetaphi.de/job/Lucene-Solr-6.x-Linux/1172/
Java: 32bit/jdk1.8.0_92 -server -XX:+UseSerialGC
1 tests failed.
FAILED: org.apache.solr.cloud.ForceLeaderTest.testReplicasInLIRNoLeader
Error Message:
org.apache.solr.client.solrj.SolrServerException: No live SolrServers available to handle this request:[http://127.0.0.1:41459/forceleader_test_collection_shard1_replica3]
Stack Trace:
org.apache.solr.client.solrj.SolrServerException: org.apache.solr.client.solrj.SolrServerException: No live SolrServers available to handle this request:[http://127.0.0.1:41459/forceleader_test_collection_shard1_replica3]
at __randomizedtesting.SeedInfo.seed([96830BA02490A958:70143F601D125039]:0)
at org.apache.solr.client.solrj.impl.CloudSolrClient.directUpdate(CloudSolrClient.java:753)
at org.apache.solr.client.solrj.impl.CloudSolrClient.sendRequest(CloudSolrClient.java:1151)
at org.apache.solr.client.solrj.impl.CloudSolrClient.requestWithRetryOnStaleState(CloudSolrClient.java:1040)
at org.apache.solr.client.solrj.impl.CloudSolrClient.request(CloudSolrClient.java:976)
at org.apache.solr.cloud.AbstractFullDistribZkTestBase.sendDocsWithRetry(AbstractFullDistribZkTestBase.java:753)
at org.apache.solr.cloud.AbstractFullDistribZkTestBase.sendDocsWithRetry(AbstractFullDistribZkTestBase.java:741)
at org.apache.solr.cloud.ForceLeaderTest.sendDoc(ForceLeaderTest.java:424)
at org.apache.solr.cloud.ForceLeaderTest.assertSendDocFails(ForceLeaderTest.java:315)
at org.apache.solr.cloud.ForceLeaderTest.testReplicasInLIRNoLeader(ForceLeaderTest.java:110)
at sun.reflect.NativeMethodAccessorImpl.invoke0(Native Method)
at sun.reflect.NativeMethodAccessorImpl.invoke(NativeMethodAccessorImpl.java:62)
at sun.reflect.DelegatingMethodAccessorImpl.invoke(DelegatingMethodAccessorImpl.java:43)
at java.lang.reflect.Method.invoke(Method.java:498)
at com.carrotsearch.randomizedtesting.RandomizedRunner.invoke(RandomizedRunner.java:1764)
at com.carrotsearch.randomizedtesting.RandomizedRunner$8.evaluate(RandomizedRunner.java:871)
at com.carrotsearch.randomizedtesting.RandomizedRunner$9.evaluate(RandomizedRunner.java:907)
at com.carrotsearch.randomizedtesting.RandomizedRunner$10.evaluate(RandomizedRunner.java:921)
at org.apache.solr.BaseDistributedSearchTestCase$ShardsRepeatRule$ShardsFixedStatement.callStatement(BaseDistributedSearchTestCase.java:992)
at org.apache.solr.BaseDistributedSearchTestCase$ShardsRepeatRule$ShardsStatement.evaluate(BaseDistributedSearchTestCase.java:967)
at com.carrotsearch.randomizedtesting.rules.SystemPropertiesRestoreRule$1.evaluate(SystemPropertiesRestoreRule.java:57)
at org.apache.lucene.util.TestRuleSetupTeardownChained$1.evaluate(TestRuleSetupTeardownChained.java:49)
at org.apache.lucene.util.AbstractBeforeAfterRule$1.evaluate(AbstractBeforeAfterRule.java:45)
at org.apache.lucene.util.TestRuleThreadAndTestName$1.evaluate(TestRuleThreadAndTestName.java:48)
at org.apache.lucene.util.TestRuleIgnoreAfterMaxFailures$1.evaluate(TestRuleIgnoreAfterMaxFailures.java:64)
at org.apache.lucene.util.TestRuleMarkFailure$1.evaluate(TestRuleMarkFailure.java:47)
at com.carrotsearch.randomizedtesting.rules.StatementAdapter.evaluate(StatementAdapter.java:36)
at com.carrotsearch.randomizedtesting.ThreadLeakControl$StatementRunner.run(ThreadLeakControl.java:367)
at com.carrotsearch.randomizedtesting.ThreadLeakControl.forkTimeoutingTask(ThreadLeakControl.java:809)
at com.carrotsearch.randomizedtesting.ThreadLeakControl$3.evaluate(ThreadLeakControl.java:460)
at com.carrotsearch.randomizedtesting.RandomizedRunner.runSingleTest(RandomizedRunner.java:880)
at com.carrotsearch.randomizedtesting.RandomizedRunner$5.evaluate(RandomizedRunner.java:781)
at com.carrotsearch.randomizedtesting.RandomizedRunner$6.evaluate(RandomizedRunner.java:816)
at com.carrotsearch.randomizedtesting.RandomizedRunner$7.evaluate(RandomizedRunner.java:827)
at com.carrotsearch.randomizedtesting.rules.StatementAdapter.evaluate(StatementAdapter.java:36)
at com.carrotsearch.randomizedtesting.rules.SystemPropertiesRestoreRule$1.evaluate(SystemPropertiesRestoreRule.java:57)
at org.apache.lucene.util.AbstractBeforeAfterRule$1.evaluate(AbstractBeforeAfterRule.java:45)
at com.carrotsearch.randomizedtesting.rules.StatementAdapter.evaluate(StatementAdapter.java:36)
at org.apache.lucene.util.TestRuleStoreClassName$1.evaluate(TestRuleStoreClassName.java:41)
at com.carrotsearch.randomizedtesting.rules.NoShadowingOrOverridesOnMethodsRule$1.evaluate(NoShadowingOrOverridesOnMethodsRule.java:40)
at com.carrotsearch.randomizedtesting.rules.NoShadowingOrOverridesOnMethodsRule$1.evaluate(NoShadowingOrOverridesOnMethodsRule.java:40)
at com.carrotsearch.randomizedtesting.rules.StatementAdapter.evaluate(StatementAdapter.java:36)
at com.carrotsearch.randomizedtesting.rules.StatementAdapter.evaluate(StatementAdapter.java:36)
at com.carrotsearch.randomizedtesting.rules.StatementAdapter.evaluate(StatementAdapter.java:36)
at org.apache.lucene.util.TestRuleAssertionsRequired$1.evaluate(TestRuleAssertionsRequired.java:53)
at org.apache.lucene.util.TestRuleMarkFailure$1.evaluate(TestRuleMarkFailure.java:47)
at org.apache.lucene.util.TestRuleIgnoreAfterMaxFailures$1.evaluate(TestRuleIgnoreAfterMaxFailures.java:64)
at org.apache.lucene.util.TestRuleIgnoreTestSuites$1.evaluate(TestRuleIgnoreTestSuites.java:54)
at com.carrotsearch.randomizedtesting.rules.StatementAdapter.evaluate(StatementAdapter.java:36)
at com.carrotsearch.randomizedtesting.ThreadLeakControl$StatementRunner.run(ThreadLeakControl.java:367)
at java.lang.Thread.run(Thread.java:745)
Caused by: org.apache.solr.client.solrj.SolrServerException: No live SolrServers available to handle this request:[http://127.0.0.1:41459/forceleader_test_collection_shard1_replica3]
at org.apache.solr.client.solrj.impl.LBHttpSolrClient.request(LBHttpSolrClient.java:383)
at org.apache.solr.client.solrj.impl.CloudSolrClient.directUpdate(CloudSolrClient.java:747)
... 49 more
Caused by: org.apache.solr.client.solrj.SolrServerException: Server refused connection at: http://127.0.0.1:41459/forceleader_test_collection_shard1_replica3
at org.apache.solr.client.solrj.impl.HttpSolrClient.executeMethod(HttpSolrClient.java:597)
at org.apache.solr.client.solrj.impl.HttpSolrClient.request(HttpSolrClient.java:259)
at org.apache.solr.client.solrj.impl.HttpSolrClient.request(HttpSolrClient.java:248)
at org.apache.solr.client.solrj.impl.LBHttpSolrClient.doRequest(LBHttpSolrClient.java:403)
at org.apache.solr.client.solrj.impl.LBHttpSolrClient.request(LBHttpSolrClient.java:372)
... 50 more
Caused by: java.net.ConnectException: Connection refused
at java.net.PlainSocketImpl.socketConnect(Native Method)
at java.net.AbstractPlainSocketImpl.doConnect(AbstractPlainSocketImpl.java:350)
at java.net.AbstractPlainSocketImpl.connectToAddress(AbstractPlainSocketImpl.java:206)
at java.net.AbstractPlainSocketImpl.connect(AbstractPlainSocketImpl.java:188)
at java.net.SocksSocketImpl.connect(SocksSocketImpl.java:392)
at java.net.Socket.connect(Socket.java:589)
at org.apache.http.conn.scheme.PlainSocketFactory.connectSocket(PlainSocketFactory.java:117)
at org.apache.http.impl.conn.DefaultClientConnectionOperator.openConnection(DefaultClientConnectionOperator.java:177)
at org.apache.http.impl.conn.ManagedClientConnectionImpl.open(ManagedClientConnectionImpl.java:304)
at org.apache.http.impl.client.DefaultRequestDirector.tryConnect(DefaultRequestDirector.java:611)
at org.apache.http.impl.client.DefaultRequestDirector.execute(DefaultRequestDirector.java:446)
at org.apache.http.impl.client.AbstractHttpClient.doExecute(AbstractHttpClient.java:882)
at org.apache.http.impl.client.CloseableHttpClient.execute(CloseableHttpClient.java:82)
at org.apache.http.impl.client.CloseableHttpClient.execute(CloseableHttpClient.java:107)
at org.apache.http.impl.client.CloseableHttpClient.execute(CloseableHttpClient.java:55)
at org.apache.solr.client.solrj.impl.HttpSolrClient.executeMethod(HttpSolrClient.java:495)
... 54 more
Build Log:
[...truncated 10656 lines...]
[junit4] Suite: org.apache.solr.cloud.ForceLeaderTest
[junit4] 2> Creating dataDir: /home/jenkins/workspace/Lucene-Solr-6.x-Linux/solr/build/solr-core/test/J0/temp/solr.cloud.ForceLeaderTest_96830BA02490A958-001/init-core-data-001
[junit4] 2> 0 INFO (SUITE-ForceLeaderTest-seed#[96830BA02490A958]-worker) [ ] o.e.j.u.log Logging initialized @1651ms
[junit4] 2> 5 INFO (SUITE-ForceLeaderTest-seed#[96830BA02490A958]-worker) [ ] o.a.s.SolrTestCaseJ4 Randomized ssl (false) and clientAuth (false) via: @org.apache.solr.SolrTestCaseJ4$SuppressSSL(bugUrl=https://issues.apache.org/jira/browse/SOLR-5776)
[junit4] 2> 12 INFO (SUITE-ForceLeaderTest-seed#[96830BA02490A958]-worker) [ ] o.a.s.BaseDistributedSearchTestCase Setting hostContext system property: /
[junit4] 2> 30 INFO (TEST-ForceLeaderTest.testReplicasInLIRNoLeader-seed#[96830BA02490A958]) [ ] o.a.s.c.ZkTestServer STARTING ZK TEST SERVER
[junit4] 2> 32 INFO (Thread-1) [ ] o.a.s.c.ZkTestServer client port:0.0.0.0/0.0.0.0:0
[junit4] 2> 32 INFO (Thread-1) [ ] o.a.s.c.ZkTestServer Starting server
[junit4] 2> 132 INFO (TEST-ForceLeaderTest.testReplicasInLIRNoLeader-seed#[96830BA02490A958]) [ ] o.a.s.c.ZkTestServer start zk server on port:40985
[junit4] 2> 166 INFO (TEST-ForceLeaderTest.testReplicasInLIRNoLeader-seed#[96830BA02490A958]) [ ] o.a.s.c.c.SolrZkClient Using default ZkCredentialsProvider
[junit4] 2> 207 INFO (TEST-ForceLeaderTest.testReplicasInLIRNoLeader-seed#[96830BA02490A958]) [ ] o.a.s.c.c.ConnectionManager Waiting for client to connect to ZooKeeper
[junit4] 2> 256 INFO (zkCallback-1-thread-1) [ ] o.a.s.c.c.ConnectionManager Watcher org.apache.solr.common.cloud.ConnectionManager@328811 name:ZooKeeperConnection Watcher:127.0.0.1:40985 got event WatchedEvent state:SyncConnected type:None path:null path:null type:None
[junit4] 2> 256 INFO (TEST-ForceLeaderTest.testReplicasInLIRNoLeader-seed#[96830BA02490A958]) [ ] o.a.s.c.c.ConnectionManager Client is connected to ZooKeeper
[junit4] 2> 259 INFO (TEST-ForceLeaderTest.testReplicasInLIRNoLeader-seed#[96830BA02490A958]) [ ] o.a.s.c.c.SolrZkClient Using default ZkACLProvider
[junit4] 2> 260 INFO (TEST-ForceLeaderTest.testReplicasInLIRNoLeader-seed#[96830BA02490A958]) [ ] o.a.s.c.c.SolrZkClient makePath: /solr
[junit4] 2> 283 INFO (TEST-ForceLeaderTest.testReplicasInLIRNoLeader-seed#[96830BA02490A958]) [ ] o.a.s.c.c.SolrZkClient Using default ZkCredentialsProvider
[junit4] 2> 284 INFO (TEST-ForceLeaderTest.testReplicasInLIRNoLeader-seed#[96830BA02490A958]) [ ] o.a.s.c.c.ConnectionManager Waiting for client to connect to ZooKeeper
[junit4] 2> 285 INFO (zkCallback-2-thread-1) [ ] o.a.s.c.c.ConnectionManager Watcher org.apache.solr.common.cloud.ConnectionManager@16cc8e name:ZooKeeperConnection Watcher:127.0.0.1:40985/solr got event WatchedEvent state:SyncConnected type:None path:null path:null type:None
[junit4] 2> 285 INFO (TEST-ForceLeaderTest.testReplicasInLIRNoLeader-seed#[96830BA02490A958]) [ ] o.a.s.c.c.ConnectionManager Client is connected to ZooKeeper
[junit4] 2> 286 INFO (TEST-ForceLeaderTest.testReplicasInLIRNoLeader-seed#[96830BA02490A958]) [ ] o.a.s.c.c.SolrZkClient Using default ZkACLProvider
[junit4] 2> 291 INFO (TEST-ForceLeaderTest.testReplicasInLIRNoLeader-seed#[96830BA02490A958]) [ ] o.a.s.c.c.SolrZkClient makePath: /collections/collection1
[junit4] 2> 297 INFO (TEST-ForceLeaderTest.testReplicasInLIRNoLeader-seed#[96830BA02490A958]) [ ] o.a.s.c.c.SolrZkClient makePath: /collections/collection1/shards
[junit4] 2> 300 INFO (TEST-ForceLeaderTest.testReplicasInLIRNoLeader-seed#[96830BA02490A958]) [ ] o.a.s.c.c.SolrZkClient makePath: /collections/control_collection
[junit4] 2> 303 INFO (TEST-ForceLeaderTest.testReplicasInLIRNoLeader-seed#[96830BA02490A958]) [ ] o.a.s.c.c.SolrZkClient makePath: /collections/control_collection/shards
[junit4] 2> 305 INFO (TEST-ForceLeaderTest.testReplicasInLIRNoLeader-seed#[96830BA02490A958]) [ ] o.a.s.c.AbstractZkTestCase put /home/jenkins/workspace/Lucene-Solr-6.x-Linux/solr/core/src/test-files/solr/collection1/conf/solrconfig-tlog.xml to /configs/conf1/solrconfig.xml
[junit4] 2> 318 INFO (TEST-ForceLeaderTest.testReplicasInLIRNoLeader-seed#[96830BA02490A958]) [ ] o.a.s.c.c.SolrZkClient makePath: /configs/conf1/solrconfig.xml
[junit4] 2> 322 INFO (TEST-ForceLeaderTest.testReplicasInLIRNoLeader-seed#[96830BA02490A958]) [ ] o.a.s.c.AbstractZkTestCase put /home/jenkins/workspace/Lucene-Solr-6.x-Linux/solr/core/src/test-files/solr/collection1/conf/schema.xml to /configs/conf1/schema.xml
[junit4] 2> 322 INFO (TEST-ForceLeaderTest.testReplicasInLIRNoLeader-seed#[96830BA02490A958]) [ ] o.a.s.c.c.SolrZkClient makePath: /configs/conf1/schema.xml
[junit4] 2> 324 INFO (TEST-ForceLeaderTest.testReplicasInLIRNoLeader-seed#[96830BA02490A958]) [ ] o.a.s.c.AbstractZkTestCase put /home/jenkins/workspace/Lucene-Solr-6.x-Linux/solr/core/src/test-files/solr/collection1/conf/solrconfig.snippet.randomindexconfig.xml to /configs/conf1/solrconfig.snippet.randomindexconfig.xml
[junit4] 2> 325 INFO (TEST-ForceLeaderTest.testReplicasInLIRNoLeader-seed#[96830BA02490A958]) [ ] o.a.s.c.c.SolrZkClient makePath: /configs/conf1/solrconfig.snippet.randomindexconfig.xml
[junit4] 2> 328 INFO (TEST-ForceLeaderTest.testReplicasInLIRNoLeader-seed#[96830BA02490A958]) [ ] o.a.s.c.AbstractZkTestCase put /home/jenkins/workspace/Lucene-Solr-6.x-Linux/solr/core/src/test-files/solr/collection1/conf/stopwords.txt to /configs/conf1/stopwords.txt
[junit4] 2> 328 INFO (TEST-ForceLeaderTest.testReplicasInLIRNoLeader-seed#[96830BA02490A958]) [ ] o.a.s.c.c.SolrZkClient makePath: /configs/conf1/stopwords.txt
[junit4] 2> 331 INFO (TEST-ForceLeaderTest.testReplicasInLIRNoLeader-seed#[96830BA02490A958]) [ ] o.a.s.c.AbstractZkTestCase put /home/jenkins/workspace/Lucene-Solr-6.x-Linux/solr/core/src/test-files/solr/collection1/conf/protwords.txt to /configs/conf1/protwords.txt
[junit4] 2> 331 INFO (TEST-ForceLeaderTest.testReplicasInLIRNoLeader-seed#[96830BA02490A958]) [ ] o.a.s.c.c.SolrZkClient makePath: /configs/conf1/protwords.txt
[junit4] 2> 334 INFO (TEST-ForceLeaderTest.testReplicasInLIRNoLeader-seed#[96830BA02490A958]) [ ] o.a.s.c.AbstractZkTestCase put /home/jenkins/workspace/Lucene-Solr-6.x-Linux/solr/core/src/test-files/solr/collection1/conf/currency.xml to /configs/conf1/currency.xml
[junit4] 2> 334 INFO (TEST-ForceLeaderTest.testReplicasInLIRNoLeader-seed#[96830BA02490A958]) [ ] o.a.s.c.c.SolrZkClient makePath: /configs/conf1/currency.xml
[junit4] 2> 336 INFO (TEST-ForceLeaderTest.testReplicasInLIRNoLeader-seed#[96830BA02490A958]) [ ] o.a.s.c.AbstractZkTestCase put /home/jenkins/workspace/Lucene-Solr-6.x-Linux/solr/core/src/test-files/solr/collection1/conf/enumsConfig.xml to /configs/conf1/enumsConfig.xml
[junit4] 2> 336 INFO (TEST-ForceLeaderTest.testReplicasInLIRNoLeader-seed#[96830BA02490A958]) [ ] o.a.s.c.c.SolrZkClient makePath: /configs/conf1/enumsConfig.xml
[junit4] 2> 339 INFO (TEST-ForceLeaderTest.testReplicasInLIRNoLeader-seed#[96830BA02490A958]) [ ] o.a.s.c.AbstractZkTestCase put /home/jenkins/workspace/Lucene-Solr-6.x-Linux/solr/core/src/test-files/solr/collection1/conf/open-exchange-rates.json to /configs/conf1/open-exchange-rates.json
[junit4] 2> 339 INFO (TEST-ForceLeaderTest.testReplicasInLIRNoLeader-seed#[96830BA02490A958]) [ ] o.a.s.c.c.SolrZkClient makePath: /configs/conf1/open-exchange-rates.json
[junit4] 2> 342 INFO (TEST-ForceLeaderTest.testReplicasInLIRNoLeader-seed#[96830BA02490A958]) [ ] o.a.s.c.AbstractZkTestCase put /home/jenkins/workspace/Lucene-Solr-6.x-Linux/solr/core/src/test-files/solr/collection1/conf/mapping-ISOLatin1Accent.txt to /configs/conf1/mapping-ISOLatin1Accent.txt
[junit4] 2> 342 INFO (TEST-ForceLeaderTest.testReplicasInLIRNoLeader-seed#[96830BA02490A958]) [ ] o.a.s.c.c.SolrZkClient makePath: /configs/conf1/mapping-ISOLatin1Accent.txt
[junit4] 2> 344 INFO (TEST-ForceLeaderTest.testReplicasInLIRNoLeader-seed#[96830BA02490A958]) [ ] o.a.s.c.AbstractZkTestCase put /home/jenkins/workspace/Lucene-Solr-6.x-Linux/solr/core/src/test-files/solr/collection1/conf/old_synonyms.txt to /configs/conf1/old_synonyms.txt
[junit4] 2> 345 INFO (TEST-ForceLeaderTest.testReplicasInLIRNoLeader-seed#[96830BA02490A958]) [ ] o.a.s.c.c.SolrZkClient makePath: /configs/conf1/old_synonyms.txt
[junit4] 2> 347 INFO (TEST-ForceLeaderTest.testReplicasInLIRNoLeader-seed#[96830BA02490A958]) [ ] o.a.s.c.AbstractZkTestCase put /home/jenkins/workspace/Lucene-Solr-6.x-Linux/solr/core/src/test-files/solr/collection1/conf/synonyms.txt to /configs/conf1/synonyms.txt
[junit4] 2> 347 INFO (TEST-ForceLeaderTest.testReplicasInLIRNoLeader-seed#[96830BA02490A958]) [ ] o.a.s.c.c.SolrZkClient makePath: /configs/conf1/synonyms.txt
[junit4] 2> 441 INFO (TEST-ForceLeaderTest.testReplicasInLIRNoLeader-seed#[96830BA02490A958]) [ ] o.a.s.SolrTestCaseJ4 Writing core.properties file to /home/jenkins/workspace/Lucene-Solr-6.x-Linux/solr/build/solr-core/test/J0/temp/solr.cloud.ForceLeaderTest_96830BA02490A958-001/control-001/cores/collection1
[junit4] 2> 606 INFO (TEST-ForceLeaderTest.testReplicasInLIRNoLeader-seed#[96830BA02490A958]) [ ] o.e.j.s.Server jetty-9.3.8.v20160314
[junit4] 2> 640 INFO (TEST-ForceLeaderTest.testReplicasInLIRNoLeader-seed#[96830BA02490A958]) [ ] o.e.j.s.h.ContextHandler Started o.e.j.s.ServletContextHandler@b0203{/,null,AVAILABLE}
[junit4] 2> 651 INFO (TEST-ForceLeaderTest.testReplicasInLIRNoLeader-seed#[96830BA02490A958]) [ ] o.e.j.s.ServerConnector Started ServerConnector@468863{HTTP/1.1,[http/1.1]}{127.0.0.1:42447}
[junit4] 2> 651 INFO (TEST-ForceLeaderTest.testReplicasInLIRNoLeader-seed#[96830BA02490A958]) [ ] o.e.j.s.Server Started @2309ms
[junit4] 2> 652 INFO (TEST-ForceLeaderTest.testReplicasInLIRNoLeader-seed#[96830BA02490A958]) [ ] o.a.s.c.s.e.JettySolrRunner Jetty properties: {solr.data.dir=/home/jenkins/workspace/Lucene-Solr-6.x-Linux/solr/build/solr-core/test/J0/temp/solr.cloud.ForceLeaderTest_96830BA02490A958-001/tempDir-001/control/data, hostContext=/, hostPort=45713, coreRootDirectory=/home/jenkins/workspace/Lucene-Solr-6.x-Linux/solr/build/solr-core/test/J0/temp/solr.cloud.ForceLeaderTest_96830BA02490A958-001/control-001/cores}
[junit4] 2> 664 INFO (TEST-ForceLeaderTest.testReplicasInLIRNoLeader-seed#[96830BA02490A958]) [ ] o.a.s.s.SolrDispatchFilter SolrDispatchFilter.init(): sun.misc.Launcher$AppClassLoader@1d16e93
[junit4] 2> 683 INFO (TEST-ForceLeaderTest.testReplicasInLIRNoLeader-seed#[96830BA02490A958]) [ ] o.a.s.c.SolrResourceLoader new SolrResourceLoader for directory: '/home/jenkins/workspace/Lucene-Solr-6.x-Linux/solr/build/solr-core/test/J0/temp/solr.cloud.ForceLeaderTest_96830BA02490A958-001/control-001'
[junit4] 2> 686 INFO (TEST-ForceLeaderTest.testReplicasInLIRNoLeader-seed#[96830BA02490A958]) [ ] o.a.s.c.SolrResourceLoader JNDI not configured for solr (NoInitialContextEx)
[junit4] 2> 686 INFO (TEST-ForceLeaderTest.testReplicasInLIRNoLeader-seed#[96830BA02490A958]) [ ] o.a.s.c.SolrResourceLoader solr home defaulted to 'solr/' (could not find system property or JNDI)
[junit4] 2> 690 INFO (TEST-ForceLeaderTest.testReplicasInLIRNoLeader-seed#[96830BA02490A958]) [ ] o.a.s.c.c.SolrZkClient Using default ZkCredentialsProvider
[junit4] 2> 690 INFO (TEST-ForceLeaderTest.testReplicasInLIRNoLeader-seed#[96830BA02490A958]) [ ] o.a.s.c.c.ConnectionManager Waiting for client to connect to ZooKeeper
[junit4] 2> 693 INFO (zkCallback-3-thread-1) [ ] o.a.s.c.c.ConnectionManager Watcher org.apache.solr.common.cloud.ConnectionManager@11aa934 name:ZooKeeperConnection Watcher:127.0.0.1:40985/solr got event WatchedEvent state:SyncConnected type:None path:null path:null type:None
[junit4] 2> 693 INFO (TEST-ForceLeaderTest.testReplicasInLIRNoLeader-seed#[96830BA02490A958]) [ ] o.a.s.c.c.ConnectionManager Client is connected to ZooKeeper
[junit4] 2> 693 INFO (TEST-ForceLeaderTest.testReplicasInLIRNoLeader-seed#[96830BA02490A958]) [ ] o.a.s.c.c.SolrZkClient Using default ZkACLProvider
[junit4] 2> 694 INFO (TEST-ForceLeaderTest.testReplicasInLIRNoLeader-seed#[96830BA02490A958]) [ ] o.a.s.s.SolrDispatchFilter Loading solr.xml from SolrHome (not found in ZooKeeper)
[junit4] 2> 696 INFO (TEST-ForceLeaderTest.testReplicasInLIRNoLeader-seed#[96830BA02490A958]) [ ] o.a.s.c.SolrXmlConfig Loading container configuration from /home/jenkins/workspace/Lucene-Solr-6.x-Linux/solr/build/solr-core/test/J0/temp/solr.cloud.ForceLeaderTest_96830BA02490A958-001/control-001/solr.xml
[junit4] 2> 771 INFO (TEST-ForceLeaderTest.testReplicasInLIRNoLeader-seed#[96830BA02490A958]) [ ] o.a.s.c.CorePropertiesLocator Config-defined core root directory: /home/jenkins/workspace/Lucene-Solr-6.x-Linux/solr/build/solr-core/test/J0/temp/solr.cloud.ForceLeaderTest_96830BA02490A958-001/control-001/cores
[junit4] 2> 811 INFO (TEST-ForceLeaderTest.testReplicasInLIRNoLeader-seed#[96830BA02490A958]) [ ] o.a.s.c.CoreContainer New CoreContainer 5556847
[junit4] 2> 811 INFO (TEST-ForceLeaderTest.testReplicasInLIRNoLeader-seed#[96830BA02490A958]) [ ] o.a.s.c.CoreContainer Loading cores into CoreContainer [instanceDir=/home/jenkins/workspace/Lucene-Solr-6.x-Linux/solr/build/solr-core/test/J0/temp/solr.cloud.ForceLeaderTest_96830BA02490A958-001/control-001]
[junit4] 2> 812 WARN (TEST-ForceLeaderTest.testReplicasInLIRNoLeader-seed#[96830BA02490A958]) [ ] o.a.s.c.CoreContainer Couldn't add files from /home/jenkins/workspace/Lucene-Solr-6.x-Linux/solr/build/solr-core/test/J0/temp/solr.cloud.ForceLeaderTest_96830BA02490A958-001/control-001/lib to classpath: /home/jenkins/workspace/Lucene-Solr-6.x-Linux/solr/build/solr-core/test/J0/temp/solr.cloud.ForceLeaderTest_96830BA02490A958-001/control-001/lib
[junit4] 2> 829 INFO (TEST-ForceLeaderTest.testReplicasInLIRNoLeader-seed#[96830BA02490A958]) [ ] o.a.s.h.c.HttpShardHandlerFactory created with socketTimeout : 90000,urlScheme : ,connTimeout : 15000,maxConnectionsPerHost : 20,maxConnections : 10000,corePoolSize : 0,maximumPoolSize : 2147483647,maxThreadIdleTime : 5,sizeOfQueue : -1,fairnessPolicy : false,useRetries : false,connectionsEvictorSleepDelay : 5000,maxConnectionIdleTime : 40000,
[junit4] 2> 972 INFO (TEST-ForceLeaderTest.testReplicasInLIRNoLeader-seed#[96830BA02490A958]) [ ] o.a.s.u.UpdateShardHandler Creating UpdateShardHandler HTTP client with params: socketTimeout=340000&connTimeout=45000&retry=true
[junit4] 2> 975 INFO (TEST-ForceLeaderTest.testReplicasInLIRNoLeader-seed#[96830BA02490A958]) [ ] o.a.s.l.LogWatcher SLF4J impl is org.slf4j.impl.Log4jLoggerFactory
[junit4] 2> 976 INFO (TEST-ForceLeaderTest.testReplicasInLIRNoLeader-seed#[96830BA02490A958]) [ ] o.a.s.l.LogWatcher Registering Log Listener [Log4j (org.slf4j.impl.Log4jLoggerFactory)]
[junit4] 2> 977 INFO (TEST-ForceLeaderTest.testReplicasInLIRNoLeader-seed#[96830BA02490A958]) [ ] o.a.s.c.ZkContainer Zookeeper client=127.0.0.1:40985/solr
[junit4] 2> 987 INFO (TEST-ForceLeaderTest.testReplicasInLIRNoLeader-seed#[96830BA02490A958]) [ ] o.a.s.c.ZkController zkHost includes chroot
[junit4] 2> 987 INFO (TEST-ForceLeaderTest.testReplicasInLIRNoLeader-seed#[96830BA02490A958]) [ ] o.a.s.c.c.SolrZkClient Using default ZkCredentialsProvider
[junit4] 2> 988 INFO (TEST-ForceLeaderTest.testReplicasInLIRNoLeader-seed#[96830BA02490A958]) [ ] o.a.s.c.c.ConnectionManager Waiting for client to connect to ZooKeeper
[junit4] 2> 990 INFO (zkCallback-6-thread-1) [ ] o.a.s.c.c.ConnectionManager Watcher org.apache.solr.common.cloud.ConnectionManager@4af057 name:ZooKeeperConnection Watcher:127.0.0.1:40985 got event WatchedEvent state:SyncConnected type:None path:null path:null type:None
[junit4] 2> 990 INFO (TEST-ForceLeaderTest.testReplicasInLIRNoLeader-seed#[96830BA02490A958]) [ ] o.a.s.c.c.ConnectionManager Client is connected to ZooKeeper
[junit4] 2> 990 INFO (TEST-ForceLeaderTest.testReplicasInLIRNoLeader-seed#[96830BA02490A958]) [ ] o.a.s.c.c.SolrZkClient Using default ZkACLProvider
[junit4] 2> 994 INFO (TEST-ForceLeaderTest.testReplicasInLIRNoLeader-seed#[96830BA02490A958]) [n:127.0.0.1:45713_ ] o.a.s.c.ZkController Added new OnReconnect listener org.apache.solr.cloud.ZkController$$Lambda$10/19246365@1a9590b
[junit4] 2> 996 INFO (TEST-ForceLeaderTest.testReplicasInLIRNoLeader-seed#[96830BA02490A958]) [n:127.0.0.1:45713_ ] o.a.s.c.c.ConnectionManager Waiting for client to connect to ZooKeeper
[junit4] 2> 999 INFO (zkCallback-7-thread-1-processing-n:127.0.0.1:45713_) [n:127.0.0.1:45713_ ] o.a.s.c.c.ConnectionManager Watcher org.apache.solr.common.cloud.ConnectionManager@507cff name:ZooKeeperConnection Watcher:127.0.0.1:40985/solr got event WatchedEvent state:SyncConnected type:None path:null path:null type:None
[junit4] 2> 999 INFO (TEST-ForceLeaderTest.testReplicasInLIRNoLeader-seed#[96830BA02490A958]) [n:127.0.0.1:45713_ ] o.a.s.c.c.ConnectionManager Client is connected to ZooKeeper
[junit4] 2> 1010 INFO (TEST-ForceLeaderTest.testReplicasInLIRNoLeader-seed#[96830BA02490A958]) [n:127.0.0.1:45713_ ] o.a.s.c.c.SolrZkClient makePath: /overseer/queue
[junit4] 2> 1016 INFO (TEST-ForceLeaderTest.testReplicasInLIRNoLeader-seed#[96830BA02490A958]) [n:127.0.0.1:45713_ ] o.a.s.c.c.SolrZkClient makePath: /overseer/collection-queue-work
[junit4] 2> 1019 INFO (TEST-ForceLeaderTest.testReplicasInLIRNoLeader-seed#[96830BA02490A958]) [n:127.0.0.1:45713_ ] o.a.s.c.c.SolrZkClient makePath: /overseer/collection-map-running
[junit4] 2> 1023 INFO (TEST-ForceLeaderTest.testReplicasInLIRNoLeader-seed#[96830BA02490A958]) [n:127.0.0.1:45713_ ] o.a.s.c.c.SolrZkClient makePath: /overseer/collection-map-completed
[junit4] 2> 1025 INFO (TEST-ForceLeaderTest.testReplicasInLIRNoLeader-seed#[96830BA02490A958]) [n:127.0.0.1:45713_ ] o.a.s.c.c.SolrZkClient makePath: /overseer/collection-map-failure
[junit4] 2> 1031 INFO (TEST-ForceLeaderTest.testReplicasInLIRNoLeader-seed#[96830BA02490A958]) [n:127.0.0.1:45713_ ] o.a.s.c.c.SolrZkClient makePath: /live_nodes
[junit4] 2> 1033 INFO (TEST-ForceLeaderTest.testReplicasInLIRNoLeader-seed#[96830BA02490A958]) [n:127.0.0.1:45713_ ] o.a.s.c.c.SolrZkClient makePath: /aliases.json
[junit4] 2> 1035 INFO (TEST-ForceLeaderTest.testReplicasInLIRNoLeader-seed#[96830BA02490A958]) [n:127.0.0.1:45713_ ] o.a.s.c.c.SolrZkClient makePath: /clusterstate.json
[junit4] 2> 1036 INFO (TEST-ForceLeaderTest.testReplicasInLIRNoLeader-seed#[96830BA02490A958]) [n:127.0.0.1:45713_ ] o.a.s.c.c.SolrZkClient makePath: /security.json
[junit4] 2> 1037 INFO (TEST-ForceLeaderTest.testReplicasInLIRNoLeader-seed#[96830BA02490A958]) [n:127.0.0.1:45713_ ] o.a.s.c.c.ZkStateReader Updating cluster state from ZooKeeper...
[junit4] 2> 1039 INFO (TEST-ForceLeaderTest.testReplicasInLIRNoLeader-seed#[96830BA02490A958]) [n:127.0.0.1:45713_ ] o.a.s.c.c.ZkStateReader Loaded empty cluster properties
[junit4] 2> 1042 INFO (TEST-ForceLeaderTest.testReplicasInLIRNoLeader-seed#[96830BA02490A958]) [n:127.0.0.1:45713_ ] o.a.s.c.c.ZkStateReader Updated live nodes from ZooKeeper... (0) -> (0)
[junit4] 2> 1058 INFO (TEST-ForceLeaderTest.testReplicasInLIRNoLeader-seed#[96830BA02490A958]) [n:127.0.0.1:45713_ ] o.a.s.c.c.SolrZkClient makePath: /overseer_elect
[junit4] 2> 1059 INFO (TEST-ForceLeaderTest.testReplicasInLIRNoLeader-seed#[96830BA02490A958]) [n:127.0.0.1:45713_ ] o.a.s.c.c.SolrZkClient makePath: /overseer_elect/election
[junit4] 2> 1061 INFO (TEST-ForceLeaderTest.testReplicasInLIRNoLeader-seed#[96830BA02490A958]) [n:127.0.0.1:45713_ ] o.a.s.c.Overseer Overseer (id=null) closing
[junit4] 2> 1061 INFO (TEST-ForceLeaderTest.testReplicasInLIRNoLeader-seed#[96830BA02490A958]) [n:127.0.0.1:45713_ ] o.a.s.c.LeaderElector Joined leadership election with path: /overseer_elect/election/96250284720783364-127.0.0.1:45713_-n_0000000000
[junit4] 2> 1062 INFO (TEST-ForceLeaderTest.testReplicasInLIRNoLeader-seed#[96830BA02490A958]) [n:127.0.0.1:45713_ ] o.a.s.c.OverseerElectionContext I am going to be the leader 127.0.0.1:45713_
[junit4] 2> 1062 INFO (TEST-ForceLeaderTest.testReplicasInLIRNoLeader-seed#[96830BA02490A958]) [n:127.0.0.1:45713_ ] o.a.s.c.c.SolrZkClient makePath: /overseer_elect/leader
[junit4] 2> 1064 INFO (TEST-ForceLeaderTest.testReplicasInLIRNoLeader-seed#[96830BA02490A958]) [n:127.0.0.1:45713_ ] o.a.s.c.Overseer Overseer (id=96250284720783364-127.0.0.1:45713_-n_0000000000) starting
[junit4] 2> 1067 INFO (TEST-ForceLeaderTest.testReplicasInLIRNoLeader-seed#[96830BA02490A958]) [n:127.0.0.1:45713_ ] o.a.s.c.c.SolrZkClient makePath: /overseer/queue-work
[junit4] 2> 1101 INFO (TEST-ForceLeaderTest.testReplicasInLIRNoLeader-seed#[96830BA02490A958]) [n:127.0.0.1:45713_ ] o.a.s.c.OverseerAutoReplicaFailoverThread Starting OverseerAutoReplicaFailoverThread autoReplicaFailoverWorkLoopDelay=10000 autoReplicaFailoverWaitAfterExpiration=10000 autoReplicaFailoverBadNodeExpiration=60000
[junit4] 2> 1160 INFO (OverseerCollectionConfigSetProcessor-96250284720783364-127.0.0.1:45713_-n_0000000000) [n:127.0.0.1:45713_ ] o.a.s.c.OverseerTaskProcessor Process current queue of overseer operations
[junit4] 2> 1161 INFO (TEST-ForceLeaderTest.testReplicasInLIRNoLeader-seed#[96830BA02490A958]) [n:127.0.0.1:45713_ ] o.a.s.c.ZkController Register node as live in ZooKeeper:/live_nodes/127.0.0.1:45713_
[junit4] 2> 1161 INFO (TEST-ForceLeaderTest.testReplicasInLIRNoLeader-seed#[96830BA02490A958]) [n:127.0.0.1:45713_ ] o.a.s.c.c.SolrZkClient makePath: /live_nodes/127.0.0.1:45713_
[junit4] 2> 1164 INFO (zkCallback-7-thread-1-processing-n:127.0.0.1:45713_) [n:127.0.0.1:45713_ ] o.a.s.c.c.ZkStateReader A live node change: [WatchedEvent state:SyncConnected type:NodeChildrenChanged path:/live_nodes], has occurred - updating... (live nodes size: [0])
[junit4] 2> 1164 INFO (zkCallback-7-thread-1-processing-n:127.0.0.1:45713_) [n:127.0.0.1:45713_ ] o.a.s.c.c.ZkStateReader Updated live nodes from ZooKeeper... (0) -> (1)
[junit4] 2> 1172 INFO (OverseerStateUpdate-96250284720783364-127.0.0.1:45713_-n_0000000000) [n:127.0.0.1:45713_ ] o.a.s.c.Overseer Starting to work on the main queue
[junit4] 2> 1173 INFO (OverseerStateUpdate-96250284720783364-127.0.0.1:45713_-n_0000000000) [n:127.0.0.1:45713_ ] o.a.s.c.c.ZkStateReader Updated live nodes from ZooKeeper... (1) -> (1)
[junit4] 2> 1209 INFO (TEST-ForceLeaderTest.testReplicasInLIRNoLeader-seed#[96830BA02490A958]) [n:127.0.0.1:45713_ ] o.a.s.c.CoreContainer Security conf doesn't exist. Skipping setup for authorization module.
[junit4] 2> 1209 INFO (TEST-ForceLeaderTest.testReplicasInLIRNoLeader-seed#[96830BA02490A958]) [n:127.0.0.1:45713_ ] o.a.s.c.CoreContainer No authentication plugin used.
[junit4] 2> 1256 INFO (TEST-ForceLeaderTest.testReplicasInLIRNoLeader-seed#[96830BA02490A958]) [n:127.0.0.1:45713_ ] o.a.s.c.CorePropertiesLocator Looking for core definitions underneath /home/jenkins/workspace/Lucene-Solr-6.x-Linux/solr/build/solr-core/test/J0/temp/solr.cloud.ForceLeaderTest_96830BA02490A958-001/control-001/cores
[junit4] 2> 1261 INFO (TEST-ForceLeaderTest.testReplicasInLIRNoLeader-seed#[96830BA02490A958]) [n:127.0.0.1:45713_ ] o.a.s.c.CoreDescriptor Created CoreDescriptor: {name=collection1, config=solrconfig.xml, transient=false, schema=schema.xml, loadOnStartup=true, configSetProperties=configsetprops.json, collection=control_collection, coreNodeName=, dataDir=data/, shard=}
[junit4] 2> 1261 INFO (TEST-ForceLeaderTest.testReplicasInLIRNoLeader-seed#[96830BA02490A958]) [n:127.0.0.1:45713_ ] o.a.s.c.CorePropertiesLocator Found core collection1 in /home/jenkins/workspace/Lucene-Solr-6.x-Linux/solr/build/solr-core/test/J0/temp/solr.cloud.ForceLeaderTest_96830BA02490A958-001/control-001/cores/collection1
[junit4] 2> 1262 INFO (TEST-ForceLeaderTest.testReplicasInLIRNoLeader-seed#[96830BA02490A958]) [n:127.0.0.1:45713_ ] o.a.s.c.CorePropertiesLocator Found 1 core definitions
[junit4] 2> 1265 INFO (TEST-ForceLeaderTest.testReplicasInLIRNoLeader-seed#[96830BA02490A958]) [n:127.0.0.1:45713_ ] o.a.s.s.SolrDispatchFilter user.dir=/home/jenkins/workspace/Lucene-Solr-6.x-Linux/solr/build/solr-core/test/J0
[junit4] 2> 1266 INFO (TEST-ForceLeaderTest.testReplicasInLIRNoLeader-seed#[96830BA02490A958]) [n:127.0.0.1:45713_ ] o.a.s.s.SolrDispatchFilter SolrDispatchFilter.init() done
[junit4] 2> 1266 INFO (coreLoadExecutor-7-thread-1-processing-n:127.0.0.1:45713_) [n:127.0.0.1:45713_ c:control_collection x:collection1] o.a.s.c.ZkController publishing state=down
[junit4] 2> 1266 INFO (coreLoadExecutor-7-thread-1-processing-n:127.0.0.1:45713_) [n:127.0.0.1:45713_ c:control_collection x:collection1] o.a.s.c.ZkController numShards not found on descriptor - reading it from system property
[junit4] 2> 1268 INFO (coreLoadExecutor-7-thread-1-processing-n:127.0.0.1:45713_) [n:127.0.0.1:45713_ c:control_collection x:collection1] o.a.s.c.ZkController Collection control_collection not visible yet, but flagging it so a watch is registered when it becomes visible
[junit4] 2> 1268 INFO (OverseerStateUpdate-96250284720783364-127.0.0.1:45713_-n_0000000000) [n:127.0.0.1:45713_ ] o.a.s.c.Overseer processMessage: queueSize: 1, message = {
[junit4] 2> "core":"collection1",
[junit4] 2> "roles":null,
[junit4] 2> "base_url":"http://127.0.0.1:45713",
[junit4] 2> "node_name":"127.0.0.1:45713_",
[junit4] 2> "numShards":"1",
[junit4] 2> "state":"down",
[junit4] 2> "shard":null,
[junit4] 2> "collection":"control_collection",
[junit4] 2> "operation":"state"} current state version: 0
[junit4] 2> 1270 INFO (coreLoadExecutor-7-thread-1-processing-n:127.0.0.1:45713_) [n:127.0.0.1:45713_ c:control_collection x:collection1] o.a.s.c.c.ZkStateReader Deleting data for [control_collection]
[junit4] 2> 1280 INFO (coreLoadExecutor-7-thread-1-processing-n:127.0.0.1:45713_) [n:127.0.0.1:45713_ c:control_collection x:collection1] o.a.s.c.ZkController look for our core node name
[junit4] 2> 1310 INFO (OverseerStateUpdate-96250284720783364-127.0.0.1:45713_-n_0000000000) [n:127.0.0.1:45713_ ] o.a.s.c.o.ReplicaMutator Update state numShards=1 message={
[junit4] 2> "core":"collection1",
[junit4] 2> "roles":null,
[junit4] 2> "base_url":"http://127.0.0.1:45713",
[junit4] 2> "node_name":"127.0.0.1:45713_",
[junit4] 2> "numShards":"1",
[junit4] 2> "state":"down",
[junit4] 2> "shard":null,
[junit4] 2> "collection":"control_collection",
[junit4] 2> "operation":"state"}
[junit4] 2> 1312 INFO (OverseerStateUpdate-96250284720783364-127.0.0.1:45713_-n_0000000000) [n:127.0.0.1:45713_ ] o.a.s.c.o.ClusterStateMutator building a new cName: control_collection
[junit4] 2> 1319 INFO (OverseerStateUpdate-96250284720783364-127.0.0.1:45713_-n_0000000000) [n:127.0.0.1:45713_ ] o.a.s.c.o.ReplicaMutator Assigning new node to shard shard=shard1
[junit4] 2> 1323 INFO (zkCallback-7-thread-1-processing-n:127.0.0.1:45713_) [n:127.0.0.1:45713_ ] o.a.s.c.c.ZkStateReader A cluster state change: [WatchedEvent state:SyncConnected type:NodeDataChanged path:/clusterstate.json], has occurred - updating... (live nodes size: [1])
[junit4] 2> 2281 INFO (coreLoadExecutor-7-thread-1-processing-n:127.0.0.1:45713_) [n:127.0.0.1:45713_ c:control_collection x:collection1] o.a.s.c.ZkController waiting to find shard id in clusterstate for collection1
[junit4] 2> 2281 INFO (coreLoadExecutor-7-thread-1-processing-n:127.0.0.1:45713_) [n:127.0.0.1:45713_ c:control_collection x:collection1] o.a.s.c.ZkController Check for collection zkNode:control_collection
[junit4] 2> 2282 INFO (coreLoadExecutor-7-thread-1-processing-n:127.0.0.1:45713_) [n:127.0.0.1:45713_ c:control_collection x:collection1] o.a.s.c.ZkController Collection zkNode exists
[junit4] 2> 2282 INFO (coreLoadExecutor-7-thread-1-processing-n:127.0.0.1:45713_) [n:127.0.0.1:45713_ c:control_collection x:collection1] o.a.s.c.c.ZkStateReader Load collection config from: [/collections/control_collection]
[junit4] 2> 2283 INFO (coreLoadExecutor-7-thread-1-processing-n:127.0.0.1:45713_) [n:127.0.0.1:45713_ c:control_collection x:collection1] o.a.s.c.c.ZkStateReader path=[/collections/control_collection] [configName]=[conf1] specified config exists in ZooKeeper
[junit4] 2> 2284 INFO (coreLoadExecutor-7-thread-1-processing-n:127.0.0.1:45713_) [n:127.0.0.1:45713_ c:control_collection x:collection1] o.a.s.c.SolrResourceLoader new SolrResourceLoader for directory: '/home/jenkins/workspace/Lucene-Solr-6.x-Linux/solr/build/solr-core/test/J0/temp/solr.cloud.ForceLeaderTest_96830BA02490A958-001/control-001/cores/collection1'
[junit4] 2> 2284 INFO (coreLoadExecutor-7-thread-1-processing-n:127.0.0.1:45713_) [n:127.0.0.1:45713_ c:control_collection x:collection1] o.a.s.c.SolrResourceLoader JNDI not configured for solr (NoInitialContextEx)
[junit4] 2> 2284 INFO (coreLoadExecutor-7-thread-1-processing-n:127.0.0.1:45713_) [n:127.0.0.1:45713_ c:control_collection x:collection1] o.a.s.c.SolrResourceLoader solr home defaulted to 'solr/' (could not find system property or JNDI)
[junit4] 2> 2286 INFO (coreLoadExecutor-7-thread-1-processing-n:127.0.0.1:45713_) [n:127.0.0.1:45713_ c:control_collection x:collection1] o.a.s.c.Config loaded config solrconfig.xml with version 0
[junit4] 2> 2308 INFO (coreLoadExecutor-7-thread-1-processing-n:127.0.0.1:45713_) [n:127.0.0.1:45713_ c:control_collection x:collection1] o.a.s.c.SolrConfig current version of requestparams : -1
[junit4] 2> 2324 INFO (coreLoadExecutor-7-thread-1-processing-n:127.0.0.1:45713_) [n:127.0.0.1:45713_ c:control_collection x:collection1] o.a.s.c.SolrConfig Using Lucene MatchVersion: 6.2.0
[junit4] 2> 2379 INFO (coreLoadExecutor-7-thread-1-processing-n:127.0.0.1:45713_) [n:127.0.0.1:45713_ c:control_collection x:collection1] o.a.s.c.SolrConfig Loaded SolrConfig: solrconfig.xml
[junit4] 2> 2443 INFO (coreLoadExecutor-7-thread-1-processing-n:127.0.0.1:45713_) [n:127.0.0.1:45713_ c:control_collection x:collection1] o.a.s.s.IndexSchema [collection1] Schema name=test
[junit4] 2> 2884 INFO (coreLoadExecutor-7-thread-1-processing-n:127.0.0.1:45713_) [n:127.0.0.1:45713_ c:control_collection x:collection1] o.a.s.s.OpenExchangeRatesOrgProvider Initialized with rates=open-exchange-rates.json, refreshInterval=1440.
[junit4] 2> 2901 INFO (coreLoadExecutor-7-thread-1-processing-n:127.0.0.1:45713_) [n:127.0.0.1:45713_ c:control_collection x:collection1] o.a.s.s.IndexSchema default search field in schema is text
[junit4] 2> 2903 INFO (coreLoadExecutor-7-thread-1-processing-n:127.0.0.1:45713_) [n:127.0.0.1:45713_ c:control_collection x:collection1] o.a.s.s.IndexSchema unique key field: id
[junit4] 2> 3019 INFO (coreLoadExecutor-7-thread-1-processing-n:127.0.0.1:45713_) [n:127.0.0.1:45713_ c:control_collection x:collection1] o.a.s.s.FileExchangeRateProvider Reloading exchange rates from file currency.xml
[junit4] 2> 3022 INFO (coreLoadExecutor-7-thread-1-processing-n:127.0.0.1:45713_) [n:127.0.0.1:45713_ c:control_collection x:collection1] o.a.s.s.FileExchangeRateProvider Reloading exchange rates from file currency.xml
[junit4] 2> 3028 INFO (coreLoadExecutor-7-thread-1-processing-n:127.0.0.1:45713_) [n:127.0.0.1:45713_ c:control_collection x:collection1] o.a.s.s.OpenExchangeRatesOrgProvider Reloading exchange rates from open-exchange-rates.json
[junit4] 2> 3030 INFO (coreLoadExecutor-7-thread-1-processing-n:127.0.0.1:45713_) [n:127.0.0.1:45713_ c:control_collection x:collection1] o.a.s.s.OpenExchangeRatesOrgProvider Reloading exchange rates from open-exchange-rates.json
[junit4] 2> 3033 INFO (coreLoadExecutor-7-thread-1-processing-n:127.0.0.1:45713_) [n:127.0.0.1:45713_ c:control_collection x:collection1] o.a.s.c.ConfigSetProperties Did not find ConfigSet properties, assuming default properties: Can't find resource 'configsetprops.json' in classpath or '/configs/conf1', cwd=/home/jenkins/workspace/Lucene-Solr-6.x-Linux/solr/build/solr-core/test/J0
[junit4] 2> 3033 INFO (coreLoadExecutor-7-thread-1-processing-n:127.0.0.1:45713_) [n:127.0.0.1:45713_ c:control_collection x:collection1] o.a.s.c.CoreContainer Creating SolrCore 'collection1' using configuration from collection control_collection
[junit4] 2> 3062 INFO (coreLoadExecutor-7-thread-1-processing-n:127.0.0.1:45713_) [n:127.0.0.1:45713_ c:control_collection s:shard1 r:core_node1 x:collection1] o.a.s.c.SolrCore org.apache.solr.core.MockDirectoryFactory
[junit4] 2> 3071 INFO (coreLoadExecutor-7-thread-1-processing-n:127.0.0.1:45713_) [n:127.0.0.1:45713_ c:control_collection s:shard1 r:core_node1 x:collection1] o.a.s.c.SolrCore [[collection1] ] Opening new SolrCore at [/home/jenkins/workspace/Lucene-Solr-6.x-Linux/solr/build/solr-core/test/J0/temp/solr.cloud.ForceLeaderTest_96830BA02490A958-001/control-001/cores/collection1], dataDir=[/home/jenkins/workspace/Lucene-Solr-6.x-Linux/solr/build/solr-core/test/J0/temp/solr.cloud.ForceLeaderTest_96830BA02490A958-001/control-001/cores/collection1/data/]
[junit4] 2> 3074 INFO (coreLoadExecutor-7-thread-1-processing-n:127.0.0.1:45713_) [n:127.0.0.1:45713_ c:control_collection s:shard1 r:core_node1 x:collection1] o.a.s.c.JmxMonitoredMap JMX monitoring is enabled. Adding Solr mbeans to JMX Server: com.sun.jmx.mbeanserver.JmxMBeanServer@5ad6e6
[junit4] 2> 3110 INFO (coreLoadExecutor-7-thread-1-processing-n:127.0.0.1:45713_) [n:127.0.0.1:45713_ c:control_collection s:shard1 r:core_node1 x:collection1] o.a.s.c.CachingDirectoryFactory return new directory for /home/jenkins/workspace/Lucene-Solr-6.x-Linux/solr/build/solr-core/test/J0/temp/solr.cloud.ForceLeaderTest_96830BA02490A958-001/control-001/cores/collection1/data
[junit4] 2> 3110 INFO (coreLoadExecutor-7-thread-1-processing-n:127.0.0.1:45713_) [n:127.0.0.1:45713_ c:control_collection s:shard1 r:core_node1 x:collection1] o.a.s.c.SolrCore New index directory detected: old=null new=/home/jenkins/workspace/Lucene-Solr-6.x-Linux/solr/build/solr-core/test/J0/temp/solr.cloud.ForceLeaderTest_96830BA02490A958-001/control-001/cores/collection1/data/index/
[junit4] 2> 3110 WARN (coreLoadExecutor-7-thread-1-processing-n:127.0.0.1:45713_) [n:127.0.0.1:45713_ c:control_collection s:shard1 r:core_node1 x:collection1] o.a.s.c.SolrCore [collection1] Solr index directory '/home/jenkins/workspace/Lucene-Solr-6.x-Linux/solr/build/solr-core/test/J0/temp/solr.cloud.ForceLeaderTest_96830BA02490A958-001/control-001/cores/collection1/data/index' doesn't exist. Creating new index...
[junit4] 2> 3122 INFO (coreLoadExecutor-7-thread-1-processing-n:127.0.0.1:45713_) [n:127.0.0.1:45713_ c:control_collection s:shard1 r:core_node1 x:collection1] o.a.s.c.CachingDirectoryFactory return new directory for /home/jenkins/workspace/Lucene-Solr-6.x-Linux/solr/build/solr-core/test/J0/temp/solr.cloud.ForceLeaderTest_96830BA02490A958-001/control-001/cores/collection1/data/index
[junit4] 2> 3124 INFO (coreLoadExecutor-7-thread-1-processing-n:127.0.0.1:45713_) [n:127.0.0.1:45713_ c:control_collection s:shard1 r:core_node1 x:collection1] o.a.s.u.RandomMergePolicy RandomMergePolicy wrapping class org.apache.lucene.index.TieredMergePolicy: [TieredMergePolicy: maxMergeAtOnce=28, maxMergeAtOnceExplicit=17, maxMergedSegmentMB=47.1162109375, floorSegmentMB=0.9814453125, forceMergeDeletesPctAllowed=28.90666046595554, segmentsPerTier=44.0, maxCFSSegmentSizeMB=8.796093022207999E12, noCFSRatio=0.0
[junit4] 2> 3162 INFO (coreLoadExecutor-7-thread-1-processing-n:127.0.0.1:45713_) [n:127.0.0.1:45713_ c:control_collection s:shard1 r:core_node1 x:collection1] o.a.s.c.SolrDeletionPolicy SolrDeletionPolicy.onCommit: commits: num=1
[junit4] 2> commit{dir=MockDirectoryWrapper(RAMDirectory@18d5308 lockFactory=org.apache.lucene.store.SingleInstanceLockFactory@19f12bf),segFN=segments_1,generation=1}
[junit4] 2> 3162 INFO (coreLoadExecutor-7-thread-1-processing-n:127.0.0.1:45713_) [n:127.0.0.1:45713_ c:control_collection s:shard1 r:core_node1 x:collection1] o.a.s.c.SolrDeletionPolicy newest commit generation = 1
[junit4] 2> 3164 INFO (OldIndexDirectoryCleanupThreadForCore-collection1) [n:127.0.0.1:45713_ c:control_collection s:shard1 r:core_node1 x:collection1] o.a.s.c.SolrCore Looking for old index directories to cleanup for core collection1 in /home/jenkins/workspace/Lucene-Solr-6.x-Linux/solr/build/solr-core/test/J0/temp/solr.cloud.ForceLeaderTest_96830BA02490A958-001/control-001/cores/collection1/data/
[junit4] 2> 3164 WARN (OldIndexDirectoryCleanupThreadForCore-collection1) [n:127.0.0.1:45713_ c:control_collection s:shard1 r:core_node1 x:collection1] o.a.s.c.DirectoryFactory /home/jenkins/workspace/Lucene-Solr-6.x-Linux/solr/build/solr-core/test/J0/temp/solr.cloud.ForceLeaderTest_96830BA02490A958-001/control-001/cores/collection1/data/ does not point to a valid data directory; skipping clean-up of old index directories.
[junit4] 2> 3315 INFO (coreLoadExecutor-7-thread-1-processing-n:127.0.0.1:45713_) [n:127.0.0.1:45713_ c:control_collection s:shard1 r:core_node1 x:collection1] o.a.s.u.p.UpdateRequestProcessorChain creating updateRequestProcessorChain "nodistrib"
[junit4] 2> 3329 INFO (coreLoadExecutor-7-thread-1-processing-n:127.0.0.1:45713_) [n:127.0.0.1:45713_ c:control_collection s:shard1 r:core_node1 x:collection1] o.a.s.u.p.UpdateRequestProcessorChain creating updateRequestProcessorChain "dedupe"
[junit4] 2> 3332 INFO (coreLoadExecutor-7-thread-1-processing-n:127.0.0.1:45713_) [n:127.0.0.1:45713_ c:control_collection s:shard1 r:core_node1 x:collection1] o.a.s.u.p.UpdateRequestProcessorChain inserting DistributedUpdateProcessorFactory into updateRequestProcessorChain "dedupe"
[junit4] 2> 3333 INFO (coreLoadExecutor-7-thread-1-processing-n:127.0.0.1:45713_) [n:127.0.0.1:45713_ c:control_collection s:shard1 r:core_node1 x:collection1] o.a.s.u.p.UpdateRequestProcessorChain creating updateRequestProcessorChain "stored_sig"
[junit4] 2> 3333 INFO (coreLoadExecutor-7-thread-1-processing-n:127.0.0.1:45713_) [n:127.0.0.1:45713_ c:control_collection s:shard1 r:core_node1 x:collection1] o.a.s.u.p.UpdateRequestProcessorChain inserting DistributedUpdateProcessorFactory into updateRequestProcessorChain "stored_sig"
[junit4] 2> 3333 INFO (coreLoadExecutor-7-thread-1-processing-n:127.0.0.1:45713_) [n:127.0.0.1:45713_ c:control_collection s:shard1 r:core_node1 x:collection1] o.a.s.u.p.UpdateRequestProcessorChain creating updateRequestProcessorChain "distrib-dup-test-chain-explicit"
[junit4] 2> 3348 INFO (coreLoadExecutor-7-thread-1-processing-n:127.0.0.1:45713_) [n:127.0.0.1:45713_ c:control_collection s:shard1 r:core_node1 x:collection1] o.a.s.u.p.UpdateRequestProcessorChain creating updateRequestProcessorChain "distrib-dup-test-chain-implicit"
[junit4] 2> 3348 INFO (coreLoadExecutor-7-thread-1-processing-n:127.0.0.1:45713_) [n:127.0.0.1:45713_ c:control_collection s:shard1 r:core_node1 x:collection1] o.a.s.u.p.UpdateRequestProcessorChain inserting DistributedUpdateProcessorFactory into updateRequestProcessorChain "distrib-dup-test-chain-implicit"
[junit4] 2> 3348 INFO (coreLoadExecutor-7-thread-1-processing-n:127.0.0.1:45713_) [n:127.0.0.1:45713_ c:control_collection s:shard1 r:core_node1 x:collection1] o.a.s.c.SolrCore no updateRequestProcessorChain defined as default, creating implicit default
[junit4] 2> 3351 WARN (coreLoadExecutor-7-thread-1-processing-n:127.0.0.1:45713_) [n:127.0.0.1:45713_ c:control_collection s:shard1 r:core_node1 x:collection1] o.a.s.c.RequestHandlers INVALID paramSet a in requestHandler {type = requestHandler,name = /dump,class = DumpRequestHandler,args = {defaults={a=A,b=B}}}
[junit4] 2> 3388 INFO (coreLoadExecutor-7-thread-1-processing-n:127.0.0.1:45713_) [n:127.0.0.1:45713_ c:control_collection s:shard1 r:core_node1 x:collection1] o.a.s.h.l.XMLLoader xsltCacheLifetimeSeconds=60
[junit4] 2> 3393 INFO (coreLoadExecutor-7-thread-1-processing-n:127.0.0.1:45713_) [n:127.0.0.1:45713_ c:control_collection s:shard1 r:core_node1 x:collection1] o.a.s.h.l.XMLLoader xsltCacheLifetimeSeconds=60
[junit4] 2> 3394 INFO (coreLoadExecutor-7-thread-1-processing-n:127.0.0.1:45713_) [n:127.0.0.1:45713_ c:control_collection s:shard1 r:core_node1 x:collection1] o.a.s.h.l.XMLLoader xsltCacheLifetimeSeconds=60
[junit4] 2> 3395 INFO (coreLoadExecutor-7-thread-1-processing-n:127.0.0.1:45713_) [n:127.0.0.1:45713_ c:control_collection s:shard1 r:core_node1 x:collection1] o.a.s.h.l.XMLLoader xsltCacheLifetimeSeconds=60
[junit4] 2> 3572 INFO (coreLoadExecutor-7-thread-1-processing-n:127.0.0.1:45713_) [n:127.0.0.1:45713_ c:control_collection s:shard1 r:core_node1 x:collection1] o.a.s.c.RequestHandlers Registered paths: /admin/mbeans,standard,/update/json/docs,/admin/luke,/export,/get,/admin/properties,/update/json,/admin/threads,/dump,/update/csv,/sql,/graph,/admin/segments,/admin/system,/replication,/config,/stream,/schema,/admin/plugins,/admin/logging,/admin/ping,/update,/admin/file,/terms
[junit4] 2> 3572 INFO (coreLoadExecutor-7-thread-1-processing-n:127.0.0.1:45713_) [n:127.0.0.1:45713_ c:control_collection s:shard1 r:core_node1 x:collection1] o.a.s.c.SolrCore Using default statsCache cache: org.apache.solr.search.stats.LocalStatsCache
[junit4] 2> 3585 INFO (coreLoadExecutor-7-thread-1-processing-n:127.0.0.1:45713_) [n:127.0.0.1:45713_ c:control_collection s:shard1 r:core_node1 x:collection1] o.a.s.u.UpdateHandler Using UpdateLog implementation: org.apache.solr.update.UpdateLog
[junit4] 2> 3585 INFO (coreLoadExecutor-7-thread-1-processing-n:127.0.0.1:45713_) [n:127.0.0.1:45713_ c:control_collection s:shard1 r:core_node1 x:collection1] o.a.s.u.UpdateLog Initializing UpdateLog: dataDir= defaultSyncLevel=FLUSH numRecordsToKeep=100 maxNumLogsToKeep=10 numVersionBuckets=65536
[junit4] 2> 3591 INFO (coreLoadExecutor-7-thread-1-processing-n:127.0.0.1:45713_) [n:127.0.0.1:45713_ c:control_collection s:shard1 r:core_node1 x:collection1] o.a.s.u.CommitTracker Hard AutoCommit: disabled
[junit4] 2> 3591 INFO (coreLoadExecutor-7-thread-1-processing-n:127.0.0.1:45713_) [n:127.0.0.1:45713_ c:control_collection s:shard1 r:core_node1 x:collection1] o.a.s.u.CommitTracker Soft AutoCommit: disabled
[junit4] 2> 3593 INFO (coreLoadExecutor-7-thread-1-processing-n:127.0.0.1:45713_) [n:127.0.0.1:45713_ c:control_collection s:shard1 r:core_node1 x:collection1] o.a.s.u.RandomMergePolicy RandomMergePolicy wrapping class org.apache.lucene.index.LogDocMergePolicy: [LogDocMergePolicy: minMergeSize=1000, mergeFactor=19, maxMergeSize=9223372036854775807, maxMergeSizeForForcedMerge=9223372036854775807, calibrateSizeByDeletes=true, maxMergeDocs=2147483647, maxCFSSegmentSizeMB=8.796093022207999E12, noCFSRatio=0.0]
[junit4] 2> 3595 INFO (coreLoadExecutor-7-thread-1-processing-n:127.0.0.1:45713_) [n:127.0.0.1:45713_ c:control_collection s:shard1 r:core_node1 x:collection1] o.a.s.c.SolrDeletionPolicy SolrDeletionPolicy.onInit: commits: num=1
[junit4] 2> commit{dir=MockDirectoryWrapper(RAMDirectory@18d5308 lockFactory=org.apache.lucene.store.SingleInstanceLockFactory@19f12bf),segFN=segments_1,generation=1}
[junit4] 2> 3595 INFO (coreLoadExecutor-7-thread-1-processing-n:127.0.0.1:45713_) [n:127.0.0.1:45713_ c:control_collection s:shard1 r:core_node1 x:collection1] o.a.s.c.SolrDeletionPolicy newest commit generation = 1
[junit4] 2> 3608 INFO (coreLoadExecutor-7-thread-1-processing-n:127.0.0.1:45713_) [n:127.0.0.1:45713_ c:control_collection s:shard1 r:core_node1 x:collection1] o.a.s.s.SolrIndexSearcher Opening [Searcher@5afa0a[collection1] main]
[junit4] 2> 3621 INFO (coreLoadExecutor-7-thread-1-processing-n:127.0.0.1:45713_) [n:127.0.0.1:45713_ c:control_collection s:shard1 r:core_node1 x:collection1] o.a.s.c.c.ZkStateReader Load collection config from: [/collections/control_collection]
[junit4] 2> 3622 INFO (coreLoadExecutor-7-thread-1-processing-n:127.0.0.1:45713_) [n:127.0.0.1:45713_ c:control_collection s:shard1 r:core_node1 x:collection1] o.a.s.c.c.ZkStateReader path=[/collections/control_collection] [configName]=[conf1] specified config exists in ZooKeeper
[junit4] 2> 3622 INFO (coreLoadExecutor-7-thread-1-processing-n:127.0.0.1:45713_) [n:127.0.0.1:45713_ c:control_collection s:shard1 r:core_node1 x:collection1] o.a.s.r.ManagedResourceStorage Setting up ZooKeeper-based storage for the RestManager with znodeBase: /configs/conf1
[junit4] 2> 3624 INFO (coreLoadExecutor-7-thread-1-processing-n:127.0.0.1:45713_) [n:127.0.0.1:45713_ c:control_collection s:shard1 r:core_node1 x:collection1] o.a.s.r.ManagedResourceStorage Configured ZooKeeperStorageIO with znodeBase: /configs/conf1
[junit4] 2> 3624 INFO (coreLoadExecutor-7-thread-1-processing-n:127.0.0.1:45713_) [n:127.0.0.1:45713_ c:control_collection s:shard1 r:core_node1 x:collection1] o.a.s.r.RestManager Initializing RestManager with initArgs: {}
[junit4] 2> 3639 INFO (coreLoadExecutor-7-thread-1-processing-n:127.0.0.1:45713_) [n:127.0.0.1:45713_ c:control_collection s:shard1 r:core_node1 x:collection1] o.a.s.r.ManagedResourceStorage Reading _rest_managed.json using ZooKeeperStorageIO:path=/configs/conf1
[junit4] 2> 3639 INFO (coreLoadExecutor-7-thread-1-processing-n:127.0.0.1:45713_) [n:127.0.0.1:45713_ c:control_collection s:shard1 r:core_node1 x:collection1] o.a.s.r.ManagedResourceStorage No data found for znode /configs/conf1/_rest_managed.json
[junit4] 2> 3639 INFO (coreLoadExecutor-7-thread-1-processing-n:127.0.0.1:45713_) [n:127.0.0.1:45713_ c:control_collection s:shard1 r:core_node1 x:collection1] o.a.s.r.ManagedResourceStorage Loaded null at path _rest_managed.json using ZooKeeperStorageIO:path=/configs/conf1
[junit4] 2> 3639 INFO (coreLoadExecutor-7-thread-1-processing-n:127.0.0.1:45713_) [n:127.0.0.1:45713_ c:control_collection s:shard1 r:core_node1 x:collection1] o.a.s.r.RestManager Initializing 0 registered ManagedResources
[junit4] 2> 3656 INFO (coreLoadExecutor-7-thread-1-processing-n:127.0.0.1:45713_) [n:127.0.0.1:45713_ c:control_collection s:shard1 r:core_node1 x:collection1] o.a.s.h.ReplicationHandler Commits will be reserved for 10000
[junit4] 2> 3676 INFO (searcherExecutor-8-thread-1-processing-n:127.0.0.1:45713_ x:collection1 s:shard1 c:control_collection r:core_node1) [n:127.0.0.1:45713_ c:control_collection s:shard1 r:core_node1 x:collection1] o.a.s.c.SolrCore [collection1] Registered new searcher Searcher@5afa0a[collection1] main{ExitableDirectoryReader(UninvertingDirectoryReader())}
[junit4] 2> 3676 INFO (coreLoadExecutor-7-thread-1-processing-n:127.0.0.1:45713_) [n:127.0.0.1:45713_ c:control_collection s:shard1 r:core_node1 x:collection1] o.a.s.u.UpdateLog Looking up max value of version field to seed version buckets
[junit4] 2> 3678 INFO (coreLoadExecutor-7-thread-1-processing-n:127.0.0.1:45713_) [n:127.0.0.1:45713_ c:control_collection s:shard1 r:core_node1 x:collection1] o.a.s.u.VersionInfo Refreshing highest value of _version_ for 65536 version buckets from index
[junit4] 2> 3678 INFO (coreLoadExecutor-7-thread-1-processing-n:127.0.0.1:45713_) [n:127.0.0.1:45713_ c:control_collection s:shard1 r:core_node1 x:collection1] o.a.s.u.VersionInfo No terms found for _version_, cannot seed version bucket highest value from index
[junit4] 2> 3678 INFO (coreLoadExecutor-7-thread-1-processing-n:127.0.0.1:45713_) [n:127.0.0.1:45713_ c:control_collection s:shard1 r:core_node1 x:collection1] o.a.s.u.UpdateLog Could not find max version in index or recent updates, using new clock 1540004559302164480
[junit4] 2> 3682 INFO (coreLoadExecutor-7-thread-1-processing-n:127.0.0.1:45713_) [n:127.0.0.1:45713_ c:control_collection s:shard1 r:core_node1 x:collection1] o.a.s.u.UpdateLog Took 4.0ms to seed version buckets with highest version 1540004559302164480
[junit4] 2> 3683 INFO (coreLoadExecutor-7-thread-1-processing-n:127.0.0.1:45713_) [n:127.0.0.1:45713_ c:control_collection s:shard1 r:core_node1 x:collection1] o.a.s.c.ZkController watch zkdir /configs/conf1
[junit4] 2> 3684 INFO (coreLoadExecutor-7-thread-1-processing-n:127.0.0.1:45713_) [n:127.0.0.1:45713_ c:control_collection s:shard1 r:core_node1 x:collection1] o.a.s.c.CoreContainer registering core: collection1
[junit4] 2> 3685 INFO (coreZkRegister-1-thread-1-processing-n:127.0.0.1:45713_ x:collection1 s:shard1 c:control_collection r:core_node1) [n:127.0.0.1:45713_ c:control_collection s:shard1 r:core_node1 x:collection1] o.a.s.c.ZkController Register replica - core:collection1 address:http://127.0.0.1:45713 collection:control_collection shard:shard1
[junit4] 2> 3691 INFO (coreZkRegister-1-thread-1-processing-n:127.0.0.1:45713_ x:collection1 s:shard1 c:control_collection r:core_node1) [n:127.0.0.1:45713_ c:control_collection s:shard1 r:core_node1 x:collection1] o.a.s.c.c.SolrZkClient makePath: /collections/control_collection/leader_elect/shard1/election
[junit4] 2> 3694 INFO (coreZkRegister-1-thread-1-processing-n:127.0.0.1:45713_ x:collection1 s:shard1 c:control_collection r:core_node1) [n:127.0.0.1:45713_ c:control_collection s:shard1 r:core_node1 x:collection1] o.a.s.c.LeaderElector Joined leadership election with path: /collections/control_collection/leader_elect/shard1/election/96250284720783364-core_node1-n_0000000000
[junit4] 2> 3695 INFO (coreZkRegister-1-thread-1-processing-n:127.0.0.1:45713_ x:collection1 s:shard1 c:control_collection r:core_node1) [n:127.0.0.1:45713_ c:control_collection s:shard1 r:core_node1 x:collection1] o.a.s.c.ShardLeaderElectionContext Running the leader process for shard=shard1 and weAreReplacement=false and leaderVoteWait=10000
[junit4] 2> 3697 INFO (coreZkRegister-1-thread-1-processing-n:127.0.0.1:45713_ x:collection1 s:shard1 c:control_collection r:core_node1) [n:127.0.0.1:45713_ c:control_collection s:shard1 r:core_node1 x:collection1] o.a.s.c.ShardLeaderElectionContext Enough replicas found to continue.
[junit4] 2> 3697 INFO (coreZkRegister-1-thread-1-processing-n:127.0.0.1:45713_ x:collection1 s:shard1 c:control_collection r:core_node1) [n:127.0.0.1:45713_ c:control_collection s:shard1 r:core_node1 x:collection1] o.a.s.c.ShardLeaderElectionContext I may be the new leader - try and sync
[junit4] 2> 3697 INFO (OverseerStateUpdate-96250284720783364-127.0.0.1:45713_-n_0000000000) [n:127.0.0.1:45713_ ] o.a.s.c.Overseer processMessage: queueSize: 1, message = {
[junit4] 2> "operation":"leader",
[junit4] 2> "shard":"shard1",
[junit4] 2> "collection":"control_collection"} current state version: 1
[junit4] 2> 3698 INFO (coreZkRegister-1-thread-1-processing-n:127.0.0.1:45713_ x:collection1 s:shard1 c:control_collection r:core_node1) [n:127.0.0.1:45713_ c:control_collection s:shard1 r:core_node1 x:collection1] o.a.s.c.SyncStrategy Sync replicas to http://127.0.0.1:45713/collection1/
[junit4] 2> 3698 INFO (coreZkRegister-1-thread-1-processing-n:127.0.0.1:45713_ x:collection1 s:shard1 c:control_collection r:core_node1) [n:127.0.0.1:45713_ c:control_collection s:shard1 r:core_node1 x:collection1] o.a.s.c.SyncStrategy Sync Success - now sync replicas to me
[junit4] 2> 3698 INFO (coreZkRegister-1-thread-1-processing-n:127.0.0.1:45713_ x:collection1 s:shard1 c:control_collection r:core_node1) [n:127.0.0.1:45713_ c:control_collection s:shard1 r:core_node1 x:collection1] o.a.s.c.SyncStrategy http://127.0.0.1:45713/collection1/ has no replicas
[junit4] 2> 3700 INFO (zkCallback-7-thread-1-processing-n:127.0.0.1:45713_) [n:127.0.0.1:45713_ ] o.a.s.c.c.ZkStateReader A cluster state change: [WatchedEvent state:SyncConnected type:NodeDataChanged path:/clusterstate.json], has occurred - updating... (live nodes size: [1])
[junit4] 2> 3701 INFO (coreZkRegister-1-thread-1-processing-n:127.0.0.1:45713_ x:collection1 s:shard1 c:control_collection r:core_node1) [n:127.0.0.1:45713_ c:control_collection s:shard1 r:core_node1 x:collection1] o.a.s.c.c.SolrZkClient makePath: /collections/control_collection/leaders/shard1
[junit4] 2> 3704 INFO (coreZkRegister-1-thread-1-processing-n:127.0.0.1:45713_ x:collection1 s:shard1 c:control_collection r:core_node1) [n:127.0.0.1:45713_ c:control_collection s:shard1 r:core_node1 x:collection1] o.a.s.c.ShardLeaderElectionContextBase Creating leader registration node /collections/control_collection/leaders/shard1/leader after winning as /collections/control_collection/leader_elect/shard1/election/96250284720783364-core_node1-n_0000000000
[junit4] 2> 3716 INFO (coreZkRegister-1-thread-1-processing-n:127.0.0.1:45713_ x:collection1 s:shard1 c:control_collection r:core_node1) [n:127.0.0.1:45713_ c:control_collection s:shard1 r:core_node1 x:collection1] o.a.s.c.ShardLeaderElectionContext I am the new leader: http://127.0.0.1:45713/collection1/ shard1
[junit4] 2> 3717 INFO (OverseerStateUpdate-96250284720783364-127.0.0.1:45713_-n_0000000000) [n:127.0.0.1:45713_ ] o.a.s.c.Overseer processMessage: queueSize: 1, message = {
[junit4] 2> "operation":"leader",
[junit4] 2> "shard":"shard1",
[junit4] 2> "collection":"control_collection",
[junit4] 2> "base_url":"http://127.0.0.1:45713",
[junit4] 2> "core":"collection1",
[junit4] 2> "state":"active"} current state version: 2
[junit4] 2> 3790 INFO (TEST-ForceLeaderTest.testReplicasInLIRNoLeader-seed#[96830BA02490A958]) [ ] o.a.s.c.c.SolrZkClient Using default ZkCredentialsProvider
[junit4] 2> 3791 INFO (TEST-ForceLeaderTest.testReplicasInLIRNoLeader-seed#[96830BA02490A958]) [ ] o.a.s.c.c.ConnectionManager Waiting for client to connect to ZooKeeper
[junit4] 2> 3793 INFO (zkCallback-11-thread-1) [ ] o.a.s.c.c.ConnectionManager Watcher org.apache.solr.common.cloud.ConnectionManager@125f334 name:ZooKeeperConnection Watcher:127.0.0.1:40985/solr got event WatchedEvent state:SyncConnected type:None path:null path:null type:None
[junit4] 2> 3793 INFO (TEST-ForceLeaderTest.testReplicasInLIRNoLeader-seed#[96830BA02490A958]) [ ] o.a.s.c.c.ConnectionManager Client is connected to ZooKeeper
[junit4] 2> 3794 INFO (TEST-ForceLeaderTest.testReplicasInLIRNoLeader-seed#[96830BA02490A958]) [ ] o.a.s.c.c.SolrZkClient Using default ZkACLProvider
[junit4] 2> 3794 INFO (TEST-ForceLeaderTest.testReplicasInLIRNoLeader-seed#[96830BA02490A958]) [ ] o.a.s.c.c.ZkStateReader Updating cluster state from ZooKeeper...
[junit4] 2> 3795 INFO (TEST-ForceLeaderTest.testReplicasInLIRNoLeader-seed#[96830BA02490A958]) [ ] o.a.s.c.c.ZkStateReader Loaded empty cluster properties
[junit4] 2> 3795 INFO (TEST-ForceLeaderTest.testReplicasInLIRNoLeader-seed#[96830BA02490A958]) [ ] o.a.s.c.c.ZkStateReader Updated live nodes from ZooKeeper... (0) -> (1)
[junit4] 2> 3798 INFO (TEST-ForceLeaderTest.testReplicasInLIRNoLeader-seed#[96830BA02490A958]) [ ] o.a.s.c.ChaosMonkey monkey: init - expire sessions:false cause connection loss:false
[junit4] 2> 3798 INFO (TEST-ForceLeaderTest.testReplicasInLIRNoLeader-seed#[96830BA02490A958]) [ ] o.a.s.c.AbstractFullDistribZkTestBase Creating collection1 with stateFormat=2
[junit4] 2> 3798 INFO (TEST-ForceLeaderTest.testReplicasInLIRNoLeader-seed#[96830BA02490A958]) [ ] o.a.s.c.c.SolrZkClient Using default ZkCredentialsProvider
[junit4] 2> 3799 INFO (TEST-ForceLeaderTest.testReplicasInLIRNoLeader-seed#[96830BA02490A958]) [ ] o.a.s.c.c.ConnectionManager Waiting for client to connect to ZooKeeper
[junit4] 2> 3800 INFO (zkCallback-12-thread-1) [ ] o.a.s.c.c.ConnectionManager Watcher org.apache.solr.common.cloud.ConnectionManager@d586f1 name:ZooKeeperConnection Watcher:127.0.0.1:40985/solr got event WatchedEvent state:SyncConnected type:None path:null path:null type:None
[junit4] 2> 3800 INFO (TEST-ForceLeaderTest.testReplicasInLIRNoLeader-seed#[96830BA02490A958]) [ ] o.a.s.c.c.ConnectionManager Client is connected to ZooKeeper
[junit4] 2> 3801 INFO (TEST-ForceLeaderTest.testReplicasInLIRNoLeader-seed#[96830BA02490A958]) [ ] o.a.s.c.c.SolrZkClient Using default ZkACLProvider
[junit4] 2> 3803 INFO (OverseerStateUpdate-96250284720783364-127.0.0.1:45713_-n_0000000000) [n:127.0.0.1:45713_ ] o.a.s.c.Overseer processMessage: queueSize: 1, message = {
[junit4] 2> "operation":"create",
[junit4] 2> "name":"collection1",
[junit4] 2> "numShards":"2",
[junit4] 2> "stateFormat":"2"} current state version: 2
[junit4] 2> 3804 INFO (OverseerStateUpdate-96250284720783364-127.0.0.1:45713_-n_0000000000) [n:127.0.0.1:45713_ ] o.a.s.c.o.ClusterStateMutator building a new cName: collection1
[junit4] 2> 3804 INFO (zkCallback-7-thread-1-processing-n:127.0.0.1:45713_) [n:127.0.0.1:45713_ ] o.a.s.c.c.ZkStateReader A cluster state change: [WatchedEvent state:SyncConnected type:NodeDataChanged path:/clusterstate.json], has occurred - updating... (live nodes size: [1])
[junit4] 2> 3804 INFO (zkCallback-11-thread-1) [ ] o.a.s.c.c.ZkStateReader A cluster state change: [WatchedEvent state:SyncConnected type:NodeDataChanged path:/clusterstate.json], has occurred - updating... (live nodes size: [1])
[junit4] 2> 3817 INFO (coreZkRegister-1-thread-1-processing-n:127.0.0.1:45713_ x:collection1 s:shard1 c:control_collection r:core_node1) [n:127.0.0.1:45713_ c:control_collection s:shard1 r:core_node1 x:collection1] o.a.s.c.ZkController We are http://127.0.0.1:45713/collection1/ and leader is http://127.0.0.1:45713/collection1/
[junit4] 2> 3818 INFO (coreZkRegister-1-thread-1-processing-n:127.0.0.1:45713_ x:collection1 s:shard1 c:control_collection r:core_node1) [n:127.0.0.1:45713_ c:control_collection s:shard1 r:core_node1 x:collection1] o.a.s.c.ZkController No LogReplay needed for core=collection1 baseURL=http://127.0.0.1:45713
[junit4] 2> 3818 INFO (coreZkRegister-1-thread-1-processing-n:127.0.0.1:45713_ x:collection1 s:shard1 c:control_collection r:core_node1) [n:127.0.0.1:45713_ c:control_collection s:shard1 r:core_node1 x:collection1] o.a.s.c.ZkController I am the leader, no recovery necessary
[junit4] 2> 3818 INFO (coreZkRegister-1-thread-1-processing-n:127.0.0.1:45713_ x:collection1 s:shard1 c:control_collection r:core_node1) [n:127.0.0.1:45713_ c:control_collection s:shard1 r:core_node1 x:collection1] o.a.s.c.ZkController publishing state=active
[junit4] 2> 3818 INFO (coreZkRegister-1-thread-1-processing-n:127.0.0.1:45713_ x:collection1 s:shard1 c:control_collection r:core_node1) [n:127.0.0.1:45713_ c:control_collection s:shard1 r:core_node1 x:collection1] o.a.s.c.ZkController numShards not found on descriptor - reading it from system property
[junit4] 2> 3820 INFO (coreZkRegister-1-thread-1-processing-n:127.0.0.1:45713_ x:collection1 s:shard1 c:control_collection r:core_node1) [n:127.0.0.1:45713_ c:control_collection s:shard1 r:core_node1 x:collection1] o.a.s.c.c.ZkStateReader Checking legacy cluster state for collection control_collection
[junit4] 2> 3820 INFO (OverseerStateUpdate-96250284720783364-127.0.0.1:45713_-n_0000000000) [n:127.0.0.1:45713_ ] o.a.s.c.Overseer processMessage: queueSize: 1, message = {
[junit4] 2> "core":"collection1",
[junit4] 2> "core_node_name":"core_node1",
[junit4] 2> "roles":null,
[junit4] 2> "base_url":"http://127.0.0.1:45713",
[junit4] 2> "node_name":"127.0.0.1:45713_",
[junit4] 2> "numShards":"2",
[junit4] 2> "state":"active",
[junit4] 2> "shard":"shard1",
[junit4] 2> "collection":"control_collection",
[junit4] 2> "operation":"state"} current state version: 3
[junit4] 2> 3821 INFO (OverseerStateUpdate-96250284720783364-127.0.0.1:45713_-n_0000000000) [n:127.0.0.1:45713_ ] o.a.s.c.o.ReplicaMutator Update state numShards=2 message={
[junit4] 2> "core":"collection1",
[junit4] 2> "core_node_name":"core_node1",
[junit4] 2> "roles":null,
[junit4] 2> "base_url":"http://127.0.0.1:45713",
[junit4] 2> "node_name":"127.0.0.1:45713_",
[junit4] 2> "numShards":"2",
[junit4] 2> "state":"active",
[junit4] 2> "shard":"shard1",
[junit4] 2> "collection":"control_collection",
[junit4] 2> "operation":"state"}
[junit4] 2> 3821 INFO (OverseerStateUpdate-96250284720783364-127.0.0.1:45713_-n_0000000000) [n:127.0.0.1:45713_ ] o.a.s.c.o.ZkStateWriter going to create_collection /collections/collection1/state.json
[junit4] 2> 3871 INFO (TEST-ForceLeaderTest.testReplicasInLIRNoLeader-seed#[96830BA02490A958]) [ ] o.a.s.SolrTestCaseJ4 Writing core.properties file to /home/jenkins/workspace/Lucene-Solr-6.x-Linux/solr/build/solr-core/test/J0/temp/solr.cloud.ForceLeaderTest_96830BA02490A958-001/shard-1-001/cores/collection1
[junit4] 2> 3872 INFO (TEST-ForceLeaderTest.testReplicasInLIRNoLeader-seed#[96830BA02490A958]) [ ] o.a.s.c.AbstractFullDistribZkTestBase create jetty 1 in directory /home/jenkins/workspace/Lucene-Solr-6.x-Linux/solr/build/solr-core/test/J0/temp/solr.cloud.ForceLeaderTest_96830BA02490A958-001/shard-1-001
[junit4] 2> 3873 INFO (TEST-ForceLeaderTest.testReplicasInLIRNoLeader-seed#[96830BA02490A958]) [ ] o.e.j.s.Server jetty-9.3.8.v20160314
[junit4] 2> 3888 INFO (TEST-ForceLeaderTest.testReplicasInLIRNoLeader-seed#[96830BA02490A958]) [ ] o.e.j.s.h.ContextHandler Started o.e.j.s.ServletContextHandler@c76c25{/,null,AVAILABLE}
[junit4] 2> 3889 INFO (TEST-ForceLeaderTest.testReplicasInLIRNoLeader-seed#[96830BA02490A958]) [ ] o.e.j.s.ServerConnector Started ServerConnector@b1728a{HTTP/1.1,[http/1.1]}{127.0.0.1:36670}
[junit4] 2> 3889 INFO (TEST-ForceLeaderTest.testReplicasInLIRNoLeader-seed#[96830BA02490A958]) [ ] o.e.j.s.Server Started @5547ms
[junit4] 2> 3889 INFO (TEST-ForceLeaderTest.testReplicasInLIRNoLeader-seed#[96830BA02490A958]) [ ] o.a.s.c.s.e.JettySolrRunner Jetty properties: {solr.data.dir=/home/jenkins/workspace/Lucene-Solr-6.x-Linux/solr/build/solr-core/test/J0/temp/solr.cloud.ForceLeaderTest_96830BA02490A958-001/tempDir-001/jetty1, solrconfig=solrconfig.xml, hostContext=/, hostPort=38690, coreRootDirectory=/home/jenkins/workspace/Lucene-Solr-6.x-Linux/solr/build/solr-core/test/J0/temp/solr.cloud.ForceLeaderTest_96830BA02490A958-001/shard-1-001/cores}
[junit4] 2> 3890 INFO (TEST-ForceLeaderTest.testReplicasInLIRNoLeader-seed#[96830BA02490A958]) [ ] o.a.s.s.SolrDispatchFilter SolrDispatchFilter.init(): sun.misc.Launcher$AppClassLoader@1d16e93
[junit4] 2> 3890 INFO (TEST-ForceLeaderTest.testReplicasInLIRNoLeader-seed#[96830BA02490A958]) [ ] o.a.s.c.SolrResourceLoader new SolrResourceLoader for directory: '/home/jenkins/workspace/Lucene-Solr-6.x-Linux/solr/build/solr-core/test/J0/temp/solr.cloud.ForceLeaderTest_96830BA02490A958-001/shard-1-001'
[junit4] 2> 3890 INFO (TEST-ForceLeaderTest.testReplicasInLIRNoLeader-seed#[96830BA02490A958]) [ ] o.a.s.c.SolrResourceLoader JNDI not configured for solr (NoInitialContextEx)
[junit4] 2> 3890 INFO (TEST-ForceLeaderTest.testReplicasInLIRNoLeader-seed#[96830BA02490A958]) [ ] o.a.s.c.SolrResourceLoader solr home defaulted to 'solr/' (could not find system property or JNDI)
[junit4] 2> 3891 INFO (TEST-ForceLeaderTest.testReplicasInLIRNoLeader-seed#[96830BA02490A958]) [ ] o.a.s.c.c.SolrZkClient Using default ZkCredentialsProvider
[junit4] 2> 3891 INFO (TEST-ForceLeaderTest.testReplicasInLIRNoLeader-seed#[96830BA02490A958]) [ ] o.a.s.c.c.ConnectionManager Waiting for client to connect to ZooKeeper
[junit4] 2> 3893 INFO (zkCallback-13-thread-1) [ ] o.a.s.c.c.ConnectionManager Watcher org.apache.solr.common.cloud.ConnectionManager@9a93ee name:ZooKeeperConnection Watcher:127.0.0.1:40985/solr got event WatchedEvent state:SyncConnected type:None path:null path:null type:None
[junit4] 2> 3893 INFO (TEST-ForceLeaderTest.testReplicasInLIRNoLeader-seed#[96830BA02490A958]) [ ] o.a.s.c.c.ConnectionManager Client is connected to ZooKeeper
[junit4] 2> 3893 INFO (TEST-ForceLeaderTest.testReplicasInLIRNoLeader-seed#[96830BA02490A958]) [ ] o.a.s.c.c.SolrZkClient Using default ZkACLProvider
[junit4] 2> 3895 INFO (TEST-ForceLeaderTest.testReplicasInLIRNoLeader-seed#[96830BA02490A958]) [ ] o.a.s.s.SolrDispatchFilter Loading solr.xml from SolrHome (not found in ZooKeeper)
[junit4] 2> 3895 INFO (TEST-ForceLeaderTest.testReplicasInLIRNoLeader-seed#[96830BA02490A958]) [ ] o.a.s.c.SolrXmlConfig Loading container configuration from /home/jenkins/workspace/Lucene-Solr-6.x-Linux/solr/build/solr-core/test/J0/temp/solr.cloud.ForceLeaderTest_96830BA02490A958-001/shard-1-001/solr.xml
[junit4] 2> 3906 INFO (TEST-ForceLeaderTest.testReplicasInLIRNoLeader-seed#[96830BA02490A958]) [ ] o.a.s.c.CorePropertiesLocator Config-defined core root directory: /home/jenkins/workspace/Lucene-Solr-6.x-Linux/solr/build/solr-core/test/J0/temp/solr.cloud.ForceLeaderTest_96830BA02490A958-001/shard-1-001/cores
[junit4] 2> 3906 INFO (TEST-ForceLeaderTest.testReplicasInLIRNoLeader-seed#[96830BA02490A958]) [ ] o.a.s.c.CoreContainer New CoreContainer 6706385
[junit4] 2> 3906 INFO (TEST-ForceLeaderTest.testReplicasInLIRNoLeader-seed#[96830BA02490A958]) [ ] o.a.s.c.CoreContainer Loading cores into CoreContainer [instanceDir=/home/jenkins/workspace/Lucene-Solr-6.x-Linux/solr/build/solr-core/test/J0/temp/solr.cloud.ForceLeaderTest_96830BA02490A958-001/shard-1-001]
[junit4] 2> 3906 WARN (TEST-ForceLeaderTest.testReplicasInLIRNoLeader-seed#[96830BA02490A958]) [ ] o.a.s.c.CoreContainer Couldn't add files from /home/jenkins/workspace/Lucene-Solr-6.x-Linux/solr/build/solr-core/test/J0/temp/solr.cloud.ForceLeaderTest_96830BA02490A958-001/shard-1-001/lib to classpath: /home/jenkins/workspace/Lucene-Solr-6.x-Linux/solr/build/solr-core/test/J0/temp/solr.cloud.ForceLeaderTest_96830BA02490A958-001/shard-1-001/lib
[junit4] 2> 3906 INFO (TEST-ForceLeaderTest.testReplicasInLIRNoLeader-seed#[96830BA02490A958]) [ ] o.a.s.h.c.HttpShardHandlerFactory created with socketTimeout : 90000,urlScheme : ,connTimeout : 15000,maxConnectionsPerHost : 20,maxConnections : 10000,corePoolSize : 0,maximumPoolSize : 2147483647,maxThreadIdleTime : 5,sizeOfQueue : -1,fairnessPolicy : false,useRetries : false,connectionsEvictorSleepDelay : 5000,maxConnectionIdleTime : 40000,
[junit4] 2> 3908 INFO (TEST-ForceLeaderTest.testReplicasInLIRNoLeader-seed#[96830BA02490A958]) [ ] o.a.s.u.UpdateShardHandler Creating UpdateShardHandler HTTP client with params: socketTimeout=340000&connTimeout=45000&retry=true
[junit4] 2> 3909 INFO (TEST-ForceLeaderTest.testReplicasInLIRNoLeader-seed#[96830BA02490A958]) [ ] o.a.s.l.LogWatcher SLF4J impl is org.slf4j.impl.Log4jLoggerFactory
[junit4] 2> 3909 INFO (TEST-ForceLeaderTest.testReplicasInLIRNoLeader-seed#[96830BA02490A958]) [ ] o.a.s.l.LogWatcher Registering Log Listener [Log4j (org.slf4j.impl.Log4jLoggerFactory)]
[junit4] 2> 3909 INFO (TEST-ForceLeaderTest.testReplicasInLIRNoLeader-seed#[96830BA02490A958]) [ ] o.a.s.c.ZkContainer Zookeeper client=127.0.0.1:40985/solr
[junit4] 2> 3909 INFO (TEST-ForceLeaderTest.testReplicasInLIRNoLeader-seed#[96830BA02490A958]) [ ] o.a.s.c.ZkController zkHost includes chroot
[junit4] 2> 3909 INFO (TEST-ForceLeaderTest.testReplicasInLIRNoLeader-seed#[96830BA02490A958]) [ ] o.a.s.c.c.SolrZkClient Using default ZkCredentialsProvider
[junit4] 2> 3909 INFO (TEST-ForceLeaderTest.testReplicasInLIRNoLeader-seed#[96830BA02490A958]) [ ] o.a.s.c.c.ConnectionManager Waiting for client to connect to ZooKeeper
[junit4] 2> 3911 INFO (zkCallback-16-thread-1) [ ] o.a.s.c.c.ConnectionManager Watcher org.apache.solr.common.cloud.ConnectionManager@1fa96d name:ZooKeeperConnection Watcher:127.0.0.1:40985 got event WatchedEvent state:SyncConnected type:None path:null path:null type:None
[junit4] 2> 3911 INFO (TEST-ForceLeaderTest.testReplicasInLIRNoLeader-seed#[96830BA02490A958]) [ ] o.a.s.c.c.ConnectionManager Client is connected to ZooKeeper
[junit4] 2> 3912 INFO (TEST-ForceLeaderTest.testReplicasInLIRNoLeader-seed#[96830BA02490A958]) [ ] o.a.s.c.c.SolrZkClient Using default ZkACLProvider
[junit4] 2> 3914 INFO (TEST-ForceLeaderTest.testReplicasInLIRNoLeader-seed#[96830BA02490A958]) [n:127.0.0.1:38690_ ] o.a.s.c.ZkController Added new OnReconnect listener org.apache.solr.cloud.ZkController$$Lambda$10/19246365@1a9207
[junit4] 2> 3914 INFO (TEST-ForceLeaderTest.testReplicasInLIRNoLeader-seed#[96830BA02490A958]) [n:127.0.0.1:38690_ ] o.a.s.c.c.ConnectionManager Waiting for client to connect to ZooKeeper
[junit4] 2> 3915 INFO (zkCallback-17-thread-1-processing-n:127.0.0.1:38690_) [n:127.0.0.1:38690_ ] o.a.s.c.c.ConnectionManager Watcher org.apache.solr.common.cloud.ConnectionManager@432c32 name:ZooKeeperConnection Watcher:127.0.0.1:40985/solr got event WatchedEvent state:SyncConnected type:None path:null path:null type:None
[junit4] 2> 3916 INFO (TEST-ForceLeaderTest.testReplicasInLIRNoLeader-seed#[96830BA02490A958]) [n:127.0.0.1:38690_ ] o.a.s.c.c.ConnectionManager Client is connected to ZooKeeper
[junit4] 2> 3920 INFO (TEST-ForceLeaderTest.testReplicasInLIRNoLeader-seed#[96830BA02490A958]) [n:127.0.0.1:38690_ ] o.a.s.c.c.ZkStateReader Updating cluster state from ZooKeeper...
[junit4] 2> 3921 INFO (TEST-ForceLeaderTest.testReplicasInLIRNoLeader-seed#[96830BA02490A958]) [n:127.0.0.1:38690_ ] o.a.s.c.c.ZkStateReader Loaded empty cluster properties
[junit4] 2> 3921 INFO (TEST-ForceLeaderTest.testReplicasInLIRNoLeader-seed#[96830BA02490A958]) [n:127.0.0.1:38690_ ] o.a.s.c.c.ZkStateReader Updated live nodes from ZooKeeper... (0) -> (1)
[junit4] 2> 3923 INFO (TEST-ForceLeaderTest.testReplicasInLIRNoLeader-seed#[96830BA02490A958]) [n:127.0.0.1:38690_ ] o.a.s.c.Overseer Overseer (id=null) closing
[junit4] 2> 3923 INFO (TEST-ForceLeaderTest.testReplicasInLIRNoLeader-seed#[96830BA02490A958]) [n:127.0.0.1:38690_ ] o.a.s.c.LeaderElector Joined leadership election with path: /overseer_elect/election/96250284720783369-127.0.0.1:38690_-n_0000000001
[junit4] 2> 3926 INFO (zkCallback-17-thread-1-processing-n:127.0.0.1:38690_) [n:127.0.0.1:38690_ ] o.a.s.c.c.ZkStateReader A cluster state change: [WatchedEvent state:SyncConnected type:NodeDataChanged path:/clusterstate.json], has occurred - updating... (live nodes size: [1])
[junit4] 2> 3926 INFO (zkCallback-7-thread-1-processing-n:127.0.0.1:45713_) [n:127.0.0.1:45713_ ] o.a.s.c.c.ZkStateReader A cluster state change: [WatchedEvent state:SyncConnected type:NodeDataChanged path:/clusterstate.json], has occurred - updating... (live nodes size: [1])
[junit4] 2> 3926 INFO (TEST-ForceLeaderTest.testReplicasInLIRNoLeader-seed#[96830BA02490A958]) [n:127.0.0.1:38690_ ] o.a.s.c.LeaderElector Watching path /overseer_elect/election/96250284720783364-127.0.0.1:45713_-n_0000000000 to know if I could be the leader
[junit4] 2> 3926 INFO (zkCallback-11-thread-1) [ ] o.a.s.c.c.ZkStateReader A cluster state change: [WatchedEvent state:SyncConnected type:NodeDataChanged path:/clusterstate.json], has occurred - updating... (live nodes size: [1])
[junit4] 2> 3926 INFO (TEST-ForceLeaderTest.testReplicasInLIRNoLeader-seed#[96830BA02490A958]) [n:127.0.0.1:38690_ ] o.a.s.c.ZkController Publish node=127.0.0.1:38690_ as DOWN
[junit4] 2> 3928 INFO (TEST-ForceLeaderTest.testReplicasInLIRNoLeader-seed#[96830BA02490A958]) [n:127.0.0.1:38690_ ] o.a.s.c.ZkController Register node as live in ZooKeeper:/live_nodes/127.0.0.1:38690_
[junit4] 2> 3928 INFO (TEST-ForceLeaderTest.testReplicasInLIRNoLeader-seed#[96830BA02490A958]) [n:127.0.0.1:38690_ ] o.a.s.c.c.SolrZkClient makePath: /live_nodes/127.0.0.1:38690_
[junit4] 2> 3928 INFO (OverseerStateUpdate-96250284720783364-127.0.0.1:45713_-n_0000000000) [n:127.0.0.1:45713_ ] o.a.s.c.Overseer processMessage: queueSize: 1, message = {
[junit4] 2> "operation":"downnode",
[junit4] 2> "node_name":"127.0.0.1:38690_"} current state version: 4
[junit4] 2> 3929 INFO (zkCallback-7-thread-1-processing-n:127.0.0.1:45713_) [n:127.0.0.1:45713_ ] o.a.s.c.c.ZkStateReader A live node change: [WatchedEvent state:SyncConnected type:NodeChildrenChanged path:/live_nodes], has occurred - updating... (live nodes size: [1])
[junit4] 2> 3929 INFO (zkCallback-11-thread-1) [ ] o.a.s.c.c.ZkStateReader A live node change: [WatchedEvent state:SyncConnected type:NodeChildrenChanged path:/live_nodes], has occurred - updating... (live nodes size: [1])
[junit4] 2> 3929 INFO (zkCallback-7-thread-1-processing-n:127.0.0.1:45713_) [n:127.0.0.1:45713_ ] o.a.s.c.c.ZkStateReader Updated live nodes from ZooKeeper... (1) -> (2)
[junit4] 2> 3929 INFO (zkCallback-11-thread-1) [ ] o.a.s.c.c.ZkStateReader Updated live nodes from ZooKeeper... (1) -> (2)
[junit4] 2> 3929 INFO (OverseerStateUpdate-96250284720783364-127.0.0.1:45713_-n_0000000000) [n:127.0.0.1:45713_ ] o.a.s.c.o.NodeMutator DownNode state invoked for node: 127.0.0.1:38690_
[junit4] 2> 3930 INFO (zkCallback-17-thread-1-processing-n:127.0.0.1:38690_) [n:127.0.0.1:38690_ ] o.a.s.c.c.ZkStateReader A live node change: [WatchedEvent state:SyncConnected type:NodeChildrenChanged path:/live_nodes], has occurred - updating... (live nodes size: [1])
[junit4] 2> 3930 INFO (zkCallback-17-thread-1-processing-n:127.0.0.1:38690_) [n:127.0.0.1:38690_ ] o.a.s.c.c.ZkStateReader Updated live nodes from ZooKeeper... (1) -> (2)
[junit4] 2> 3931 INFO (zkCallback-7-thread-1-processing-n:127.0.0.1:45713_) [n:127.0.0.1:45713_ ] o.a.s.c.c.ZkStateReader A cluster state change: [WatchedEvent state:SyncConnected type:NodeDataChanged path:/clusterstate.json], has occurred - updating... (live nodes size: [2])
[junit4] 2> 3931 INFO (zkCallback-17-thread-1-processing-n:127.0.0.1:38690_) [n:127.0.0.1:38690_ ] o.a.s.c.c.ZkStateReader A cluster state change: [WatchedEvent state:SyncConnected type:NodeDataChanged path:/clusterstate.json], has occurred - updating... (live nodes size: [2])
[junit4] 2> 3931 INFO (zkCallback-11-thread-1) [ ] o.a.s.c.c.ZkStateReader A cluster state change: [WatchedEvent state:SyncConnected type:NodeDataChanged path:/clusterstate.json], has occurred - updating... (live nodes size: [2])
[junit4] 2> 3972 INFO (TEST-ForceLeaderTest.testReplicasInLIRNoLeader-seed#[96830BA02490A958]) [n:127.0.0.1:38690_ ] o.a.s.c.CoreContainer Security conf doesn't exist. Skipping setup for authorization module.
[junit4] 2> 3973 INFO (TEST-ForceLeaderTest.testReplicasInLIRNoLeader-seed#[96830BA02490A958]) [n:127.0.0.1:38690_ ] o.a.s.c.CoreContainer No authentication plugin used.
[junit4] 2> 3974 INFO (TEST-ForceLeaderTest.testReplicasInLIRNoLeader-seed#[96830BA02490A958]) [n:127.0.0.1:38690_ ] o.a.s.c.CorePropertiesLocator Looking for core definitions underneath /home/jenkins/workspace/Lucene-Solr-6.x-Linux/solr/build/solr-core/test/J0/temp/solr.cloud.ForceLeaderTest_96830BA02490A958-001/shard-1-001/cores
[junit4] 2> 3975 INFO (TEST-ForceLeaderTest.testReplicasInLIRNoLeader-seed#[96830BA02490A958]) [n:127.0.0.1:38690_ ] o.a.s.c.CoreDescriptor Created CoreDescriptor: {name=collection1, config=solrconfig.xml, transient=false, schema=schema.xml, loadOnStartup=true, configSetProperties=configsetprops.json, collection=collection1, coreNodeName=, dataDir=data/, shard=}
[junit4] 2> 3975 INFO (TEST-ForceLeaderTest.testReplicasInLIRNoLeader-seed#[96830BA02490A958]) [n:127.0.0.1:38690_ ] o.a.s.c.CorePropertiesLocator Found core collection1 in /home/jenkins/workspace/Lucene-Solr-6.x-Linux/solr/build/solr-core/test/J0/temp/solr.cloud.ForceLeaderTest_96830BA02490A958-001/shard-1-001/cores/collection1
[junit4] 2> 3975 INFO (TEST-ForceLeaderTest.testReplicasInLIRNoLeader-seed#[96830BA02490A958]) [n:127.0.0.1:38690_ ] o.a.s.c.CorePropertiesLocator Found 1 core definitions
[junit4] 2> 3976 INFO (TEST-ForceLeaderTest.testReplicasInLIRNoLeader-seed#[96830BA02490A958]) [n:127.0.0.1:38690_ ] o.a.s.s.SolrDispatchFilter user.dir=/home/jenkins/workspace/Lucene-Solr-6.x-Linux/solr/build/solr-core/test/J0
[junit4] 2> 3976 INFO (TEST-ForceLeaderTest.testReplicasInLIRNoLeader-seed#[96830BA02490A958]) [n:127.0.0.1:38690_ ] o.a.s.s.SolrDispatchFilter SolrDispatchFilter.init() done
[junit4] 2> 3978 INFO (coreLoadExecutor-18-thread-1-processing-n:127.0.0.1:38690_) [n:127.0.0.1:38690_ c:collection1 x:collection1] o.a.s.c.ZkController publishing state=down
[junit4] 2> 3978 INFO (coreLoadExecutor-18-thread-1-processing-n:127.0.0.1:38690_) [n:127.0.0.1:38690_ c:collection1 x:collection1] o.a.s.c.ZkController numShards not found on descriptor - reading it from system property
[junit4] 2> 3979 INFO (coreLoadExecutor-18-thread-1-processing-n:127.0.0.1:38690_) [n:127.0.0.1:38690_ c:collection1 x:collection1] o.a.s.c.ZkController Registering watch for collection collection1
[junit4] 2> 3979 INFO (OverseerStateUpdate-96250284720783364-127.0.0.1:45713_-n_0000000000) [n:127.0.0.1:45713_ ] o.a.s.c.Overseer processMessage: queueSize: 1, message = {
[junit4] 2> "core":"collection1",
[junit4] 2> "roles":null,
[junit4] 2> "base_url":"http://127.0.0.1:38690",
[junit4] 2> "node_name":"127.0.0.1:38690_",
[junit4] 2> "numShards":"2",
[junit4] 2> "state":"down",
[junit4] 2> "shard":null,
[junit4] 2> "collection":"collection1",
[junit4] 2> "operation":"state"} current state version: 5
[junit4] 2> 3979 INFO (coreLoadExecutor-18-thread-1-processing-n:127.0.0.1:38690_) [n:127.0.0.1:38690_ c:collection1 x:collection1] o.a.s.c.c.ZkStateReader Add data for [collection1] ver [0]
[junit4] 2> 3979 INFO (OverseerStateUpdate-96250284720783364-127.0.0.1:45713_-n_0000000000) [n:127.0.0.1:45713_ ] o.a.s.c.o.ReplicaMutator Update state numShards=2 message={
[junit4] 2> "core":"collection1",
[junit4] 2> "roles":null,
[junit4] 2> "base_url":"http://127.0.0.1:38690",
[junit4] 2> "node_name":"127.0.0.1:38690_",
[junit4] 2> "numShards":"2",
[junit4] 2> "state":"down",
[junit4] 2> "shard":null,
[junit4] 2> "collection":"collection1",
[junit4] 2> "operation":"state"}
[junit4] 2> 3979 INFO (OverseerStateUpdate-96250284720783364-127.0.0.1:45713_-n_0000000000) [n:127.0.0.1:45713_ ] o.a.s.c.o.ReplicaMutator Collection already exists with numShards=2
[junit4] 2> 3979 INFO (coreLoadExecutor-18-thread-1-processing-n:127.0.0.1:38690_) [n:127.0.0.1:38690_ c:collection1 x:collection1] o.a.s.c.ZkController look for our core node name
[junit4] 2> 3979 INFO (OverseerStateUpdate-96250284720783364-127.0.0.1:45713_-n_0000000000) [n:127.0.0.1:45713_ ] o.a.s.c.o.ReplicaMutator Assigning new node to shard shard=shard2
[junit4] 2> 4082 INFO (OverseerStateUpdate-96250284720783364-127.0.0.1:45713_-n_0000000000) [n:127.0.0.1:45713_ ] o.a.s.c.o.ZkStateWriter going to update_collection /collections/collection1/state.json version: 0
[junit4] 2> 4083 INFO (zkCallback-17-thread-1-processing-n:127.0.0.1:38690_) [n:127.0.0.1:38690_ ] o.a.s.c.c.ZkStateReader A cluster state change: [WatchedEvent state:SyncConnected type:NodeDataChanged path:/collections/collection1/state.json] for collection [collection1] has occurred - updating... (live nodes size: [2])
[junit4] 2> 4084 INFO (zkCallback-17-thread-1-processing-n:127.0.0.1:38690_) [n:127.0.0.1:38690_ ] o.a.s.c.c.ZkStateReader Updating data for [collection1] from [0] to [1]
[junit4] 2> 4980 INFO (coreLoadExecutor-18-thread-1-processing-n:127.0.0.1:38690_) [n:127.0.0.1:38690_ c:collection1 x:collection1] o.a.s.c.ZkController waiting to find shard id in clusterstate for collection1
[junit4] 2> 4980 INFO (coreLoadExecutor-18-thread-1-processing-n:127.0.0.1:38690_) [n:127.0.0.1:38690_ c:collection1 x:collection1] o.a.s.c.ZkController Check for collection zkNode:collection1
[junit4] 2> 4981 INFO (coreLoadExecutor-18-thread-1-processing-n:127.0.0.1:38690_) [n:127.0.0.1:38690_ c:collection1 x:collection1] o.a.s.c.ZkController Collection zkNode exists
[junit4] 2> 4981 INFO (coreLoadExecutor-18-thread-1-processing-n:127.0.0.1:38690_) [n:127.0.0.1:38690_ c:collection1 x:collection1] o.a.s.c.c.ZkStateReader Load collection config from: [/collections/collection1]
[junit4] 2> 4981 INFO (coreLoadExecutor-18-thread-1-processing-n:127
[...truncated too long message...]
sShutdown=true
[junit4] 2> 104784 INFO (zkCallback-63-thread-2-processing-n:127.0.0.1:33890_) [n:127.0.0.1:33890_ c:collection1 s:shard2 r:core_node3 x:collection1] o.a.s.c.CachingDirectoryFactory Closing directory: /home/jenkins/workspace/Lucene-Solr-6.x-Linux/solr/build/solr-core/test/J0/temp/solr.cloud.ForceLeaderTest_96830BA02490A958-001/shard-3-002/cores/collection1/data
[junit4] 2> 104784 INFO (zkCallback-63-thread-2-processing-n:127.0.0.1:33890_) [n:127.0.0.1:33890_ c:collection1 s:shard2 r:core_node3 x:collection1] o.a.s.c.CachingDirectoryFactory looking to close /home/jenkins/workspace/Lucene-Solr-6.x-Linux/solr/build/solr-core/test/J0/temp/solr.cloud.ForceLeaderTest_96830BA02490A958-001/shard-3-002/cores/collection1/data/index [CachedDir<<refCount=0;path=/home/jenkins/workspace/Lucene-Solr-6.x-Linux/solr/build/solr-core/test/J0/temp/solr.cloud.ForceLeaderTest_96830BA02490A958-001/shard-3-002/cores/collection1/data/index;done=false>>]
[junit4] 2> 104784 INFO (zkCallback-63-thread-2-processing-n:127.0.0.1:33890_) [n:127.0.0.1:33890_ c:collection1 s:shard2 r:core_node3 x:collection1] o.a.s.c.CachingDirectoryFactory Closing directory, CoreContainer#isShutdown=true
[junit4] 2> 104784 INFO (zkCallback-63-thread-2-processing-n:127.0.0.1:33890_) [n:127.0.0.1:33890_ c:collection1 s:shard2 r:core_node3 x:collection1] o.a.s.c.CachingDirectoryFactory Closing directory: /home/jenkins/workspace/Lucene-Solr-6.x-Linux/solr/build/solr-core/test/J0/temp/solr.cloud.ForceLeaderTest_96830BA02490A958-001/shard-3-002/cores/collection1/data/index
[junit4] 2> 104784 INFO (zkCallback-63-thread-2-processing-n:127.0.0.1:33890_) [n:127.0.0.1:33890_ c:collection1 s:shard2 r:core_node3 x:collection1] o.a.s.c.ElectionContext Canceling election /collections/collection1/leader_elect/shard2/election/96250286933278735-core_node3-n_0000000001
[junit4] 2> 104784 WARN (zkCallback-63-thread-2-processing-n:127.0.0.1:33890_) [n:127.0.0.1:33890_ c:collection1 s:shard2 r:core_node3 x:collection1] o.a.s.c.LeaderElector
[junit4] 2> org.apache.zookeeper.KeeperException$SessionExpiredException: KeeperErrorCode = Session expired for /collections/collection1/leader_elect/shard2/election/96250286933278735-core_node3-n_0000000001
[junit4] 2> at org.apache.zookeeper.KeeperException.create(KeeperException.java:127)
[junit4] 2> at org.apache.zookeeper.KeeperException.create(KeeperException.java:51)
[junit4] 2> at org.apache.zookeeper.ZooKeeper.delete(ZooKeeper.java:873)
[junit4] 2> at org.apache.solr.common.cloud.SolrZkClient$2.execute(SolrZkClient.java:244)
[junit4] 2> at org.apache.solr.common.cloud.SolrZkClient$2.execute(SolrZkClient.java:241)
[junit4] 2> at org.apache.solr.common.cloud.ZkCmdExecutor.retryOperation(ZkCmdExecutor.java:60)
[junit4] 2> at org.apache.solr.common.cloud.SolrZkClient.delete(SolrZkClient.java:241)
[junit4] 2> at org.apache.solr.cloud.ElectionContext.cancelElection(ElectionContext.java:85)
[junit4] 2> at org.apache.solr.cloud.ShardLeaderElectionContextBase.cancelElection(ElectionContext.java:142)
[junit4] 2> at org.apache.solr.cloud.ShardLeaderElectionContext.cancelElection(ElectionContext.java:274)
[junit4] 2> at org.apache.solr.cloud.ShardLeaderElectionContext.runLeaderProcess(ElectionContext.java:450)
[junit4] 2> at org.apache.solr.cloud.LeaderElector.runIamLeaderProcess(LeaderElector.java:170)
[junit4] 2> at org.apache.solr.cloud.LeaderElector.checkIfIamLeader(LeaderElector.java:135)
[junit4] 2> at org.apache.solr.cloud.LeaderElector.access$200(LeaderElector.java:56)
[junit4] 2> at org.apache.solr.cloud.LeaderElector$ElectionWatcher.process(LeaderElector.java:348)
[junit4] 2> at org.apache.solr.common.cloud.SolrZkClient$3.lambda$process$0(SolrZkClient.java:266)
[junit4] 2> at java.util.concurrent.Executors$RunnableAdapter.call(Executors.java:511)
[junit4] 2> at java.util.concurrent.FutureTask.run(FutureTask.java:266)
[junit4] 2> at org.apache.solr.common.util.ExecutorUtil$MDCAwareThreadPoolExecutor.lambda$execute$0(ExecutorUtil.java:229)
[junit4] 2> at java.util.concurrent.ThreadPoolExecutor.runWorker(ThreadPoolExecutor.java:1142)
[junit4] 2> at java.util.concurrent.ThreadPoolExecutor$Worker.run(ThreadPoolExecutor.java:617)
[junit4] 2> at java.lang.Thread.run(Thread.java:745)
[junit4] 2> 104786 INFO (TEST-ForceLeaderTest.testLastPublishedStateIsActive-seed#[96830BA02490A958]) [ ] o.e.j.s.ServerConnector Stopped ServerConnector@11aa764{HTTP/1.1,[http/1.1]}{127.0.0.1:0}
[junit4] 2> 104787 INFO (TEST-ForceLeaderTest.testLastPublishedStateIsActive-seed#[96830BA02490A958]) [ ] o.e.j.s.h.ContextHandler Stopped o.e.j.s.ServletContextHandler@a2d2cb{/,null,UNAVAILABLE}
[junit4] 2> 104787 INFO (TEST-ForceLeaderTest.testLastPublishedStateIsActive-seed#[96830BA02490A958]) [ ] o.a.s.c.ChaosMonkey monkey: stop shard! 44917
[junit4] 2> 104788 INFO (TEST-ForceLeaderTest.testLastPublishedStateIsActive-seed#[96830BA02490A958]) [ ] o.a.s.c.ZkTestServer connecting to 127.0.0.1:37629 37629
[junit4] 2> 104799 INFO (Thread-51) [ ] o.a.s.c.ZkTestServer connecting to 127.0.0.1:37629 37629
[junit4] 2> 104799 WARN (Thread-51) [ ] o.a.s.c.ZkTestServer Watch limit violations:
[junit4] 2> Maximum concurrent create/delete watches above limit:
[junit4] 2>
[junit4] 2> 5 /solr/aliases.json
[junit4] 2> 5 /solr/clusterprops.json
[junit4] 2> 4 /solr/security.json
[junit4] 2> 4 /solr/configs/conf1
[junit4] 2>
[junit4] 2> Maximum concurrent data watches above limit:
[junit4] 2>
[junit4] 2> 5 /solr/clusterstate.json
[junit4] 2> 3 /solr/collections/forceleader_last_published/state.json
[junit4] 2> 3 /solr/collections/collection1/state.json
[junit4] 2>
[junit4] 2> Maximum concurrent children watches above limit:
[junit4] 2>
[junit4] 2> 65 /solr/overseer/collection-queue-work
[junit4] 2> 34 /solr/overseer/queue
[junit4] 2> 12 /solr/overseer/queue-work
[junit4] 2> 5 /solr/live_nodes
[junit4] 2> 5 /solr/collections
[junit4] 2>
[junit4] 2> 104799 WARN (TEST-ForceLeaderTest.testLastPublishedStateIsActive-seed#[96830BA02490A958]) [ ] o.a.s.c.SocketProxy Closing 5 connections to: http://127.0.0.1:44917/, target: http://127.0.0.1:40110/
[junit4] 2> 104800 WARN (TEST-ForceLeaderTest.testLastPublishedStateIsActive-seed#[96830BA02490A958]) [ ] o.a.s.c.SocketProxy Closing 9 connections to: http://127.0.0.1:36434/, target: http://127.0.0.1:37154/
[junit4] 2> 104800 WARN (TEST-ForceLeaderTest.testLastPublishedStateIsActive-seed#[96830BA02490A958]) [ ] o.a.s.c.SocketProxy Closing 9 connections to: http://127.0.0.1:43109/, target: http://127.0.0.1:45862/
[junit4] 2> 104800 WARN (TEST-ForceLeaderTest.testLastPublishedStateIsActive-seed#[96830BA02490A958]) [ ] o.a.s.c.SocketProxy Closing 0 connections to: http://127.0.0.1:33890/, target: http://127.0.0.1:34303/
[junit4] 2> 104802 INFO (SUITE-ForceLeaderTest-seed#[96830BA02490A958]-worker) [ ] o.a.s.SolrTestCaseJ4 ###deleteCore
[junit4] 2> NOTE: leaving temporary files on disk at: /home/jenkins/workspace/Lucene-Solr-6.x-Linux/solr/build/solr-core/test/J0/temp/solr.cloud.ForceLeaderTest_96830BA02490A958-001
[junit4] 2> Jul 16, 2016 9:54:56 AM com.carrotsearch.randomizedtesting.ThreadLeakControl checkThreadLeaks
[junit4] 2> WARNING: Will linger awaiting termination of 2 leaked thread(s).
[junit4] 2> NOTE: test params are: codec=Asserting(Lucene62): {range_facet_l_dv=Lucene50(blocksize=128), _version_=PostingsFormat(name=Memory doPackFST= true), multiDefault=PostingsFormat(name=LuceneFixedGap), a_t=PostingsFormat(name=Memory doPackFST= true), intDefault=PostingsFormat(name=Memory doPackFST= true), id=Lucene50(blocksize=128), range_facet_i_dv=PostingsFormat(name=Memory doPackFST= true), text=PostingsFormat(name=LuceneVarGapDocFreqInterval), range_facet_l=PostingsFormat(name=Memory doPackFST= true), timestamp=PostingsFormat(name=Memory doPackFST= true)}, docValues:{range_facet_l_dv=DocValuesFormat(name=Lucene54), range_facet_i_dv=DocValuesFormat(name=Direct), timestamp=DocValuesFormat(name=Direct)}, maxPointsInLeafNode=993, maxMBSortInHeap=6.413486718829089, sim=ClassicSimilarity, locale=vi-VN, timezone=Asia/Qatar
[junit4] 2> NOTE: Linux 4.4.0-28-generic i386/Oracle Corporation 1.8.0_92 (32-bit)/cpus=12,threads=1,free=25815080,total=88883200
[junit4] 2> NOTE: All tests run in this JVM: [ForceLeaderTest]
[junit4] Completed [14/621 (1!)] on J0 in 106.30s, 3 tests, 1 error, 1 skipped <<< FAILURES!
[...truncated 1983 lines...]
BUILD FAILED
/home/jenkins/workspace/Lucene-Solr-6.x-Linux/build.xml:763: The following error occurred while executing this line:
/home/jenkins/workspace/Lucene-Solr-6.x-Linux/build.xml:707: The following error occurred while executing this line:
/home/jenkins/workspace/Lucene-Solr-6.x-Linux/build.xml:59: The following error occurred while executing this line:
/home/jenkins/workspace/Lucene-Solr-6.x-Linux/solr/build.xml:233: The following error occurred while executing this line:
/home/jenkins/workspace/Lucene-Solr-6.x-Linux/solr/common-build.xml:536: The following error occurred while executing this line:
/home/jenkins/workspace/Lucene-Solr-6.x-Linux/lucene/common-build.xml:1443: The following error occurred while executing this line:
/home/jenkins/workspace/Lucene-Solr-6.x-Linux/lucene/common-build.xml:984: There were test failures: 621 suites (10 ignored), 2642 tests, 1 error, 129 ignored (83 assumptions) [seed: 96830BA02490A958]
Total time: 56 minutes 11 seconds
Build step 'Invoke Ant' marked build as failure
Archiving artifacts
[WARNINGS] Skipping publisher since build result is FAILURE
Recording test results
Email was triggered for: Failure - Any
Sending email for trigger: Failure - Any