You are viewing a plain text version of this content. The canonical link for it is here.
Posted to builds@solr.apache.org by Apache Jenkins Server <je...@builds.apache.org> on 2023/12/08 17:13:59 UTC

[JENKINS] Solr » Solr-Check-9.x - Build # 1 - Failure!

Build: https://ci-builds.apache.org/job/Solr/job/Solr-Check-9.x/1/

1 tests failed.
FAILED:  org.apache.solr.search.TestFiltering.testRandomFiltering

Error Message:
java.lang.AssertionError: FAILURE: indexSize=57 iiter=0 qiter=413 request=[q, {!cache=false tag=t} val_i:0 val_i:1 val_i:2 val_i:5 val_i:8 val_i:9 val_i:10 val_i:12 val_i:14 val_i:16 val_i:19 val_i:21 val_i:22 val_i:25 val_i:29 val_i:33 val_i:37 val_i:39 val_i:43 val_i:44 val_i:45 val_i:46 val_i:47 val_i:48 val_i:49 val_i:50 val_i:51 val_i:52 val_i:54 val_i:55, fq, {!frange v=val_i l=37 u=61}, fq, {!cache=true} val_i:0 val_i:1 val_i:3 val_i:5 val_i:7 val_i:8 val_i:9 val_i:11 val_i:12 val_i:13 val_i:16 val_i:21 val_i:22 val_i:23 val_i:25 val_i:26 val_i:27 val_i:31 val_i:33 val_i:34 val_i:36 val_i:37 val_i:38 val_i:39 val_i:42 val_i:46 val_i:47 val_i:48 val_i:52 val_i:53 val_i:54, fq, {! cache=true tag=t}id:RAND537214227 OR val_s:{00024 TO 00074], fq, {!cache=true} -val_i:0 -val_i:1 -val_i:3 -val_i:4 -val_i:5 -val_i:6 -val_i:9 -val_i:10 -val_i:11 -val_i:12 -val_i:15 -val_i:19 -val_i:21 -val_i:22 -val_i:23 -val_i:25 -val_i:28 -val_i:29 -val_i:30 -val_i:32 -val_i:34 -val_i:40 -val_i:43 -val_i:45 -val_i:46 -val_i:49 -val_i:51 -val_i:52 -val_i:54, facet, true, facet.query, *:*, facet.query, {!key=multiSelect ex=t}*:*, facet.query, {!key=facetQuery cache=true} val_i:2 val_i:3 val_i:4 val_i:6 val_i:7 val_i:9 val_i:14 val_i:15 val_i:16 val_i:17 val_i:21 val_i:25 val_i:27 val_i:28 val_i:31 val_i:32 val_i:33 val_i:34 val_i:35 val_i:36 val_i:38 val_i:39 val_i:44 val_i:46 val_i:48 val_i:49 val_i:52 val_i:53 val_i:55]

Stack Trace:
java.lang.AssertionError: FAILURE: indexSize=57 iiter=0 qiter=413 request=[q, {!cache=false tag=t} val_i:0 val_i:1 val_i:2 val_i:5 val_i:8 val_i:9 val_i:10 val_i:12 val_i:14 val_i:16 val_i:19 val_i:21 val_i:22 val_i:25 val_i:29 val_i:33 val_i:37 val_i:39 val_i:43 val_i:44 val_i:45 val_i:46 val_i:47 val_i:48 val_i:49 val_i:50 val_i:51 val_i:52 val_i:54 val_i:55, fq, {!frange v=val_i l=37 u=61}, fq, {!cache=true} val_i:0 val_i:1 val_i:3 val_i:5 val_i:7 val_i:8 val_i:9 val_i:11 val_i:12 val_i:13 val_i:16 val_i:21 val_i:22 val_i:23 val_i:25 val_i:26 val_i:27 val_i:31 val_i:33 val_i:34 val_i:36 val_i:37 val_i:38 val_i:39 val_i:42 val_i:46 val_i:47 val_i:48 val_i:52 val_i:53 val_i:54, fq, {! cache=true tag=t}id:RAND537214227 OR val_s:{00024 TO 00074], fq, {!cache=true} -val_i:0 -val_i:1 -val_i:3 -val_i:4 -val_i:5 -val_i:6 -val_i:9 -val_i:10 -val_i:11 -val_i:12 -val_i:15 -val_i:19 -val_i:21 -val_i:22 -val_i:23 -val_i:25 -val_i:28 -val_i:29 -val_i:30 -val_i:32 -val_i:34 -val_i:40 -val_i:43 -val_i:45 -val_i:46 -val_i:49 -val_i:51 -val_i:52 -val_i:54, facet, true, facet.query, *:*, facet.query, {!key=multiSelect ex=t}*:*, facet.query, {!key=facetQuery cache=true} val_i:2 val_i:3 val_i:4 val_i:6 val_i:7 val_i:9 val_i:14 val_i:15 val_i:16 val_i:17 val_i:21 val_i:25 val_i:27 val_i:28 val_i:31 val_i:32 val_i:33 val_i:34 val_i:35 val_i:36 val_i:38 val_i:39 val_i:44 val_i:46 val_i:48 val_i:49 val_i:52 val_i:53 val_i:55]
	at __randomizedtesting.SeedInfo.seed([A264F2E4B9295391:BD0751215C0E1398]:0)
	at org.junit.Assert.fail(Assert.java:89)
	at org.apache.solr.search.TestFiltering.testRandomFiltering(TestFiltering.java:576)
	at java.base/jdk.internal.reflect.NativeMethodAccessorImpl.invoke0(Native Method)
	at java.base/jdk.internal.reflect.NativeMethodAccessorImpl.invoke(NativeMethodAccessorImpl.java:62)
	at java.base/jdk.internal.reflect.DelegatingMethodAccessorImpl.invoke(DelegatingMethodAccessorImpl.java:43)
	at java.base/java.lang.reflect.Method.invoke(Method.java:566)
	at com.carrotsearch.randomizedtesting.RandomizedRunner.invoke(RandomizedRunner.java:1758)
	at com.carrotsearch.randomizedtesting.RandomizedRunner$8.evaluate(RandomizedRunner.java:946)
	at com.carrotsearch.randomizedtesting.RandomizedRunner$9.evaluate(RandomizedRunner.java:982)
	at com.carrotsearch.randomizedtesting.RandomizedRunner$10.evaluate(RandomizedRunner.java:996)
	at com.carrotsearch.randomizedtesting.rules.SystemPropertiesRestoreRule$1.evaluate(SystemPropertiesRestoreRule.java:80)
	at org.junit.rules.RunRules.evaluate(RunRules.java:20)
	at org.apache.lucene.tests.util.TestRuleSetupTeardownChained$1.evaluate(TestRuleSetupTeardownChained.java:48)
	at org.apache.lucene.tests.util.AbstractBeforeAfterRule$1.evaluate(AbstractBeforeAfterRule.java:43)
	at org.apache.lucene.tests.util.TestRuleThreadAndTestName$1.evaluate(TestRuleThreadAndTestName.java:45)
	at org.apache.lucene.tests.util.TestRuleIgnoreAfterMaxFailures$1.evaluate(TestRuleIgnoreAfterMaxFailures.java:60)
	at org.apache.lucene.tests.util.TestRuleMarkFailure$1.evaluate(TestRuleMarkFailure.java:44)
	at org.junit.rules.RunRules.evaluate(RunRules.java:20)
	at com.carrotsearch.randomizedtesting.rules.StatementAdapter.evaluate(StatementAdapter.java:36)
	at com.carrotsearch.randomizedtesting.ThreadLeakControl$StatementRunner.run(ThreadLeakControl.java:390)
	at com.carrotsearch.randomizedtesting.ThreadLeakControl.forkTimeoutingTask(ThreadLeakControl.java:843)
	at com.carrotsearch.randomizedtesting.ThreadLeakControl$3.evaluate(ThreadLeakControl.java:490)
	at com.carrotsearch.randomizedtesting.RandomizedRunner.runSingleTest(RandomizedRunner.java:955)
	at com.carrotsearch.randomizedtesting.RandomizedRunner$5.evaluate(RandomizedRunner.java:840)
	at com.carrotsearch.randomizedtesting.RandomizedRunner$6.evaluate(RandomizedRunner.java:891)
	at com.carrotsearch.randomizedtesting.RandomizedRunner$7.evaluate(RandomizedRunner.java:902)
	at com.carrotsearch.randomizedtesting.rules.StatementAdapter.evaluate(StatementAdapter.java:36)
	at com.carrotsearch.randomizedtesting.rules.StatementAdapter.evaluate(StatementAdapter.java:36)
	at org.apache.lucene.tests.util.AbstractBeforeAfterRule$1.evaluate(AbstractBeforeAfterRule.java:43)
	at org.apache.lucene.tests.util.AbstractBeforeAfterRule$1.evaluate(AbstractBeforeAfterRule.java:43)
	at com.carrotsearch.randomizedtesting.rules.SystemPropertiesRestoreRule$1.evaluate(SystemPropertiesRestoreRule.java:80)
	at org.junit.rules.RunRules.evaluate(RunRules.java:20)
	at org.apache.lucene.tests.util.AbstractBeforeAfterRule$1.evaluate(AbstractBeforeAfterRule.java:43)
	at com.carrotsearch.randomizedtesting.rules.StatementAdapter.evaluate(StatementAdapter.java:36)
	at org.apache.lucene.tests.util.TestRuleStoreClassName$1.evaluate(TestRuleStoreClassName.java:38)
	at com.carrotsearch.randomizedtesting.rules.NoShadowingOrOverridesOnMethodsRule$1.evaluate(NoShadowingOrOverridesOnMethodsRule.java:40)
	at com.carrotsearch.randomizedtesting.rules.NoShadowingOrOverridesOnMethodsRule$1.evaluate(NoShadowingOrOverridesOnMethodsRule.java:40)
	at com.carrotsearch.randomizedtesting.rules.StatementAdapter.evaluate(StatementAdapter.java:36)
	at com.carrotsearch.randomizedtesting.rules.StatementAdapter.evaluate(StatementAdapter.java:36)
	at org.apache.lucene.tests.util.TestRuleAssertionsRequired$1.evaluate(TestRuleAssertionsRequired.java:53)
	at org.apache.lucene.tests.util.AbstractBeforeAfterRule$1.evaluate(AbstractBeforeAfterRule.java:43)
	at org.apache.lucene.tests.util.TestRuleMarkFailure$1.evaluate(TestRuleMarkFailure.java:44)
	at org.apache.lucene.tests.util.TestRuleIgnoreAfterMaxFailures$1.evaluate(TestRuleIgnoreAfterMaxFailures.java:60)
	at org.apache.lucene.tests.util.TestRuleIgnoreTestSuites$1.evaluate(TestRuleIgnoreTestSuites.java:47)
	at org.junit.rules.RunRules.evaluate(RunRules.java:20)
	at com.carrotsearch.randomizedtesting.rules.StatementAdapter.evaluate(StatementAdapter.java:36)
	at com.carrotsearch.randomizedtesting.ThreadLeakControl$StatementRunner.run(ThreadLeakControl.java:390)
	at com.carrotsearch.randomizedtesting.ThreadLeakControl.lambda$forkTimeoutingTask$0(ThreadLeakControl.java:850)
	at java.base/java.lang.Thread.run(Thread.java:829)




Build Log:
[...truncated 2241 lines...]
#   ERROR: IOException occurred when talking to server at: https://localhost:35181/solr/test/select
#
#   org.apache.solr.client.solrj.SolrServerException: IOException occurred when talking to server at: https://localhost:35181/solr/test/select
#   	at org.apache.solr.client.solrj.impl.Http2SolrClient.request(Http2SolrClient.java:585)
#   	at org.apache.solr.client.solrj.SolrClient.request(SolrClient.java:1193)
#   	at org.apache.solr.cli.ApiTool.callGet(ApiTool.java:92)
#   	at org.apache.solr.cli.ApiTool.runImpl(ApiTool.java:64)
#   	at org.apache.solr.cli.ToolBase.runTool(ToolBase.java:52)
#   	at org.apache.solr.cli.SolrCLI.main(SolrCLI.java:153)
#   Caused by: java.nio.channels.ClosedChannelException
#   	at org.eclipse.jetty.http2.HTTP2Session$StreamsState.onShutdown(HTTP2Session.java:1865)
#   	at org.eclipse.jetty.http2.HTTP2Session.onShutdown(HTTP2Session.java:1036)
#   	at org.eclipse.jetty.http2.HTTP2Connection$HTTP2Producer.produce(HTTP2Connection.java:385)
#   	at org.eclipse.jetty.util.thread.strategy.AdaptiveExecutionStrategy.produceTask(AdaptiveExecutionStrategy.java:455)
#   	at org.eclipse.jetty.util.thread.strategy.AdaptiveExecutionStrategy.tryProduce(AdaptiveExecutionStrategy.java:248)
#   	at org.eclipse.jetty.util.thread.strategy.AdaptiveExecutionStrategy.produce(AdaptiveExecutionStrategy.java:193)
#   	at org.eclipse.jetty.http2.HTTP2Connection.produce(HTTP2Connection.java:208)
#   	at org.eclipse.jetty.http2.client.HTTP2ClientConnectionFactory$HTTP2ClientConnection.succeeded(HTTP2ClientConnectionFactory.java:174)
#   	at org.eclipse.jetty.util.Callback$Nested.succeeded(Callback.java:392)
#   	at org.eclipse.jetty.util.CountingCallback.succeeded(CountingCallback.java:63)
#   	at org.eclipse.jetty.util.Callback$Nested.succeeded(Callback.java:392)
#   	at org.eclipse.jetty.http2.HTTP2Session$ControlEntry.succeeded(HTTP2Session.java:1377)
#   	at java.base/java.util.ArrayList.forEach(ArrayList.java:1541)
#   	at org.eclipse.jetty.http2.HTTP2Flusher.finish(HTTP2Flusher.java:323)
#   	at org.eclipse.jetty.http2.HTTP2Flusher.succeeded(HTTP2Flusher.java:315)
#   	at org.eclipse.jetty.io.WriteFlusher.write(WriteFlusher.java:291)
#   	at org.eclipse.jetty.io.WriteFlusher.write(WriteFlusher.java:254)
#   	at org.eclipse.jetty.io.AbstractEndPoint.write(AbstractEndPoint.java:386)
#   	at org.eclipse.jetty.http2.HTTP2Flusher.process(HTTP2Flusher.java:292)
#   	at org.eclipse.jetty.util.IteratingCallback.processing(IteratingCallback.java:243)
#   	at org.eclipse.jetty.util.IteratingCallback.iterate(IteratingCallback.java:224)
#   	at org.eclipse.jetty.http2.HTTP2Session.frame(HTTP2Session.java:821)
#   	at org.eclipse.jetty.http2.HTTP2Session.frames(HTTP2Session.java:793)
#   	at org.eclipse.jetty.http2.client.HTTP2ClientConnectionFactory$HTTP2ClientConnection.onOpen(HTTP2ClientConnectionFactory.java:161)
#   	at org.eclipse.jetty.io.AbstractEndPoint.upgrade(AbstractEndPoint.java:451)
#   	at org.eclipse.jetty.io.NegotiatingClientConnection.replaceConnection(NegotiatingClientConnection.java:117)
#   	at org.eclipse.jetty.io.NegotiatingClientConnection.onFillable(NegotiatingClientConnection.java:87)
#   	at org.eclipse.jetty.io.AbstractConnection$ReadCallback.succeeded(AbstractConnection.java:314)
#   	at org.eclipse.jetty.io.FillInterest.fillable(FillInterest.java:100)
#   	at org.eclipse.jetty.io.ssl.SslConnection$DecryptedEndPoint.onFillable(SslConnection.java:558)
#   	at org.eclipse.jetty.io.ssl.SslConnection.onFillable(SslConnection.java:379)
#   	at org.eclipse.jetty.io.ssl.SslConnection$2.succeeded(SslConnection.java:146)
#   	at org.eclipse.jetty.io.FillInterest.fillable(FillInterest.java:100)
#   	at org.eclipse.jetty.io.SelectableChannelEndPoint$1.run(SelectableChannelEndPoint.java:53)
#   	at org.apache.solr.common.util.ExecutorUtil$MDCAwareThreadPoolExecutor.lambda$execute$0(ExecutorUtil.java:294)
#   	at java.base/java.util.concurrent.ThreadPoolExecutor.runWorker(ThreadPoolExecutor.java:1128)
#   	at java.base/java.util.concurrent.ThreadPoolExecutor$Worker.run(ThreadPoolExecutor.java:628)
#   	at java.base/java.lang.Thread.run(Thread.java:829)
# --
#
# Please find the SOLR_HOME snapshot for failed test #5 at: /home/jenkins/jenkins-slave/workspace/Solr/Solr-Check-9.x/solr/packaging/build/test-output/failure-snapshots/62-5
# Last output:
# INFO  - 2023-12-08 17:10:38.119; org.apache.solr.util.configuration.SSLConfigurations; Setting javax.net.ssl.keyStorePassword
# INFO  - 2023-12-08 17:10:38.124; org.apache.solr.util.configuration.SSLConfigurations; Setting javax.net.ssl.trustStorePassword
# WARN  - 2023-12-08 17:10:38.967; org.apache.solr.common.cloud.SolrZkClient; Using default ZkCredentialsInjector. ZkCredentialsInjector is not secure, it creates an empty list of credentials which leads to 'OPEN_ACL_UNSAFE' ACLs to Zookeeper nodes
# WARN  - 2023-12-08 17:10:39.001; org.apache.solr.common.cloud.SolrZkClient; Using default ZkACLProvider. DefaultZkACLProvider is not secure, it creates 'OPEN_ACL_UNSAFE' ACLs to Zookeeper nodes
ok 63 start solr with mTLS wanted in 51046ms
ok 64 test keystore reload in 69252ms
ok 65 SOLR-11740 check 'solr stop' connection in 14311ms
ok 66 stop command for single port in 18510ms
ok 67 status detects locally running solr in 7879ms
ok 68 status does not expose cli parameters to end user in 247ms
ok 69 listing out files in 3035ms
ok 70 copying files around in 6627ms
ok 71 upconfig in 2568ms
ok 72 zkcli.sh gets 'solrhome' from 'solr.home' system property in 1236ms
ok 73 zkcli.sh gets 'solrhome' from 'solrhome' command line option in 1236ms
ok 74 Cleanup in 1277ms

> Task :solr:packaging:integrationTests FAILED

ERROR: The following test(s) have failed:
  - org.apache.solr.search.TestFiltering.testRandomFiltering (:solr:core)
    Test output: /home/jenkins/jenkins-slave/workspace/Solr/Solr-Check-9.x/solr/core/build/test-results/test/outputs/OUTPUT-org.apache.solr.search.TestFiltering.txt
    Reproduce with: gradlew :solr:core:test --tests "org.apache.solr.search.TestFiltering.testRandomFiltering" -Ptests.jvms=4 -Ptests.haltonfailure=false "-Ptests.jvmargs=-XX:TieredStopAtLevel=1 -XX:+UseParallelGC -XX:ActiveProcessorCount=1 -XX:ReservedCodeCacheSize=120m" -Ptests.seed=A264F2E4B9295391 -Ptests.multiplier=2 -Ptests.badapples=false -Ptests.file.encoding=ISO-8859-1

WARNING: there were unreferenced files under license folder:
  - /home/jenkins/jenkins-slave/workspace/Solr/Solr-Check-9.x/solr/licenses/awaitility-4.2.0.jar.sha1

FAILURE: Build failed with an exception.

* Where:
Build file '/home/jenkins/jenkins-slave/workspace/Solr/Solr-Check-9.x/solr/packaging/build.gradle' line: 301

* What went wrong:
Execution failed for task ':solr:packaging:integrationTests'.
> Process 'command '/home/jenkins/jenkins-slave/workspace/Solr/Solr-Check-9.x/.gradle/node/packaging/node_modules/bats/bin/bats'' finished with non-zero exit value 1

* Try:
> Run with --stacktrace option to get the stack trace.
> Run with --info or --debug option to get more log output.
> Get more help at https://help.gradle.org.

Deprecated Gradle features were used in this build, making it incompatible with Gradle 9.0.

You can use '--warning-mode all' to show the individual deprecation warnings and determine if they come from your own scripts or plugins.

For more on this, please refer to https://docs.gradle.org/8.4/userguide/command_line_interface.html#sec:command_line_warnings in the Gradle documentation.

BUILD FAILED in 1h 5m 39s
693 actionable tasks: 693 executed

Publishing build scan...
https://ge.apache.org/s/dp57ywbf3rqmu

Build step 'Invoke Gradle script' changed build result to FAILURE
Build step 'Invoke Gradle script' marked build as failure
Archiving artifacts
Recording test results
[Checks API] No suitable checks publisher found.
Email was triggered for: Failure - Any
Sending email for trigger: Failure - Any