You are viewing a plain text version of this content. The canonical link for it is here.
Posted to dev@lucene.apache.org by Policeman Jenkins Server <je...@thetaphi.de> on 2016/09/14 16:34:15 UTC
[JENKINS-EA] Lucene-Solr-master-Linux (32bit/jdk-9-ea+134) - Build
# 17819 - Unstable!
Build: http://jenkins.thetaphi.de/job/Lucene-Solr-master-Linux/17819/
Java: 32bit/jdk-9-ea+134 -client -XX:+UseG1GC
1 tests failed.
FAILED: org.apache.solr.cloud.ForceLeaderTest.testReplicasInLIRNoLeader
Error Message:
No live SolrServers available to handle this request:[http://127.0.0.1:42982/w_d/forceleader_test_collection_shard1_replica1]
Stack Trace:
org.apache.solr.client.solrj.impl.CloudSolrClient$RouteException: No live SolrServers available to handle this request:[http://127.0.0.1:42982/w_d/forceleader_test_collection_shard1_replica1]
at __randomizedtesting.SeedInfo.seed([945285203273CE79:72C5B1E00BF13718]:0)
at org.apache.solr.client.solrj.impl.CloudSolrClient.directUpdate(CloudSolrClient.java:755)
at org.apache.solr.client.solrj.impl.CloudSolrClient.sendRequest(CloudSolrClient.java:1161)
at org.apache.solr.client.solrj.impl.CloudSolrClient.requestWithRetryOnStaleState(CloudSolrClient.java:1050)
at org.apache.solr.client.solrj.impl.CloudSolrClient.request(CloudSolrClient.java:992)
at org.apache.solr.cloud.AbstractFullDistribZkTestBase.sendDocsWithRetry(AbstractFullDistribZkTestBase.java:753)
at org.apache.solr.cloud.AbstractFullDistribZkTestBase.sendDocsWithRetry(AbstractFullDistribZkTestBase.java:741)
at org.apache.solr.cloud.ForceLeaderTest.sendDoc(ForceLeaderTest.java:424)
at org.apache.solr.cloud.ForceLeaderTest.testReplicasInLIRNoLeader(ForceLeaderTest.java:131)
at jdk.internal.reflect.NativeMethodAccessorImpl.invoke0(java.base@9-ea/Native Method)
at jdk.internal.reflect.NativeMethodAccessorImpl.invoke(java.base@9-ea/NativeMethodAccessorImpl.java:62)
at jdk.internal.reflect.DelegatingMethodAccessorImpl.invoke(java.base@9-ea/DelegatingMethodAccessorImpl.java:43)
at java.lang.reflect.Method.invoke(java.base@9-ea/Method.java:535)
at com.carrotsearch.randomizedtesting.RandomizedRunner.invoke(RandomizedRunner.java:1764)
at com.carrotsearch.randomizedtesting.RandomizedRunner$8.evaluate(RandomizedRunner.java:871)
at com.carrotsearch.randomizedtesting.RandomizedRunner$9.evaluate(RandomizedRunner.java:907)
at com.carrotsearch.randomizedtesting.RandomizedRunner$10.evaluate(RandomizedRunner.java:921)
at org.apache.solr.BaseDistributedSearchTestCase$ShardsRepeatRule$ShardsFixedStatement.callStatement(BaseDistributedSearchTestCase.java:985)
at org.apache.solr.BaseDistributedSearchTestCase$ShardsRepeatRule$ShardsStatement.evaluate(BaseDistributedSearchTestCase.java:960)
at com.carrotsearch.randomizedtesting.rules.SystemPropertiesRestoreRule$1.evaluate(SystemPropertiesRestoreRule.java:57)
at org.apache.lucene.util.TestRuleSetupTeardownChained$1.evaluate(TestRuleSetupTeardownChained.java:49)
at org.apache.lucene.util.AbstractBeforeAfterRule$1.evaluate(AbstractBeforeAfterRule.java:45)
at org.apache.lucene.util.TestRuleThreadAndTestName$1.evaluate(TestRuleThreadAndTestName.java:48)
at org.apache.lucene.util.TestRuleIgnoreAfterMaxFailures$1.evaluate(TestRuleIgnoreAfterMaxFailures.java:64)
at org.apache.lucene.util.TestRuleMarkFailure$1.evaluate(TestRuleMarkFailure.java:47)
at com.carrotsearch.randomizedtesting.rules.StatementAdapter.evaluate(StatementAdapter.java:36)
at com.carrotsearch.randomizedtesting.ThreadLeakControl$StatementRunner.run(ThreadLeakControl.java:367)
at com.carrotsearch.randomizedtesting.ThreadLeakControl.forkTimeoutingTask(ThreadLeakControl.java:809)
at com.carrotsearch.randomizedtesting.ThreadLeakControl$3.evaluate(ThreadLeakControl.java:460)
at com.carrotsearch.randomizedtesting.RandomizedRunner.runSingleTest(RandomizedRunner.java:880)
at com.carrotsearch.randomizedtesting.RandomizedRunner$5.evaluate(RandomizedRunner.java:781)
at com.carrotsearch.randomizedtesting.RandomizedRunner$6.evaluate(RandomizedRunner.java:816)
at com.carrotsearch.randomizedtesting.RandomizedRunner$7.evaluate(RandomizedRunner.java:827)
at com.carrotsearch.randomizedtesting.rules.StatementAdapter.evaluate(StatementAdapter.java:36)
at com.carrotsearch.randomizedtesting.rules.SystemPropertiesRestoreRule$1.evaluate(SystemPropertiesRestoreRule.java:57)
at org.apache.lucene.util.AbstractBeforeAfterRule$1.evaluate(AbstractBeforeAfterRule.java:45)
at com.carrotsearch.randomizedtesting.rules.StatementAdapter.evaluate(StatementAdapter.java:36)
at org.apache.lucene.util.TestRuleStoreClassName$1.evaluate(TestRuleStoreClassName.java:41)
at com.carrotsearch.randomizedtesting.rules.NoShadowingOrOverridesOnMethodsRule$1.evaluate(NoShadowingOrOverridesOnMethodsRule.java:40)
at com.carrotsearch.randomizedtesting.rules.NoShadowingOrOverridesOnMethodsRule$1.evaluate(NoShadowingOrOverridesOnMethodsRule.java:40)
at com.carrotsearch.randomizedtesting.rules.StatementAdapter.evaluate(StatementAdapter.java:36)
at com.carrotsearch.randomizedtesting.rules.StatementAdapter.evaluate(StatementAdapter.java:36)
at com.carrotsearch.randomizedtesting.rules.StatementAdapter.evaluate(StatementAdapter.java:36)
at org.apache.lucene.util.TestRuleAssertionsRequired$1.evaluate(TestRuleAssertionsRequired.java:53)
at org.apache.lucene.util.TestRuleMarkFailure$1.evaluate(TestRuleMarkFailure.java:47)
at org.apache.lucene.util.TestRuleIgnoreAfterMaxFailures$1.evaluate(TestRuleIgnoreAfterMaxFailures.java:64)
at org.apache.lucene.util.TestRuleIgnoreTestSuites$1.evaluate(TestRuleIgnoreTestSuites.java:54)
at com.carrotsearch.randomizedtesting.rules.StatementAdapter.evaluate(StatementAdapter.java:36)
at com.carrotsearch.randomizedtesting.ThreadLeakControl$StatementRunner.run(ThreadLeakControl.java:367)
at java.lang.Thread.run(java.base@9-ea/Thread.java:843)
Caused by: org.apache.solr.client.solrj.SolrServerException: No live SolrServers available to handle this request:[http://127.0.0.1:42982/w_d/forceleader_test_collection_shard1_replica1]
at org.apache.solr.client.solrj.impl.LBHttpSolrClient.request(LBHttpSolrClient.java:394)
at org.apache.solr.client.solrj.impl.CloudSolrClient.lambda$directUpdate$0(CloudSolrClient.java:730)
at java.util.concurrent.FutureTask.run(java.base@9-ea/FutureTask.java:264)
at org.apache.solr.common.util.ExecutorUtil$MDCAwareThreadPoolExecutor.lambda$execute$0(ExecutorUtil.java:229)
at java.util.concurrent.ThreadPoolExecutor.runWorker(java.base@9-ea/ThreadPoolExecutor.java:1158)
at java.util.concurrent.ThreadPoolExecutor$Worker.run(java.base@9-ea/ThreadPoolExecutor.java:632)
... 1 more
Caused by: org.apache.solr.client.solrj.SolrServerException: Server refused connection at: http://127.0.0.1:42982/w_d/forceleader_test_collection_shard1_replica1
at org.apache.solr.client.solrj.impl.HttpSolrClient.executeMethod(HttpSolrClient.java:615)
at org.apache.solr.client.solrj.impl.HttpSolrClient.request(HttpSolrClient.java:261)
at org.apache.solr.client.solrj.impl.HttpSolrClient.request(HttpSolrClient.java:250)
at org.apache.solr.client.solrj.impl.LBHttpSolrClient.doRequest(LBHttpSolrClient.java:415)
at org.apache.solr.client.solrj.impl.LBHttpSolrClient.request(LBHttpSolrClient.java:383)
... 6 more
Caused by: org.apache.http.conn.HttpHostConnectException: Connect to 127.0.0.1:42982 [/127.0.0.1] failed: Connection refused
at org.apache.http.impl.conn.DefaultHttpClientConnectionOperator.connect(DefaultHttpClientConnectionOperator.java:151)
at org.apache.http.impl.conn.PoolingHttpClientConnectionManager.connect(PoolingHttpClientConnectionManager.java:353)
at org.apache.http.impl.execchain.MainClientExec.establishRoute(MainClientExec.java:380)
at org.apache.http.impl.execchain.MainClientExec.execute(MainClientExec.java:236)
at org.apache.http.impl.execchain.ProtocolExec.execute(ProtocolExec.java:184)
at org.apache.http.impl.execchain.RetryExec.execute(RetryExec.java:88)
at org.apache.http.impl.execchain.RedirectExec.execute(RedirectExec.java:110)
at org.apache.http.impl.client.InternalHttpClient.doExecute(InternalHttpClient.java:184)
at org.apache.http.impl.client.CloseableHttpClient.execute(CloseableHttpClient.java:82)
at org.apache.http.impl.client.CloseableHttpClient.execute(CloseableHttpClient.java:55)
at org.apache.solr.client.solrj.impl.HttpSolrClient.executeMethod(HttpSolrClient.java:513)
... 10 more
Caused by: java.net.ConnectException: Connection refused
at java.net.PlainSocketImpl.socketConnect(java.base@9-ea/Native Method)
at java.net.AbstractPlainSocketImpl.doConnect(java.base@9-ea/AbstractPlainSocketImpl.java:400)
at java.net.AbstractPlainSocketImpl.connectToAddress(java.base@9-ea/AbstractPlainSocketImpl.java:243)
at java.net.AbstractPlainSocketImpl.connect(java.base@9-ea/AbstractPlainSocketImpl.java:225)
at java.net.SocksSocketImpl.connect(java.base@9-ea/SocksSocketImpl.java:402)
at java.net.Socket.connect(java.base@9-ea/Socket.java:591)
at org.apache.http.conn.socket.PlainConnectionSocketFactory.connectSocket(PlainConnectionSocketFactory.java:74)
at org.apache.http.impl.conn.DefaultHttpClientConnectionOperator.connect(DefaultHttpClientConnectionOperator.java:134)
... 20 more
Build Log:
[...truncated 12017 lines...]
[junit4] Suite: org.apache.solr.cloud.ForceLeaderTest
[junit4] 2> Creating dataDir: /home/jenkins/workspace/Lucene-Solr-master-Linux/solr/build/solr-core/test/J0/temp/solr.cloud.ForceLeaderTest_945285203273CE79-001/init-core-data-001
[junit4] 2> 1465664 INFO (SUITE-ForceLeaderTest-seed#[945285203273CE79]-worker) [ ] o.a.s.SolrTestCaseJ4 Randomized ssl (false) and clientAuth (false) via: @org.apache.solr.SolrTestCaseJ4$SuppressSSL(bugUrl="https://issues.apache.org/jira/browse/SOLR-5776")
[junit4] 2> 1465664 INFO (SUITE-ForceLeaderTest-seed#[945285203273CE79]-worker) [ ] o.a.s.BaseDistributedSearchTestCase Setting hostContext system property: /w_d/
[junit4] 2> 1465665 INFO (TEST-ForceLeaderTest.testLastPublishedStateIsActive-seed#[945285203273CE79]) [ ] o.a.s.c.ZkTestServer STARTING ZK TEST SERVER
[junit4] 2> 1465665 INFO (Thread-2721) [ ] o.a.s.c.ZkTestServer client port:0.0.0.0/0.0.0.0:0
[junit4] 2> 1465666 INFO (Thread-2721) [ ] o.a.s.c.ZkTestServer Starting server
[junit4] 2> 1465766 INFO (TEST-ForceLeaderTest.testLastPublishedStateIsActive-seed#[945285203273CE79]) [ ] o.a.s.c.ZkTestServer start zk server on port:39601
[junit4] 2> 1465766 INFO (TEST-ForceLeaderTest.testLastPublishedStateIsActive-seed#[945285203273CE79]) [ ] o.a.s.c.c.SolrZkClient Using default ZkCredentialsProvider
[junit4] 2> 1465766 INFO (TEST-ForceLeaderTest.testLastPublishedStateIsActive-seed#[945285203273CE79]) [ ] o.a.s.c.c.ConnectionManager Waiting for client to connect to ZooKeeper
[junit4] 2> 1465767 INFO (zkCallback-2095-thread-1) [ ] o.a.s.c.c.ConnectionManager Watcher org.apache.solr.common.cloud.ConnectionManager@189f2b9 name:ZooKeeperConnection Watcher:127.0.0.1:39601 got event WatchedEvent state:SyncConnected type:None path:null path:null type:None
[junit4] 2> 1465767 INFO (TEST-ForceLeaderTest.testLastPublishedStateIsActive-seed#[945285203273CE79]) [ ] o.a.s.c.c.ConnectionManager Client is connected to ZooKeeper
[junit4] 2> 1465768 INFO (TEST-ForceLeaderTest.testLastPublishedStateIsActive-seed#[945285203273CE79]) [ ] o.a.s.c.c.SolrZkClient Using default ZkACLProvider
[junit4] 2> 1465768 INFO (TEST-ForceLeaderTest.testLastPublishedStateIsActive-seed#[945285203273CE79]) [ ] o.a.s.c.c.SolrZkClient makePath: /solr
[junit4] 2> 1465769 INFO (TEST-ForceLeaderTest.testLastPublishedStateIsActive-seed#[945285203273CE79]) [ ] o.a.s.c.c.SolrZkClient Using default ZkCredentialsProvider
[junit4] 2> 1465769 INFO (TEST-ForceLeaderTest.testLastPublishedStateIsActive-seed#[945285203273CE79]) [ ] o.a.s.c.c.ConnectionManager Waiting for client to connect to ZooKeeper
[junit4] 2> 1465769 INFO (zkCallback-2096-thread-1) [ ] o.a.s.c.c.ConnectionManager Watcher org.apache.solr.common.cloud.ConnectionManager@d5c8d1 name:ZooKeeperConnection Watcher:127.0.0.1:39601/solr got event WatchedEvent state:SyncConnected type:None path:null path:null type:None
[junit4] 2> 1465769 INFO (TEST-ForceLeaderTest.testLastPublishedStateIsActive-seed#[945285203273CE79]) [ ] o.a.s.c.c.ConnectionManager Client is connected to ZooKeeper
[junit4] 2> 1465770 INFO (TEST-ForceLeaderTest.testLastPublishedStateIsActive-seed#[945285203273CE79]) [ ] o.a.s.c.c.SolrZkClient Using default ZkACLProvider
[junit4] 2> 1465770 INFO (TEST-ForceLeaderTest.testLastPublishedStateIsActive-seed#[945285203273CE79]) [ ] o.a.s.c.c.SolrZkClient makePath: /collections/collection1
[junit4] 2> 1465770 INFO (TEST-ForceLeaderTest.testLastPublishedStateIsActive-seed#[945285203273CE79]) [ ] o.a.s.c.c.SolrZkClient makePath: /collections/collection1/shards
[junit4] 2> 1465771 INFO (TEST-ForceLeaderTest.testLastPublishedStateIsActive-seed#[945285203273CE79]) [ ] o.a.s.c.c.SolrZkClient makePath: /collections/control_collection
[junit4] 2> 1465771 INFO (TEST-ForceLeaderTest.testLastPublishedStateIsActive-seed#[945285203273CE79]) [ ] o.a.s.c.c.SolrZkClient makePath: /collections/control_collection/shards
[junit4] 2> 1465771 INFO (TEST-ForceLeaderTest.testLastPublishedStateIsActive-seed#[945285203273CE79]) [ ] o.a.s.c.AbstractZkTestCase put /home/jenkins/workspace/Lucene-Solr-master-Linux/solr/core/src/test-files/solr/collection1/conf/solrconfig-tlog.xml to /configs/conf1/solrconfig.xml
[junit4] 2> 1465772 INFO (TEST-ForceLeaderTest.testLastPublishedStateIsActive-seed#[945285203273CE79]) [ ] o.a.s.c.c.SolrZkClient makePath: /configs/conf1/solrconfig.xml
[junit4] 2> 1465772 INFO (TEST-ForceLeaderTest.testLastPublishedStateIsActive-seed#[945285203273CE79]) [ ] o.a.s.c.AbstractZkTestCase put /home/jenkins/workspace/Lucene-Solr-master-Linux/solr/core/src/test-files/solr/collection1/conf/schema.xml to /configs/conf1/schema.xml
[junit4] 2> 1465772 INFO (TEST-ForceLeaderTest.testLastPublishedStateIsActive-seed#[945285203273CE79]) [ ] o.a.s.c.c.SolrZkClient makePath: /configs/conf1/schema.xml
[junit4] 2> 1465773 INFO (TEST-ForceLeaderTest.testLastPublishedStateIsActive-seed#[945285203273CE79]) [ ] o.a.s.c.AbstractZkTestCase put /home/jenkins/workspace/Lucene-Solr-master-Linux/solr/core/src/test-files/solr/collection1/conf/solrconfig.snippet.randomindexconfig.xml to /configs/conf1/solrconfig.snippet.randomindexconfig.xml
[junit4] 2> 1465773 INFO (TEST-ForceLeaderTest.testLastPublishedStateIsActive-seed#[945285203273CE79]) [ ] o.a.s.c.c.SolrZkClient makePath: /configs/conf1/solrconfig.snippet.randomindexconfig.xml
[junit4] 2> 1465773 INFO (TEST-ForceLeaderTest.testLastPublishedStateIsActive-seed#[945285203273CE79]) [ ] o.a.s.c.AbstractZkTestCase put /home/jenkins/workspace/Lucene-Solr-master-Linux/solr/core/src/test-files/solr/collection1/conf/stopwords.txt to /configs/conf1/stopwords.txt
[junit4] 2> 1465774 INFO (TEST-ForceLeaderTest.testLastPublishedStateIsActive-seed#[945285203273CE79]) [ ] o.a.s.c.c.SolrZkClient makePath: /configs/conf1/stopwords.txt
[junit4] 2> 1465774 INFO (TEST-ForceLeaderTest.testLastPublishedStateIsActive-seed#[945285203273CE79]) [ ] o.a.s.c.AbstractZkTestCase put /home/jenkins/workspace/Lucene-Solr-master-Linux/solr/core/src/test-files/solr/collection1/conf/protwords.txt to /configs/conf1/protwords.txt
[junit4] 2> 1465774 INFO (TEST-ForceLeaderTest.testLastPublishedStateIsActive-seed#[945285203273CE79]) [ ] o.a.s.c.c.SolrZkClient makePath: /configs/conf1/protwords.txt
[junit4] 2> 1465774 INFO (TEST-ForceLeaderTest.testLastPublishedStateIsActive-seed#[945285203273CE79]) [ ] o.a.s.c.AbstractZkTestCase put /home/jenkins/workspace/Lucene-Solr-master-Linux/solr/core/src/test-files/solr/collection1/conf/currency.xml to /configs/conf1/currency.xml
[junit4] 2> 1465775 INFO (TEST-ForceLeaderTest.testLastPublishedStateIsActive-seed#[945285203273CE79]) [ ] o.a.s.c.c.SolrZkClient makePath: /configs/conf1/currency.xml
[junit4] 2> 1465776 INFO (TEST-ForceLeaderTest.testLastPublishedStateIsActive-seed#[945285203273CE79]) [ ] o.a.s.c.AbstractZkTestCase put /home/jenkins/workspace/Lucene-Solr-master-Linux/solr/core/src/test-files/solr/collection1/conf/enumsConfig.xml to /configs/conf1/enumsConfig.xml
[junit4] 2> 1465776 INFO (TEST-ForceLeaderTest.testLastPublishedStateIsActive-seed#[945285203273CE79]) [ ] o.a.s.c.c.SolrZkClient makePath: /configs/conf1/enumsConfig.xml
[junit4] 2> 1465776 INFO (TEST-ForceLeaderTest.testLastPublishedStateIsActive-seed#[945285203273CE79]) [ ] o.a.s.c.AbstractZkTestCase put /home/jenkins/workspace/Lucene-Solr-master-Linux/solr/core/src/test-files/solr/collection1/conf/open-exchange-rates.json to /configs/conf1/open-exchange-rates.json
[junit4] 2> 1465776 INFO (TEST-ForceLeaderTest.testLastPublishedStateIsActive-seed#[945285203273CE79]) [ ] o.a.s.c.c.SolrZkClient makePath: /configs/conf1/open-exchange-rates.json
[junit4] 2> 1465777 INFO (TEST-ForceLeaderTest.testLastPublishedStateIsActive-seed#[945285203273CE79]) [ ] o.a.s.c.AbstractZkTestCase put /home/jenkins/workspace/Lucene-Solr-master-Linux/solr/core/src/test-files/solr/collection1/conf/mapping-ISOLatin1Accent.txt to /configs/conf1/mapping-ISOLatin1Accent.txt
[junit4] 2> 1465777 INFO (TEST-ForceLeaderTest.testLastPublishedStateIsActive-seed#[945285203273CE79]) [ ] o.a.s.c.c.SolrZkClient makePath: /configs/conf1/mapping-ISOLatin1Accent.txt
[junit4] 2> 1465777 INFO (TEST-ForceLeaderTest.testLastPublishedStateIsActive-seed#[945285203273CE79]) [ ] o.a.s.c.AbstractZkTestCase put /home/jenkins/workspace/Lucene-Solr-master-Linux/solr/core/src/test-files/solr/collection1/conf/old_synonyms.txt to /configs/conf1/old_synonyms.txt
[junit4] 2> 1465777 INFO (TEST-ForceLeaderTest.testLastPublishedStateIsActive-seed#[945285203273CE79]) [ ] o.a.s.c.c.SolrZkClient makePath: /configs/conf1/old_synonyms.txt
[junit4] 2> 1465778 INFO (TEST-ForceLeaderTest.testLastPublishedStateIsActive-seed#[945285203273CE79]) [ ] o.a.s.c.AbstractZkTestCase put /home/jenkins/workspace/Lucene-Solr-master-Linux/solr/core/src/test-files/solr/collection1/conf/synonyms.txt to /configs/conf1/synonyms.txt
[junit4] 2> 1465778 INFO (TEST-ForceLeaderTest.testLastPublishedStateIsActive-seed#[945285203273CE79]) [ ] o.a.s.c.c.SolrZkClient makePath: /configs/conf1/synonyms.txt
[junit4] 2> 1465841 INFO (TEST-ForceLeaderTest.testLastPublishedStateIsActive-seed#[945285203273CE79]) [ ] o.a.s.SolrTestCaseJ4 Writing core.properties file to /home/jenkins/workspace/Lucene-Solr-master-Linux/solr/build/solr-core/test/J0/temp/solr.cloud.ForceLeaderTest_945285203273CE79-001/control-001/cores/collection1
[junit4] 2> 1465843 INFO (TEST-ForceLeaderTest.testLastPublishedStateIsActive-seed#[945285203273CE79]) [ ] o.e.j.s.Server jetty-9.3.8.v20160314
[junit4] 2> 1465844 INFO (TEST-ForceLeaderTest.testLastPublishedStateIsActive-seed#[945285203273CE79]) [ ] o.e.j.s.h.ContextHandler Started o.e.j.s.ServletContextHandler@e6126e{/w_d,null,AVAILABLE}
[junit4] 2> 1465845 INFO (TEST-ForceLeaderTest.testLastPublishedStateIsActive-seed#[945285203273CE79]) [ ] o.e.j.s.ServerConnector Started ServerConnector@1c8527a{HTTP/1.1,[http/1.1]}{127.0.0.1:42343}
[junit4] 2> 1465845 INFO (TEST-ForceLeaderTest.testLastPublishedStateIsActive-seed#[945285203273CE79]) [ ] o.e.j.s.Server Started @1467699ms
[junit4] 2> 1465845 INFO (TEST-ForceLeaderTest.testLastPublishedStateIsActive-seed#[945285203273CE79]) [ ] o.a.s.c.s.e.JettySolrRunner Jetty properties: {hostContext=/w_d, solr.data.dir=/home/jenkins/workspace/Lucene-Solr-master-Linux/solr/build/solr-core/test/J0/temp/solr.cloud.ForceLeaderTest_945285203273CE79-001/tempDir-001/control/data, hostPort=42475, coreRootDirectory=/home/jenkins/workspace/Lucene-Solr-master-Linux/solr/build/solr-core/test/J0/temp/solr.cloud.ForceLeaderTest_945285203273CE79-001/control-001/cores}
[junit4] 2> 1465845 INFO (TEST-ForceLeaderTest.testLastPublishedStateIsActive-seed#[945285203273CE79]) [ ] o.a.s.s.SolrDispatchFilter SolrDispatchFilter.init(): jdk.internal.loader.ClassLoaders$AppClassLoader@1223dd8
[junit4] 2> 1465845 INFO (TEST-ForceLeaderTest.testLastPublishedStateIsActive-seed#[945285203273CE79]) [ ] o.a.s.c.SolrResourceLoader new SolrResourceLoader for directory: '/home/jenkins/workspace/Lucene-Solr-master-Linux/solr/build/solr-core/test/J0/temp/solr.cloud.ForceLeaderTest_945285203273CE79-001/control-001'
[junit4] 2> 1465845 INFO (TEST-ForceLeaderTest.testLastPublishedStateIsActive-seed#[945285203273CE79]) [ ] o.a.s.c.SolrResourceLoader JNDI not configured for solr (NoInitialContextEx)
[junit4] 2> 1465845 INFO (TEST-ForceLeaderTest.testLastPublishedStateIsActive-seed#[945285203273CE79]) [ ] o.a.s.c.SolrResourceLoader solr home defaulted to 'solr/' (could not find system property or JNDI)
[junit4] 2> 1465845 INFO (TEST-ForceLeaderTest.testLastPublishedStateIsActive-seed#[945285203273CE79]) [ ] o.a.s.c.c.SolrZkClient Using default ZkCredentialsProvider
[junit4] 2> 1465846 INFO (TEST-ForceLeaderTest.testLastPublishedStateIsActive-seed#[945285203273CE79]) [ ] o.a.s.c.c.ConnectionManager Waiting for client to connect to ZooKeeper
[junit4] 2> 1465846 INFO (zkCallback-2097-thread-1) [ ] o.a.s.c.c.ConnectionManager Watcher org.apache.solr.common.cloud.ConnectionManager@fcc156 name:ZooKeeperConnection Watcher:127.0.0.1:39601/solr got event WatchedEvent state:SyncConnected type:None path:null path:null type:None
[junit4] 2> 1465846 INFO (TEST-ForceLeaderTest.testLastPublishedStateIsActive-seed#[945285203273CE79]) [ ] o.a.s.c.c.ConnectionManager Client is connected to ZooKeeper
[junit4] 2> 1465847 INFO (TEST-ForceLeaderTest.testLastPublishedStateIsActive-seed#[945285203273CE79]) [ ] o.a.s.c.c.SolrZkClient Using default ZkACLProvider
[junit4] 2> 1465847 INFO (TEST-ForceLeaderTest.testLastPublishedStateIsActive-seed#[945285203273CE79]) [ ] o.a.s.s.SolrDispatchFilter Loading solr.xml from SolrHome (not found in ZooKeeper)
[junit4] 2> 1465847 INFO (TEST-ForceLeaderTest.testLastPublishedStateIsActive-seed#[945285203273CE79]) [ ] o.a.s.c.SolrXmlConfig Loading container configuration from /home/jenkins/workspace/Lucene-Solr-master-Linux/solr/build/solr-core/test/J0/temp/solr.cloud.ForceLeaderTest_945285203273CE79-001/control-001/solr.xml
[junit4] 2> 1465850 INFO (TEST-ForceLeaderTest.testLastPublishedStateIsActive-seed#[945285203273CE79]) [ ] o.a.s.c.CorePropertiesLocator Config-defined core root directory: /home/jenkins/workspace/Lucene-Solr-master-Linux/solr/build/solr-core/test/J0/temp/solr.cloud.ForceLeaderTest_945285203273CE79-001/control-001/cores
[junit4] 2> 1465850 INFO (TEST-ForceLeaderTest.testLastPublishedStateIsActive-seed#[945285203273CE79]) [ ] o.a.s.c.CoreContainer New CoreContainer 1933297
[junit4] 2> 1465850 INFO (TEST-ForceLeaderTest.testLastPublishedStateIsActive-seed#[945285203273CE79]) [ ] o.a.s.c.CoreContainer Loading cores into CoreContainer [instanceDir=/home/jenkins/workspace/Lucene-Solr-master-Linux/solr/build/solr-core/test/J0/temp/solr.cloud.ForceLeaderTest_945285203273CE79-001/control-001]
[junit4] 2> 1465850 WARN (TEST-ForceLeaderTest.testLastPublishedStateIsActive-seed#[945285203273CE79]) [ ] o.a.s.c.CoreContainer Couldn't add files from /home/jenkins/workspace/Lucene-Solr-master-Linux/solr/build/solr-core/test/J0/temp/solr.cloud.ForceLeaderTest_945285203273CE79-001/control-001/lib to classpath: /home/jenkins/workspace/Lucene-Solr-master-Linux/solr/build/solr-core/test/J0/temp/solr.cloud.ForceLeaderTest_945285203273CE79-001/control-001/lib
[junit4] 2> 1465851 INFO (TEST-ForceLeaderTest.testLastPublishedStateIsActive-seed#[945285203273CE79]) [ ] o.a.s.h.c.HttpShardHandlerFactory created with socketTimeout : 90000,urlScheme : ,connTimeout : 15000,maxConnectionsPerHost : 20,maxConnections : 10000,corePoolSize : 0,maximumPoolSize : 2147483647,maxThreadIdleTime : 5,sizeOfQueue : -1,fairnessPolicy : false,
[junit4] 2> 1465852 INFO (TEST-ForceLeaderTest.testLastPublishedStateIsActive-seed#[945285203273CE79]) [ ] o.a.s.u.UpdateShardHandler Created UpdateShardHandler HTTP client with params: socketTimeout=340000&connTimeout=45000&maxConnections=100000&maxConnectionsPerHost=100000
[junit4] 2> 1465852 INFO (TEST-ForceLeaderTest.testLastPublishedStateIsActive-seed#[945285203273CE79]) [ ] o.a.s.l.LogWatcher SLF4J impl is org.slf4j.impl.Log4jLoggerFactory
[junit4] 2> 1465853 INFO (TEST-ForceLeaderTest.testLastPublishedStateIsActive-seed#[945285203273CE79]) [ ] o.a.s.l.LogWatcher Registering Log Listener [Log4j (org.slf4j.impl.Log4jLoggerFactory)]
[junit4] 2> 1465853 INFO (TEST-ForceLeaderTest.testLastPublishedStateIsActive-seed#[945285203273CE79]) [ ] o.a.s.c.ZkContainer Zookeeper client=127.0.0.1:39601/solr
[junit4] 2> 1465853 INFO (TEST-ForceLeaderTest.testLastPublishedStateIsActive-seed#[945285203273CE79]) [ ] o.a.s.c.ZkController zkHost includes chroot
[junit4] 2> 1465853 INFO (TEST-ForceLeaderTest.testLastPublishedStateIsActive-seed#[945285203273CE79]) [ ] o.a.s.c.c.SolrZkClient Using default ZkCredentialsProvider
[junit4] 2> 1465853 INFO (TEST-ForceLeaderTest.testLastPublishedStateIsActive-seed#[945285203273CE79]) [ ] o.a.s.c.c.ConnectionManager Waiting for client to connect to ZooKeeper
[junit4] 2> 1465853 INFO (zkCallback-2100-thread-1) [ ] o.a.s.c.c.ConnectionManager Watcher org.apache.solr.common.cloud.ConnectionManager@5dd985 name:ZooKeeperConnection Watcher:127.0.0.1:39601 got event WatchedEvent state:SyncConnected type:None path:null path:null type:None
[junit4] 2> 1465854 INFO (TEST-ForceLeaderTest.testLastPublishedStateIsActive-seed#[945285203273CE79]) [ ] o.a.s.c.c.ConnectionManager Client is connected to ZooKeeper
[junit4] 2> 1465854 INFO (TEST-ForceLeaderTest.testLastPublishedStateIsActive-seed#[945285203273CE79]) [ ] o.a.s.c.c.SolrZkClient Using default ZkACLProvider
[junit4] 2> 1465854 INFO (TEST-ForceLeaderTest.testLastPublishedStateIsActive-seed#[945285203273CE79]) [ ] o.a.s.c.ZkController Added new OnReconnect listener org.apache.solr.cloud.ZkController$$Lambda$205/10564886@1343f61
[junit4] 2> 1465854 INFO (TEST-ForceLeaderTest.testLastPublishedStateIsActive-seed#[945285203273CE79]) [ ] o.a.s.c.c.ConnectionManager Waiting for client to connect to ZooKeeper
[junit4] 2> 1465855 INFO (zkCallback-2101-thread-1) [ ] o.a.s.c.c.ConnectionManager Watcher org.apache.solr.common.cloud.ConnectionManager@e26e1c name:ZooKeeperConnection Watcher:127.0.0.1:39601/solr got event WatchedEvent state:SyncConnected type:None path:null path:null type:None
[junit4] 2> 1465855 INFO (TEST-ForceLeaderTest.testLastPublishedStateIsActive-seed#[945285203273CE79]) [ ] o.a.s.c.c.ConnectionManager Client is connected to ZooKeeper
[junit4] 2> 1465856 INFO (TEST-ForceLeaderTest.testLastPublishedStateIsActive-seed#[945285203273CE79]) [ ] o.a.s.c.c.SolrZkClient makePath: /overseer/queue
[junit4] 2> 1465856 INFO (TEST-ForceLeaderTest.testLastPublishedStateIsActive-seed#[945285203273CE79]) [ ] o.a.s.c.c.SolrZkClient makePath: /overseer/collection-queue-work
[junit4] 2> 1465857 INFO (TEST-ForceLeaderTest.testLastPublishedStateIsActive-seed#[945285203273CE79]) [ ] o.a.s.c.c.SolrZkClient makePath: /overseer/collection-map-running
[junit4] 2> 1465858 INFO (TEST-ForceLeaderTest.testLastPublishedStateIsActive-seed#[945285203273CE79]) [ ] o.a.s.c.c.SolrZkClient makePath: /overseer/collection-map-completed
[junit4] 2> 1465858 INFO (TEST-ForceLeaderTest.testLastPublishedStateIsActive-seed#[945285203273CE79]) [ ] o.a.s.c.c.SolrZkClient makePath: /overseer/collection-map-failure
[junit4] 2> 1465859 INFO (TEST-ForceLeaderTest.testLastPublishedStateIsActive-seed#[945285203273CE79]) [ ] o.a.s.c.c.SolrZkClient makePath: /live_nodes
[junit4] 2> 1465860 INFO (TEST-ForceLeaderTest.testLastPublishedStateIsActive-seed#[945285203273CE79]) [ ] o.a.s.c.c.SolrZkClient makePath: /aliases.json
[junit4] 2> 1465861 INFO (TEST-ForceLeaderTest.testLastPublishedStateIsActive-seed#[945285203273CE79]) [ ] o.a.s.c.c.SolrZkClient makePath: /clusterstate.json
[junit4] 2> 1465861 INFO (TEST-ForceLeaderTest.testLastPublishedStateIsActive-seed#[945285203273CE79]) [ ] o.a.s.c.c.SolrZkClient makePath: /security.json
[junit4] 2> 1465861 INFO (TEST-ForceLeaderTest.testLastPublishedStateIsActive-seed#[945285203273CE79]) [ ] o.a.s.c.c.ZkStateReader Updating cluster state from ZooKeeper...
[junit4] 2> 1465861 INFO (TEST-ForceLeaderTest.testLastPublishedStateIsActive-seed#[945285203273CE79]) [ ] o.a.s.c.c.ZkStateReader Loaded empty cluster properties
[junit4] 2> 1465862 INFO (TEST-ForceLeaderTest.testLastPublishedStateIsActive-seed#[945285203273CE79]) [ ] o.a.s.c.c.ZkStateReader Updated live nodes from ZooKeeper... (0) -> (0)
[junit4] 2> 1465862 INFO (TEST-ForceLeaderTest.testLastPublishedStateIsActive-seed#[945285203273CE79]) [ ] o.a.s.c.c.SolrZkClient makePath: /overseer_elect
[junit4] 2> 1465863 INFO (TEST-ForceLeaderTest.testLastPublishedStateIsActive-seed#[945285203273CE79]) [ ] o.a.s.c.c.SolrZkClient makePath: /overseer_elect/election
[junit4] 2> 1465863 INFO (TEST-ForceLeaderTest.testLastPublishedStateIsActive-seed#[945285203273CE79]) [ ] o.a.s.c.Overseer Overseer (id=null) closing
[junit4] 2> 1465863 INFO (TEST-ForceLeaderTest.testLastPublishedStateIsActive-seed#[945285203273CE79]) [ ] o.a.s.c.LeaderElector Joined leadership election with path: /overseer_elect/election/96591536480780292-127.0.0.1:42475_w_d-n_0000000000
[junit4] 2> 1465863 INFO (TEST-ForceLeaderTest.testLastPublishedStateIsActive-seed#[945285203273CE79]) [ ] o.a.s.c.OverseerElectionContext I am going to be the leader 127.0.0.1:42475_w_d
[junit4] 2> 1465863 INFO (TEST-ForceLeaderTest.testLastPublishedStateIsActive-seed#[945285203273CE79]) [ ] o.a.s.c.c.SolrZkClient makePath: /overseer_elect/leader
[junit4] 2> 1465864 INFO (TEST-ForceLeaderTest.testLastPublishedStateIsActive-seed#[945285203273CE79]) [ ] o.a.s.c.Overseer Overseer (id=96591536480780292-127.0.0.1:42475_w_d-n_0000000000) starting
[junit4] 2> 1465864 INFO (TEST-ForceLeaderTest.testLastPublishedStateIsActive-seed#[945285203273CE79]) [ ] o.a.s.c.c.SolrZkClient makePath: /overseer/queue-work
[junit4] 2> 1465866 INFO (TEST-ForceLeaderTest.testLastPublishedStateIsActive-seed#[945285203273CE79]) [ ] o.a.s.c.OverseerAutoReplicaFailoverThread Starting OverseerAutoReplicaFailoverThread autoReplicaFailoverWorkLoopDelay=10000 autoReplicaFailoverWaitAfterExpiration=10000 autoReplicaFailoverBadNodeExpiration=60000
[junit4] 2> 1465866 INFO (OverseerCollectionConfigSetProcessor-96591536480780292-127.0.0.1:42475_w_d-n_0000000000) [ ] o.a.s.c.OverseerTaskProcessor Process current queue of overseer operations
[junit4] 2> 1465866 INFO (OverseerStateUpdate-96591536480780292-127.0.0.1:42475_w_d-n_0000000000) [ ] o.a.s.c.Overseer Starting to work on the main queue
[junit4] 2> 1465866 INFO (TEST-ForceLeaderTest.testLastPublishedStateIsActive-seed#[945285203273CE79]) [ ] o.a.s.c.ZkController Register node as live in ZooKeeper:/live_nodes/127.0.0.1:42475_w_d
[junit4] 2> 1465866 INFO (TEST-ForceLeaderTest.testLastPublishedStateIsActive-seed#[945285203273CE79]) [ ] o.a.s.c.c.SolrZkClient makePath: /live_nodes/127.0.0.1:42475_w_d
[junit4] 2> 1465867 INFO (OverseerStateUpdate-96591536480780292-127.0.0.1:42475_w_d-n_0000000000) [ ] o.a.s.c.c.ZkStateReader Updated live nodes from ZooKeeper... (0) -> (0)
[junit4] 2> 1465867 INFO (zkCallback-2101-thread-1) [ ] o.a.s.c.c.ZkStateReader A live node change: [WatchedEvent state:SyncConnected type:NodeChildrenChanged path:/live_nodes], has occurred - updating... (live nodes size: [0])
[junit4] 2> 1465867 INFO (zkCallback-2101-thread-1) [ ] o.a.s.c.c.ZkStateReader Updated live nodes from ZooKeeper... (0) -> (1)
[junit4] 2> 1465882 INFO (TEST-ForceLeaderTest.testLastPublishedStateIsActive-seed#[945285203273CE79]) [ ] o.a.s.c.CoreContainer Security conf doesn't exist. Skipping setup for authorization module.
[junit4] 2> 1465882 INFO (TEST-ForceLeaderTest.testLastPublishedStateIsActive-seed#[945285203273CE79]) [ ] o.a.s.c.CoreContainer No authentication plugin used.
[junit4] 2> 1465882 INFO (TEST-ForceLeaderTest.testLastPublishedStateIsActive-seed#[945285203273CE79]) [ ] o.a.s.c.CorePropertiesLocator Looking for core definitions underneath /home/jenkins/workspace/Lucene-Solr-master-Linux/solr/build/solr-core/test/J0/temp/solr.cloud.ForceLeaderTest_945285203273CE79-001/control-001/cores
[junit4] 2> 1465883 INFO (TEST-ForceLeaderTest.testLastPublishedStateIsActive-seed#[945285203273CE79]) [ ] o.a.s.c.CoreDescriptor Created CoreDescriptor: {schema=schema.xml, dataDir=data/, collection=control_collection, loadOnStartup=true, coreNodeName=, transient=false, name=collection1, shard=, config=solrconfig.xml, configSetProperties=configsetprops.json}
[junit4] 2> 1465883 INFO (TEST-ForceLeaderTest.testLastPublishedStateIsActive-seed#[945285203273CE79]) [ ] o.a.s.c.CorePropertiesLocator Found core collection1 in /home/jenkins/workspace/Lucene-Solr-master-Linux/solr/build/solr-core/test/J0/temp/solr.cloud.ForceLeaderTest_945285203273CE79-001/control-001/cores/collection1
[junit4] 2> 1465883 INFO (TEST-ForceLeaderTest.testLastPublishedStateIsActive-seed#[945285203273CE79]) [ ] o.a.s.c.CorePropertiesLocator Found 1 core definitions
[junit4] 2> 1465884 INFO (coreLoadExecutor-6827-thread-1) [ ] o.a.s.c.ZkController publishing state=down
[junit4] 2> 1465884 INFO (coreLoadExecutor-6827-thread-1) [ ] o.a.s.c.ZkController numShards not found on descriptor - reading it from system property
[junit4] 2> 1465884 INFO (TEST-ForceLeaderTest.testLastPublishedStateIsActive-seed#[945285203273CE79]) [ ] o.a.s.s.SolrDispatchFilter user.dir=/home/jenkins/workspace/Lucene-Solr-master-Linux/solr/build/solr-core/test/J0
[junit4] 2> 1465884 INFO (TEST-ForceLeaderTest.testLastPublishedStateIsActive-seed#[945285203273CE79]) [ ] o.a.s.s.SolrDispatchFilter SolrDispatchFilter.init() done
[junit4] 2> 1465884 INFO (coreLoadExecutor-6827-thread-1) [ ] o.a.s.c.ZkController Collection control_collection not visible yet, but flagging it so a watch is registered when it becomes visible
[junit4] 2> 1465884 INFO (OverseerStateUpdate-96591536480780292-127.0.0.1:42475_w_d-n_0000000000) [ ] o.a.s.c.Overseer processMessage: queueSize: 1, message = {
[junit4] 2> "core":"collection1",
[junit4] 2> "roles":null,
[junit4] 2> "base_url":"http://127.0.0.1:42475/w_d",
[junit4] 2> "node_name":"127.0.0.1:42475_w_d",
[junit4] 2> "numShards":"1",
[junit4] 2> "state":"down",
[junit4] 2> "shard":null,
[junit4] 2> "collection":"control_collection",
[junit4] 2> "operation":"state"} current state version: 0
[junit4] 2> 1465884 INFO (OverseerStateUpdate-96591536480780292-127.0.0.1:42475_w_d-n_0000000000) [ ] o.a.s.c.o.ReplicaMutator Update state numShards=1 message={
[junit4] 2> "core":"collection1",
[junit4] 2> "roles":null,
[junit4] 2> "base_url":"http://127.0.0.1:42475/w_d",
[junit4] 2> "node_name":"127.0.0.1:42475_w_d",
[junit4] 2> "numShards":"1",
[junit4] 2> "state":"down",
[junit4] 2> "shard":null,
[junit4] 2> "collection":"control_collection",
[junit4] 2> "operation":"state"}
[junit4] 2> 1465884 INFO (coreLoadExecutor-6827-thread-1) [ ] o.a.s.c.c.ZkStateReader Deleting data for [control_collection]
[junit4] 2> 1465884 INFO (OverseerStateUpdate-96591536480780292-127.0.0.1:42475_w_d-n_0000000000) [ ] o.a.s.c.o.ClusterStateMutator building a new cName: control_collection
[junit4] 2> 1465885 INFO (OverseerStateUpdate-96591536480780292-127.0.0.1:42475_w_d-n_0000000000) [ ] o.a.s.c.o.ReplicaMutator Assigning new node to shard shard=shard1
[junit4] 2> 1465885 INFO (coreLoadExecutor-6827-thread-1) [ ] o.a.s.c.ZkController look for our core node name
[junit4] 2> 1465885 INFO (zkCallback-2101-thread-1) [ ] o.a.s.c.c.ZkStateReader A cluster state change: [WatchedEvent state:SyncConnected type:NodeDataChanged path:/clusterstate.json], has occurred - updating... (live nodes size: [1])
[junit4] 2> 1466885 INFO (coreLoadExecutor-6827-thread-1) [ ] o.a.s.c.ZkController waiting to find shard id in clusterstate for collection1
[junit4] 2> 1466885 INFO (coreLoadExecutor-6827-thread-1) [ ] o.a.s.c.ZkController Check for collection zkNode:control_collection
[junit4] 2> 1466885 INFO (coreLoadExecutor-6827-thread-1) [ ] o.a.s.c.ZkController Collection zkNode exists
[junit4] 2> 1466885 INFO (coreLoadExecutor-6827-thread-1) [ ] o.a.s.c.c.ZkStateReader Load collection config from: [/collections/control_collection]
[junit4] 2> 1466885 INFO (coreLoadExecutor-6827-thread-1) [ ] o.a.s.c.c.ZkStateReader path=[/collections/control_collection] [configName]=[conf1] specified config exists in ZooKeeper
[junit4] 2> 1466886 INFO (coreLoadExecutor-6827-thread-1) [ ] o.a.s.c.SolrResourceLoader new SolrResourceLoader for directory: '/home/jenkins/workspace/Lucene-Solr-master-Linux/solr/build/solr-core/test/J0/temp/solr.cloud.ForceLeaderTest_945285203273CE79-001/control-001/cores/collection1'
[junit4] 2> 1466886 INFO (coreLoadExecutor-6827-thread-1) [ ] o.a.s.c.SolrResourceLoader JNDI not configured for solr (NoInitialContextEx)
[junit4] 2> 1466886 INFO (coreLoadExecutor-6827-thread-1) [ ] o.a.s.c.SolrResourceLoader solr home defaulted to 'solr/' (could not find system property or JNDI)
[junit4] 2> 1466886 INFO (coreLoadExecutor-6827-thread-1) [ ] o.a.s.c.Config loaded config solrconfig.xml with version 0
[junit4] 2> 1466889 INFO (coreLoadExecutor-6827-thread-1) [ ] o.a.s.c.SolrConfig current version of requestparams : -1
[junit4] 2> 1466892 INFO (coreLoadExecutor-6827-thread-1) [ ] o.a.s.c.SolrConfig Using Lucene MatchVersion: 7.0.0
[junit4] 2> 1466898 INFO (coreLoadExecutor-6827-thread-1) [ ] o.a.s.c.SolrConfig Loaded SolrConfig: solrconfig.xml
[junit4] 2> 1466902 INFO (coreLoadExecutor-6827-thread-1) [ ] o.a.s.s.IndexSchema [collection1] Schema name=test
[junit4] 2> 1466970 INFO (coreLoadExecutor-6827-thread-1) [ ] o.a.s.s.OpenExchangeRatesOrgProvider Initialized with rates=open-exchange-rates.json, refreshInterval=1440.
[junit4] 2> 1466987 INFO (coreLoadExecutor-6827-thread-1) [ ] o.a.s.s.IndexSchema default search field in schema is text
[junit4] 2> 1466988 INFO (coreLoadExecutor-6827-thread-1) [ ] o.a.s.s.IndexSchema unique key field: id
[junit4] 2> 1466992 INFO (coreLoadExecutor-6827-thread-1) [ ] o.a.s.s.FileExchangeRateProvider Reloading exchange rates from file currency.xml
[junit4] 2> 1466993 INFO (coreLoadExecutor-6827-thread-1) [ ] o.a.s.s.FileExchangeRateProvider Reloading exchange rates from file currency.xml
[junit4] 2> 1466994 INFO (coreLoadExecutor-6827-thread-1) [ ] o.a.s.s.OpenExchangeRatesOrgProvider Reloading exchange rates from open-exchange-rates.json
[junit4] 2> 1466994 INFO (coreLoadExecutor-6827-thread-1) [ ] o.a.s.s.OpenExchangeRatesOrgProvider Reloading exchange rates from open-exchange-rates.json
[junit4] 2> 1466995 INFO (coreLoadExecutor-6827-thread-1) [ ] o.a.s.c.ConfigSetProperties Did not find ConfigSet properties, assuming default properties: Can't find resource 'configsetprops.json' in classpath or '/configs/conf1', cwd=/home/jenkins/workspace/Lucene-Solr-master-Linux/solr/build/solr-core/test/J0
[junit4] 2> 1466995 INFO (coreLoadExecutor-6827-thread-1) [ ] o.a.s.c.CoreContainer Creating SolrCore 'collection1' using configuration from collection control_collection
[junit4] 2> 1466995 INFO (coreLoadExecutor-6827-thread-1) [ ] o.a.s.c.SolrCore org.apache.solr.core.MockDirectoryFactory
[junit4] 2> 1466995 INFO (coreLoadExecutor-6827-thread-1) [ ] o.a.s.c.SolrCore [[collection1] ] Opening new SolrCore at [/home/jenkins/workspace/Lucene-Solr-master-Linux/solr/build/solr-core/test/J0/temp/solr.cloud.ForceLeaderTest_945285203273CE79-001/control-001/cores/collection1], dataDir=[/home/jenkins/workspace/Lucene-Solr-master-Linux/solr/build/solr-core/test/J0/temp/solr.cloud.ForceLeaderTest_945285203273CE79-001/control-001/cores/collection1/data/]
[junit4] 2> 1466995 INFO (coreLoadExecutor-6827-thread-1) [ ] o.a.s.c.JmxMonitoredMap JMX monitoring is enabled. Adding Solr mbeans to JMX Server: com.sun.jmx.mbeanserver.JmxMBeanServer@58c5cd
[junit4] 2> 1466996 INFO (coreLoadExecutor-6827-thread-1) [ ] o.a.s.c.CachingDirectoryFactory return new directory for /home/jenkins/workspace/Lucene-Solr-master-Linux/solr/build/solr-core/test/J0/temp/solr.cloud.ForceLeaderTest_945285203273CE79-001/control-001/cores/collection1/data/snapshot_metadata
[junit4] 2> 1466996 INFO (coreLoadExecutor-6827-thread-1) [ ] o.a.s.c.s.SolrSnapshotMetaDataManager Loading from snapshot metadata file...
[junit4] 2> 1466996 INFO (coreLoadExecutor-6827-thread-1) [ ] o.a.s.c.CachingDirectoryFactory return new directory for /home/jenkins/workspace/Lucene-Solr-master-Linux/solr/build/solr-core/test/J0/temp/solr.cloud.ForceLeaderTest_945285203273CE79-001/control-001/cores/collection1/data
[junit4] 2> 1466996 INFO (coreLoadExecutor-6827-thread-1) [ ] o.a.s.c.SolrCore New index directory detected: old=null new=/home/jenkins/workspace/Lucene-Solr-master-Linux/solr/build/solr-core/test/J0/temp/solr.cloud.ForceLeaderTest_945285203273CE79-001/control-001/cores/collection1/data/index/
[junit4] 2> 1466996 WARN (coreLoadExecutor-6827-thread-1) [ ] o.a.s.c.SolrCore [collection1] Solr index directory '/home/jenkins/workspace/Lucene-Solr-master-Linux/solr/build/solr-core/test/J0/temp/solr.cloud.ForceLeaderTest_945285203273CE79-001/control-001/cores/collection1/data/index' doesn't exist. Creating new index...
[junit4] 2> 1466996 INFO (coreLoadExecutor-6827-thread-1) [ ] o.a.s.c.CachingDirectoryFactory return new directory for /home/jenkins/workspace/Lucene-Solr-master-Linux/solr/build/solr-core/test/J0/temp/solr.cloud.ForceLeaderTest_945285203273CE79-001/control-001/cores/collection1/data/index
[junit4] 2> 1466996 INFO (coreLoadExecutor-6827-thread-1) [ ] o.a.s.u.RandomMergePolicy RandomMergePolicy wrapping class org.apache.lucene.index.TieredMergePolicy: [TieredMergePolicy: maxMergeAtOnce=23, maxMergeAtOnceExplicit=28, maxMergedSegmentMB=17.6875, floorSegmentMB=1.697265625, forceMergeDeletesPctAllowed=18.929659583740804, segmentsPerTier=17.0, maxCFSSegmentSizeMB=8.796093022207999E12, noCFSRatio=0.7724600395420064
[junit4] 2> 1466997 INFO (coreLoadExecutor-6827-thread-1) [ ] o.a.s.c.SolrDeletionPolicy SolrDeletionPolicy.onCommit: commits: num=1
[junit4] 2> commit{dir=MockDirectoryWrapper(RAMDirectory@1af1334 lockFactory=org.apache.lucene.store.SingleInstanceLockFactory@1b677a1),segFN=segments_1,generation=1}
[junit4] 2> 1466997 INFO (coreLoadExecutor-6827-thread-1) [ ] o.a.s.c.SolrDeletionPolicy newest commit generation = 1
[junit4] 2> 1466997 INFO (OldIndexDirectoryCleanupThreadForCore-collection1) [ ] o.a.s.c.SolrCore Looking for old index directories to cleanup for core collection1 in /home/jenkins/workspace/Lucene-Solr-master-Linux/solr/build/solr-core/test/J0/temp/solr.cloud.ForceLeaderTest_945285203273CE79-001/control-001/cores/collection1/data/
[junit4] 2> 1466997 WARN (OldIndexDirectoryCleanupThreadForCore-collection1) [ ] o.a.s.c.DirectoryFactory /home/jenkins/workspace/Lucene-Solr-master-Linux/solr/build/solr-core/test/J0/temp/solr.cloud.ForceLeaderTest_945285203273CE79-001/control-001/cores/collection1/data/ does not point to a valid data directory; skipping clean-up of old index directories.
[junit4] 2> 1466999 INFO (coreLoadExecutor-6827-thread-1) [ ] o.a.s.u.p.UpdateRequestProcessorChain creating updateRequestProcessorChain "nodistrib"
[junit4] 2> 1466999 INFO (coreLoadExecutor-6827-thread-1) [ ] o.a.s.u.p.UpdateRequestProcessorChain creating updateRequestProcessorChain "dedupe"
[junit4] 2> 1466999 INFO (coreLoadExecutor-6827-thread-1) [ ] o.a.s.u.p.UpdateRequestProcessorChain inserting DistributedUpdateProcessorFactory into updateRequestProcessorChain "dedupe"
[junit4] 2> 1466999 INFO (coreLoadExecutor-6827-thread-1) [ ] o.a.s.u.p.UpdateRequestProcessorChain creating updateRequestProcessorChain "stored_sig"
[junit4] 2> 1466999 INFO (coreLoadExecutor-6827-thread-1) [ ] o.a.s.u.p.UpdateRequestProcessorChain inserting DistributedUpdateProcessorFactory into updateRequestProcessorChain "stored_sig"
[junit4] 2> 1466999 INFO (coreLoadExecutor-6827-thread-1) [ ] o.a.s.u.p.UpdateRequestProcessorChain creating updateRequestProcessorChain "distrib-dup-test-chain-explicit"
[junit4] 2> 1466999 INFO (coreLoadExecutor-6827-thread-1) [ ] o.a.s.u.p.UpdateRequestProcessorChain creating updateRequestProcessorChain "distrib-dup-test-chain-implicit"
[junit4] 2> 1466999 INFO (coreLoadExecutor-6827-thread-1) [ ] o.a.s.u.p.UpdateRequestProcessorChain inserting DistributedUpdateProcessorFactory into updateRequestProcessorChain "distrib-dup-test-chain-implicit"
[junit4] 2> 1466999 INFO (coreLoadExecutor-6827-thread-1) [ ] o.a.s.c.SolrCore no updateRequestProcessorChain defined as default, creating implicit default
[junit4] 2> 1466999 WARN (coreLoadExecutor-6827-thread-1) [ ] o.a.s.c.RequestHandlers INVALID paramSet a in requestHandler {type = requestHandler,name = /dump,class = DumpRequestHandler,args = {defaults={a=A,b=B}}}
[junit4] 2> 1467001 INFO (coreLoadExecutor-6827-thread-1) [ ] o.a.s.h.l.XMLLoader xsltCacheLifetimeSeconds=60
[junit4] 2> 1467001 INFO (coreLoadExecutor-6827-thread-1) [ ] o.a.s.h.l.XMLLoader xsltCacheLifetimeSeconds=60
[junit4] 2> 1467002 INFO (coreLoadExecutor-6827-thread-1) [ ] o.a.s.h.l.XMLLoader xsltCacheLifetimeSeconds=60
[junit4] 2> 1467002 INFO (coreLoadExecutor-6827-thread-1) [ ] o.a.s.h.l.XMLLoader xsltCacheLifetimeSeconds=60
[junit4] 2> 1467004 INFO (coreLoadExecutor-6827-thread-1) [ ] o.a.s.c.RequestHandlers Registered paths: /admin/mbeans,standard,/update/json/docs,/admin/luke,/export,/get,/admin/properties,/update/json,/admin/threads,/dump,/update/csv,/sql,/graph,/admin/segments,/admin/system,/replication,/config,/stream,/schema,/admin/plugins,/admin/logging,/admin/ping,/update,/admin/file,/terms
[junit4] 2> 1467004 INFO (coreLoadExecutor-6827-thread-1) [ ] o.a.s.c.SolrCore Using default statsCache cache: org.apache.solr.search.stats.LocalStatsCache
[junit4] 2> 1467004 INFO (coreLoadExecutor-6827-thread-1) [ ] o.a.s.u.UpdateHandler Using UpdateLog implementation: org.apache.solr.update.UpdateLog
[junit4] 2> 1467004 INFO (coreLoadExecutor-6827-thread-1) [ ] o.a.s.u.UpdateLog Initializing UpdateLog: dataDir= defaultSyncLevel=FLUSH numRecordsToKeep=100 maxNumLogsToKeep=10 numVersionBuckets=65536
[junit4] 2> 1467005 INFO (coreLoadExecutor-6827-thread-1) [ ] o.a.s.u.CommitTracker Hard AutoCommit: disabled
[junit4] 2> 1467005 INFO (coreLoadExecutor-6827-thread-1) [ ] o.a.s.u.CommitTracker Soft AutoCommit: disabled
[junit4] 2> 1467005 INFO (coreLoadExecutor-6827-thread-1) [ ] o.a.s.u.RandomMergePolicy RandomMergePolicy wrapping class org.apache.lucene.index.TieredMergePolicy: [TieredMergePolicy: maxMergeAtOnce=12, maxMergeAtOnceExplicit=31, maxMergedSegmentMB=73.8525390625, floorSegmentMB=1.7841796875, forceMergeDeletesPctAllowed=3.4442516893598607, segmentsPerTier=30.0, maxCFSSegmentSizeMB=8.796093022207999E12, noCFSRatio=1.0
[junit4] 2> 1467005 INFO (coreLoadExecutor-6827-thread-1) [ ] o.a.s.c.SolrDeletionPolicy SolrDeletionPolicy.onInit: commits: num=1
[junit4] 2> commit{dir=MockDirectoryWrapper(RAMDirectory@1af1334 lockFactory=org.apache.lucene.store.SingleInstanceLockFactory@1b677a1),segFN=segments_1,generation=1}
[junit4] 2> 1467005 INFO (coreLoadExecutor-6827-thread-1) [ ] o.a.s.c.SolrDeletionPolicy newest commit generation = 1
[junit4] 2> 1467005 INFO (coreLoadExecutor-6827-thread-1) [ ] o.a.s.s.SolrIndexSearcher Opening [Searcher@5cf13a[collection1] main]
[junit4] 2> 1467005 INFO (coreLoadExecutor-6827-thread-1) [ ] o.a.s.c.c.ZkStateReader Load collection config from: [/collections/control_collection]
[junit4] 2> 1467006 INFO (coreLoadExecutor-6827-thread-1) [ ] o.a.s.c.c.ZkStateReader path=[/collections/control_collection] [configName]=[conf1] specified config exists in ZooKeeper
[junit4] 2> 1467006 INFO (coreLoadExecutor-6827-thread-1) [ ] o.a.s.r.ManagedResourceStorage Setting up ZooKeeper-based storage for the RestManager with znodeBase: /configs/conf1
[junit4] 2> 1467006 INFO (coreLoadExecutor-6827-thread-1) [ ] o.a.s.r.ManagedResourceStorage Configured ZooKeeperStorageIO with znodeBase: /configs/conf1
[junit4] 2> 1467006 INFO (coreLoadExecutor-6827-thread-1) [ ] o.a.s.r.RestManager Initializing RestManager with initArgs: {}
[junit4] 2> 1467006 INFO (coreLoadExecutor-6827-thread-1) [ ] o.a.s.r.ManagedResourceStorage Reading _rest_managed.json using ZooKeeperStorageIO:path=/configs/conf1
[junit4] 2> 1467006 INFO (coreLoadExecutor-6827-thread-1) [ ] o.a.s.r.ManagedResourceStorage No data found for znode /configs/conf1/_rest_managed.json
[junit4] 2> 1467006 INFO (coreLoadExecutor-6827-thread-1) [ ] o.a.s.r.ManagedResourceStorage Loaded null at path _rest_managed.json using ZooKeeperStorageIO:path=/configs/conf1
[junit4] 2> 1467006 INFO (coreLoadExecutor-6827-thread-1) [ ] o.a.s.r.RestManager Initializing 0 registered ManagedResources
[junit4] 2> 1467006 INFO (coreLoadExecutor-6827-thread-1) [ ] o.a.s.h.ReplicationHandler Commits will be reserved for 10000
[junit4] 2> 1467007 INFO (searcherExecutor-6828-thread-1) [ ] o.a.s.c.SolrCore [collection1] Registered new searcher Searcher@5cf13a[collection1] main{ExitableDirectoryReader(UninvertingDirectoryReader())}
[junit4] 2> 1467007 INFO (coreLoadExecutor-6827-thread-1) [ ] o.a.s.u.UpdateLog Looking up max value of version field to seed version buckets
[junit4] 2> 1467007 INFO (coreLoadExecutor-6827-thread-1) [ ] o.a.s.u.VersionInfo Refreshing highest value of _version_ for 65536 version buckets from index
[junit4] 2> 1467007 INFO (coreLoadExecutor-6827-thread-1) [ ] o.a.s.u.VersionInfo No terms found for _version_, cannot seed version bucket highest value from index
[junit4] 2> 1467007 INFO (coreLoadExecutor-6827-thread-1) [ ] o.a.s.u.UpdateLog Could not find max version in index or recent updates, using new clock 1545464585098625024
[junit4] 2> 1467008 INFO (coreLoadExecutor-6827-thread-1) [ ] o.a.s.u.UpdateLog Took 1.0ms to seed version buckets with highest version 1545464585098625024
[junit4] 2> 1467008 INFO (coreLoadExecutor-6827-thread-1) [ ] o.a.s.c.ZkController watch zkdir /configs/conf1
[junit4] 2> 1467009 INFO (coreLoadExecutor-6827-thread-1) [ ] o.a.s.c.CoreContainer registering core: collection1
[junit4] 2> 1467009 INFO (coreZkRegister-6820-thread-1) [ ] o.a.s.c.ZkController Register replica - core:collection1 address:http://127.0.0.1:42475/w_d collection:control_collection shard:shard1
[junit4] 2> 1467009 INFO (coreZkRegister-6820-thread-1) [ ] o.a.s.c.c.SolrZkClient makePath: /collections/control_collection/leader_elect/shard1/election
[junit4] 2> 1467010 INFO (coreZkRegister-6820-thread-1) [ ] o.a.s.c.LeaderElector Joined leadership election with path: /collections/control_collection/leader_elect/shard1/election/96591536480780292-core_node1-n_0000000000
[junit4] 2> 1467010 INFO (coreZkRegister-6820-thread-1) [ ] o.a.s.c.ShardLeaderElectionContext Running the leader process for shard=shard1 and weAreReplacement=false and leaderVoteWait=10000
[junit4] 2> 1467011 INFO (coreZkRegister-6820-thread-1) [ ] o.a.s.c.ShardLeaderElectionContext Enough replicas found to continue.
[junit4] 2> 1467011 INFO (coreZkRegister-6820-thread-1) [ ] o.a.s.c.ShardLeaderElectionContext I may be the new leader - try and sync
[junit4] 2> 1467011 INFO (coreZkRegister-6820-thread-1) [ ] o.a.s.c.SyncStrategy Sync replicas to http://127.0.0.1:42475/w_d/collection1/
[junit4] 2> 1467011 INFO (OverseerStateUpdate-96591536480780292-127.0.0.1:42475_w_d-n_0000000000) [ ] o.a.s.c.Overseer processMessage: queueSize: 1, message = {
[junit4] 2> "operation":"leader",
[junit4] 2> "shard":"shard1",
[junit4] 2> "collection":"control_collection"} current state version: 1
[junit4] 2> 1467011 INFO (coreZkRegister-6820-thread-1) [ ] o.a.s.c.SyncStrategy Sync Success - now sync replicas to me
[junit4] 2> 1467011 INFO (coreZkRegister-6820-thread-1) [ ] o.a.s.c.SyncStrategy http://127.0.0.1:42475/w_d/collection1/ has no replicas
[junit4] 2> 1467011 INFO (coreZkRegister-6820-thread-1) [ ] o.a.s.c.c.SolrZkClient makePath: /collections/control_collection/leaders/shard1
[junit4] 2> 1467012 INFO (coreZkRegister-6820-thread-1) [ ] o.a.s.c.ShardLeaderElectionContextBase Creating leader registration node /collections/control_collection/leaders/shard1/leader after winning as /collections/control_collection/leader_elect/shard1/election/96591536480780292-core_node1-n_0000000000
[junit4] 2> 1467013 INFO (coreZkRegister-6820-thread-1) [ ] o.a.s.c.ShardLeaderElectionContext I am the new leader: http://127.0.0.1:42475/w_d/collection1/ shard1
[junit4] 2> 1467013 INFO (OverseerStateUpdate-96591536480780292-127.0.0.1:42475_w_d-n_0000000000) [ ] o.a.s.c.Overseer processMessage: queueSize: 1, message = {
[junit4] 2> "operation":"leader",
[junit4] 2> "shard":"shard1",
[junit4] 2> "collection":"control_collection",
[junit4] 2> "base_url":"http://127.0.0.1:42475/w_d",
[junit4] 2> "core":"collection1",
[junit4] 2> "state":"active"} current state version: 1
[junit4] 2> 1467114 INFO (zkCallback-2101-thread-1) [ ] o.a.s.c.c.ZkStateReader A cluster state change: [WatchedEvent state:SyncConnected type:NodeDataChanged path:/clusterstate.json], has occurred - updating... (live nodes size: [1])
[junit4] 2> 1467163 INFO (coreZkRegister-6820-thread-1) [ ] o.a.s.c.ZkController We are http://127.0.0.1:42475/w_d/collection1/ and leader is http://127.0.0.1:42475/w_d/collection1/
[junit4] 2> 1467163 INFO (coreZkRegister-6820-thread-1) [ ] o.a.s.c.ZkController No LogReplay needed for core=collection1 baseURL=http://127.0.0.1:42475/w_d
[junit4] 2> 1467163 INFO (coreZkRegister-6820-thread-1) [ ] o.a.s.c.ZkController I am the leader, no recovery necessary
[junit4] 2> 1467163 INFO (coreZkRegister-6820-thread-1) [ ] o.a.s.c.ZkController publishing state=active
[junit4] 2> 1467163 INFO (coreZkRegister-6820-thread-1) [ ] o.a.s.c.ZkController numShards not found on descriptor - reading it from system property
[junit4] 2> 1467164 INFO (coreZkRegister-6820-thread-1) [ ] o.a.s.c.c.ZkStateReader Checking legacy cluster state for collection control_collection
[junit4] 2> 1467164 INFO (OverseerStateUpdate-96591536480780292-127.0.0.1:42475_w_d-n_0000000000) [ ] o.a.s.c.Overseer processMessage: queueSize: 1, message = {
[junit4] 2> "core":"collection1",
[junit4] 2> "core_node_name":"core_node1",
[junit4] 2> "roles":null,
[junit4] 2> "base_url":"http://127.0.0.1:42475/w_d",
[junit4] 2> "node_name":"127.0.0.1:42475_w_d",
[junit4] 2> "numShards":"1",
[junit4] 2> "state":"active",
[junit4] 2> "shard":"shard1",
[junit4] 2> "collection":"control_collection",
[junit4] 2> "operation":"state"} current state version: 2
[junit4] 2> 1467164 INFO (OverseerStateUpdate-96591536480780292-127.0.0.1:42475_w_d-n_0000000000) [ ] o.a.s.c.o.ReplicaMutator Update state numShards=1 message={
[junit4] 2> "core":"collection1",
[junit4] 2> "core_node_name":"core_node1",
[junit4] 2> "roles":null,
[junit4] 2> "base_url":"http://127.0.0.1:42475/w_d",
[junit4] 2> "node_name":"127.0.0.1:42475_w_d",
[junit4] 2> "numShards":"1",
[junit4] 2> "state":"active",
[junit4] 2> "shard":"shard1",
[junit4] 2> "collection":"control_collection",
[junit4] 2> "operation":"state"}
[junit4] 2> 1467265 INFO (zkCallback-2101-thread-2) [ ] o.a.s.c.c.ZkStateReader A cluster state change: [WatchedEvent state:SyncConnected type:NodeDataChanged path:/clusterstate.json], has occurred - updating... (live nodes size: [1])
[junit4] 2> 1467386 INFO (TEST-ForceLeaderTest.testLastPublishedStateIsActive-seed#[945285203273CE79]) [ ] o.a.s.c.c.SolrZkClient Using default ZkCredentialsProvider
[junit4] 2> 1467387 INFO (TEST-ForceLeaderTest.testLastPublishedStateIsActive-seed#[945285203273CE79]) [ ] o.a.s.c.c.ConnectionManager Waiting for client to connect to ZooKeeper
[junit4] 2> 1467387 INFO (zkCallback-2105-thread-1) [ ] o.a.s.c.c.ConnectionManager Watcher org.apache.solr.common.cloud.ConnectionManager@1abf6c1 name:ZooKeeperConnection Watcher:127.0.0.1:39601/solr got event WatchedEvent state:SyncConnected type:None path:null path:null type:None
[junit4] 2> 1467388 INFO (TEST-ForceLeaderTest.testLastPublishedStateIsActive-seed#[945285203273CE79]) [ ] o.a.s.c.c.ConnectionManager Client is connected to ZooKeeper
[junit4] 2> 1467388 INFO (TEST-ForceLeaderTest.testLastPublishedStateIsActive-seed#[945285203273CE79]) [ ] o.a.s.c.c.SolrZkClient Using default ZkACLProvider
[junit4] 2> 1467388 INFO (TEST-ForceLeaderTest.testLastPublishedStateIsActive-seed#[945285203273CE79]) [ ] o.a.s.c.c.ZkStateReader Updating cluster state from ZooKeeper...
[junit4] 2> 1467388 INFO (TEST-ForceLeaderTest.testLastPublishedStateIsActive-seed#[945285203273CE79]) [ ] o.a.s.c.c.ZkStateReader Loaded empty cluster properties
[junit4] 2> 1467388 INFO (TEST-ForceLeaderTest.testLastPublishedStateIsActive-seed#[945285203273CE79]) [ ] o.a.s.c.c.ZkStateReader Updated live nodes from ZooKeeper... (0) -> (1)
[junit4] 2> 1467389 INFO (TEST-ForceLeaderTest.testLastPublishedStateIsActive-seed#[945285203273CE79]) [ ] o.a.s.c.ChaosMonkey monkey: init - expire sessions:false cause connection loss:false
[junit4] 2> 1467472 INFO (TEST-ForceLeaderTest.testLastPublishedStateIsActive-seed#[945285203273CE79]) [ ] o.a.s.SolrTestCaseJ4 Writing core.properties file to /home/jenkins/workspace/Lucene-Solr-master-Linux/solr/build/solr-core/test/J0/temp/solr.cloud.ForceLeaderTest_945285203273CE79-001/shard-1-001/cores/collection1
[junit4] 2> 1467473 INFO (TEST-ForceLeaderTest.testLastPublishedStateIsActive-seed#[945285203273CE79]) [ ] o.a.s.c.AbstractFullDistribZkTestBase create jetty 1 in directory /home/jenkins/workspace/Lucene-Solr-master-Linux/solr/build/solr-core/test/J0/temp/solr.cloud.ForceLeaderTest_945285203273CE79-001/shard-1-001
[junit4] 2> 1467474 INFO (TEST-ForceLeaderTest.testLastPublishedStateIsActive-seed#[945285203273CE79]) [ ] o.e.j.s.Server jetty-9.3.8.v20160314
[junit4] 2> 1467475 INFO (TEST-ForceLeaderTest.testLastPublishedStateIsActive-seed#[945285203273CE79]) [ ] o.e.j.s.h.ContextHandler Started o.e.j.s.ServletContextHandler@8dabf{/w_d,null,AVAILABLE}
[junit4] 2> 1467475 INFO (TEST-ForceLeaderTest.testLastPublishedStateIsActive-seed#[945285203273CE79]) [ ] o.e.j.s.ServerConnector Started ServerConnector@1e2add1{HTTP/1.1,[http/1.1]}{127.0.0.1:34972}
[junit4] 2> 1467476 INFO (TEST-ForceLeaderTest.testLastPublishedStateIsActive-seed#[945285203273CE79]) [ ] o.e.j.s.Server Started @1469329ms
[junit4] 2> 1467476 INFO (TEST-ForceLeaderTest.testLastPublishedStateIsActive-seed#[945285203273CE79]) [ ] o.a.s.c.s.e.JettySolrRunner Jetty properties: {hostContext=/w_d, solrconfig=solrconfig.xml, solr.data.dir=/home/jenkins/workspace/Lucene-Solr-master-Linux/solr/build/solr-core/test/J0/temp/solr.cloud.ForceLeaderTest_945285203273CE79-001/tempDir-001/jetty1, hostPort=39491, coreRootDirectory=/home/jenkins/workspace/Lucene-Solr-master-Linux/solr/build/solr-core/test/J0/temp/solr.cloud.ForceLeaderTest_945285203273CE79-001/shard-1-001/cores}
[junit4] 2> 1467476 INFO (TEST-ForceLeaderTest.testLastPublishedStateIsActive-seed#[945285203273CE79]) [ ] o.a.s.s.SolrDispatchFilter SolrDispatchFilter.init(): jdk.internal.loader.ClassLoaders$AppClassLoader@1223dd8
[junit4] 2> 1467476 INFO (TEST-ForceLeaderTest.testLastPublishedStateIsActive-seed#[945285203273CE79]) [ ] o.a.s.c.SolrResourceLoader new SolrResourceLoader for directory: '/home/jenkins/workspace/Lucene-Solr-master-Linux/solr/build/solr-core/test/J0/temp/solr.cloud.ForceLeaderTest_945285203273CE79-001/shard-1-001'
[junit4] 2> 1467476 INFO (TEST-ForceLeaderTest.testLastPublishedStateIsActive-seed#[945285203273CE79]) [ ] o.a.s.c.SolrResourceLoader JNDI not configured for solr (NoInitialContextEx)
[junit4] 2> 1467476 INFO (TEST-ForceLeaderTest.testLastPublishedStateIsActive-seed#[945285203273CE79]) [ ] o.a.s.c.SolrResourceLoader solr home defaulted to 'solr/' (could not find system property or JNDI)
[junit4] 2> 1467476 INFO (TEST-ForceLeaderTest.testLastPublishedStateIsActive-seed#[945285203273CE79]) [ ] o.a.s.c.c.SolrZkClient Using default ZkCredentialsProvider
[junit4] 2> 1467477 INFO (TEST-ForceLeaderTest.testLastPublishedStateIsActive-seed#[945285203273CE79]) [ ] o.a.s.c.c.ConnectionManager Waiting for client to connect to ZooKeeper
[junit4] 2> 1467477 INFO (zkCallback-2106-thread-1) [ ] o.a.s.c.c.ConnectionManager Watcher org.apache.solr.common.cloud.ConnectionManager@21cff6 name:ZooKeeperConnection Watcher:127.0.0.1:39601/solr got event WatchedEvent state:SyncConnected type:None path:null path:null type:None
[junit4] 2> 1467477 INFO (TEST-ForceLeaderTest.testLastPublishedStateIsActive-seed#[945285203273CE79]) [ ] o.a.s.c.c.ConnectionManager Client is connected to ZooKeeper
[junit4] 2> 1467478 INFO (TEST-ForceLeaderTest.testLastPublishedStateIsActive-seed#[945285203273CE79]) [ ] o.a.s.c.c.SolrZkClient Using default ZkACLProvider
[junit4] 2> 1467478 INFO (TEST-ForceLeaderTest.testLastPublishedStateIsActive-seed#[945285203273CE79]) [ ] o.a.s.s.SolrDispatchFilter Loading solr.xml from SolrHome (not found in ZooKeeper)
[junit4] 2> 1467478 INFO (TEST-ForceLeaderTest.testLastPublishedStateIsActive-seed#[945285203273CE79]) [ ] o.a.s.c.SolrXmlConfig Loading container configuration from /home/jenkins/workspace/Lucene-Solr-master-Linux/solr/build/solr-core/test/J0/temp/solr.cloud.ForceLeaderTest_945285203273CE79-001/shard-1-001/solr.xml
[junit4] 2> 1467482 INFO (TEST-ForceLeaderTest.testLastPublishedStateIsActive-seed#[945285203273CE79]) [ ] o.a.s.c.CorePropertiesLocator Config-defined core root directory: /home/jenkins/workspace/Lucene-Solr-master-Linux/solr/build/solr-core/test/J0/temp/solr.cloud.ForceLeaderTest_945285203273CE79-001/shard-1-001/cores
[junit4] 2> 1467482 INFO (TEST-ForceLeaderTest.testLastPublishedStateIsActive-seed#[945285203273CE79]) [ ] o.a.s.c.CoreContainer New CoreContainer 18382215
[junit4] 2> 1467482 INFO (TEST-ForceLeaderTest.testLastPublishedStateIsActive-seed#[945285203273CE79]) [ ] o.a.s.c.CoreContainer Loading cores into CoreContainer [instanceDir=/home/jenkins/workspace/Lucene-Solr-master-Linux/solr/build/solr-core/test/J0/temp/solr.cloud.ForceLeaderTest_945285203273CE79-001/shard-1-001]
[junit4] 2> 1467482 WARN (TEST-ForceLeaderTest.testLastPublishedStateIsActive-seed#[945285203273CE79]) [ ] o.a.s.c.CoreContainer Couldn't add files from /home/jenkins/workspace/Lucene-Solr-master-Linux/solr/build/solr-core/test/J0/temp/solr.cloud.ForceLeaderTest_945285203273CE79-001/shard-1-001/lib to classpath: /home/jenkins/workspace/Lucene-Solr-master-Linux/solr/build/solr-core/test/J0/temp/solr.cloud.ForceLeaderTest_945285203273CE79-001/shard-1-001/lib
[junit4] 2> 1467482 INFO (TEST-ForceLeaderTest.testLastPublishedStateIsActive-seed#[945285203273CE79]) [ ] o.a.s.h.c.HttpShardHandlerFactory created with socketTimeout : 90000,urlScheme : ,connTimeout : 15000,maxConnectionsPerHost : 20,maxConnections : 10000,corePoolSize : 0,maximumPoolSize : 2147483647,maxThreadIdleTime : 5,sizeOfQueue : -1,fairnessPolicy : false,
[junit4] 2> 1467484 INFO (TEST-ForceLeaderTest.testLastPublishedStateIsActive-seed#[945285203273CE79]) [ ] o.a.s.u.UpdateShardHandler Created UpdateShardHandler HTTP client with params: socketTimeout=340000&connTimeout=45000&maxConnections=100000&maxConnectionsPerHost=100000
[junit4] 2> 1467484 INFO (TEST-ForceLeaderTest.testLastPublishedStateIsActive-seed#[945285203273CE79]) [ ] o.a.s.l.LogWatcher SLF4J impl is org.slf4j.impl.Log4jLoggerFactory
[junit4] 2> 1467484 INFO (TEST-ForceLeaderTest.testLastPublishedStateIsActive-seed#[945285203273CE79]) [ ] o.a.s.l.LogWatcher Registering Log Listener [Log4j (org.slf4j.impl.Log4jLoggerFactory)]
[junit4] 2> 1467484 INFO (TEST-ForceLeaderTest.testLastPublishedStateIsActive-seed#[945285203273CE79]) [ ] o.a.s.c.ZkContainer Zookeeper client=127.0.0.1:39601/solr
[junit4] 2> 1467484 INFO (TEST-ForceLeaderTest.testLastPublishedStateIsActive-seed#[945285203273CE79]) [ ] o.a.s.c.ZkController zkHost includes chroot
[junit4] 2> 1467484 INFO (TEST-ForceLeaderTest.testLastPublishedStateIsActive-seed#[945285203273CE79]) [ ] o.a.s.c.c.SolrZkClient Using default ZkCredentialsProvider
[junit4] 2> 1467485 INFO (TEST-ForceLeaderTest.testLastPublishedStateIsActive-seed#[945285203273CE79]) [ ] o.a.s.c.c.ConnectionManager Waiting for client to connect to ZooKeeper
[junit4] 2> 1467485 INFO (zkCallback-2109-thread-1) [ ] o.a.s.c.c.ConnectionManager Watcher org.apache.solr.common.cloud.ConnectionManager@6494c4 name:ZooKeeperConnection Watcher:127.0.0.1:39601 got event WatchedEvent state:SyncConnected type:None path:null path:null type:None
[junit4] 2> 1467485 INFO (TEST-ForceLeaderTest.testLastPublishedStateIsActive-seed#[945285203273CE79]) [ ] o.a.s.c.c.ConnectionManager Client is connected to ZooKeeper
[junit4] 2> 1467485 INFO (TEST-ForceLeaderTest.testLastPublishedStateIsActive-seed#[945285203273CE79]) [ ] o.a.s.c.c.SolrZkClient Using default ZkACLProvider
[junit4] 2> 1467486 INFO (TEST-ForceLeaderTest.testLastPublishedStateIsActive-seed#[945285203273CE79]) [ ] o.a.s.c.ZkController Added new OnReconnect listener org.apache.solr.cloud.ZkController$$Lambda$205/10564886@9de477
[junit4] 2> 1467486 INFO (TEST-ForceLeaderTest.testLastPublishedStateIsActive-seed#[945285203273CE79]) [ ] o.a.s.c.c.ConnectionManager Waiting for client to connect to ZooKeeper
[junit4] 2> 1467486 INFO (zkCallback-2110-thread-1) [ ] o.a.s.c.c.ConnectionManager Watcher org.apache.solr.common.cloud.ConnectionManager@fa4499 name:ZooKeeperConnection Watcher:127.0.0.1:39601/solr got event WatchedEvent state:SyncConnected type:None path:null path:null type:None
[junit4] 2> 1467486 INFO (TEST-ForceLeaderTest.testLastPublishedStateIsActive-seed#[945285203273CE79]) [ ] o.a.s.c.c.ConnectionManager Client is connected to ZooKeeper
[junit4] 2> 1467489 INFO (TEST-ForceLeaderTest.testLastPublishedStateIsActive-seed#[945285203273CE79]) [ ] o.a.s.c.c.ZkStateReader Updating cluster state from ZooKeeper...
[junit4] 2> 1467489 INFO (TEST-ForceLeaderTest.testLastPublishedStateIsActive-seed#[945285203273CE79]) [ ] o.a.s.c.c.ZkStateReader Loaded empty cluster properties
[junit4] 2> 1467489 INFO (TEST-ForceLeaderTest.testLastPublishedStateIsActive-seed#[945285203273CE79]) [ ] o.a.s.c.c.ZkStateReader Updated live nodes from ZooKeeper... (0) -> (1)
[junit4] 2> 1467490 INFO (TEST-ForceLeaderTest.testLastPublishedStateIsActive-seed#[945285203273CE79]) [ ] o.a.s.c.Overseer Overseer (id=null) closing
[junit4] 2> 1467490 INFO (TEST-ForceLeaderTest.testLastPublishedStateIsActive-seed#[945285203273CE79]) [ ] o.a.s.c.LeaderElector Joined leadership election with path: /overseer_elect/election/96591536480780296-127.0.0.1:39491_w_d-n_0000000001
[junit4] 2> 1467490 INFO (TEST-ForceLeaderTest.testLastPublishedStateIsActive-seed#[945285203273CE79]) [ ] o.a.s.c.LeaderElector Watching path /overseer_elect/election/96591536480780292-127.0.0.1:42475_w_d-n_0000000000 to know if I could be the leader
[junit4] 2> 1467490 INFO (TEST-ForceLeaderTest.testLastPublishedStateIsActive-seed#[945285203273CE79]) [ ] o.a.s.c.ZkController Publish node=127.0.0.1:39491_w_d as DOWN
[junit4] 2> 1467491 INFO (TEST-ForceLeaderTest.testLastPublishedStateIsActive-seed#[945285203273CE79]) [ ] o.a.s.c.ZkController Register node as live in ZooKeeper:/live_nodes/127.0.0.1:39491_w_d
[junit4] 2> 1467491 INFO (TEST-ForceLeaderTest.testLastPublishedStateIsActive-seed#[945285203273CE79]) [ ] o.a.s.c.c.SolrZkClient makePath: /live_nodes/127.0.0.1:39491_w_d
[junit4] 2> 1467492 INFO (OverseerStateUpdate-96591536480780292-127.0.0.1:42475_w_d-n_0000000000) [ ] o.a.s.c.Overseer processMessage: queueSize: 1, message = {
[junit4] 2> "operation":"downnode",
[junit4] 2> "node_name":"127.0.0.1:39491_w_d"} current state version: 3
[junit4] 2> 1467492 INFO (OverseerStateUpdate-96591536480780292-127.0.0.1:42475_w_d-n_0000000000) [ ] o.a.s.c.o.NodeMutator DownNode state invoked for node: 127.0.0.1:39491_w_d
[junit4] 2> 1467492 INFO (zkCallback-2105-thread-1) [ ] o.a.s.c.c.ZkStateReader A live node change: [WatchedEvent state:SyncConnected type:NodeChildrenChanged path:/live_nodes], has occurred - updating... (live nodes size: [1])
[junit4] 2> 1467492 INFO (zkCallback-2110-thread-1) [ ] o.a.s.c.c.ZkStateReader A live node change: [WatchedEvent state:SyncConnected type:NodeChildrenChanged path:/live_nodes], has occurred - updating... (live nodes size: [1])
[junit4] 2> 1467492 INFO (zkCallback-2101-thread-2) [ ] o.a.s.c.c.ZkStateReader A live node change: [WatchedEvent state:SyncConnected type:NodeChildrenChanged path:/live_nodes], has occurred - updating... (live nodes size: [1])
[junit4] 2> 1467493 INFO (zkCallback-2105-thread-1) [ ] o.a.s.c.c.ZkStateReader Updated live nodes from ZooKeeper... (1) -> (2)
[junit4] 2> 1467493 INFO (zkCallback-2110-thread-1) [ ] o.a.s.c.c.ZkStateReader Updated live nodes from ZooKeeper... (1) -> (2)
[junit4] 2> 1467493 INFO (zkCallback-2101-thread-2) [ ] o.a.s.c.c.ZkStateReader Updated live nodes from ZooKeeper... (1) -> (2)
[junit4] 2> 1467509 INFO (TEST-ForceLeaderTest.testLastPublishedStateIsActive-seed#[945285203273CE79]) [ ] o.a.s.c.CoreContainer Security conf doesn't exist. Skipping setup for authorization module.
[junit4] 2> 1467509 INFO (TEST-ForceLeaderTest.testLastPublishedStateIsActive-seed#[945285203273CE79]) [ ] o.a.s.c.CoreContainer No authentication plugin used.
[junit4] 2> 1467509 INFO (TEST-ForceLeaderTest.testLastPublishedStateIsActive-seed#[945285203273CE79]) [ ] o.a.s.c.CorePropertiesLocator Looking for core definitions underneath /home/jenkins/workspace/Lucene-Solr-master-Linux/solr/build/solr-core/test/J0/temp/solr.cloud.ForceLeaderTest_945285203273CE79-001/shard-1-001/cores
[junit4] 2> 1467510 INFO (TEST-ForceLeaderTest.testLastPublishedStateIsActive-seed#[945285203273CE79]) [ ] o.a.s.c.CoreDescriptor Created CoreDescriptor: {schema=schema.xml, dataDir=data/, collection=collection1, loadOnStartup=true, coreNodeName=, transient=false, name=collection1, shard=, config=solrconfig.xml, configSetProperties=configsetprops.json}
[junit4] 2> 1467510 INFO (TEST-ForceLeaderTest.testLastPublishedStateIsActive-seed#[945285203273CE79]) [ ] o.a.s.c.CorePropertiesLocator Found core collection1 in /home/jenkins/workspace/Lucene-Solr-master-Linux/solr/build/solr-core/test/J0/temp/solr.cloud.ForceLeaderTest_945285203273CE79-001/shard-1-001/cores/collection1
[junit4] 2> 1467510 INFO (TEST-ForceLeaderTest.testLastPublishedStateIsActive-seed#[945285203273CE79]) [ ] o.a.s.c.CorePropertiesLocator Found 1 core definitions
[junit4] 2> 1467510 INFO (TEST-ForceLeaderTest.testLastPublishedStateIsActive-seed#[945285203273CE79]) [ ] o.a.s.s.SolrDispatchFilter user.dir=/home/jenkins/workspace/Lucene-Solr-master-Linux/solr/build/solr-core/test/J0
[junit4] 2> 1467510 INFO (TEST-ForceLeaderTest.testLastPublishedStateIsActive-seed#[945285203273CE79]) [ ] o.a.s.s.SolrDispatchFilter SolrDispatchFilter.init() done
[junit4] 2> 1467510 INFO (coreLoadExecutor-6838-thread-1) [ ] o.a.s.c.ZkController publishing state=down
[junit4] 2> 1467510 INFO (coreLoadExecutor-6838-thread-1) [ ] o.a.s.c.ZkController numShards not found on descriptor - reading it from system property
[junit4] 2> 1467511 INFO (coreLoadExecutor-6838-thread-1) [ ] o.a.s.c.ZkController Collection collection1 not visible yet, but flagging it so a watch is registered when it becomes visible
[junit4] 2> 1467511 INFO (OverseerStateUpdate-96591536480780292-127.0.0.1:42475_w_d-n_0000000000) [ ] o.a.s.c.Overseer processMessage: queueSize: 1, message = {
[junit4] 2> "core":"collection1",
[junit4] 2> "roles":null,
[junit4] 2> "base_url":"http://127.0.0.1:39491/w_d",
[junit4] 2> "node_name":"127.0.0.1:39491_w_d",
[junit4] 2> "numShards":"2",
[junit4] 2> "state":"down",
[junit4] 2> "shard":null,
[junit4] 2> "collection":"collection1",
[junit4] 2> "operation":"state"} current state version: 3
[junit4] 2> 1467511 INFO (OverseerStateUpdate-96591536480780292-127.0.0.1:42475_w_d-n_0000000000) [ ] o.a.s.c.o.ReplicaMutator Update state numShards=2 message={
[junit4] 2> "core":"collection1",
[junit4] 2> "roles":null,
[junit4] 2> "base_url":"http://127.0.0.1:39491/w_d",
[junit4] 2> "node_name":"127.0.0.1:39491_w_d",
[junit4] 2> "numShards":"2",
[junit4] 2> "state":"down",
[junit4] 2> "shard":null,
[junit4] 2> "collection":"collection1",
[junit4] 2> "operation":"state"}
[junit4] 2> 1467511 INFO (coreLoadExecutor-6838-thread-1) [ ] o.a.s.c.c.ZkStateReader Deleting data for [collection1]
[junit4] 2> 1467511 INFO (OverseerStateUpdate-96591536480780292-127.0.0.1:42475_w_d-n_0000000000) [ ] o.a.s.c.o.ClusterStateMutator building a new cName: collection1
[junit4] 2> 1467511 INFO (OverseerStateUpdate-96591536480780292-127.0.0.1:42475_w_d-n_0000000000) [ ] o.a.s.c.o.ReplicaMutator Assigning new node to shard shard=shard2
[junit4] 2> 1467511 INFO (coreLoadExecutor-6838-thread-1) [ ] o.a.s.c.ZkController look for our core node name
[junit4] 2> 1467612 INFO (zkCallback-2101-thread-2) [ ] o.a.s.c.c.ZkStateReader A cluster state change: [WatchedEvent state:SyncConnected type:NodeDataChanged path:/clusterstate.json], has occurred - updating... (live nodes size: [2])
[junit4] 2> 1467612 INFO (zkCallback-2110-thread-1) [ ] o.a.s.c.c.ZkStateReader A cluster state change: [WatchedEvent state:SyncConnected type:NodeDataChanged path:/clusterstate.json], has occurred - updating... (live nodes size: [2])
[junit4] 2> 1467612 INFO (zkCallback-2105-thread-1) [ ] o.a.s.c.c.ZkStateReader A cluster state change: [WatchedEvent state:SyncConnected type:NodeDataChanged path:/clusterstate.json], has occurred - updating... (live nodes size: [2])
[junit4] 2> 1468512 INFO (coreLoadExecutor-6838-thread-1) [ ] o.a.s.c.ZkController waiting to find shard id in clusterstate for collection1
[junit4] 2> 1468512 INFO (coreLoadExecutor-6838-thread-1) [ ] o.a.s.c.ZkController Check for collection zkNode:collection1
[junit4] 2> 1468512 INFO (coreLoadExecutor-6838-thread-1) [ ] o.a.s.c.ZkController Collection zkNode exists
[junit4] 2> 1468512 INFO (coreLoadExecutor-6838-thread-1) [ ] o.a.s.c.c.ZkStateReader Load collection config from: [/collections/collection1]
[junit4] 2> 1468512 INFO (coreLoadExecutor-6838-thread-1) [ ] o.a.s.c.c.ZkStateReader path=[/collections/collection1] [configName]=[conf1] specified config exists in ZooKeeper
[junit4] 2> 1468512 INFO (coreLoadExecutor-6838-thread-1) [ ] o.a.s.c.SolrResourceLoader new SolrResourceLoader for directory: '/home/jenkins/workspace/Lucene-Solr-master-Linux/solr/build/solr-core/test/J0/temp/solr.cloud.ForceLeaderTest_945285203273CE79-001/shard-1-001/cores/collection1'
[junit4] 2> 1468513 INFO (coreLoadExecutor-6838-thread-1) [ ] o.a.s.c.SolrResourceLoader JNDI not configured for solr (NoInitialContextEx)
[junit4] 2> 1468513 INFO (coreLoadExecutor-6838-thread-1) [ ] o.a.s.c.SolrResourceLoader solr home defaulted to 'solr/' (could not find system property or JNDI)
[junit4] 2> 1468513 INFO (coreLoadExecutor-6838-thread-1) [ ] o.a.s.c.Config loaded config solrconfig.xml with version 0
[junit4] 2> 1468516 INFO (coreLoadExecutor-6838-thread-1) [ ] o.a.s.c.SolrConfig current version of requestparams : -1
[junit4] 2> 1468518 INFO (coreLoadExecutor-6838-thread-1) [ ] o.a.s.c.SolrConfig Using Lucene MatchVersion: 7.0.0
[junit4] 2> 1468524 INFO (coreLoadExecutor-6838-thread-1) [ ] o.a.s.c.SolrConfig Loaded SolrConfig: solrconfig.xml
[junit4] 2> 1468528 INFO (coreLoadExecutor-6838-thread-1) [ ] o.a.s.s.IndexSchema [collection1] Schema name=test
[junit4] 2> 1468590 INFO (coreLoadExecutor-6838-thread-1) [ ] o.a.s.s.OpenExchangeRatesOrgProvider Initialized with rates=open-exchange-rates.json, refreshInterval=1440.
[junit4] 2> 1468601 INFO (coreLoadExecutor-6838-thread-1) [ ] o.a.s.s.IndexSchema default search field in schema is text
[junit4] 2> 1468603 INFO (coreLoadExecutor-6838-thread-1) [ ] o.a.s.s.IndexSchema unique key field: id
[junit4] 2> 1468606 INFO (coreLoadExecutor-6838-thread-1) [ ] o.a.s.s.FileExchangeRateProvider Reloading exchange rates from file currency.xml
[junit4] 2> 1468608 INFO (coreLoadExecutor-6838-thread-1) [ ] o.a.s.s.FileExchangeRateProvider Reloading exchange rates from file currency.xml
[junit4] 2> 1468609 INFO (coreLoadExecutor-6838-thread-1) [ ] o.a.s.s.OpenExchangeRatesOrgProvider Reloading exchange rates from open-exchange-rates.json
[junit4] 2> 1468609 INFO (coreLoadExecutor-6838-thread-1) [ ] o.a.s.s.OpenExchangeRatesOrgProvider Reloading exchange rates from open-exchange-rates.json
[junit4] 2> 1468610 INFO (coreLoadExecutor-6838-thread-1) [ ] o.a.s.c.ConfigSetProperties Did not find ConfigSet properties, assuming default properties: Can't find resource 'configsetprops.json' in classpath or '/configs/conf1', cwd=/home/jenkins/workspace/Lucene-Solr-master-Linux/solr/build/solr-core/test/J0
[junit4] 2> 1468610 INFO (coreLoadExecutor-6838-thread-1) [ ] o.a.s.c.CoreContainer Creating SolrCore 'collection1' using configuration from collection collection1
[junit4] 2> 1468610 INFO (coreLoadExecutor-6838-thread-1) [ ] o.a.s.c.SolrCore org.apache.solr.core.MockDirectoryFactory
[junit4] 2> 1468610 INFO (coreLoadExecutor-6838-thread-1) [ ] o.a.s.c.SolrCore [[collection1] ] Opening new SolrCore at [/home/jenkins/workspace/Lucene-Solr-master-Linux/solr/build/solr-core/test/J0/temp/solr.cloud.ForceLeaderTest_945285203273CE79-001/shard-1-001/cores/collection1], dataDir=[/home/jenkins/workspace/Lucene-Solr-master-Linux/solr/build/solr-core/test/J0/temp/solr.cloud.ForceLeaderTest_945285203273CE79-001/shard-1-001/cores/collection1/data/]
[junit4] 2> 1468610 INFO (coreLoadExecutor-6838-thread-1) [ ] o.a.s.c.JmxMonitoredMap JMX monitoring is enabled. Adding Solr mbeans to JMX Server: com.sun.jmx.mbeanserver.JmxMBeanServer@58c5cd
[junit4] 2> 1468611 INFO (coreLoadExecutor-6838-thread-1) [ ] o.a.s.c.CachingDirectoryFactory return new directory for /home/jenkins/workspace/Lucene-Solr-master-Linux/solr/build/solr-core/test/J0/temp/solr.cloud.ForceLeaderTest_945285203273CE79-001/shard-1-001/cores/collection1/data/snapshot_metadata
[junit4] 2> 1468611 INFO (coreLoadExecutor-6838-thread-1) [ ] o.a.s.c.s.SolrSnapshotMetaDataManager Loading from snapshot metadata file...
[junit4] 2> 1468611 INFO (coreLoadExecutor-6838-thread-1) [ ] o.a.s.c.CachingDirectoryFactory return new directory for /home/jenkins/workspace/Lucene-Solr-master-Linux/solr/build/solr-core/test/J0/temp/solr.cloud.ForceLeaderTest_945285203273CE79-001/shard-1-001/cores/collection1/data
[junit4] 2> 1468611 INFO (coreLoadExecutor-6838-thread-1) [ ] o.a.s.c.SolrCore New index directory detected: old=null new=/home/jenkins/workspace/Lucene-Solr-master-Linux/solr/build/solr-core/test/J0/temp/solr.cloud.ForceLeaderTest_945285203273CE79-001/shard-1-001/cores/collection1/data/index/
[junit4] 2> 1468611 WARN (coreLoadExecutor-6838-thread-1) [ ] o.a.s.c.SolrCore [collection1] Solr index directory '/home/jenkins/workspace/Lucene-Solr-master-Linux/solr/build/solr-core/test/J0/temp/solr.cloud.ForceLeaderTest_945285203273CE79-001/shard-1-001/cores/collection1/data/index' doesn't exist. Creating new index...
[junit4] 2> 1468611 INFO (coreLoadExecutor-6838-thread-1) [ ] o.a.s.c.CachingDirectoryFactory return new directory for /home/jenkins/workspace/Lucene-Solr-master-Linux/solr/build/solr-core/test/J0/temp/solr.cloud.ForceLeaderTest_945285203273CE79-001/shard-1-001/cores/collection1/data/index
[junit4] 2> 1468611 INFO (coreLoadExecutor-6838-thread-1) [ ] o.a.s.u.RandomMergePolicy RandomMergePolicy wrapping class org.apache.lucene.index.TieredMergePolicy: [TieredMergePolicy: maxMergeAtOnce=23, maxMergeAtOnceExplicit=28, maxMergedSegmentMB=17.6875, floorSegmentMB=1.697265625, forceMergeDeletesPctAllowed=18.929659583740804, segmentsPerTier=17.0, maxCFSSegmentSizeMB=8.796093022207999E12, noCFSRatio=0.7724600395420064
[junit4] 2> 1468612 INFO (coreLoadExecutor-6838-thread-1) [ ] o.a.s.c.SolrDeletionPolicy SolrDeletionPolicy.onCommit: commits: num=1
[junit4] 2> commit{dir=MockDirectoryWrapper(RAMDirectory@1a8eeba lockFactory=org.apache.lucene.store.SingleInstanceLockFactory@870128),segFN=segments_1,generation=1}
[junit4] 2> 1468612 INFO (coreLoadExecutor-6838-thread-1) [ ] o.a.s.c.SolrDeletionPolicy newest commit generation = 1
[junit4] 2> 1468612 INFO (OldIndexDirectoryCleanupThreadForCore-collection1) [ ] o.a.s.c.SolrCore Looking for old index directories to cleanup for core collection1 in /home/jenkins/workspace/Lucene-Solr-master-Linux/solr/build/solr-core/test/J0/temp/solr.cloud.ForceLeaderTest_945285203273CE79-001/shard-1-001/cores/collection1/data/
[junit4] 2> 1468612 WARN (OldIndexDirectoryCleanupThreadForCore-collection1) [ ] o.a.s.c.DirectoryFactory /home/jenkins/workspace/Lucene-Solr-master-Linux/solr/build/solr-core/test/J0/temp/solr.cloud.ForceLeaderTest_945285203273CE79-001/shard-1-001/cores/collection1/data/ does not point to a valid data directory; skipping clean-up of old index directories.
[junit4] 2> 1468614 INFO (coreLoadExecutor-6838-thread-1) [ ] o.a.s.u.p.UpdateRequestProcessorChain creating updateRequestProcessorChain "nodistrib"
[junit4] 2> 1468614 INFO (coreLoadExecutor-6838-thread-1) [ ] o.a.s.u.p.UpdateRequestProcessorChain creating updateRequestProcessorChain "dedupe"
[junit4] 2> 1468614 INFO (coreLoadExecutor-6838-thread-1) [ ] o.a.s.u.p.UpdateRequestProcessorChain inserting DistributedUpdateProcessorFactory into updateRequestProcessorChain "dedupe"
[junit4] 2> 1468614 INFO (coreLoadExecutor-6838-thread-1) [ ] o.a.s.u.p.UpdateRequestProcessorChain creating updateRequestProcessorChain "stored_sig"
[junit4] 2> 1468614 INFO (coreLoadExecutor-6838-thread-1) [ ] o.a.s.u.p.UpdateRequestProcessorChain inserting DistributedUpdateProcessorFactory into updateRequestProcessorChain "stored_sig"
[junit4] 2> 1468614 INFO (coreLoadExecutor-6838-thread-1) [ ] o.a.s.u.p.UpdateRequestProcessorChain creating updateRequestProcessorChain "distrib-dup-test-chain-explicit"
[junit4] 2> 1468615 INFO (coreLoadExecutor-6838-thread-1) [ ] o.a.s.u.p.UpdateRequestProcessorChain creating updateRequestProcessorChain "distrib-dup-test-chain-implicit"
[junit4] 2> 1468615 INFO (coreLoadExecutor-6838-thread-1) [ ] o.a.s.u.p.UpdateRequestProcessorChain inserting DistributedUpdateProcessorFactory into updateRequestProcessorChain "distrib-dup-test-chain-implicit"
[junit4] 2> 1468615 INFO (coreLoadExecutor-6838-thread-1) [ ] o.a.s.c.SolrCore no updateRequestProcessorChain defined as default, creating implicit default
[junit4] 2> 1468615 WARN (coreLoadExecutor-6838-thread-1) [ ] o.a.s.c.RequestHandlers INVALID paramSet a in requestHandler {type = requestHandler,name = /dump,class = DumpRequestHandler,args = {defaults={a=A,b=B}}}
[junit4] 2> 1468616 INFO (coreLoadExecutor-6838-thread-1) [ ] o.a.s.h.l.XMLLoader xsltCacheLifetimeSeconds=60
[junit4] 2> 1468617 INFO (coreLoadExecutor-6838-thread-1) [ ] o.a.s.h.l.XMLLoader xsltCacheLifetimeSeconds=60
[junit4] 2> 1468617 INFO (coreLoadExecutor-6838-thread-1) [ ] o.a.s.h.l.XMLLoader xsltCacheLifetimeSeconds=60
[junit4] 2> 1468618 INFO (coreLoadExecutor-6838-thread-1) [ ] o.a.s.h.l.XMLLoader xsltCacheLifetimeSeconds=60
[junit4] 2> 1468673 INFO (coreLoadExecutor-6838-thread-1) [ ] o.a.s.c.RequestHandlers Registered paths: /admin/mbeans,standard,/update/json/docs,/admin/luke,/export,/get,/admin/properties,/update/json,/admin/threads,/dump,/update/csv,/sql,/graph,/admin/segments,/admin/system,/replication,/config,/stream,/schema,/admin/plugins,/admin/logging,/admin/ping,/update,/admin/file,/terms
[junit4] 2> 1468673 INFO (coreLoadExecutor-6838-thread-1) [ ] o.a.s.c.SolrCore Using default statsCache cache: org.apache.solr.search.stats.LocalStatsCache
[junit4] 2> 1468673 INFO (coreLoadExecutor-6838-thread-1) [ ] o.a.s.u.UpdateHandler Using UpdateLog implementation: org.apache.solr.update.UpdateLog
[junit4] 2> 1468673 INFO (coreLoadExecutor-6838-thread-1) [ ] o.a.s.u.UpdateLog Initializing UpdateLog: dataDir= defaultSyncLevel=FLUSH numRecordsToKeep=100 maxNumLogsToKeep=10 numVersionBuckets=65536
[junit4] 2> 1468674 INFO (coreLoadExecutor-6838-thread-1) [ ] o.a.s.u.CommitTracker Hard AutoCommit: disabled
[junit4] 2> 1468674 INFO (coreLoadExecutor-6838-thread-1) [ ] o.a.s.u.CommitTracker Soft AutoCommit: disabled
[junit4] 2> 1468674 INFO (coreLoadExecutor-6838-thread-1) [ ] o.a.s.u.RandomMergePolicy RandomMergePolicy wrapping class org.apache.lucene.index.TieredMergePolicy: [TieredMergePolicy: maxMergeAtOnce=12, maxMergeAtOnceExplicit=31, maxMergedSegmentMB=73.8525390625, floorSegmentMB=1.7841796875, forceMergeDeletesPctAllowed=3.4442516893598607, segmentsPerTier=30.0, maxCFSSegmentSizeMB=8.796093022207999E12, noCFSRatio=1.0
[junit4] 2> 1468674 INFO (coreLoadExecutor-6838-thread-1) [ ] o.a.s.c.SolrDeletionPolicy SolrDeletionPolicy.onInit: commits: num=1
[junit4] 2> commit{dir=MockDirectoryWrapper(RAMDirectory@1a8eeba lockFactory=org.apache.lucene.store.SingleInstanceLockFactory@870128),segFN=segments_1,generation=1}
[junit4] 2> 1468674 INFO (coreLoadExecutor-6838-thread-1) [ ] o.a.s.c.SolrDeletionPolicy newest commit generation = 1
[junit4] 2> 1468674 INFO (coreLoadExecutor-6838-thread-1) [ ] o.a.s.s.SolrIndexSearcher Opening [Searcher@1ca3143[collection1] main]
[junit4] 2> 1468674 INFO (coreLoadExecutor-6838-thread-1) [ ] o.a.s.c.c.ZkStateReader Load collection config from: [/collections/collection1]
[junit4] 2> 1468675 INFO (coreLoadExecutor-6838-thread-1) [ ] o.a.s.c.c.ZkStateReader path=[/collections/collection1] [configName]=[conf1] specified config exists in ZooKeeper
[junit4] 2> 1468675 INFO (coreLoadExecutor-6838-thread-1) [ ] o.a.s.r.ManagedResourceStorage Setting up ZooKeeper-based storage for the RestManager with znodeBase: /configs/conf1
[junit4] 2> 1468675 INFO (coreLoadExecutor-6838-thread-1) [ ] o.a.s.r.ManagedResourceStorage Configured ZooKeeperStorageIO with znodeBase: /configs/conf1
[junit4] 2> 1468675 INFO (coreLoadExecutor-6838-thread-1) [ ] o.a.s.r.RestManager Initializing RestManager with initArgs: {}
[junit4] 2> 1468675 INFO (coreLoadExecutor-6838-thread-1) [ ] o.a.s.r.ManagedResourceStorage Reading _rest_managed.json using ZooKeeperStorageIO:path=/configs/conf1
[junit4] 2> 1468675 INFO (coreLoadExecutor-6838-thread-1) [ ] o.a.s.r.ManagedResourceStorage No data found for znode /configs/conf1/_rest_managed.json
[junit4] 2> 1468675 INFO (coreLoadExecutor-6838-thread-1) [ ] o.a.s.r.ManagedResourceStorage Loaded null at path _rest_managed.json using ZooKeeperStorageIO:path=/configs/conf1
[junit4] 2> 1468675 INFO (coreLoadExecutor-6838-thread-1) [ ] o.a.s.r.RestManager Initializing 0 registered ManagedResources
[junit4] 2> 1468675 INFO (coreLoadExecutor-6838-thread-1) [ ] o.a.s.h.ReplicationHandler Commits will be reserved for 10000
[junit4] 2> 1468676 INFO (searcherExe
[...truncated too long message...]
Impl.invoke(java.base@9-ea/DelegatingMethodAccessorImpl.java:43)
[junit4] > at org.apache.solr.BaseDistributedSearchTestCase$ShardsRepeatRule$ShardsFixedStatement.callStatement(BaseDistributedSearchTestCase.java:985)
[junit4] > at org.apache.solr.BaseDistributedSearchTestCase$ShardsRepeatRule$ShardsStatement.evaluate(BaseDistributedSearchTestCase.java:960)
[junit4] > at java.lang.Thread.run(java.base@9-ea/Thread.java:843)
[junit4] > Caused by: org.apache.solr.client.solrj.SolrServerException: No live SolrServers available to handle this request:[http://127.0.0.1:42982/w_d/forceleader_test_collection_shard1_replica1]
[junit4] > at org.apache.solr.client.solrj.impl.LBHttpSolrClient.request(LBHttpSolrClient.java:394)
[junit4] > at org.apache.solr.client.solrj.impl.CloudSolrClient.lambda$directUpdate$0(CloudSolrClient.java:730)
[junit4] > at java.util.concurrent.FutureTask.run(java.base@9-ea/FutureTask.java:264)
[junit4] > at org.apache.solr.common.util.ExecutorUtil$MDCAwareThreadPoolExecutor.lambda$execute$0(ExecutorUtil.java:229)
[junit4] > at java.util.concurrent.ThreadPoolExecutor.runWorker(java.base@9-ea/ThreadPoolExecutor.java:1158)
[junit4] > at java.util.concurrent.ThreadPoolExecutor$Worker.run(java.base@9-ea/ThreadPoolExecutor.java:632)
[junit4] > ... 1 more
[junit4] > Caused by: org.apache.solr.client.solrj.SolrServerException: Server refused connection at: http://127.0.0.1:42982/w_d/forceleader_test_collection_shard1_replica1
[junit4] > at org.apache.solr.client.solrj.impl.HttpSolrClient.executeMethod(HttpSolrClient.java:615)
[junit4] > at org.apache.solr.client.solrj.impl.HttpSolrClient.request(HttpSolrClient.java:261)
[junit4] > at org.apache.solr.client.solrj.impl.HttpSolrClient.request(HttpSolrClient.java:250)
[junit4] > at org.apache.solr.client.solrj.impl.LBHttpSolrClient.doRequest(LBHttpSolrClient.java:415)
[junit4] > at org.apache.solr.client.solrj.impl.LBHttpSolrClient.request(LBHttpSolrClient.java:383)
[junit4] > ... 6 more
[junit4] > Caused by: org.apache.http.conn.HttpHostConnectException: Connect to 127.0.0.1:42982 [/127.0.0.1] failed: Connection refused
[junit4] > at org.apache.http.impl.conn.DefaultHttpClientConnectionOperator.connect(DefaultHttpClientConnectionOperator.java:151)
[junit4] > at org.apache.http.impl.conn.PoolingHttpClientConnectionManager.connect(PoolingHttpClientConnectionManager.java:353)
[junit4] > at org.apache.http.impl.execchain.MainClientExec.establishRoute(MainClientExec.java:380)
[junit4] > at org.apache.http.impl.execchain.MainClientExec.execute(MainClientExec.java:236)
[junit4] > at org.apache.http.impl.execchain.ProtocolExec.execute(ProtocolExec.java:184)
[junit4] > at org.apache.http.impl.execchain.RetryExec.execute(RetryExec.java:88)
[junit4] > at org.apache.http.impl.execchain.RedirectExec.execute(RedirectExec.java:110)
[junit4] > at org.apache.http.impl.client.InternalHttpClient.doExecute(InternalHttpClient.java:184)
[junit4] > at org.apache.http.impl.client.CloseableHttpClient.execute(CloseableHttpClient.java:82)
[junit4] > at org.apache.http.impl.client.CloseableHttpClient.execute(CloseableHttpClient.java:55)
[junit4] > at org.apache.solr.client.solrj.impl.HttpSolrClient.executeMethod(HttpSolrClient.java:513)
[junit4] > ... 10 more
[junit4] > Caused by: java.net.ConnectException: Connection refused
[junit4] > at java.net.PlainSocketImpl.socketConnect(java.base@9-ea/Native Method)
[junit4] > at java.net.AbstractPlainSocketImpl.doConnect(java.base@9-ea/AbstractPlainSocketImpl.java:400)
[junit4] > at java.net.AbstractPlainSocketImpl.connectToAddress(java.base@9-ea/AbstractPlainSocketImpl.java:243)
[junit4] > at java.net.AbstractPlainSocketImpl.connect(java.base@9-ea/AbstractPlainSocketImpl.java:225)
[junit4] > at java.net.SocksSocketImpl.connect(java.base@9-ea/SocksSocketImpl.java:402)
[junit4] > at java.net.Socket.connect(java.base@9-ea/Socket.java:591)
[junit4] > at org.apache.http.conn.socket.PlainConnectionSocketFactory.connectSocket(PlainConnectionSocketFactory.java:74)
[junit4] > at org.apache.http.impl.conn.DefaultHttpClientConnectionOperator.connect(DefaultHttpClientConnectionOperator.java:134)
[junit4] > ... 20 more
[junit4] 2> 1580854 INFO (SUITE-ForceLeaderTest-seed#[945285203273CE79]-worker) [ ] o.a.s.SolrTestCaseJ4 ###deleteCore
[junit4] 2> NOTE: leaving temporary files on disk at: /home/jenkins/workspace/Lucene-Solr-master-Linux/solr/build/solr-core/test/J0/temp/solr.cloud.ForceLeaderTest_945285203273CE79-001
[junit4] 2> Sep 14, 2016 4:19:55 PM com.carrotsearch.randomizedtesting.ThreadLeakControl checkThreadLeaks
[junit4] 2> WARNING: Will linger awaiting termination of 1 leaked thread(s).
[junit4] 2> NOTE: test params are: codec=Asserting(Lucene62): {range_facet_l_dv=FSTOrd50, _version_=PostingsFormat(name=LuceneVarGapDocFreqInterval), multiDefault=BlockTreeOrds(blocksize=128), a_t=PostingsFormat(name=LuceneVarGapDocFreqInterval), intDefault=PostingsFormat(name=LuceneVarGapDocFreqInterval), id=FSTOrd50, range_facet_i_dv=PostingsFormat(name=LuceneVarGapDocFreqInterval), text=PostingsFormat(name=Memory doPackFST= false), range_facet_l=PostingsFormat(name=LuceneVarGapDocFreqInterval), timestamp=PostingsFormat(name=LuceneVarGapDocFreqInterval)}, docValues:{range_facet_l_dv=DocValuesFormat(name=Lucene54), range_facet_i_dv=DocValuesFormat(name=Direct), timestamp=DocValuesFormat(name=Direct)}, maxPointsInLeafNode=1801, maxMBSortInHeap=6.644801607820079, sim=ClassicSimilarity, locale=ff-SN, timezone=NZ
[junit4] 2> NOTE: Linux 4.4.0-36-generic i386/Oracle Corporation 9-ea (32-bit)/cpus=12,threads=1,free=159609016,total=347078656
[junit4] 2> NOTE: All tests run in this JVM: [AnalyticsQueryTest, TestJmxIntegration, TestDFISimilarityFactory, TestBinaryResponseWriter, LeaderElectionIntegrationTest, AlternateDirectoryTest, TestTrieFacet, OverseerTaskQueueTest, TestStressRecovery, TestSolr4Spatial, TestRTimerTree, TestFunctionQuery, TestSolrCoreSnapshots, TestSolrDeletionPolicy2, TestFastWriter, TestUniqueKeyFieldResource, TestUseDocValuesAsStored, CleanupOldIndexTest, TestDocTermOrds, TestPHPSerializedResponseWriter, HdfsChaosMonkeyNothingIsSafeTest, TestChildDocTransformer, TestScoreJoinQPNoScore, TestSerializedLuceneMatchVersion, CurrencyFieldOpenExchangeTest, TestDocumentBuilder, HighlighterConfigTest, TestCrossCoreJoin, TestQuerySenderNoQuery, PathHierarchyTokenizerFactoryTest, BufferStoreTest, ResourceLoaderTest, PreAnalyzedUpdateProcessorTest, TestValueSourceCache, DistributedSuggestComponentTest, TestExpandComponent, JavabinLoaderTest, RegexBoostProcessorTest, DistributedSpellCheckComponentTest, TestSolrFieldCacheMBean, DateRangeFieldTest, TestComponentsName, TestPKIAuthenticationPlugin, OutputWriterTest, CollectionStateFormat2Test, TestStressLucene, TestDistribDocBasedVersion, BlockJoinFacetRandomTest, ConnectionReuseTest, SpatialRPTFieldTypeTest, TestNoOpRegenerator, TestSolrConfigHandler, TestSolrConfigHandlerCloud, DistributedQueryElevationComponentTest, OverseerModifyCollectionTest, TestConfigSetsAPIExclusivity, TestSolrCoreProperties, FastVectorHighlighterTest, SolrCloudExampleTest, TestFaceting, OutOfBoxZkACLAndCredentialsProvidersTest, QueryEqualityTest, TestRandomFaceting, FileBasedSpellCheckerTest, CacheHeaderTest, SaslZkACLProviderTest, TestPseudoReturnFields, AtomicUpdatesTest, TestBadConfig, UniqFieldsUpdateProcessorFactoryTest, CdcrBootstrapTest, StandardRequestHandlerTest, TestRandomFlRTGCloud, DefaultValueUpdateProcessorTest, TestHdfsCloudBackupRestore, ExplicitHLLTest, SynonymTokenizerTest, TestExactSharedStatsCache, CloudMLTQParserTest, TestManagedSchema, HdfsNNFailoverTest, TestCodecSupport, ReturnFieldsTest, TestRawTransformer, TestOmitPositions, TestNRTOpen, AnalysisAfterCoreReloadTest, CachingDirectoryFactoryTest, DeleteInactiveReplicaTest, NotRequiredUniqueKeyTest, XsltUpdateRequestHandlerTest, CollectionsAPISolrJTest, TestGraphTermsQParserPlugin, TestAtomicUpdateErrorCases, TestCustomSort, ExternalFileFieldSortTest, ActionThrottleTest, RemoteQueryErrorTest, DistributedExpandComponentTest, BadCopyFieldTest, TestIBSimilarityFactory, DocumentAnalysisRequestHandlerTest, BasicDistributedZkTest, BasicDistributedZk2Test, OpenCloseCoreStressTest, ShardRoutingTest, FullSolrCloudDistribCmdsTest, ZkSolrClientTest, TestZkChroot, TestRandomDVFaceting, TestDistributedSearch, TestRealTimeGet, TestStressVersions, TestRangeQuery, TestCoreContainer, SimpleFacetsTest, SpellCheckComponentTest, QueryElevationComponentTest, PeerSyncTest, BasicFunctionalityTest, TestLazyCores, ShowFileRequestHandlerTest, CurrencyFieldXmlFileTest, SimplePostToolTest, SignatureUpdateProcessorFactoryTest, CoreAdminHandlerTest, TestTrie, TestCSVLoader, PolyFieldTest, TestUpdate, SortByFunctionTest, DocValuesMultiTest, SolrInfoMBeanTest, DisMaxRequestHandlerTest, TestWriterPerf, PrimitiveFieldTypeTest, RequestHandlersTest, LoggingHandlerTest, IndexSchemaTest, JSONWriterTest, QueryParsingTest, JsonLoaderTest, TestPartialUpdateDeduplication, CSVRequestHandlerTest, TestLFUCache, TestSuggestSpellingConverter, DateFieldTest, SpellingQueryConverterTest, RAMDirectoryFactoryTest, ClusterStateTest, TestSolrJ, TestLRUCache, ZkNodePropsTest, SystemInfoHandlerTest, UUIDFieldTest, CircularListTest, DistributedMLTComponentTest, CursorPagingTest, SolrTestCaseJ4Test, TestCursorMarkWithoutUniqueKey, TestHighlightDedupGrouping, AsyncCallRequestStatusResponseTest, AsyncMigrateRouteKeyTest, CollectionTooManyReplicasTest, DeleteLastCustomShardedReplicaTest, DistribCursorPagingTest, DistribJoinFromCollectionTest, DistributedQueueTest, ForceLeaderTest]
[junit4] Completed [469/631 (1!)] on J0 in 115.72s, 3 tests, 1 error, 1 skipped <<< FAILURES!
[...truncated 50297 lines...]
[JENKINS-EA] Lucene-Solr-master-Linux (64bit/jdk-9-ea+134) - Build
# 17820 - Still Unstable!
Posted by Policeman Jenkins Server <je...@thetaphi.de>.
Build: http://jenkins.thetaphi.de/job/Lucene-Solr-master-Linux/17820/
Java: 64bit/jdk-9-ea+134 -XX:-UseCompressedOops -XX:+UseConcMarkSweepGC
1 tests failed.
FAILED: org.apache.solr.cloud.LeaderFailoverAfterPartitionTest.test
Error Message:
No live SolrServers available to handle this request:[http://127.0.0.1:32844/c8n_1x3_lf_shard1_replica1]
Stack Trace:
org.apache.solr.client.solrj.impl.CloudSolrClient$RouteException: No live SolrServers available to handle this request:[http://127.0.0.1:32844/c8n_1x3_lf_shard1_replica1]
at __randomizedtesting.SeedInfo.seed([17C947795EF78447:9F9D78A3F00BE9BF]:0)
at org.apache.solr.client.solrj.impl.CloudSolrClient.directUpdate(CloudSolrClient.java:755)
at org.apache.solr.client.solrj.impl.CloudSolrClient.sendRequest(CloudSolrClient.java:1161)
at org.apache.solr.client.solrj.impl.CloudSolrClient.requestWithRetryOnStaleState(CloudSolrClient.java:1050)
at org.apache.solr.client.solrj.impl.CloudSolrClient.request(CloudSolrClient.java:992)
at org.apache.solr.cloud.AbstractFullDistribZkTestBase.sendDocsWithRetry(AbstractFullDistribZkTestBase.java:753)
at org.apache.solr.cloud.AbstractFullDistribZkTestBase.sendDocsWithRetry(AbstractFullDistribZkTestBase.java:741)
at org.apache.solr.cloud.LeaderFailoverAfterPartitionTest.testRf3WithLeaderFailover(LeaderFailoverAfterPartitionTest.java:178)
at org.apache.solr.cloud.LeaderFailoverAfterPartitionTest.test(LeaderFailoverAfterPartitionTest.java:57)
at jdk.internal.reflect.NativeMethodAccessorImpl.invoke0(java.base@9-ea/Native Method)
at jdk.internal.reflect.NativeMethodAccessorImpl.invoke(java.base@9-ea/NativeMethodAccessorImpl.java:62)
at jdk.internal.reflect.DelegatingMethodAccessorImpl.invoke(java.base@9-ea/DelegatingMethodAccessorImpl.java:43)
at java.lang.reflect.Method.invoke(java.base@9-ea/Method.java:535)
at com.carrotsearch.randomizedtesting.RandomizedRunner.invoke(RandomizedRunner.java:1764)
at com.carrotsearch.randomizedtesting.RandomizedRunner$8.evaluate(RandomizedRunner.java:871)
at com.carrotsearch.randomizedtesting.RandomizedRunner$9.evaluate(RandomizedRunner.java:907)
at com.carrotsearch.randomizedtesting.RandomizedRunner$10.evaluate(RandomizedRunner.java:921)
at org.apache.solr.BaseDistributedSearchTestCase$ShardsRepeatRule$ShardsFixedStatement.callStatement(BaseDistributedSearchTestCase.java:985)
at org.apache.solr.BaseDistributedSearchTestCase$ShardsRepeatRule$ShardsStatement.evaluate(BaseDistributedSearchTestCase.java:960)
at com.carrotsearch.randomizedtesting.rules.SystemPropertiesRestoreRule$1.evaluate(SystemPropertiesRestoreRule.java:57)
at org.apache.lucene.util.TestRuleSetupTeardownChained$1.evaluate(TestRuleSetupTeardownChained.java:49)
at org.apache.lucene.util.AbstractBeforeAfterRule$1.evaluate(AbstractBeforeAfterRule.java:45)
at org.apache.lucene.util.TestRuleThreadAndTestName$1.evaluate(TestRuleThreadAndTestName.java:48)
at org.apache.lucene.util.TestRuleIgnoreAfterMaxFailures$1.evaluate(TestRuleIgnoreAfterMaxFailures.java:64)
at org.apache.lucene.util.TestRuleMarkFailure$1.evaluate(TestRuleMarkFailure.java:47)
at com.carrotsearch.randomizedtesting.rules.StatementAdapter.evaluate(StatementAdapter.java:36)
at com.carrotsearch.randomizedtesting.ThreadLeakControl$StatementRunner.run(ThreadLeakControl.java:367)
at com.carrotsearch.randomizedtesting.ThreadLeakControl.forkTimeoutingTask(ThreadLeakControl.java:809)
at com.carrotsearch.randomizedtesting.ThreadLeakControl$3.evaluate(ThreadLeakControl.java:460)
at com.carrotsearch.randomizedtesting.RandomizedRunner.runSingleTest(RandomizedRunner.java:880)
at com.carrotsearch.randomizedtesting.RandomizedRunner$5.evaluate(RandomizedRunner.java:781)
at com.carrotsearch.randomizedtesting.RandomizedRunner$6.evaluate(RandomizedRunner.java:816)
at com.carrotsearch.randomizedtesting.RandomizedRunner$7.evaluate(RandomizedRunner.java:827)
at com.carrotsearch.randomizedtesting.rules.StatementAdapter.evaluate(StatementAdapter.java:36)
at com.carrotsearch.randomizedtesting.rules.SystemPropertiesRestoreRule$1.evaluate(SystemPropertiesRestoreRule.java:57)
at org.apache.lucene.util.AbstractBeforeAfterRule$1.evaluate(AbstractBeforeAfterRule.java:45)
at com.carrotsearch.randomizedtesting.rules.StatementAdapter.evaluate(StatementAdapter.java:36)
at org.apache.lucene.util.TestRuleStoreClassName$1.evaluate(TestRuleStoreClassName.java:41)
at com.carrotsearch.randomizedtesting.rules.NoShadowingOrOverridesOnMethodsRule$1.evaluate(NoShadowingOrOverridesOnMethodsRule.java:40)
at com.carrotsearch.randomizedtesting.rules.NoShadowingOrOverridesOnMethodsRule$1.evaluate(NoShadowingOrOverridesOnMethodsRule.java:40)
at com.carrotsearch.randomizedtesting.rules.StatementAdapter.evaluate(StatementAdapter.java:36)
at com.carrotsearch.randomizedtesting.rules.StatementAdapter.evaluate(StatementAdapter.java:36)
at com.carrotsearch.randomizedtesting.rules.StatementAdapter.evaluate(StatementAdapter.java:36)
at org.apache.lucene.util.TestRuleAssertionsRequired$1.evaluate(TestRuleAssertionsRequired.java:53)
at org.apache.lucene.util.TestRuleMarkFailure$1.evaluate(TestRuleMarkFailure.java:47)
at org.apache.lucene.util.TestRuleIgnoreAfterMaxFailures$1.evaluate(TestRuleIgnoreAfterMaxFailures.java:64)
at org.apache.lucene.util.TestRuleIgnoreTestSuites$1.evaluate(TestRuleIgnoreTestSuites.java:54)
at com.carrotsearch.randomizedtesting.rules.StatementAdapter.evaluate(StatementAdapter.java:36)
at com.carrotsearch.randomizedtesting.ThreadLeakControl$StatementRunner.run(ThreadLeakControl.java:367)
at java.lang.Thread.run(java.base@9-ea/Thread.java:843)
Caused by: org.apache.solr.client.solrj.SolrServerException: No live SolrServers available to handle this request:[http://127.0.0.1:32844/c8n_1x3_lf_shard1_replica1]
at org.apache.solr.client.solrj.impl.LBHttpSolrClient.request(LBHttpSolrClient.java:394)
at org.apache.solr.client.solrj.impl.CloudSolrClient.lambda$directUpdate$0(CloudSolrClient.java:730)
at java.util.concurrent.FutureTask.run(java.base@9-ea/FutureTask.java:264)
at org.apache.solr.common.util.ExecutorUtil$MDCAwareThreadPoolExecutor.lambda$execute$0(ExecutorUtil.java:229)
at java.util.concurrent.ThreadPoolExecutor.runWorker(java.base@9-ea/ThreadPoolExecutor.java:1158)
at java.util.concurrent.ThreadPoolExecutor$Worker.run(java.base@9-ea/ThreadPoolExecutor.java:632)
... 1 more
Caused by: org.apache.solr.client.solrj.SolrServerException: Server refused connection at: http://127.0.0.1:32844/c8n_1x3_lf_shard1_replica1
at org.apache.solr.client.solrj.impl.HttpSolrClient.executeMethod(HttpSolrClient.java:615)
at org.apache.solr.client.solrj.impl.HttpSolrClient.request(HttpSolrClient.java:261)
at org.apache.solr.client.solrj.impl.HttpSolrClient.request(HttpSolrClient.java:250)
at org.apache.solr.client.solrj.impl.LBHttpSolrClient.doRequest(LBHttpSolrClient.java:415)
at org.apache.solr.client.solrj.impl.LBHttpSolrClient.request(LBHttpSolrClient.java:383)
... 6 more
Caused by: org.apache.http.conn.HttpHostConnectException: Connect to 127.0.0.1:32844 [/127.0.0.1] failed: Connection refused
at org.apache.http.impl.conn.DefaultHttpClientConnectionOperator.connect(DefaultHttpClientConnectionOperator.java:151)
at org.apache.http.impl.conn.PoolingHttpClientConnectionManager.connect(PoolingHttpClientConnectionManager.java:353)
at org.apache.http.impl.execchain.MainClientExec.establishRoute(MainClientExec.java:380)
at org.apache.http.impl.execchain.MainClientExec.execute(MainClientExec.java:236)
at org.apache.http.impl.execchain.ProtocolExec.execute(ProtocolExec.java:184)
at org.apache.http.impl.execchain.RetryExec.execute(RetryExec.java:88)
at org.apache.http.impl.execchain.RedirectExec.execute(RedirectExec.java:110)
at org.apache.http.impl.client.InternalHttpClient.doExecute(InternalHttpClient.java:184)
at org.apache.http.impl.client.CloseableHttpClient.execute(CloseableHttpClient.java:82)
at org.apache.http.impl.client.CloseableHttpClient.execute(CloseableHttpClient.java:55)
at org.apache.solr.client.solrj.impl.HttpSolrClient.executeMethod(HttpSolrClient.java:513)
... 10 more
Caused by: java.net.ConnectException: Connection refused
at java.net.PlainSocketImpl.socketConnect(java.base@9-ea/Native Method)
at java.net.AbstractPlainSocketImpl.doConnect(java.base@9-ea/AbstractPlainSocketImpl.java:400)
at java.net.AbstractPlainSocketImpl.connectToAddress(java.base@9-ea/AbstractPlainSocketImpl.java:243)
at java.net.AbstractPlainSocketImpl.connect(java.base@9-ea/AbstractPlainSocketImpl.java:225)
at java.net.SocksSocketImpl.connect(java.base@9-ea/SocksSocketImpl.java:402)
at java.net.Socket.connect(java.base@9-ea/Socket.java:591)
at org.apache.http.conn.socket.PlainConnectionSocketFactory.connectSocket(PlainConnectionSocketFactory.java:74)
at org.apache.http.impl.conn.DefaultHttpClientConnectionOperator.connect(DefaultHttpClientConnectionOperator.java:134)
... 20 more
Build Log:
[...truncated 10830 lines...]
[junit4] Suite: org.apache.solr.cloud.LeaderFailoverAfterPartitionTest
[junit4] 2> Creating dataDir: /home/jenkins/workspace/Lucene-Solr-master-Linux/solr/build/solr-core/test/J1/temp/solr.cloud.LeaderFailoverAfterPartitionTest_17C947795EF78447-001/init-core-data-001
[junit4] 2> 449499 INFO (SUITE-LeaderFailoverAfterPartitionTest-seed#[17C947795EF78447]-worker) [ ] o.a.s.SolrTestCaseJ4 Randomized ssl (false) and clientAuth (false) via: @org.apache.solr.SolrTestCaseJ4$SuppressSSL(bugUrl="https://issues.apache.org/jira/browse/SOLR-5776")
[junit4] 2> 449499 INFO (SUITE-LeaderFailoverAfterPartitionTest-seed#[17C947795EF78447]-worker) [ ] o.a.s.BaseDistributedSearchTestCase Setting hostContext system property: /
[junit4] 2> 449501 INFO (TEST-LeaderFailoverAfterPartitionTest.test-seed#[17C947795EF78447]) [ ] o.a.s.c.ZkTestServer STARTING ZK TEST SERVER
[junit4] 2> 449501 INFO (Thread-521) [ ] o.a.s.c.ZkTestServer client port:0.0.0.0/0.0.0.0:0
[junit4] 2> 449501 INFO (Thread-521) [ ] o.a.s.c.ZkTestServer Starting server
[junit4] 2> 449601 INFO (TEST-LeaderFailoverAfterPartitionTest.test-seed#[17C947795EF78447]) [ ] o.a.s.c.ZkTestServer start zk server on port:34155
[junit4] 2> 449601 INFO (TEST-LeaderFailoverAfterPartitionTest.test-seed#[17C947795EF78447]) [ ] o.a.s.c.c.SolrZkClient Using default ZkCredentialsProvider
[junit4] 2> 449601 INFO (TEST-LeaderFailoverAfterPartitionTest.test-seed#[17C947795EF78447]) [ ] o.a.s.c.c.ConnectionManager Waiting for client to connect to ZooKeeper
[junit4] 2> 449603 INFO (zkCallback-346-thread-1) [ ] o.a.s.c.c.ConnectionManager Watcher org.apache.solr.common.cloud.ConnectionManager@331f6664 name:ZooKeeperConnection Watcher:127.0.0.1:34155 got event WatchedEvent state:SyncConnected type:None path:null path:null type:None
[junit4] 2> 449603 INFO (TEST-LeaderFailoverAfterPartitionTest.test-seed#[17C947795EF78447]) [ ] o.a.s.c.c.ConnectionManager Client is connected to ZooKeeper
[junit4] 2> 449603 INFO (TEST-LeaderFailoverAfterPartitionTest.test-seed#[17C947795EF78447]) [ ] o.a.s.c.c.SolrZkClient Using default ZkACLProvider
[junit4] 2> 449603 INFO (TEST-LeaderFailoverAfterPartitionTest.test-seed#[17C947795EF78447]) [ ] o.a.s.c.c.SolrZkClient makePath: /solr
[junit4] 2> 449604 INFO (TEST-LeaderFailoverAfterPartitionTest.test-seed#[17C947795EF78447]) [ ] o.a.s.c.c.SolrZkClient Using default ZkCredentialsProvider
[junit4] 2> 449605 INFO (TEST-LeaderFailoverAfterPartitionTest.test-seed#[17C947795EF78447]) [ ] o.a.s.c.c.ConnectionManager Waiting for client to connect to ZooKeeper
[junit4] 2> 449605 INFO (zkCallback-347-thread-1) [ ] o.a.s.c.c.ConnectionManager Watcher org.apache.solr.common.cloud.ConnectionManager@34503411 name:ZooKeeperConnection Watcher:127.0.0.1:34155/solr got event WatchedEvent state:SyncConnected type:None path:null path:null type:None
[junit4] 2> 449605 INFO (TEST-LeaderFailoverAfterPartitionTest.test-seed#[17C947795EF78447]) [ ] o.a.s.c.c.ConnectionManager Client is connected to ZooKeeper
[junit4] 2> 449605 INFO (TEST-LeaderFailoverAfterPartitionTest.test-seed#[17C947795EF78447]) [ ] o.a.s.c.c.SolrZkClient Using default ZkACLProvider
[junit4] 2> 449605 INFO (TEST-LeaderFailoverAfterPartitionTest.test-seed#[17C947795EF78447]) [ ] o.a.s.c.c.SolrZkClient makePath: /collections/collection1
[junit4] 2> 449606 INFO (TEST-LeaderFailoverAfterPartitionTest.test-seed#[17C947795EF78447]) [ ] o.a.s.c.c.SolrZkClient makePath: /collections/collection1/shards
[junit4] 2> 449606 INFO (TEST-LeaderFailoverAfterPartitionTest.test-seed#[17C947795EF78447]) [ ] o.a.s.c.c.SolrZkClient makePath: /collections/control_collection
[junit4] 2> 449607 INFO (TEST-LeaderFailoverAfterPartitionTest.test-seed#[17C947795EF78447]) [ ] o.a.s.c.c.SolrZkClient makePath: /collections/control_collection/shards
[junit4] 2> 449607 INFO (TEST-LeaderFailoverAfterPartitionTest.test-seed#[17C947795EF78447]) [ ] o.a.s.c.AbstractZkTestCase put /home/jenkins/workspace/Lucene-Solr-master-Linux/solr/core/src/test-files/solr/collection1/conf/solrconfig-tlog.xml to /configs/conf1/solrconfig.xml
[junit4] 2> 449607 INFO (TEST-LeaderFailoverAfterPartitionTest.test-seed#[17C947795EF78447]) [ ] o.a.s.c.c.SolrZkClient makePath: /configs/conf1/solrconfig.xml
[junit4] 2> 449608 INFO (TEST-LeaderFailoverAfterPartitionTest.test-seed#[17C947795EF78447]) [ ] o.a.s.c.AbstractZkTestCase put /home/jenkins/workspace/Lucene-Solr-master-Linux/solr/core/src/test-files/solr/collection1/conf/schema.xml to /configs/conf1/schema.xml
[junit4] 2> 449609 INFO (TEST-LeaderFailoverAfterPartitionTest.test-seed#[17C947795EF78447]) [ ] o.a.s.c.c.SolrZkClient makePath: /configs/conf1/schema.xml
[junit4] 2> 449609 INFO (TEST-LeaderFailoverAfterPartitionTest.test-seed#[17C947795EF78447]) [ ] o.a.s.c.AbstractZkTestCase put /home/jenkins/workspace/Lucene-Solr-master-Linux/solr/core/src/test-files/solr/collection1/conf/solrconfig.snippet.randomindexconfig.xml to /configs/conf1/solrconfig.snippet.randomindexconfig.xml
[junit4] 2> 449609 INFO (TEST-LeaderFailoverAfterPartitionTest.test-seed#[17C947795EF78447]) [ ] o.a.s.c.c.SolrZkClient makePath: /configs/conf1/solrconfig.snippet.randomindexconfig.xml
[junit4] 2> 449610 INFO (TEST-LeaderFailoverAfterPartitionTest.test-seed#[17C947795EF78447]) [ ] o.a.s.c.AbstractZkTestCase put /home/jenkins/workspace/Lucene-Solr-master-Linux/solr/core/src/test-files/solr/collection1/conf/stopwords.txt to /configs/conf1/stopwords.txt
[junit4] 2> 449610 INFO (TEST-LeaderFailoverAfterPartitionTest.test-seed#[17C947795EF78447]) [ ] o.a.s.c.c.SolrZkClient makePath: /configs/conf1/stopwords.txt
[junit4] 2> 449610 INFO (TEST-LeaderFailoverAfterPartitionTest.test-seed#[17C947795EF78447]) [ ] o.a.s.c.AbstractZkTestCase put /home/jenkins/workspace/Lucene-Solr-master-Linux/solr/core/src/test-files/solr/collection1/conf/protwords.txt to /configs/conf1/protwords.txt
[junit4] 2> 449610 INFO (TEST-LeaderFailoverAfterPartitionTest.test-seed#[17C947795EF78447]) [ ] o.a.s.c.c.SolrZkClient makePath: /configs/conf1/protwords.txt
[junit4] 2> 449611 INFO (TEST-LeaderFailoverAfterPartitionTest.test-seed#[17C947795EF78447]) [ ] o.a.s.c.AbstractZkTestCase put /home/jenkins/workspace/Lucene-Solr-master-Linux/solr/core/src/test-files/solr/collection1/conf/currency.xml to /configs/conf1/currency.xml
[junit4] 2> 449611 INFO (TEST-LeaderFailoverAfterPartitionTest.test-seed#[17C947795EF78447]) [ ] o.a.s.c.c.SolrZkClient makePath: /configs/conf1/currency.xml
[junit4] 2> 449611 INFO (TEST-LeaderFailoverAfterPartitionTest.test-seed#[17C947795EF78447]) [ ] o.a.s.c.AbstractZkTestCase put /home/jenkins/workspace/Lucene-Solr-master-Linux/solr/core/src/test-files/solr/collection1/conf/enumsConfig.xml to /configs/conf1/enumsConfig.xml
[junit4] 2> 449611 INFO (TEST-LeaderFailoverAfterPartitionTest.test-seed#[17C947795EF78447]) [ ] o.a.s.c.c.SolrZkClient makePath: /configs/conf1/enumsConfig.xml
[junit4] 2> 449612 INFO (TEST-LeaderFailoverAfterPartitionTest.test-seed#[17C947795EF78447]) [ ] o.a.s.c.AbstractZkTestCase put /home/jenkins/workspace/Lucene-Solr-master-Linux/solr/core/src/test-files/solr/collection1/conf/open-exchange-rates.json to /configs/conf1/open-exchange-rates.json
[junit4] 2> 449612 INFO (TEST-LeaderFailoverAfterPartitionTest.test-seed#[17C947795EF78447]) [ ] o.a.s.c.c.SolrZkClient makePath: /configs/conf1/open-exchange-rates.json
[junit4] 2> 449612 INFO (TEST-LeaderFailoverAfterPartitionTest.test-seed#[17C947795EF78447]) [ ] o.a.s.c.AbstractZkTestCase put /home/jenkins/workspace/Lucene-Solr-master-Linux/solr/core/src/test-files/solr/collection1/conf/mapping-ISOLatin1Accent.txt to /configs/conf1/mapping-ISOLatin1Accent.txt
[junit4] 2> 449612 INFO (TEST-LeaderFailoverAfterPartitionTest.test-seed#[17C947795EF78447]) [ ] o.a.s.c.c.SolrZkClient makePath: /configs/conf1/mapping-ISOLatin1Accent.txt
[junit4] 2> 449613 INFO (TEST-LeaderFailoverAfterPartitionTest.test-seed#[17C947795EF78447]) [ ] o.a.s.c.AbstractZkTestCase put /home/jenkins/workspace/Lucene-Solr-master-Linux/solr/core/src/test-files/solr/collection1/conf/old_synonyms.txt to /configs/conf1/old_synonyms.txt
[junit4] 2> 449613 INFO (TEST-LeaderFailoverAfterPartitionTest.test-seed#[17C947795EF78447]) [ ] o.a.s.c.c.SolrZkClient makePath: /configs/conf1/old_synonyms.txt
[junit4] 2> 449613 INFO (TEST-LeaderFailoverAfterPartitionTest.test-seed#[17C947795EF78447]) [ ] o.a.s.c.AbstractZkTestCase put /home/jenkins/workspace/Lucene-Solr-master-Linux/solr/core/src/test-files/solr/collection1/conf/synonyms.txt to /configs/conf1/synonyms.txt
[junit4] 2> 449614 INFO (TEST-LeaderFailoverAfterPartitionTest.test-seed#[17C947795EF78447]) [ ] o.a.s.c.c.SolrZkClient makePath: /configs/conf1/synonyms.txt
[junit4] 2> 449670 INFO (TEST-LeaderFailoverAfterPartitionTest.test-seed#[17C947795EF78447]) [ ] o.a.s.SolrTestCaseJ4 Writing core.properties file to /home/jenkins/workspace/Lucene-Solr-master-Linux/solr/build/solr-core/test/J1/temp/solr.cloud.LeaderFailoverAfterPartitionTest_17C947795EF78447-001/control-001/cores/collection1
[junit4] 2> 449672 INFO (TEST-LeaderFailoverAfterPartitionTest.test-seed#[17C947795EF78447]) [ ] o.e.j.s.Server jetty-9.3.8.v20160314
[junit4] 2> 449672 INFO (TEST-LeaderFailoverAfterPartitionTest.test-seed#[17C947795EF78447]) [ ] o.e.j.s.h.ContextHandler Started o.e.j.s.ServletContextHandler@6bbddd4d{/,null,AVAILABLE}
[junit4] 2> 449674 INFO (TEST-LeaderFailoverAfterPartitionTest.test-seed#[17C947795EF78447]) [ ] o.e.j.s.ServerConnector Started ServerConnector@475bce7f{HTTP/1.1,[http/1.1]}{127.0.0.1:38526}
[junit4] 2> 449674 INFO (TEST-LeaderFailoverAfterPartitionTest.test-seed#[17C947795EF78447]) [ ] o.e.j.s.Server Started @451913ms
[junit4] 2> 449674 INFO (TEST-LeaderFailoverAfterPartitionTest.test-seed#[17C947795EF78447]) [ ] o.a.s.c.s.e.JettySolrRunner Jetty properties: {hostContext=/, solr.data.dir=/home/jenkins/workspace/Lucene-Solr-master-Linux/solr/build/solr-core/test/J1/temp/solr.cloud.LeaderFailoverAfterPartitionTest_17C947795EF78447-001/tempDir-001/control/data, hostPort=32844, coreRootDirectory=/home/jenkins/workspace/Lucene-Solr-master-Linux/solr/build/solr-core/test/J1/temp/solr.cloud.LeaderFailoverAfterPartitionTest_17C947795EF78447-001/control-001/cores}
[junit4] 2> 449674 INFO (TEST-LeaderFailoverAfterPartitionTest.test-seed#[17C947795EF78447]) [ ] o.a.s.s.SolrDispatchFilter SolrDispatchFilter.init(): jdk.internal.loader.ClassLoaders$AppClassLoader@17d99928
[junit4] 2> 449674 INFO (TEST-LeaderFailoverAfterPartitionTest.test-seed#[17C947795EF78447]) [ ] o.a.s.c.SolrResourceLoader new SolrResourceLoader for directory: '/home/jenkins/workspace/Lucene-Solr-master-Linux/solr/build/solr-core/test/J1/temp/solr.cloud.LeaderFailoverAfterPartitionTest_17C947795EF78447-001/control-001'
[junit4] 2> 449675 INFO (TEST-LeaderFailoverAfterPartitionTest.test-seed#[17C947795EF78447]) [ ] o.a.s.c.SolrResourceLoader JNDI not configured for solr (NoInitialContextEx)
[junit4] 2> 449675 INFO (TEST-LeaderFailoverAfterPartitionTest.test-seed#[17C947795EF78447]) [ ] o.a.s.c.SolrResourceLoader solr home defaulted to 'solr/' (could not find system property or JNDI)
[junit4] 2> 449675 INFO (TEST-LeaderFailoverAfterPartitionTest.test-seed#[17C947795EF78447]) [ ] o.a.s.c.c.SolrZkClient Using default ZkCredentialsProvider
[junit4] 2> 449675 INFO (TEST-LeaderFailoverAfterPartitionTest.test-seed#[17C947795EF78447]) [ ] o.a.s.c.c.ConnectionManager Waiting for client to connect to ZooKeeper
[junit4] 2> 449676 INFO (zkCallback-348-thread-1) [ ] o.a.s.c.c.ConnectionManager Watcher org.apache.solr.common.cloud.ConnectionManager@b929097 name:ZooKeeperConnection Watcher:127.0.0.1:34155/solr got event WatchedEvent state:SyncConnected type:None path:null path:null type:None
[junit4] 2> 449676 INFO (TEST-LeaderFailoverAfterPartitionTest.test-seed#[17C947795EF78447]) [ ] o.a.s.c.c.ConnectionManager Client is connected to ZooKeeper
[junit4] 2> 449676 INFO (TEST-LeaderFailoverAfterPartitionTest.test-seed#[17C947795EF78447]) [ ] o.a.s.c.c.SolrZkClient Using default ZkACLProvider
[junit4] 2> 449677 INFO (TEST-LeaderFailoverAfterPartitionTest.test-seed#[17C947795EF78447]) [ ] o.a.s.s.SolrDispatchFilter Loading solr.xml from SolrHome (not found in ZooKeeper)
[junit4] 2> 449677 INFO (TEST-LeaderFailoverAfterPartitionTest.test-seed#[17C947795EF78447]) [ ] o.a.s.c.SolrXmlConfig Loading container configuration from /home/jenkins/workspace/Lucene-Solr-master-Linux/solr/build/solr-core/test/J1/temp/solr.cloud.LeaderFailoverAfterPartitionTest_17C947795EF78447-001/control-001/solr.xml
[junit4] 2> 449682 INFO (TEST-LeaderFailoverAfterPartitionTest.test-seed#[17C947795EF78447]) [ ] o.a.s.c.CorePropertiesLocator Config-defined core root directory: /home/jenkins/workspace/Lucene-Solr-master-Linux/solr/build/solr-core/test/J1/temp/solr.cloud.LeaderFailoverAfterPartitionTest_17C947795EF78447-001/control-001/cores
[junit4] 2> 449682 INFO (TEST-LeaderFailoverAfterPartitionTest.test-seed#[17C947795EF78447]) [ ] o.a.s.c.CoreContainer New CoreContainer 435091604
[junit4] 2> 449682 INFO (TEST-LeaderFailoverAfterPartitionTest.test-seed#[17C947795EF78447]) [ ] o.a.s.c.CoreContainer Loading cores into CoreContainer [instanceDir=/home/jenkins/workspace/Lucene-Solr-master-Linux/solr/build/solr-core/test/J1/temp/solr.cloud.LeaderFailoverAfterPartitionTest_17C947795EF78447-001/control-001]
[junit4] 2> 449682 WARN (TEST-LeaderFailoverAfterPartitionTest.test-seed#[17C947795EF78447]) [ ] o.a.s.c.CoreContainer Couldn't add files from /home/jenkins/workspace/Lucene-Solr-master-Linux/solr/build/solr-core/test/J1/temp/solr.cloud.LeaderFailoverAfterPartitionTest_17C947795EF78447-001/control-001/lib to classpath: /home/jenkins/workspace/Lucene-Solr-master-Linux/solr/build/solr-core/test/J1/temp/solr.cloud.LeaderFailoverAfterPartitionTest_17C947795EF78447-001/control-001/lib
[junit4] 2> 449682 INFO (TEST-LeaderFailoverAfterPartitionTest.test-seed#[17C947795EF78447]) [ ] o.a.s.h.c.HttpShardHandlerFactory created with socketTimeout : 90000,urlScheme : ,connTimeout : 15000,maxConnectionsPerHost : 20,maxConnections : 10000,corePoolSize : 0,maximumPoolSize : 2147483647,maxThreadIdleTime : 5,sizeOfQueue : -1,fairnessPolicy : false,
[junit4] 2> 449685 INFO (TEST-LeaderFailoverAfterPartitionTest.test-seed#[17C947795EF78447]) [ ] o.a.s.u.UpdateShardHandler Created UpdateShardHandler HTTP client with params: socketTimeout=340000&connTimeout=45000&maxConnections=100000&maxConnectionsPerHost=100000
[junit4] 2> 449685 INFO (TEST-LeaderFailoverAfterPartitionTest.test-seed#[17C947795EF78447]) [ ] o.a.s.l.LogWatcher SLF4J impl is org.slf4j.impl.Log4jLoggerFactory
[junit4] 2> 449685 INFO (TEST-LeaderFailoverAfterPartitionTest.test-seed#[17C947795EF78447]) [ ] o.a.s.l.LogWatcher Registering Log Listener [Log4j (org.slf4j.impl.Log4jLoggerFactory)]
[junit4] 2> 449685 INFO (TEST-LeaderFailoverAfterPartitionTest.test-seed#[17C947795EF78447]) [ ] o.a.s.c.ZkContainer Zookeeper client=127.0.0.1:34155/solr
[junit4] 2> 449685 INFO (TEST-LeaderFailoverAfterPartitionTest.test-seed#[17C947795EF78447]) [ ] o.a.s.c.ZkController zkHost includes chroot
[junit4] 2> 449685 INFO (TEST-LeaderFailoverAfterPartitionTest.test-seed#[17C947795EF78447]) [ ] o.a.s.c.c.SolrZkClient Using default ZkCredentialsProvider
[junit4] 2> 449686 INFO (TEST-LeaderFailoverAfterPartitionTest.test-seed#[17C947795EF78447]) [ ] o.a.s.c.c.ConnectionManager Waiting for client to connect to ZooKeeper
[junit4] 2> 449688 INFO (zkCallback-351-thread-1) [ ] o.a.s.c.c.ConnectionManager Watcher org.apache.solr.common.cloud.ConnectionManager@5b22ca53 name:ZooKeeperConnection Watcher:127.0.0.1:34155 got event WatchedEvent state:SyncConnected type:None path:null path:null type:None
[junit4] 2> 449688 INFO (TEST-LeaderFailoverAfterPartitionTest.test-seed#[17C947795EF78447]) [ ] o.a.s.c.c.ConnectionManager Client is connected to ZooKeeper
[junit4] 2> 449689 INFO (TEST-LeaderFailoverAfterPartitionTest.test-seed#[17C947795EF78447]) [ ] o.a.s.c.c.SolrZkClient Using default ZkACLProvider
[junit4] 2> 449689 INFO (TEST-LeaderFailoverAfterPartitionTest.test-seed#[17C947795EF78447]) [ ] o.a.s.c.ZkController Added new OnReconnect listener org.apache.solr.cloud.ZkController$$Lambda$191/307818374@29a5b05a
[junit4] 2> 449690 INFO (TEST-LeaderFailoverAfterPartitionTest.test-seed#[17C947795EF78447]) [ ] o.a.s.c.c.ConnectionManager Waiting for client to connect to ZooKeeper
[junit4] 2> 449690 INFO (zkCallback-352-thread-1) [ ] o.a.s.c.c.ConnectionManager Watcher org.apache.solr.common.cloud.ConnectionManager@80cc796 name:ZooKeeperConnection Watcher:127.0.0.1:34155/solr got event WatchedEvent state:SyncConnected type:None path:null path:null type:None
[junit4] 2> 449690 INFO (TEST-LeaderFailoverAfterPartitionTest.test-seed#[17C947795EF78447]) [ ] o.a.s.c.c.ConnectionManager Client is connected to ZooKeeper
[junit4] 2> 449691 INFO (TEST-LeaderFailoverAfterPartitionTest.test-seed#[17C947795EF78447]) [ ] o.a.s.c.c.SolrZkClient makePath: /overseer/queue
[junit4] 2> 449692 INFO (TEST-LeaderFailoverAfterPartitionTest.test-seed#[17C947795EF78447]) [ ] o.a.s.c.c.SolrZkClient makePath: /overseer/collection-queue-work
[junit4] 2> 449693 INFO (TEST-LeaderFailoverAfterPartitionTest.test-seed#[17C947795EF78447]) [ ] o.a.s.c.c.SolrZkClient makePath: /overseer/collection-map-running
[junit4] 2> 449694 INFO (TEST-LeaderFailoverAfterPartitionTest.test-seed#[17C947795EF78447]) [ ] o.a.s.c.c.SolrZkClient makePath: /overseer/collection-map-completed
[junit4] 2> 449694 INFO (TEST-LeaderFailoverAfterPartitionTest.test-seed#[17C947795EF78447]) [ ] o.a.s.c.c.SolrZkClient makePath: /overseer/collection-map-failure
[junit4] 2> 449695 INFO (TEST-LeaderFailoverAfterPartitionTest.test-seed#[17C947795EF78447]) [ ] o.a.s.c.c.SolrZkClient makePath: /live_nodes
[junit4] 2> 449695 INFO (TEST-LeaderFailoverAfterPartitionTest.test-seed#[17C947795EF78447]) [ ] o.a.s.c.c.SolrZkClient makePath: /aliases.json
[junit4] 2> 449696 INFO (TEST-LeaderFailoverAfterPartitionTest.test-seed#[17C947795EF78447]) [ ] o.a.s.c.c.SolrZkClient makePath: /clusterstate.json
[junit4] 2> 449696 INFO (TEST-LeaderFailoverAfterPartitionTest.test-seed#[17C947795EF78447]) [ ] o.a.s.c.c.SolrZkClient makePath: /security.json
[junit4] 2> 449696 INFO (TEST-LeaderFailoverAfterPartitionTest.test-seed#[17C947795EF78447]) [ ] o.a.s.c.c.ZkStateReader Updating cluster state from ZooKeeper...
[junit4] 2> 449697 INFO (TEST-LeaderFailoverAfterPartitionTest.test-seed#[17C947795EF78447]) [ ] o.a.s.c.c.ZkStateReader Loaded empty cluster properties
[junit4] 2> 449697 INFO (TEST-LeaderFailoverAfterPartitionTest.test-seed#[17C947795EF78447]) [ ] o.a.s.c.c.ZkStateReader Updated live nodes from ZooKeeper... (0) -> (0)
[junit4] 2> 449698 INFO (TEST-LeaderFailoverAfterPartitionTest.test-seed#[17C947795EF78447]) [ ] o.a.s.c.c.SolrZkClient makePath: /overseer_elect
[junit4] 2> 449698 INFO (TEST-LeaderFailoverAfterPartitionTest.test-seed#[17C947795EF78447]) [ ] o.a.s.c.c.SolrZkClient makePath: /overseer_elect/election
[junit4] 2> 449698 INFO (TEST-LeaderFailoverAfterPartitionTest.test-seed#[17C947795EF78447]) [ ] o.a.s.c.Overseer Overseer (id=null) closing
[junit4] 2> 449698 INFO (TEST-LeaderFailoverAfterPartitionTest.test-seed#[17C947795EF78447]) [ ] o.a.s.c.LeaderElector Joined leadership election with path: /overseer_elect/election/96592402199478276-127.0.0.1:32844_-n_0000000000
[junit4] 2> 449699 INFO (TEST-LeaderFailoverAfterPartitionTest.test-seed#[17C947795EF78447]) [ ] o.a.s.c.OverseerElectionContext I am going to be the leader 127.0.0.1:32844_
[junit4] 2> 449699 INFO (TEST-LeaderFailoverAfterPartitionTest.test-seed#[17C947795EF78447]) [ ] o.a.s.c.c.SolrZkClient makePath: /overseer_elect/leader
[junit4] 2> 449699 INFO (TEST-LeaderFailoverAfterPartitionTest.test-seed#[17C947795EF78447]) [ ] o.a.s.c.Overseer Overseer (id=96592402199478276-127.0.0.1:32844_-n_0000000000) starting
[junit4] 2> 449700 INFO (TEST-LeaderFailoverAfterPartitionTest.test-seed#[17C947795EF78447]) [ ] o.a.s.c.c.SolrZkClient makePath: /overseer/queue-work
[junit4] 2> 449701 INFO (TEST-LeaderFailoverAfterPartitionTest.test-seed#[17C947795EF78447]) [ ] o.a.s.c.OverseerAutoReplicaFailoverThread Starting OverseerAutoReplicaFailoverThread autoReplicaFailoverWorkLoopDelay=10000 autoReplicaFailoverWaitAfterExpiration=10000 autoReplicaFailoverBadNodeExpiration=60000
[junit4] 2> 449702 INFO (OverseerCollectionConfigSetProcessor-96592402199478276-127.0.0.1:32844_-n_0000000000) [ ] o.a.s.c.OverseerTaskProcessor Process current queue of overseer operations
[junit4] 2> 449702 INFO (TEST-LeaderFailoverAfterPartitionTest.test-seed#[17C947795EF78447]) [ ] o.a.s.c.ZkController Register node as live in ZooKeeper:/live_nodes/127.0.0.1:32844_
[junit4] 2> 449702 INFO (TEST-LeaderFailoverAfterPartitionTest.test-seed#[17C947795EF78447]) [ ] o.a.s.c.c.SolrZkClient makePath: /live_nodes/127.0.0.1:32844_
[junit4] 2> 449702 INFO (OverseerStateUpdate-96592402199478276-127.0.0.1:32844_-n_0000000000) [ ] o.a.s.c.Overseer Starting to work on the main queue
[junit4] 2> 449703 INFO (zkCallback-352-thread-1) [ ] o.a.s.c.c.ZkStateReader A live node change: [WatchedEvent state:SyncConnected type:NodeChildrenChanged path:/live_nodes], has occurred - updating... (live nodes size: [0])
[junit4] 2> 449703 INFO (OverseerStateUpdate-96592402199478276-127.0.0.1:32844_-n_0000000000) [ ] o.a.s.c.c.ZkStateReader Updated live nodes from ZooKeeper... (0) -> (1)
[junit4] 2> 449703 INFO (zkCallback-352-thread-1) [ ] o.a.s.c.c.ZkStateReader Updated live nodes from ZooKeeper... (1) -> (1)
[junit4] 2> 449710 INFO (TEST-LeaderFailoverAfterPartitionTest.test-seed#[17C947795EF78447]) [ ] o.a.s.c.CoreContainer Security conf doesn't exist. Skipping setup for authorization module.
[junit4] 2> 449710 INFO (TEST-LeaderFailoverAfterPartitionTest.test-seed#[17C947795EF78447]) [ ] o.a.s.c.CoreContainer No authentication plugin used.
[junit4] 2> 449711 INFO (TEST-LeaderFailoverAfterPartitionTest.test-seed#[17C947795EF78447]) [ ] o.a.s.c.CorePropertiesLocator Looking for core definitions underneath /home/jenkins/workspace/Lucene-Solr-master-Linux/solr/build/solr-core/test/J1/temp/solr.cloud.LeaderFailoverAfterPartitionTest_17C947795EF78447-001/control-001/cores
[junit4] 2> 449712 INFO (TEST-LeaderFailoverAfterPartitionTest.test-seed#[17C947795EF78447]) [ ] o.a.s.c.CoreDescriptor Created CoreDescriptor: {schema=schema.xml, dataDir=data/, collection=control_collection, loadOnStartup=true, coreNodeName=, transient=false, name=collection1, shard=, config=solrconfig.xml, configSetProperties=configsetprops.json}
[junit4] 2> 449712 INFO (TEST-LeaderFailoverAfterPartitionTest.test-seed#[17C947795EF78447]) [ ] o.a.s.c.CorePropertiesLocator Found core collection1 in /home/jenkins/workspace/Lucene-Solr-master-Linux/solr/build/solr-core/test/J1/temp/solr.cloud.LeaderFailoverAfterPartitionTest_17C947795EF78447-001/control-001/cores/collection1
[junit4] 2> 449712 INFO (TEST-LeaderFailoverAfterPartitionTest.test-seed#[17C947795EF78447]) [ ] o.a.s.c.CorePropertiesLocator Found 1 core definitions
[junit4] 2> 449713 INFO (TEST-LeaderFailoverAfterPartitionTest.test-seed#[17C947795EF78447]) [ ] o.a.s.s.SolrDispatchFilter user.dir=/home/jenkins/workspace/Lucene-Solr-master-Linux/solr/build/solr-core/test/J1
[junit4] 2> 449713 INFO (coreLoadExecutor-922-thread-1) [ ] o.a.s.c.ZkController publishing state=down
[junit4] 2> 449713 INFO (coreLoadExecutor-922-thread-1) [ ] o.a.s.c.ZkController numShards not found on descriptor - reading it from system property
[junit4] 2> 449713 INFO (TEST-LeaderFailoverAfterPartitionTest.test-seed#[17C947795EF78447]) [ ] o.a.s.s.SolrDispatchFilter SolrDispatchFilter.init() done
[junit4] 2> 449713 INFO (coreLoadExecutor-922-thread-1) [ ] o.a.s.c.ZkController Collection control_collection not visible yet, but flagging it so a watch is registered when it becomes visible
[junit4] 2> 449714 INFO (OverseerStateUpdate-96592402199478276-127.0.0.1:32844_-n_0000000000) [ ] o.a.s.c.Overseer processMessage: queueSize: 1, message = {
[junit4] 2> "core":"collection1",
[junit4] 2> "roles":null,
[junit4] 2> "base_url":"http://127.0.0.1:32844",
[junit4] 2> "node_name":"127.0.0.1:32844_",
[junit4] 2> "numShards":"1",
[junit4] 2> "state":"down",
[junit4] 2> "shard":null,
[junit4] 2> "collection":"control_collection",
[junit4] 2> "operation":"state"} current state version: 0
[junit4] 2> 449714 INFO (coreLoadExecutor-922-thread-1) [ ] o.a.s.c.c.ZkStateReader Deleting data for [control_collection]
[junit4] 2> 449714 INFO (OverseerStateUpdate-96592402199478276-127.0.0.1:32844_-n_0000000000) [ ] o.a.s.c.o.ReplicaMutator Update state numShards=1 message={
[junit4] 2> "core":"collection1",
[junit4] 2> "roles":null,
[junit4] 2> "base_url":"http://127.0.0.1:32844",
[junit4] 2> "node_name":"127.0.0.1:32844_",
[junit4] 2> "numShards":"1",
[junit4] 2> "state":"down",
[junit4] 2> "shard":null,
[junit4] 2> "collection":"control_collection",
[junit4] 2> "operation":"state"}
[junit4] 2> 449714 INFO (OverseerStateUpdate-96592402199478276-127.0.0.1:32844_-n_0000000000) [ ] o.a.s.c.o.ClusterStateMutator building a new cName: control_collection
[junit4] 2> 449714 INFO (coreLoadExecutor-922-thread-1) [ ] o.a.s.c.ZkController look for our core node name
[junit4] 2> 449714 INFO (OverseerStateUpdate-96592402199478276-127.0.0.1:32844_-n_0000000000) [ ] o.a.s.c.o.ReplicaMutator Assigning new node to shard shard=shard1
[junit4] 2> 449715 INFO (zkCallback-352-thread-1) [ ] o.a.s.c.c.ZkStateReader A cluster state change: [WatchedEvent state:SyncConnected type:NodeDataChanged path:/clusterstate.json], has occurred - updating... (live nodes size: [1])
[junit4] 2> 450714 INFO (coreLoadExecutor-922-thread-1) [ ] o.a.s.c.ZkController waiting to find shard id in clusterstate for collection1
[junit4] 2> 450714 INFO (coreLoadExecutor-922-thread-1) [ ] o.a.s.c.ZkController Check for collection zkNode:control_collection
[junit4] 2> 450715 INFO (coreLoadExecutor-922-thread-1) [ ] o.a.s.c.ZkController Collection zkNode exists
[junit4] 2> 450715 INFO (coreLoadExecutor-922-thread-1) [ ] o.a.s.c.c.ZkStateReader Load collection config from: [/collections/control_collection]
[junit4] 2> 450715 INFO (coreLoadExecutor-922-thread-1) [ ] o.a.s.c.c.ZkStateReader path=[/collections/control_collection] [configName]=[conf1] specified config exists in ZooKeeper
[junit4] 2> 450715 INFO (coreLoadExecutor-922-thread-1) [ ] o.a.s.c.SolrResourceLoader new SolrResourceLoader for directory: '/home/jenkins/workspace/Lucene-Solr-master-Linux/solr/build/solr-core/test/J1/temp/solr.cloud.LeaderFailoverAfterPartitionTest_17C947795EF78447-001/control-001/cores/collection1'
[junit4] 2> 450715 INFO (coreLoadExecutor-922-thread-1) [ ] o.a.s.c.SolrResourceLoader JNDI not configured for solr (NoInitialContextEx)
[junit4] 2> 450715 INFO (coreLoadExecutor-922-thread-1) [ ] o.a.s.c.SolrResourceLoader solr home defaulted to 'solr/' (could not find system property or JNDI)
[junit4] 2> 450716 INFO (coreLoadExecutor-922-thread-1) [ ] o.a.s.c.Config loaded config solrconfig.xml with version 0
[junit4] 2> 450719 INFO (coreLoadExecutor-922-thread-1) [ ] o.a.s.c.SolrConfig current version of requestparams : -1
[junit4] 2> 450722 INFO (coreLoadExecutor-922-thread-1) [ ] o.a.s.c.SolrConfig Using Lucene MatchVersion: 7.0.0
[junit4] 2> 450728 INFO (coreLoadExecutor-922-thread-1) [ ] o.a.s.c.SolrConfig Loaded SolrConfig: solrconfig.xml
[junit4] 2> 450733 INFO (coreLoadExecutor-922-thread-1) [ ] o.a.s.s.IndexSchema [collection1] Schema name=test
[junit4] 2> 450804 INFO (coreLoadExecutor-922-thread-1) [ ] o.a.s.s.OpenExchangeRatesOrgProvider Initialized with rates=open-exchange-rates.json, refreshInterval=1440.
[junit4] 2> 450811 INFO (coreLoadExecutor-922-thread-1) [ ] o.a.s.s.IndexSchema default search field in schema is text
[junit4] 2> 450812 INFO (coreLoadExecutor-922-thread-1) [ ] o.a.s.s.IndexSchema unique key field: id
[junit4] 2> 450820 INFO (coreLoadExecutor-922-thread-1) [ ] o.a.s.s.FileExchangeRateProvider Reloading exchange rates from file currency.xml
[junit4] 2> 450822 INFO (coreLoadExecutor-922-thread-1) [ ] o.a.s.s.FileExchangeRateProvider Reloading exchange rates from file currency.xml
[junit4] 2> 450823 INFO (coreLoadExecutor-922-thread-1) [ ] o.a.s.s.OpenExchangeRatesOrgProvider Reloading exchange rates from open-exchange-rates.json
[junit4] 2> 450823 INFO (coreLoadExecutor-922-thread-1) [ ] o.a.s.s.OpenExchangeRatesOrgProvider Reloading exchange rates from open-exchange-rates.json
[junit4] 2> 450824 INFO (coreLoadExecutor-922-thread-1) [ ] o.a.s.c.ConfigSetProperties Did not find ConfigSet properties, assuming default properties: Can't find resource 'configsetprops.json' in classpath or '/configs/conf1', cwd=/home/jenkins/workspace/Lucene-Solr-master-Linux/solr/build/solr-core/test/J1
[junit4] 2> 450824 INFO (coreLoadExecutor-922-thread-1) [ ] o.a.s.c.CoreContainer Creating SolrCore 'collection1' using configuration from collection control_collection
[junit4] 2> 450824 INFO (coreLoadExecutor-922-thread-1) [ ] o.a.s.c.SolrCore org.apache.solr.core.MockDirectoryFactory
[junit4] 2> 450824 INFO (coreLoadExecutor-922-thread-1) [ ] o.a.s.c.SolrCore [[collection1] ] Opening new SolrCore at [/home/jenkins/workspace/Lucene-Solr-master-Linux/solr/build/solr-core/test/J1/temp/solr.cloud.LeaderFailoverAfterPartitionTest_17C947795EF78447-001/control-001/cores/collection1], dataDir=[/home/jenkins/workspace/Lucene-Solr-master-Linux/solr/build/solr-core/test/J1/temp/solr.cloud.LeaderFailoverAfterPartitionTest_17C947795EF78447-001/control-001/cores/collection1/data/]
[junit4] 2> 450824 INFO (coreLoadExecutor-922-thread-1) [ ] o.a.s.c.JmxMonitoredMap JMX monitoring is enabled. Adding Solr mbeans to JMX Server: com.sun.jmx.mbeanserver.JmxMBeanServer@7c86c452
[junit4] 2> 450825 INFO (coreLoadExecutor-922-thread-1) [ ] o.a.s.c.CachingDirectoryFactory return new directory for /home/jenkins/workspace/Lucene-Solr-master-Linux/solr/build/solr-core/test/J1/temp/solr.cloud.LeaderFailoverAfterPartitionTest_17C947795EF78447-001/control-001/cores/collection1/data/snapshot_metadata
[junit4] 2> 450825 INFO (coreLoadExecutor-922-thread-1) [ ] o.a.s.c.s.SolrSnapshotMetaDataManager Loading from snapshot metadata file...
[junit4] 2> 450826 INFO (coreLoadExecutor-922-thread-1) [ ] o.a.s.c.CachingDirectoryFactory return new directory for /home/jenkins/workspace/Lucene-Solr-master-Linux/solr/build/solr-core/test/J1/temp/solr.cloud.LeaderFailoverAfterPartitionTest_17C947795EF78447-001/control-001/cores/collection1/data
[junit4] 2> 450826 INFO (coreLoadExecutor-922-thread-1) [ ] o.a.s.c.SolrCore New index directory detected: old=null new=/home/jenkins/workspace/Lucene-Solr-master-Linux/solr/build/solr-core/test/J1/temp/solr.cloud.LeaderFailoverAfterPartitionTest_17C947795EF78447-001/control-001/cores/collection1/data/index/
[junit4] 2> 450826 WARN (coreLoadExecutor-922-thread-1) [ ] o.a.s.c.SolrCore [collection1] Solr index directory '/home/jenkins/workspace/Lucene-Solr-master-Linux/solr/build/solr-core/test/J1/temp/solr.cloud.LeaderFailoverAfterPartitionTest_17C947795EF78447-001/control-001/cores/collection1/data/index' doesn't exist. Creating new index...
[junit4] 2> 450826 INFO (coreLoadExecutor-922-thread-1) [ ] o.a.s.c.CachingDirectoryFactory return new directory for /home/jenkins/workspace/Lucene-Solr-master-Linux/solr/build/solr-core/test/J1/temp/solr.cloud.LeaderFailoverAfterPartitionTest_17C947795EF78447-001/control-001/cores/collection1/data/index
[junit4] 2> 450826 INFO (coreLoadExecutor-922-thread-1) [ ] o.a.s.u.RandomMergePolicy RandomMergePolicy wrapping class org.apache.lucene.index.TieredMergePolicy: [TieredMergePolicy: maxMergeAtOnce=44, maxMergeAtOnceExplicit=46, maxMergedSegmentMB=31.1728515625, floorSegmentMB=0.5322265625, forceMergeDeletesPctAllowed=6.99257880149744, segmentsPerTier=42.0, maxCFSSegmentSizeMB=8.796093022207999E12, noCFSRatio=1.0
[junit4] 2> 450827 INFO (coreLoadExecutor-922-thread-1) [ ] o.a.s.c.SolrDeletionPolicy SolrDeletionPolicy.onCommit: commits: num=1
[junit4] 2> commit{dir=MockDirectoryWrapper(RAMDirectory@4e5e3876 lockFactory=org.apache.lucene.store.SingleInstanceLockFactory@64365a63),segFN=segments_1,generation=1}
[junit4] 2> 450827 INFO (coreLoadExecutor-922-thread-1) [ ] o.a.s.c.SolrDeletionPolicy newest commit generation = 1
[junit4] 2> 450827 INFO (OldIndexDirectoryCleanupThreadForCore-collection1) [ ] o.a.s.c.SolrCore Looking for old index directories to cleanup for core collection1 in /home/jenkins/workspace/Lucene-Solr-master-Linux/solr/build/solr-core/test/J1/temp/solr.cloud.LeaderFailoverAfterPartitionTest_17C947795EF78447-001/control-001/cores/collection1/data/
[junit4] 2> 450827 WARN (OldIndexDirectoryCleanupThreadForCore-collection1) [ ] o.a.s.c.DirectoryFactory /home/jenkins/workspace/Lucene-Solr-master-Linux/solr/build/solr-core/test/J1/temp/solr.cloud.LeaderFailoverAfterPartitionTest_17C947795EF78447-001/control-001/cores/collection1/data/ does not point to a valid data directory; skipping clean-up of old index directories.
[junit4] 2> 450829 INFO (coreLoadExecutor-922-thread-1) [ ] o.a.s.u.p.UpdateRequestProcessorChain creating updateRequestProcessorChain "nodistrib"
[junit4] 2> 450829 INFO (coreLoadExecutor-922-thread-1) [ ] o.a.s.u.p.UpdateRequestProcessorChain creating updateRequestProcessorChain "dedupe"
[junit4] 2> 450829 INFO (coreLoadExecutor-922-thread-1) [ ] o.a.s.u.p.UpdateRequestProcessorChain inserting DistributedUpdateProcessorFactory into updateRequestProcessorChain "dedupe"
[junit4] 2> 450829 INFO (coreLoadExecutor-922-thread-1) [ ] o.a.s.u.p.UpdateRequestProcessorChain creating updateRequestProcessorChain "stored_sig"
[junit4] 2> 450829 INFO (coreLoadExecutor-922-thread-1) [ ] o.a.s.u.p.UpdateRequestProcessorChain inserting DistributedUpdateProcessorFactory into updateRequestProcessorChain "stored_sig"
[junit4] 2> 450829 INFO (coreLoadExecutor-922-thread-1) [ ] o.a.s.u.p.UpdateRequestProcessorChain creating updateRequestProcessorChain "distrib-dup-test-chain-explicit"
[junit4] 2> 450829 INFO (coreLoadExecutor-922-thread-1) [ ] o.a.s.u.p.UpdateRequestProcessorChain creating updateRequestProcessorChain "distrib-dup-test-chain-implicit"
[junit4] 2> 450829 INFO (coreLoadExecutor-922-thread-1) [ ] o.a.s.u.p.UpdateRequestProcessorChain inserting DistributedUpdateProcessorFactory into updateRequestProcessorChain "distrib-dup-test-chain-implicit"
[junit4] 2> 450829 INFO (coreLoadExecutor-922-thread-1) [ ] o.a.s.c.SolrCore no updateRequestProcessorChain defined as default, creating implicit default
[junit4] 2> 450829 WARN (coreLoadExecutor-922-thread-1) [ ] o.a.s.c.RequestHandlers INVALID paramSet a in requestHandler {type = requestHandler,name = /dump,class = DumpRequestHandler,args = {defaults={a=A,b=B}}}
[junit4] 2> 450831 INFO (coreLoadExecutor-922-thread-1) [ ] o.a.s.h.l.XMLLoader xsltCacheLifetimeSeconds=60
[junit4] 2> 450831 INFO (coreLoadExecutor-922-thread-1) [ ] o.a.s.h.l.XMLLoader xsltCacheLifetimeSeconds=60
[junit4] 2> 450832 INFO (coreLoadExecutor-922-thread-1) [ ] o.a.s.h.l.XMLLoader xsltCacheLifetimeSeconds=60
[junit4] 2> 450833 INFO (coreLoadExecutor-922-thread-1) [ ] o.a.s.h.l.XMLLoader xsltCacheLifetimeSeconds=60
[junit4] 2> 450835 INFO (coreLoadExecutor-922-thread-1) [ ] o.a.s.c.RequestHandlers Registered paths: /admin/mbeans,standard,/update/json/docs,/admin/luke,/export,/get,/admin/properties,/update/json,/admin/threads,/dump,/update/csv,/sql,/graph,/admin/segments,/admin/system,/replication,/config,/stream,/schema,/admin/plugins,/admin/logging,/admin/ping,/update,/admin/file,/terms
[junit4] 2> 450835 INFO (coreLoadExecutor-922-thread-1) [ ] o.a.s.c.SolrCore Using default statsCache cache: org.apache.solr.search.stats.LocalStatsCache
[junit4] 2> 450835 INFO (coreLoadExecutor-922-thread-1) [ ] o.a.s.u.UpdateHandler Using UpdateLog implementation: org.apache.solr.update.UpdateLog
[junit4] 2> 450835 INFO (coreLoadExecutor-922-thread-1) [ ] o.a.s.u.UpdateLog Initializing UpdateLog: dataDir= defaultSyncLevel=FLUSH numRecordsToKeep=100 maxNumLogsToKeep=10 numVersionBuckets=65536
[junit4] 2> 450836 INFO (coreLoadExecutor-922-thread-1) [ ] o.a.s.u.CommitTracker Hard AutoCommit: disabled
[junit4] 2> 450836 INFO (coreLoadExecutor-922-thread-1) [ ] o.a.s.u.CommitTracker Soft AutoCommit: disabled
[junit4] 2> 450836 INFO (coreLoadExecutor-922-thread-1) [ ] o.a.s.u.RandomMergePolicy RandomMergePolicy wrapping class org.apache.lucene.index.LogByteSizeMergePolicy: [LogByteSizeMergePolicy: minMergeSize=1677721, mergeFactor=28, maxMergeSize=2147483648, maxMergeSizeForForcedMerge=9223372036854775807, calibrateSizeByDeletes=false, maxMergeDocs=2147483647, maxCFSSegmentSizeMB=8.796093022207999E12, noCFSRatio=0.0]
[junit4] 2> 450836 INFO (coreLoadExecutor-922-thread-1) [ ] o.a.s.c.SolrDeletionPolicy SolrDeletionPolicy.onInit: commits: num=1
[junit4] 2> commit{dir=MockDirectoryWrapper(RAMDirectory@4e5e3876 lockFactory=org.apache.lucene.store.SingleInstanceLockFactory@64365a63),segFN=segments_1,generation=1}
[junit4] 2> 450837 INFO (coreLoadExecutor-922-thread-1) [ ] o.a.s.c.SolrDeletionPolicy newest commit generation = 1
[junit4] 2> 450837 INFO (coreLoadExecutor-922-thread-1) [ ] o.a.s.s.SolrIndexSearcher Opening [Searcher@71c6b7de[collection1] main]
[junit4] 2> 450837 INFO (coreLoadExecutor-922-thread-1) [ ] o.a.s.c.c.ZkStateReader Load collection config from: [/collections/control_collection]
[junit4] 2> 450837 INFO (coreLoadExecutor-922-thread-1) [ ] o.a.s.c.c.ZkStateReader path=[/collections/control_collection] [configName]=[conf1] specified config exists in ZooKeeper
[junit4] 2> 450837 INFO (coreLoadExecutor-922-thread-1) [ ] o.a.s.r.ManagedResourceStorage Setting up ZooKeeper-based storage for the RestManager with znodeBase: /configs/conf1
[junit4] 2> 450837 INFO (coreLoadExecutor-922-thread-1) [ ] o.a.s.r.ManagedResourceStorage Configured ZooKeeperStorageIO with znodeBase: /configs/conf1
[junit4] 2> 450837 INFO (coreLoadExecutor-922-thread-1) [ ] o.a.s.r.RestManager Initializing RestManager with initArgs: {}
[junit4] 2> 450838 INFO (coreLoadExecutor-922-thread-1) [ ] o.a.s.r.ManagedResourceStorage Reading _rest_managed.json using ZooKeeperStorageIO:path=/configs/conf1
[junit4] 2> 450838 INFO (coreLoadExecutor-922-thread-1) [ ] o.a.s.r.ManagedResourceStorage No data found for znode /configs/conf1/_rest_managed.json
[junit4] 2> 450838 INFO (coreLoadExecutor-922-thread-1) [ ] o.a.s.r.ManagedResourceStorage Loaded null at path _rest_managed.json using ZooKeeperStorageIO:path=/configs/conf1
[junit4] 2> 450838 INFO (coreLoadExecutor-922-thread-1) [ ] o.a.s.r.RestManager Initializing 0 registered ManagedResources
[junit4] 2> 450838 INFO (coreLoadExecutor-922-thread-1) [ ] o.a.s.h.ReplicationHandler Commits will be reserved for 10000
[junit4] 2> 450838 INFO (searcherExecutor-923-thread-1) [ ] o.a.s.c.SolrCore [collection1] Registered new searcher Searcher@71c6b7de[collection1] main{ExitableDirectoryReader(UninvertingDirectoryReader())}
[junit4] 2> 450839 INFO (coreLoadExecutor-922-thread-1) [ ] o.a.s.u.UpdateLog Looking up max value of version field to seed version buckets
[junit4] 2> 450839 INFO (coreLoadExecutor-922-thread-1) [ ] o.a.s.u.VersionInfo Refreshing highest value of _version_ for 65536 version buckets from index
[junit4] 2> 450839 INFO (coreLoadExecutor-922-thread-1) [ ] o.a.s.u.VersionInfo No terms found for _version_, cannot seed version bucket highest value from index
[junit4] 2> 450839 INFO (coreLoadExecutor-922-thread-1) [ ] o.a.s.u.UpdateLog Could not find max version in index or recent updates, using new clock 1545478436593598464
[junit4] 2> 450840 INFO (coreLoadExecutor-922-thread-1) [ ] o.a.s.u.UpdateLog Took 1.0ms to seed version buckets with highest version 1545478436593598464
[junit4] 2> 450841 INFO (coreLoadExecutor-922-thread-1) [ ] o.a.s.c.ZkController watch zkdir /configs/conf1
[junit4] 2> 450841 INFO (coreLoadExecutor-922-thread-1) [ ] o.a.s.c.CoreContainer registering core: collection1
[junit4] 2> 450841 INFO (coreZkRegister-915-thread-1) [ ] o.a.s.c.ZkController Register replica - core:collection1 address:http://127.0.0.1:32844 collection:control_collection shard:shard1
[junit4] 2> 450842 INFO (coreZkRegister-915-thread-1) [ ] o.a.s.c.c.SolrZkClient makePath: /collections/control_collection/leader_elect/shard1/election
[junit4] 2> 450842 INFO (coreZkRegister-915-thread-1) [ ] o.a.s.c.LeaderElector Joined leadership election with path: /collections/control_collection/leader_elect/shard1/election/96592402199478276-core_node1-n_0000000000
[junit4] 2> 450843 INFO (coreZkRegister-915-thread-1) [ ] o.a.s.c.ShardLeaderElectionContext Running the leader process for shard=shard1 and weAreReplacement=false and leaderVoteWait=10000
[junit4] 2> 450843 INFO (coreZkRegister-915-thread-1) [ ] o.a.s.c.ShardLeaderElectionContext Enough replicas found to continue.
[junit4] 2> 450843 INFO (coreZkRegister-915-thread-1) [ ] o.a.s.c.ShardLeaderElectionContext I may be the new leader - try and sync
[junit4] 2> 450843 INFO (coreZkRegister-915-thread-1) [ ] o.a.s.c.SyncStrategy Sync replicas to http://127.0.0.1:32844/collection1/
[junit4] 2> 450843 INFO (coreZkRegister-915-thread-1) [ ] o.a.s.c.SyncStrategy Sync Success - now sync replicas to me
[junit4] 2> 450843 INFO (coreZkRegister-915-thread-1) [ ] o.a.s.c.SyncStrategy http://127.0.0.1:32844/collection1/ has no replicas
[junit4] 2> 450843 INFO (OverseerStateUpdate-96592402199478276-127.0.0.1:32844_-n_0000000000) [ ] o.a.s.c.Overseer processMessage: queueSize: 1, message = {
[junit4] 2> "operation":"leader",
[junit4] 2> "shard":"shard1",
[junit4] 2> "collection":"control_collection"} current state version: 1
[junit4] 2> 450843 INFO (coreZkRegister-915-thread-1) [ ] o.a.s.c.c.SolrZkClient makePath: /collections/control_collection/leaders/shard1
[junit4] 2> 450844 INFO (coreZkRegister-915-thread-1) [ ] o.a.s.c.ShardLeaderElectionContextBase Creating leader registration node /collections/control_collection/leaders/shard1/leader after winning as /collections/control_collection/leader_elect/shard1/election/96592402199478276-core_node1-n_0000000000
[junit4] 2> 450845 INFO (coreZkRegister-915-thread-1) [ ] o.a.s.c.ShardLeaderElectionContext I am the new leader: http://127.0.0.1:32844/collection1/ shard1
[junit4] 2> 450845 INFO (OverseerStateUpdate-96592402199478276-127.0.0.1:32844_-n_0000000000) [ ] o.a.s.c.Overseer processMessage: queueSize: 1, message = {
[junit4] 2> "operation":"leader",
[junit4] 2> "shard":"shard1",
[junit4] 2> "collection":"control_collection",
[junit4] 2> "base_url":"http://127.0.0.1:32844",
[junit4] 2> "core":"collection1",
[junit4] 2> "state":"active"} current state version: 1
[junit4] 2> 450946 INFO (zkCallback-352-thread-1) [ ] o.a.s.c.c.ZkStateReader A cluster state change: [WatchedEvent state:SyncConnected type:NodeDataChanged path:/clusterstate.json], has occurred - updating... (live nodes size: [1])
[junit4] 2> 450995 INFO (coreZkRegister-915-thread-1) [ ] o.a.s.c.ZkController We are http://127.0.0.1:32844/collection1/ and leader is http://127.0.0.1:32844/collection1/
[junit4] 2> 450995 INFO (coreZkRegister-915-thread-1) [ ] o.a.s.c.ZkController No LogReplay needed for core=collection1 baseURL=http://127.0.0.1:32844
[junit4] 2> 450995 INFO (coreZkRegister-915-thread-1) [ ] o.a.s.c.ZkController I am the leader, no recovery necessary
[junit4] 2> 450995 INFO (coreZkRegister-915-thread-1) [ ] o.a.s.c.ZkController publishing state=active
[junit4] 2> 450996 INFO (coreZkRegister-915-thread-1) [ ] o.a.s.c.ZkController numShards not found on descriptor - reading it from system property
[junit4] 2> 450996 INFO (coreZkRegister-915-thread-1) [ ] o.a.s.c.c.ZkStateReader Checking legacy cluster state for collection control_collection
[junit4] 2> 450996 INFO (OverseerStateUpdate-96592402199478276-127.0.0.1:32844_-n_0000000000) [ ] o.a.s.c.Overseer processMessage: queueSize: 1, message = {
[junit4] 2> "core":"collection1",
[junit4] 2> "core_node_name":"core_node1",
[junit4] 2> "roles":null,
[junit4] 2> "base_url":"http://127.0.0.1:32844",
[junit4] 2> "node_name":"127.0.0.1:32844_",
[junit4] 2> "numShards":"1",
[junit4] 2> "state":"active",
[junit4] 2> "shard":"shard1",
[junit4] 2> "collection":"control_collection",
[junit4] 2> "operation":"state"} current state version: 2
[junit4] 2> 450996 INFO (OverseerStateUpdate-96592402199478276-127.0.0.1:32844_-n_0000000000) [ ] o.a.s.c.o.ReplicaMutator Update state numShards=1 message={
[junit4] 2> "core":"collection1",
[junit4] 2> "core_node_name":"core_node1",
[junit4] 2> "roles":null,
[junit4] 2> "base_url":"http://127.0.0.1:32844",
[junit4] 2> "node_name":"127.0.0.1:32844_",
[junit4] 2> "numShards":"1",
[junit4] 2> "state":"active",
[junit4] 2> "shard":"shard1",
[junit4] 2> "collection":"control_collection",
[junit4] 2> "operation":"state"}
[junit4] 2> 451097 INFO (zkCallback-352-thread-2) [ ] o.a.s.c.c.ZkStateReader A cluster state change: [WatchedEvent state:SyncConnected type:NodeDataChanged path:/clusterstate.json], has occurred - updating... (live nodes size: [1])
[junit4] 2> 451215 INFO (TEST-LeaderFailoverAfterPartitionTest.test-seed#[17C947795EF78447]) [ ] o.a.s.c.c.SolrZkClient Using default ZkCredentialsProvider
[junit4] 2> 451216 INFO (TEST-LeaderFailoverAfterPartitionTest.test-seed#[17C947795EF78447]) [ ] o.a.s.c.c.ConnectionManager Waiting for client to connect to ZooKeeper
[junit4] 2> 451217 INFO (zkCallback-356-thread-1) [ ] o.a.s.c.c.ConnectionManager Watcher org.apache.solr.common.cloud.ConnectionManager@5409dfff name:ZooKeeperConnection Watcher:127.0.0.1:34155/solr got event WatchedEvent state:SyncConnected type:None path:null path:null type:None
[junit4] 2> 451217 INFO (TEST-LeaderFailoverAfterPartitionTest.test-seed#[17C947795EF78447]) [ ] o.a.s.c.c.ConnectionManager Client is connected to ZooKeeper
[junit4] 2> 451217 INFO (TEST-LeaderFailoverAfterPartitionTest.test-seed#[17C947795EF78447]) [ ] o.a.s.c.c.SolrZkClient Using default ZkACLProvider
[junit4] 2> 451217 INFO (TEST-LeaderFailoverAfterPartitionTest.test-seed#[17C947795EF78447]) [ ] o.a.s.c.c.ZkStateReader Updating cluster state from ZooKeeper...
[junit4] 2> 451218 INFO (TEST-LeaderFailoverAfterPartitionTest.test-seed#[17C947795EF78447]) [ ] o.a.s.c.c.ZkStateReader Loaded empty cluster properties
[junit4] 2> 451218 INFO (TEST-LeaderFailoverAfterPartitionTest.test-seed#[17C947795EF78447]) [ ] o.a.s.c.c.ZkStateReader Updated live nodes from ZooKeeper... (0) -> (1)
[junit4] 2> 451218 INFO (TEST-LeaderFailoverAfterPartitionTest.test-seed#[17C947795EF78447]) [ ] o.a.s.c.ChaosMonkey monkey: init - expire sessions:false cause connection loss:false
[junit4] 2> 451218 INFO (TEST-LeaderFailoverAfterPartitionTest.test-seed#[17C947795EF78447]) [ ] o.a.s.c.AbstractFullDistribZkTestBase Creating collection1 with stateFormat=2
[junit4] 2> 451218 INFO (TEST-LeaderFailoverAfterPartitionTest.test-seed#[17C947795EF78447]) [ ] o.a.s.c.c.SolrZkClient Using default ZkCredentialsProvider
[junit4] 2> 451218 INFO (TEST-LeaderFailoverAfterPartitionTest.test-seed#[17C947795EF78447]) [ ] o.a.s.c.c.ConnectionManager Waiting for client to connect to ZooKeeper
[junit4] 2> 451219 INFO (zkCallback-357-thread-1) [ ] o.a.s.c.c.ConnectionManager Watcher org.apache.solr.common.cloud.ConnectionManager@11095c97 name:ZooKeeperConnection Watcher:127.0.0.1:34155/solr got event WatchedEvent state:SyncConnected type:None path:null path:null type:None
[junit4] 2> 451219 INFO (TEST-LeaderFailoverAfterPartitionTest.test-seed#[17C947795EF78447]) [ ] o.a.s.c.c.ConnectionManager Client is connected to ZooKeeper
[junit4] 2> 451219 INFO (TEST-LeaderFailoverAfterPartitionTest.test-seed#[17C947795EF78447]) [ ] o.a.s.c.c.SolrZkClient Using default ZkACLProvider
[junit4] 2> 451220 INFO (OverseerStateUpdate-96592402199478276-127.0.0.1:32844_-n_0000000000) [ ] o.a.s.c.Overseer processMessage: queueSize: 1, message = {
[junit4] 2> "operation":"create",
[junit4] 2> "name":"collection1",
[junit4] 2> "numShards":"2",
[junit4] 2> "stateFormat":"2"} current state version: 3
[junit4] 2> 451220 INFO (OverseerStateUpdate-96592402199478276-127.0.0.1:32844_-n_0000000000) [ ] o.a.s.c.o.ClusterStateMutator building a new cName: collection1
[junit4] 2> 451275 INFO (TEST-LeaderFailoverAfterPartitionTest.test-seed#[17C947795EF78447]) [ ] o.a.s.SolrTestCaseJ4 Writing core.properties file to /home/jenkins/workspace/Lucene-Solr-master-Linux/solr/build/solr-core/test/J1/temp/solr.cloud.LeaderFailoverAfterPartitionTest_17C947795EF78447-001/shard-1-001/cores/collection1
[junit4] 2> 451276 INFO (TEST-LeaderFailoverAfterPartitionTest.test-seed#[17C947795EF78447]) [ ] o.a.s.c.AbstractFullDistribZkTestBase create jetty 1 in directory /home/jenkins/workspace/Lucene-Solr-master-Linux/solr/build/solr-core/test/J1/temp/solr.cloud.LeaderFailoverAfterPartitionTest_17C947795EF78447-001/shard-1-001
[junit4] 2> 451277 INFO (TEST-LeaderFailoverAfterPartitionTest.test-seed#[17C947795EF78447]) [ ] o.e.j.s.Server jetty-9.3.8.v20160314
[junit4] 2> 451278 INFO (TEST-LeaderFailoverAfterPartitionTest.test-seed#[17C947795EF78447]) [ ] o.e.j.s.h.ContextHandler Started o.e.j.s.ServletContextHandler@c3a57a6{/,null,AVAILABLE}
[junit4] 2> 451279 INFO (TEST-LeaderFailoverAfterPartitionTest.test-seed#[17C947795EF78447]) [ ] o.e.j.s.ServerConnector Started ServerConnector@62ba9b35{HTTP/1.1,[http/1.1]}{127.0.0.1:38836}
[junit4] 2> 451279 INFO (TEST-LeaderFailoverAfterPartitionTest.test-seed#[17C947795EF78447]) [ ] o.e.j.s.Server Started @453518ms
[junit4] 2> 451279 INFO (TEST-LeaderFailoverAfterPartitionTest.test-seed#[17C947795EF78447]) [ ] o.a.s.c.s.e.JettySolrRunner Jetty properties: {hostContext=/, solrconfig=solrconfig.xml, solr.data.dir=/home/jenkins/workspace/Lucene-Solr-master-Linux/solr/build/solr-core/test/J1/temp/solr.cloud.LeaderFailoverAfterPartitionTest_17C947795EF78447-001/tempDir-001/jetty1, hostPort=34395, coreRootDirectory=/home/jenkins/workspace/Lucene-Solr-master-Linux/solr/build/solr-core/test/J1/temp/solr.cloud.LeaderFailoverAfterPartitionTest_17C947795EF78447-001/shard-1-001/cores}
[junit4] 2> 451280 INFO (TEST-LeaderFailoverAfterPartitionTest.test-seed#[17C947795EF78447]) [ ] o.a.s.s.SolrDispatchFilter SolrDispatchFilter.init(): jdk.internal.loader.ClassLoaders$AppClassLoader@17d99928
[junit4] 2> 451280 INFO (TEST-LeaderFailoverAfterPartitionTest.test-seed#[17C947795EF78447]) [ ] o.a.s.c.SolrResourceLoader new SolrResourceLoader for directory: '/home/jenkins/workspace/Lucene-Solr-master-Linux/solr/build/solr-core/test/J1/temp/solr.cloud.LeaderFailoverAfterPartitionTest_17C947795EF78447-001/shard-1-001'
[junit4] 2> 451280 INFO (TEST-LeaderFailoverAfterPartitionTest.test-seed#[17C947795EF78447]) [ ] o.a.s.c.SolrResourceLoader JNDI not configured for solr (NoInitialContextEx)
[junit4] 2> 451280 INFO (TEST-LeaderFailoverAfterPartitionTest.test-seed#[17C947795EF78447]) [ ] o.a.s.c.SolrResourceLoader solr home defaulted to 'solr/' (could not find system property or JNDI)
[junit4] 2> 451280 INFO (TEST-LeaderFailoverAfterPartitionTest.test-seed#[17C947795EF78447]) [ ] o.a.s.c.c.SolrZkClient Using default ZkCredentialsProvider
[junit4] 2> 451281 INFO (TEST-LeaderFailoverAfterPartitionTest.test-seed#[17C947795EF78447]) [ ] o.a.s.c.c.ConnectionManager Waiting for client to connect to ZooKeeper
[junit4] 2> 451281 INFO (zkCallback-358-thread-1) [ ] o.a.s.c.c.ConnectionManager Watcher org.apache.solr.common.cloud.ConnectionManager@1d65101d name:ZooKeeperConnection Watcher:127.0.0.1:34155/solr got event WatchedEvent state:SyncConnected type:None path:null path:null type:None
[junit4] 2> 451281 INFO (TEST-LeaderFailoverAfterPartitionTest.test-seed#[17C947795EF78447]) [ ] o.a.s.c.c.ConnectionManager Client is connected to ZooKeeper
[junit4] 2> 451282 INFO (TEST-LeaderFailoverAfterPartitionTest.test-seed#[17C947795EF78447]) [ ] o.a.s.c.c.SolrZkClient Using default ZkACLProvider
[junit4] 2> 451282 INFO (TEST-LeaderFailoverAfterPartitionTest.test-seed#[17C947795EF78447]) [ ] o.a.s.s.SolrDispatchFilter Loading solr.xml from SolrHome (not found in ZooKeeper)
[junit4] 2> 451282 INFO (TEST-LeaderFailoverAfterPartitionTest.test-seed#[17C947795EF78447]) [ ] o.a.s.c.SolrXmlConfig Loading container configuration from /home/jenkins/workspace/Lucene-Solr-master-Linux/solr/build/solr-core/test/J1/temp/solr.cloud.LeaderFailoverAfterPartitionTest_17C947795EF78447-001/shard-1-001/solr.xml
[junit4] 2> 451286 INFO (TEST-LeaderFailoverAfterPartitionTest.test-seed#[17C947795EF78447]) [ ] o.a.s.c.CorePropertiesLocator Config-defined core root directory: /home/jenkins/workspace/Lucene-Solr-master-Linux/solr/build/solr-core/test/J1/temp/solr.cloud.LeaderFailoverAfterPartitionTest_17C947795EF78447-001/shard-1-001/cores
[junit4] 2> 451286 INFO (TEST-LeaderFailoverAfterPartitionTest.test-seed#[17C947795EF78447]) [ ] o.a.s.c.CoreContainer New CoreContainer 290943992
[junit4] 2> 451286 INFO (TEST-LeaderFailoverAfterPartitionTest.test-seed#[17C947795EF78447]) [ ] o.a.s.c.CoreContainer Loading cores into CoreContainer [instanceDir=/home/jenkins/workspace/Lucene-Solr-master-Linux/solr/build/solr-core/test/J1/temp/solr.cloud.LeaderFailoverAfterPartitionTest_17C947795EF78447-001/shard-1-001]
[junit4] 2> 451286 WARN (TEST-LeaderFailoverAfterPartitionTest.test-seed#[17C947795EF78447]) [ ] o.a.s.c.CoreContainer Couldn't add files from /home/jenkins/workspace/Lucene-Solr-master-Linux/solr/build/solr-core/test/J1/temp/solr.cloud.LeaderFailoverAfterPartitionTest_17C947795EF78447-001/shard-1-001/lib to classpath: /home/jenkins/workspace/Lucene-Solr-master-Linux/solr/build/solr-core/test/J1/temp/solr.cloud.LeaderFailoverAfterPartitionTest_17C947795EF78447-001/shard-1-001/lib
[junit4] 2> 451286 INFO (TEST-LeaderFailoverAfterPartitionTest.test-seed#[17C947795EF78447]) [ ] o.a.s.h.c.HttpShardHandlerFactory created with socketTimeout : 90000,urlScheme : ,connTimeout : 15000,maxConnectionsPerHost : 20,maxConnections : 10000,corePoolSize : 0,maximumPoolSize : 2147483647,maxThreadIdleTime : 5,sizeOfQueue : -1,fairnessPolicy : false,
[junit4] 2> 451288 INFO (TEST-LeaderFailoverAfterPartitionTest.test-seed#[17C947795EF78447]) [ ] o.a.s.u.UpdateShardHandler Created UpdateShardHandler HTTP client with params: socketTimeout=340000&connTimeout=45000&maxConnections=100000&maxConnectionsPerHost=100000
[junit4] 2> 451288 INFO (TEST-LeaderFailoverAfterPartitionTest.test-seed#[17C947795EF78447]) [ ] o.a.s.l.LogWatcher SLF4J impl is org.slf4j.impl.Log4jLoggerFactory
[junit4] 2> 451288 INFO (TEST-LeaderFailoverAfterPartitionTest.test-seed#[17C947795EF78447]) [ ] o.a.s.l.LogWatcher Registering Log Listener [Log4j (org.slf4j.impl.Log4jLoggerFactory)]
[junit4] 2> 451288 INFO (TEST-LeaderFailoverAfterPartitionTest.test-seed#[17C947795EF78447]) [ ] o.a.s.c.ZkContainer Zookeeper client=127.0.0.1:34155/solr
[junit4] 2> 451288 INFO (TEST-LeaderFailoverAfterPartitionTest.test-seed#[17C947795EF78447]) [ ] o.a.s.c.ZkController zkHost includes chroot
[junit4] 2> 451288 INFO (TEST-LeaderFailoverAfterPartitionTest.test-seed#[17C947795EF78447]) [ ] o.a.s.c.c.SolrZkClient Using default ZkCredentialsProvider
[junit4] 2> 451289 INFO (TEST-LeaderFailoverAfterPartitionTest.test-seed#[17C947795EF78447]) [ ] o.a.s.c.c.ConnectionManager Waiting for client to connect to ZooKeeper
[junit4] 2> 451290 INFO (zkCallback-361-thread-1) [ ] o.a.s.c.c.ConnectionManager Watcher org.apache.solr.common.cloud.ConnectionManager@48c42059 name:ZooKeeperConnection Watcher:127.0.0.1:34155 got event WatchedEvent state:SyncConnected type:None path:null path:null type:None
[junit4] 2> 451290 INFO (TEST-LeaderFailoverAfterPartitionTest.test-seed#[17C947795EF78447]) [ ] o.a.s.c.c.ConnectionManager Client is connected to ZooKeeper
[junit4] 2> 451290 INFO (TEST-LeaderFailoverAfterPartitionTest.test-seed#[17C947795EF78447]) [ ] o.a.s.c.c.SolrZkClient Using default ZkACLProvider
[junit4] 2> 451291 INFO (TEST-LeaderFailoverAfterPartitionTest.test-seed#[17C947795EF78447]) [ ] o.a.s.c.ZkController Added new OnReconnect listener org.apache.solr.cloud.ZkController$$Lambda$191/307818374@34fdf3ab
[junit4] 2> 451291 INFO (TEST-LeaderFailoverAfterPartitionTest.test-seed#[17C947795EF78447]) [ ] o.a.s.c.c.ConnectionManager Waiting for client to connect to ZooKeeper
[junit4] 2> 451291 INFO (zkCallback-362-thread-1) [ ] o.a.s.c.c.ConnectionManager Watcher org.apache.solr.common.cloud.ConnectionManager@50ce8252 name:ZooKeeperConnection Watcher:127.0.0.1:34155/solr got event WatchedEvent state:SyncConnected type:None path:null path:null type:None
[junit4] 2> 451292 INFO (TEST-LeaderFailoverAfterPartitionTest.test-seed#[17C947795EF78447]) [ ] o.a.s.c.c.ConnectionManager Client is connected to ZooKeeper
[junit4] 2> 451293 INFO (TEST-LeaderFailoverAfterPartitionTest.test-seed#[17C947795EF78447]) [ ] o.a.s.c.c.ZkStateReader Updating cluster state from ZooKeeper...
[junit4] 2> 451294 INFO (TEST-LeaderFailoverAfterPartitionTest.test-seed#[17C947795EF78447]) [ ] o.a.s.c.c.ZkStateReader Loaded empty cluster properties
[junit4] 2> 451294 INFO (TEST-LeaderFailoverAfterPartitionTest.test-seed#[17C947795EF78447]) [ ] o.a.s.c.c.ZkStateReader Updated live nodes from ZooKeeper... (0) -> (1)
[junit4] 2> 451295 INFO (TEST-LeaderFailoverAfterPartitionTest.test-seed#[17C947795EF78447]) [ ] o.a.s.c.Overseer Overseer (id=null) closing
[junit4] 2> 451295 INFO (TEST-LeaderFailoverAfterPartitionTest.test-seed#[17C947795EF78447]) [ ] o.a.s.c.LeaderElector Joined leadership election with path: /overseer_elect/election/96592402199478281-127.0.0.1:34395_-n_0000000001
[junit4] 2> 451295 INFO (TEST-LeaderFailoverAfterPartitionTest.test-seed#[17C947795EF78447]) [ ] o.a.s.c.LeaderElector Watching path /overseer_elect/election/96592402199478276-127.0.0.1:32844_-n_0000000000 to know if I could be the leader
[junit4] 2> 451295 INFO (TEST-LeaderFailoverAfterPartitionTest.test-seed#[17C947795EF78447]) [ ] o.a.s.c.ZkController Publish node=127.0.0.1:34395_ as DOWN
[junit4] 2> 451296 INFO (TEST-LeaderFailoverAfterPartitionTest.test-seed#[17C947795EF78447]) [ ] o.a.s.c.ZkController Register node as live in ZooKeeper:/live_nodes/127.0.0.1:34395_
[junit4] 2> 451296 INFO (TEST-LeaderFailoverAfterPartitionTest.test-seed#[17C947795EF78447]) [ ] o.a.s.c.c.SolrZkClient makePath: /live_nodes/127.0.0.1:34395_
[junit4] 2> 451296 INFO (OverseerStateUpdate-96592402199478276-127.0.0.1:32844_-n_0000000000) [ ] o.a.s.c.Overseer processMessage: queueSize: 1, message = {
[junit4] 2> "operation":"downnode",
[junit4] 2> "node_name":"127.0.0.1:34395_"} current state version: 3
[junit4] 2> 451296 INFO (OverseerStateUpdate-96592402199478276-127.0.0.1:32844_-n_0000000000) [ ] o.a.s.c.o.NodeMutator DownNode state invoked for node: 127.0.0.1:34395_
[junit4] 2> 451296 INFO (zkCallback-352-thread-2) [ ] o.a.s.c.c.ZkStateReader A live node change: [WatchedEvent state:SyncConnected type:NodeChildrenChanged path:/live_nodes], has occurred - updating... (live nodes size: [1])
[junit4] 2> 451296 INFO (zkCallback-356-thread-1) [ ] o.a.s.c.c.ZkStateReader A live node change: [WatchedEvent state:SyncConnected type:NodeChildrenChanged path:/live_nodes], has occurred - updating... (live nodes size: [1])
[junit4] 2> 451296 INFO (zkCallback-362-thread-1) [ ] o.a.s.c.c.ZkStateReader A live node change: [WatchedEvent state:SyncConnected type:NodeChildrenChanged path:/live_nodes], has occurred - updating... (live nodes size: [1])
[junit4] 2> 451296 INFO (OverseerStateUpdate-96592402199478276-127.0.0.1:32844_-n_0000000000) [ ] o.a.s.c.o.ZkStateWriter going to create_collection /collections/collection1/state.json
[junit4] 2> 451296 INFO (zkCallback-352-thread-2) [ ] o.a.s.c.c.ZkStateReader Updated live nodes from ZooKeeper... (1) -> (2)
[junit4] 2> 451297 INFO (zkCallback-362-thread-1) [ ] o.a.s.c.c.ZkStateReader Updated live nodes from ZooKeeper... (1) -> (2)
[junit4] 2> 451297 INFO (zkCallback-356-thread-1) [ ] o.a.s.c.c.ZkStateReader Updated live nodes from ZooKeeper... (1) -> (2)
[junit4] 2> 451298 INFO (zkCallback-352-thread-2) [ ] o.a.s.c.c.ZkStateReader A cluster state change: [WatchedEvent state:SyncConnected type:NodeDataChanged path:/clusterstate.json], has occurred - updating... (live nodes size: [2])
[junit4] 2> 451298 INFO (zkCallback-356-thread-1) [ ] o.a.s.c.c.ZkStateReader A cluster state change: [WatchedEvent state:SyncConnected type:NodeDataChanged path:/clusterstate.json], has occurred - updating... (live nodes size: [2])
[junit4] 2> 451298 INFO (zkCallback-362-thread-1) [ ] o.a.s.c.c.ZkStateReader A cluster state change: [WatchedEvent state:SyncConnected type:NodeDataChanged path:/clusterstate.json], has occurred - updating... (live nodes size: [2])
[junit4] 2> 451304 INFO (TEST-LeaderFailoverAfterPartitionTest.test-seed#[17C947795EF78447]) [ ] o.a.s.c.CoreContainer Security conf doesn't exist. Skipping setup for authorization module.
[junit4] 2> 451304 INFO (TEST-LeaderFailoverAfterPartitionTest.test-seed#[17C947795EF78447]) [ ] o.a.s.c.CoreContainer No authentication plugin used.
[junit4] 2> 451304 INFO (TEST-LeaderFailoverAfterPartitionTest.test-seed#[17C947795EF78447]) [ ] o.a.s.c.CorePropertiesLocator Looking for core definitions underneath /home/jenkins/workspace/Lucene-Solr-master-Linux/solr/build/solr-core/test/J1/temp/solr.cloud.LeaderFailoverAfterPartitionTest_17C947795EF78447-001/shard-1-001/cores
[junit4] 2> 451305 INFO (TEST-LeaderFailoverAfterPartitionTest.test-seed#[17C947795EF78447]) [ ] o.a.s.c.CoreDescriptor Created CoreDescriptor: {schema=schema.xml, dataDir=data/, collection=collection1, loadOnStartup=true, coreNodeName=, transient=false, name=collection1, shard=, config=solrconfig.xml, configSetProperties=configsetprops.json}
[junit4] 2> 451305 INFO (TEST-LeaderFailoverAfterPartitionTest.test-seed#[17C947795EF78447]) [ ] o.a.s.c.CorePropertiesLocator Found core collection1 in /home/jenkins/workspace/Lucene-Solr-master-Linux/solr/build/solr-core/test/J1/temp/solr.cloud.LeaderFailoverAfterPartitionTest_17C947795EF78447-001/shard-1-001/cores/collection1
[junit4] 2> 451305 INFO (TEST-LeaderFailoverAfterPartitionTest.test-seed#[17C947795EF78447]) [ ] o.a.s.c.CorePropertiesLocator Found 1 core definitions
[junit4] 2> 451305 INFO (TEST-LeaderFailoverAfterPartitionTest.test-seed#[17C947795EF78447]) [ ] o.a.s.s.SolrDispatchFilter user.dir=/home/jenkins/workspace/Lucene-Solr-master-Linux/solr/build/solr-core/test/J1
[junit4] 2> 451305 INFO (TEST-LeaderFailoverAfterPartitionTest.test-seed#[17C947795EF78447]) [ ] o.a.s.s.SolrDispatchFilter SolrDispatchFilter.init() done
[junit4] 2> 451306 INFO (coreLoadExecutor-933-thread-1) [ ] o.a.s.c.ZkController publishing state=down
[junit4] 2> 451306 INFO (coreLoadExecutor-933-thread-1) [ ] o.a.s.c.ZkController numShards not found on descriptor - reading it from system property
[junit4] 2> 451306 INFO (coreLoadExecutor-933-thread-1) [ ] o.a.s.c.ZkController Registering watch for collection collection1
[junit4] 2> 451306 INFO (coreLoadExecutor-933-thread-1) [ ] o.a.s.c.c.ZkStateReader Add data for [collection1] ver [0]
[junit4] 2> 451306 INFO (OverseerStateUpdate-96592402199478276-127.0.0.1:32844_-n_0000000000) [ ] o.a.s.c.Overseer processMessage: queueSize: 1, message = {
[junit4] 2> "core":"collection1",
[junit4] 2> "roles":null,
[junit4] 2> "base_url":"http://127.0.0.1:34395",
[junit4] 2> "node_name":"127.0.0.1:34395_",
[junit4] 2> "numShards":"2",
[junit4] 2> "state":"down",
[junit4] 2> "shard":null,
[junit4] 2> "collection":"collection1",
[junit4] 2> "operation":"state"} current state version: 4
[junit4] 2> 451306 INFO (coreLoadExecutor-933-thread-1) [ ] o.a.s.c.ZkController look for our core node name
[junit4] 2> 451306 INFO (OverseerStateUpdate-96592402199478276-127.0.0.1:32844_-n_0000000000) [ ] o.a.s.c.o.ReplicaMutator Update state numShards=2 message={
[junit4] 2> "core":"collection1",
[junit4] 2> "roles":null,
[junit4] 2> "base_url":"http://127.0.0.1:34395",
[junit4] 2> "node_name":"127.0.0.1:34395_",
[junit4] 2> "numShards":"2",
[junit4] 2> "state":"down",
[junit4] 2> "shard":null,
[junit4] 2> "collection":"collection1",
[junit4] 2> "operation":"state"}
[junit4] 2> 451306 INFO (OverseerStateUpdate-96592402199478276-127.0.0.1:32844_-n_0000000000) [ ] o.a.s.c.o.ReplicaMutator Collection already exists with numShards=2
[junit4] 2> 451306 INFO (OverseerStateUpdate-96592402199478276-127.0.0.1:32844_-n_0000000000) [ ] o.a.s.c.o.ReplicaMutator Assigning new node to shard shard=shard2
[junit4] 2> 451407 INFO (OverseerStateUpdate-96592402199478276-127.0.0.1:32844_-n_0000000000) [ ] o.a.s.c.o.ZkStateWriter going to update_collection /collections/collection1/state.json version: 2147483647
[junit4] 2> 451408 WARN (OverseerStateUpdate-96592402199478276-127.0.0.1:32844_-n_0000000000) [ ] o.a.s.c.Overseer Bad version writing to ZK using compare-and-set, will force refresh cluster state
[junit4] 2> org.apache.zookeeper.KeeperException$BadVersionException: KeeperErrorCode = BadVersion for /collections/collection1/state.json
[junit4] 2> at org.apache.zookeeper.KeeperException.create(KeeperException.java:115)
[junit4] 2> at org.apache.zookeeper.KeeperException.create(KeeperException.java:51)
[junit4] 2> at org.apache.zookeeper.ZooKeeper.setData(ZooKeeper.java:1270)
[junit4] 2> at org.apache.solr.common.cloud.SolrZkClient$8.execute(SolrZkClient.java:373)
[junit4] 2> at org.apache.solr.common.cloud.SolrZkClient$8.execute(SolrZkClient.java:370)
[junit4] 2> at org.apache.solr.common.cloud.ZkCmdExecutor.retryOperation(ZkCmdExecutor.java:60)
[junit4] 2> at org.apache.solr.common.cloud.SolrZkClient.setData(SolrZkClient.java:370)
[junit4] 2> at org.apache.solr.cloud.overseer.ZkStateWriter.writePendingUpdates(ZkStateWriter.java:230)
[junit4] 2> at org.apache.solr.cloud.Overseer$ClusterStateUpdater.run(Overseer.java:226)
[junit4] 2> at java.lang.Thread.run(java.base@9-ea/Thread.java:843)
[junit4] 2> 451409 INFO (OverseerStateUpdate-96592402199478276-127.0.0.1:32844_-n_0000000000) [ ] o.a.s.c.c.ZkStateReader Updated live nodes from ZooKeeper... (2) -> (2)
[junit4] 2> 451409 INFO (OverseerStateUpdate-96592402199478276-127.0.0.1:32844_-n_0000000000) [ ] o.a.s.c.Overseer processMessage: workQueueSize: 2, message = {
[junit4] 2> "operation":"downnode",
[junit4] 2> "node_name":"127.0.0.1:34395_"}
[junit4] 2> 451409 INFO (OverseerStateUpdate-96592402199478276-127.0.0.1:32844_-n_0000000000) [ ] o.a.s.c.o.NodeMutator DownNode state invoked for node: 127.0.0.1:34395_
[junit4] 2> 451409 INFO (zkCallback-352-thread-1) [ ] o.a.s.c.c.ZkStateReader A cluster state change: [WatchedEvent state:SyncConnected type:NodeDataChanged path:/clusterstate.json], has occurred - updating... (live nodes size: [2])
[junit4] 2> 451409 INFO (zkCallback-362-thread-1) [ ] o.a.s.c.c.ZkStateReader A cluster state change: [WatchedEvent state:SyncConnected type:NodeDataChanged path:/clusterstate.json], has occurred - updating... (live nodes size: [2])
[junit4] 2> 451409 INFO (zkCallback-356-thread-1) [ ] o.a.s.c.c.ZkStateReader A cluster state change: [WatchedEvent state:SyncConnected type:NodeDataChanged path:/clusterstate.json], has occurred - updating... (live nodes size: [2])
[junit4] 2> 451410 INFO (OverseerStateUpdate-96592402199478276-127.0.0.1:32844_-n_0000000000) [ ] o.a.s.c.o.ZkStateWriter going to update_collection /collections/collection1/state.json version: 0
[junit4] 2> 451410 INFO (zkCallback-362-thread-1) [ ] o.a.s.c.c.ZkStateReader A cluster state change: [WatchedEvent state:SyncConnected type:NodeDataChanged path:/collections/collection1/state.json] for collection [collection1] has occurred - updating... (live nodes size: [2])
[junit4] 2> 451410 INFO (zkCallback-362-thread-1) [ ] o.a.s.c.c.ZkStateReader Updating data for [collection1] from [0] to [1]
[junit4] 2> 451410 INFO (OverseerStateUpdate-96592402199478276-127.0.0.1:32844_-n_0000000000) [ ] o.a.s.c.Overseer processMessage: workQueueSize: 1, message = {
[junit4] 2> "core":"collection1",
[junit4] 2> "roles":null,
[junit4] 2> "base_url":"http://127.0.0.1:34395",
[junit4] 2> "node_name":"127.0.0.1:34395_",
[junit4] 2> "numShards":"2",
[junit4] 2> "state":"down",
[junit4] 2> "shard":null,
[junit4] 2> "collection":"collection1",
[junit4] 2> "operation":"state"}
[junit4] 2> 451410 INFO (OverseerStateUpdate-96592402199478276-127.0.0.1:32844_-n_0000000000) [ ] o.a.s.c.o.ReplicaMutator Update state numShards=2 message={
[junit4] 2> "core":"collection1",
[junit4] 2> "roles":null,
[junit4] 2> "base_url":"http://127.0.0.1:34395",
[junit4] 2> "node_name":"127.0.0.1:34395_",
[junit4] 2> "numShards":"2",
[junit4] 2> "state":"down",
[junit4] 2> "shard":null,
[junit4] 2> "collection":"collection1",
[junit4] 2> "operation":"state"}
[junit4] 2> 451410 INFO (OverseerStateUpdate-96592402199478276-127.0.0.1:32844_-n_0000000000) [ ] o.a.s.c.o.ReplicaMutator Collection already exists with numShards=2
[junit4] 2> 451410 INFO (OverseerStateUpdate-96592402199478276-127.0.0.1:32844_-n_0000000000) [ ] o.a.s.c.o.ReplicaMutator Assigning new node to shard shard=shard2
[junit4] 2> 451411 INFO (OverseerStateUpdate-96592402199478276-127.0.0.1:32844_-n_0000000000) [ ] o.a.s.c.o.ZkStateWriter going to update_collection /collections/collection1/state.json version: 1
[junit4] 2> 451411 INFO (zkCallback-362-thread-1) [ ] o.a.s.c.c.ZkStateReader A cluster state change: [WatchedEvent state:SyncConnected type:NodeDataChanged path:/collections/collection1/state.json] for collection [collection1] has occurred - updating... (live nodes size: [2])
[junit4] 2> 451411 INFO (zkCallback-362-thread-1) [ ] o.a.s.c.c.ZkStateReader Updating data for [collection1] from [1] to [2]
[junit4] 2> 452306 INFO (coreLoadExecutor-933-thread-1) [ ] o.a.s.c.ZkController waiting to find shard id in clusterstate for collection1
[junit4] 2> 452306 INFO (coreLoadExecutor-933-thread-1) [ ] o.a.s.c.ZkController Check for collection zkNode:collection1
[junit4] 2> 452307 INFO (coreLoadExecutor-933-thread-1) [ ] o.a.s.c.ZkController Collection zkNode exists
[junit4] 2> 452307 INFO (coreLoadExecutor-933-thread-1) [ ] o.a.s.c.c.ZkStateReader Load collection config from: [/collections/collection1]
[junit4] 2> 452307 INFO (coreLoadExecutor-933-thread-1) [ ] o.a.s.c.c.ZkStateReader path=[/collections/collection1] [configName]=[conf1] specified config exists in ZooKeeper
[junit4] 2> 452307 INFO (coreLoadExecutor-933-thread-1) [ ] o.a.s.c.SolrResourceLoader new SolrResourceLoader for directory: '/home/jenkins/workspace/Lucene-Solr-master-Linux/solr/build/solr-core/test/J1/temp/solr.cloud.LeaderFailoverAfterPartitionTest_17C947795EF78447-001/shard-1-001/cores/collection1'
[junit4] 2> 452307 INFO (coreLoadExecutor-933-thread-1) [ ] o.a.s.c.SolrResourceLoader JNDI not configured for solr (NoInitialContextEx)
[junit4] 2> 452307 INFO (coreLoadExecutor-933-thread-1) [ ] o.a.s.c.SolrResourceLoader solr home defaulted to 'solr/' (could not find system property or JNDI)
[junit4] 2> 452308 INFO (coreLoadExecutor-933-thread-1) [ ] o.a.s.c.Config loaded config solrconfig.xml with version 0
[junit4] 2> 452311 INFO (coreLoadExecutor-933-thread-1) [ ] o.a.s.c.SolrConfig current version of requestparams : -1
[junit4] 2> 452314 INFO (coreLoadExecutor-933-thread-1) [ ] o.a.s.c.SolrConfig Using Lucene MatchVersion: 7.0.0
[junit4] 2> 452320 INFO (coreLoadExecutor-933-thread-1) [ ] o.a.s.c.SolrConfig Loaded SolrConfig: solrconfig.xml
[junit4] 2> 452324 INFO (coreLoadExecutor-933-thread-1) [ ] o.a.s.s.IndexSchema [collection1] Schema name=test
[junit4] 2> 452386 INFO (coreLoadExecutor-933-thread-1) [ ] o.a.s.s.OpenExchangeRatesOrgProvider Initialized with rates=open-exchange-rates.json, refreshInterval=1440.
[junit4] 2> 452390 INFO (coreLoadExecutor-933-thread-1) [ ] o.a.s.s.IndexSchema default search field in schema is text
[junit4] 2> 452391 INFO (coreLoadExecutor-933-thread-1) [ ] o.a.s.s.IndexSchema unique key field: id
[junit4] 2> 452395 INFO (coreLoadExecutor-933-thread-1) [ ] o.a.s.s.FileExchangeRateProvider Reloading exchange rates from file currency.xml
[junit4] 2> 452396 INFO (coreLoadExecutor-933-thread-1) [ ] o.a.s.s.FileExchangeRateProvider Reloading exchange rates from file currency.xml
[junit4] 2> 452397 INFO (coreLoadExecutor-933-thread-1) [ ] o.a.s.s.OpenExchangeRatesOrgProvider Reloading exchange rates from open-exchange-rates.json
[junit4] 2> 452397 INFO (coreLoadExecutor-933-thread-1) [ ] o.a.s.s.OpenExchangeRatesOrgProvider Reloading exchange rates from open-exchange-rates.json
[junit4] 2> 452398 INFO (coreLoadExecutor-933-thread-1) [ ] o.a.s.c.ConfigSetProperties Did not find ConfigSet properties, assuming default properties: Can't find resource 'configsetprops.json' in classpath or '/configs/conf1', cwd=/home/jenkins/workspace/Lucene-Solr-master-Linux/solr/build/solr-core/test/J1
[junit4] 2> 452398 INFO (coreLoadExecutor-933-thread-1) [ ] o.a.s.c.CoreContainer Creating SolrCore 'collection1' using configuration from collection collection1
[junit4] 2> 452398 INFO (coreLoadExecutor-933-thread-1) [ ] o.a.s.c.SolrCore org.apache.solr.core.MockDirectoryFactory
[junit4] 2> 452398 INFO (coreLoadExecutor-933-thread-1) [ ] o.a.s.c.SolrCore [[collection1] ] Opening new SolrCore at [/home/jenkins/workspace/Lucene-Solr-master-Linux/solr/build/solr-core/test/J1/temp/solr.cloud.LeaderFailoverAfterPartitionTest_17C947795EF78447-001/shard-1-001/cores/collection1], dataDir=[/home/jenkins/workspace/Lucene-Solr-master-Linux/solr/build/solr-core/test/J1/temp/solr.cloud.LeaderFailoverAfterPartitionTest_17C947795EF78447-001/shard-1-001/cores/collection1/data/]
[junit4] 2> 452398 INFO (coreLoadExecutor-933-thread-1) [ ] o.a.s.c.JmxMonitoredMap JMX monitoring is enabled. Adding Solr mbeans to JMX Server: com.sun.jmx.mbeanserver.JmxMBeanServer@7c86c452
[junit4] 2> 452399 INFO (coreLoadExecutor-933-thread-1) [ ] o.a.s.c.CachingDirectoryFactory return new directory for /home/jenkins/workspace/Lucene-Solr-master-Linux/solr/build/solr-core/test/J1/temp/solr.cloud.LeaderFailoverAfterPartitionTest_17C947795EF78447-001/shard-1-001/cores/collection1/data/snapshot_metadata
[junit4] 2> 452399 INFO (coreLoadExecutor-933-thread-1) [ ] o.a.s.c.s.SolrSnapshotMetaDataManager Loading from snapshot metadata file...
[junit4] 2> 452399 INFO (coreLoadExecutor-933-thread-1) [ ] o.a.s.c.CachingDirectoryFactory return new directory for /home/jenkins/workspace/Lucene-Solr-master-Linux/solr/build/solr-core/test/J1/temp/solr.cloud.LeaderFailoverAfterPartitionTest_17C947795EF78447-001/shard-1-001/cores/collection1/data
[junit4] 2> 452399 INFO (coreLoadExecutor-933-thread-1) [ ] o.a.s.c.SolrCore New index directory detected: old=null new=/home/jenkins/workspace/Lucene-Solr-master-Linux/solr/build/solr-core/test/J1/temp/solr.cloud.LeaderFailoverAfterPartitionTest_17C947795EF78447-001/shard-1-001/cores/collection1/data/index/
[junit4] 2> 452399 WARN (coreLoadExecutor-933-thread-1) [ ] o.a.s.c.SolrCore [collection1] Solr index directory '/home/jenkins/workspace/Lucene-Solr-master-Linux/solr/build/solr-core/test/J1/temp/solr.cloud.LeaderFailoverAfterPartitionTest_17C947795EF78447-001/shard-1-001/cores/collection1/data/index' doesn't exist. Creating new index...
[junit4] 2> 452399 INFO (coreLoadExecutor-933-thread-1) [ ] o.a.s.c.CachingDirectoryFactory return new directory for /home/jenkins/workspace/Lucene-Solr-master-Linux/solr/build/solr-core/test/J1/temp/solr.cloud.LeaderFailoverAfterPartitionTest_17C947795EF78447-001/shard-1-001/cores/collection1/data/index
[junit4] 2> 452399 INFO (coreLoadExecutor-933-thread-1) [ ] o.a.s.u.RandomMergePolicy RandomMergePolicy wrapping class org.apache.lucene.index.TieredMergePolicy: [TieredMergePolicy: maxMergeAtOnce=44, maxMergeAtOnceExplicit=46, maxMergedSegmentMB=31.1728515625, floorSegmentMB=0.5322265625, forceMergeDeletesPctAllowed=6.99257880149744, segmentsPerTier=42.0, maxCFSSegmentSizeMB=8.796093022207999E12, noCFSRatio=1.0
[junit4] 2> 452400 INFO (coreLoadExecutor-933-thread-1) [ ] o.a.s.c.SolrDeletionPolicy SolrDeletionPolicy.onCommit: commits: num=1
[junit4] 2> commit{dir=MockDirectoryWrapper(RAMDirectory@44898d97 lockFactory=org.apache.lucene.store.SingleInstanceLockFactory@53a871ee),segFN=segments_1,generation=1}
[junit4] 2> 452400 INFO (coreLoadExecutor-933-thread-1) [ ] o.a.s.c.SolrDeletionPolicy newest commit generation = 1
[junit4] 2> 452400 INFO (OldIndexDirectoryCleanupThreadForCore-collection1) [ ] o.a.s.c.SolrCore Looking for old index directories to cleanup for core collection1 in /home/jenkins/workspace/Lucene-Solr-master-Linux/solr/build/solr-core/test/J1/temp/solr.cloud.LeaderFailoverAfterPartitionTest_17C947795EF78447-001/shard-1-001/cores/collection1/data/
[junit4] 2> 452400 WARN (OldIndexDirectoryCleanupThreadForCore-collection1) [ ] o.a.s.c.DirectoryFactory /home/jenkins/workspace/Lucene-Solr-master-Linux/solr/build/solr-core/test/J1/temp/solr.cloud.LeaderFailoverAfterPartitionTest_17C947795EF78447-001/shard-1-001/cores/collection1/data/ does not point to a valid data directory; skipping clean-up of old index directories.
[junit4] 2> 452402 INFO (coreLoadExecutor-933-thread-1) [ ] o.a.s.u.p.UpdateRequestProcessorChain creatin
[...truncated too long message...]
TestServer Watch limit violations:
[junit4] 2> Maximum concurrent create/delete watches above limit:
[junit4] 2>
[junit4] 2> 5 /solr/aliases.json
[junit4] 2> 5 /solr/clusterprops.json
[junit4] 2> 4 /solr/security.json
[junit4] 2> 4 /solr/configs/conf1
[junit4] 2>
[junit4] 2> Maximum concurrent data watches above limit:
[junit4] 2>
[junit4] 2> 5 /solr/clusterstate.json
[junit4] 2> 3 /solr/collections/c8n_1x3_lf/state.json
[junit4] 2> 3 /solr/collections/collection1/state.json
[junit4] 2>
[junit4] 2> Maximum concurrent children watches above limit:
[junit4] 2>
[junit4] 2> 60 /solr/overseer/collection-queue-work
[junit4] 2> 37 /solr/overseer/queue
[junit4] 2> 20 /solr/overseer/queue-work
[junit4] 2> 5 /solr/live_nodes
[junit4] 2> 5 /solr/collections
[junit4] 2>
[junit4] 2> 512678 WARN (TEST-LeaderFailoverAfterPartitionTest.test-seed#[17C947795EF78447]) [ ] o.a.s.c.SocketProxy Closing 2 connections to: http://127.0.0.1:34087/, target: http://127.0.0.1:45807/
[junit4] 2> 512678 WARN (TEST-LeaderFailoverAfterPartitionTest.test-seed#[17C947795EF78447]) [ ] o.a.s.c.SocketProxy Closing 0 connections to: http://127.0.0.1:35217/, target: http://127.0.0.1:33038/
[junit4] 2> 512678 WARN (TEST-LeaderFailoverAfterPartitionTest.test-seed#[17C947795EF78447]) [ ] o.a.s.c.SocketProxy Closing 0 connections to: http://127.0.0.1:32844/, target: http://127.0.0.1:38526/
[junit4] 2> 512678 WARN (TEST-LeaderFailoverAfterPartitionTest.test-seed#[17C947795EF78447]) [ ] o.a.s.c.SocketProxy Closing 7 connections to: http://127.0.0.1:34395/, target: http://127.0.0.1:38836/
[junit4] 2> NOTE: reproduce with: ant test -Dtestcase=LeaderFailoverAfterPartitionTest -Dtests.method=test -Dtests.seed=17C947795EF78447 -Dtests.multiplier=3 -Dtests.slow=true -Dtests.locale=rwk-TZ -Dtests.timezone=Europe/Skopje -Dtests.asserts=true -Dtests.file.encoding=US-ASCII
[junit4] ERROR 63.2s J1 | LeaderFailoverAfterPartitionTest.test <<<
[junit4] > Throwable #1: org.apache.solr.client.solrj.impl.CloudSolrClient$RouteException: No live SolrServers available to handle this request:[http://127.0.0.1:32844/c8n_1x3_lf_shard1_replica1]
[junit4] > at __randomizedtesting.SeedInfo.seed([17C947795EF78447:9F9D78A3F00BE9BF]:0)
[junit4] > at org.apache.solr.client.solrj.impl.CloudSolrClient.directUpdate(CloudSolrClient.java:755)
[junit4] > at org.apache.solr.client.solrj.impl.CloudSolrClient.sendRequest(CloudSolrClient.java:1161)
[junit4] > at org.apache.solr.client.solrj.impl.CloudSolrClient.requestWithRetryOnStaleState(CloudSolrClient.java:1050)
[junit4] > at org.apache.solr.client.solrj.impl.CloudSolrClient.request(CloudSolrClient.java:992)
[junit4] > at org.apache.solr.cloud.AbstractFullDistribZkTestBase.sendDocsWithRetry(AbstractFullDistribZkTestBase.java:753)
[junit4] > at org.apache.solr.cloud.AbstractFullDistribZkTestBase.sendDocsWithRetry(AbstractFullDistribZkTestBase.java:741)
[junit4] > at org.apache.solr.cloud.LeaderFailoverAfterPartitionTest.testRf3WithLeaderFailover(LeaderFailoverAfterPartitionTest.java:178)
[junit4] > at org.apache.solr.cloud.LeaderFailoverAfterPartitionTest.test(LeaderFailoverAfterPartitionTest.java:57)
[junit4] > at jdk.internal.reflect.NativeMethodAccessorImpl.invoke0(java.base@9-ea/Native Method)
[junit4] > at jdk.internal.reflect.NativeMethodAccessorImpl.invoke(java.base@9-ea/NativeMethodAccessorImpl.java:62)
[junit4] > at jdk.internal.reflect.DelegatingMethodAccessorImpl.invoke(java.base@9-ea/DelegatingMethodAccessorImpl.java:43)
[junit4] > at org.apache.solr.BaseDistributedSearchTestCase$ShardsRepeatRule$ShardsFixedStatement.callStatement(BaseDistributedSearchTestCase.java:985)
[junit4] > at org.apache.solr.BaseDistributedSearchTestCase$ShardsRepeatRule$ShardsStatement.evaluate(BaseDistributedSearchTestCase.java:960)
[junit4] > at java.lang.Thread.run(java.base@9-ea/Thread.java:843)
[junit4] > Caused by: org.apache.solr.client.solrj.SolrServerException: No live SolrServers available to handle this request:[http://127.0.0.1:32844/c8n_1x3_lf_shard1_replica1]
[junit4] > at org.apache.solr.client.solrj.impl.LBHttpSolrClient.request(LBHttpSolrClient.java:394)
[junit4] > at org.apache.solr.client.solrj.impl.CloudSolrClient.lambda$directUpdate$0(CloudSolrClient.java:730)
[junit4] > at java.util.concurrent.FutureTask.run(java.base@9-ea/FutureTask.java:264)
[junit4] > at org.apache.solr.common.util.ExecutorUtil$MDCAwareThreadPoolExecutor.lambda$execute$0(ExecutorUtil.java:229)
[junit4] > at java.util.concurrent.ThreadPoolExecutor.runWorker(java.base@9-ea/ThreadPoolExecutor.java:1158)
[junit4] > at java.util.concurrent.ThreadPoolExecutor$Worker.run(java.base@9-ea/ThreadPoolExecutor.java:632)
[junit4] > ... 1 more
[junit4] > Caused by: org.apache.solr.client.solrj.SolrServerException: Server refused connection at: http://127.0.0.1:32844/c8n_1x3_lf_shard1_replica1
[junit4] > at org.apache.solr.client.solrj.impl.HttpSolrClient.executeMethod(HttpSolrClient.java:615)
[junit4] > at org.apache.solr.client.solrj.impl.HttpSolrClient.request(HttpSolrClient.java:261)
[junit4] > at org.apache.solr.client.solrj.impl.HttpSolrClient.request(HttpSolrClient.java:250)
[junit4] > at org.apache.solr.client.solrj.impl.LBHttpSolrClient.doRequest(LBHttpSolrClient.java:415)
[junit4] > at org.apache.solr.client.solrj.impl.LBHttpSolrClient.request(LBHttpSolrClient.java:383)
[junit4] > ... 6 more
[junit4] > Caused by: org.apache.http.conn.HttpHostConnectException: Connect to 127.0.0.1:32844 [/127.0.0.1] failed: Connection refused
[junit4] > at org.apache.http.impl.conn.DefaultHttpClientConnectionOperator.connect(DefaultHttpClientConnectionOperator.java:151)
[junit4] > at org.apache.http.impl.conn.PoolingHttpClientConnectionManager.connect(PoolingHttpClientConnectionManager.java:353)
[junit4] > at org.apache.http.impl.execchain.MainClientExec.establishRoute(MainClientExec.java:380)
[junit4] > at org.apache.http.impl.execchain.MainClientExec.execute(MainClientExec.java:236)
[junit4] > at org.apache.http.impl.execchain.ProtocolExec.execute(ProtocolExec.java:184)
[junit4] > at org.apache.http.impl.execchain.RetryExec.execute(RetryExec.java:88)
[junit4] > at org.apache.http.impl.execchain.RedirectExec.execute(RedirectExec.java:110)
[junit4] > at org.apache.http.impl.client.InternalHttpClient.doExecute(InternalHttpClient.java:184)
[junit4] > at org.apache.http.impl.client.CloseableHttpClient.execute(CloseableHttpClient.java:82)
[junit4] > at org.apache.http.impl.client.CloseableHttpClient.execute(CloseableHttpClient.java:55)
[junit4] > at org.apache.solr.client.solrj.impl.HttpSolrClient.executeMethod(HttpSolrClient.java:513)
[junit4] > ... 10 more
[junit4] > Caused by: java.net.ConnectException: Connection refused
[junit4] > at java.net.PlainSocketImpl.socketConnect(java.base@9-ea/Native Method)
[junit4] > at java.net.AbstractPlainSocketImpl.doConnect(java.base@9-ea/AbstractPlainSocketImpl.java:400)
[junit4] > at java.net.AbstractPlainSocketImpl.connectToAddress(java.base@9-ea/AbstractPlainSocketImpl.java:243)
[junit4] > at java.net.AbstractPlainSocketImpl.connect(java.base@9-ea/AbstractPlainSocketImpl.java:225)
[junit4] > at java.net.SocksSocketImpl.connect(java.base@9-ea/SocksSocketImpl.java:402)
[junit4] > at java.net.Socket.connect(java.base@9-ea/Socket.java:591)
[junit4] > at org.apache.http.conn.socket.PlainConnectionSocketFactory.connectSocket(PlainConnectionSocketFactory.java:74)
[junit4] > at org.apache.http.impl.conn.DefaultHttpClientConnectionOperator.connect(DefaultHttpClientConnectionOperator.java:134)
[junit4] > ... 20 more
[junit4] 2> 512683 INFO (SUITE-LeaderFailoverAfterPartitionTest-seed#[17C947795EF78447]-worker) [ ] o.a.s.SolrTestCaseJ4 ###deleteCore
[junit4] 2> NOTE: leaving temporary files on disk at: /home/jenkins/workspace/Lucene-Solr-master-Linux/solr/build/solr-core/test/J1/temp/solr.cloud.LeaderFailoverAfterPartitionTest_17C947795EF78447-001
[junit4] 2> Sep 14, 2016 7:59:13 PM com.carrotsearch.randomizedtesting.ThreadLeakControl checkThreadLeaks
[junit4] 2> WARNING: Will linger awaiting termination of 1 leaked thread(s).
[junit4] 2> NOTE: test params are: codec=Asserting(Lucene62): {range_facet_l_dv=PostingsFormat(name=LuceneFixedGap), _version_=PostingsFormat(name=Memory doPackFST= true), multiDefault=PostingsFormat(name=Memory doPackFST= false), a_t=PostingsFormat(name=Memory doPackFST= false), intDefault=PostingsFormat(name=Memory doPackFST= true), id=PostingsFormat(name=LuceneFixedGap), range_facet_i_dv=PostingsFormat(name=Memory doPackFST= false), text=PostingsFormat(name=LuceneVarGapDocFreqInterval), range_facet_l=PostingsFormat(name=Memory doPackFST= false), timestamp=PostingsFormat(name=Memory doPackFST= false)}, docValues:{range_facet_l_dv=DocValuesFormat(name=Lucene54), range_facet_i_dv=DocValuesFormat(name=Direct), timestamp=DocValuesFormat(name=Direct)}, maxPointsInLeafNode=1874, maxMBSortInHeap=6.799580747522429, sim=ClassicSimilarity, locale=rwk-TZ, timezone=Europe/Skopje
[junit4] 2> NOTE: Linux 4.4.0-36-generic amd64/Oracle Corporation 9-ea (64-bit)/cpus=12,threads=1,free=183247072,total=515899392
[junit4] 2> NOTE: All tests run in this JVM: [IgnoreCommitOptimizeUpdateProcessorFactoryTest, TestClusterStateMutator, TestShortCircuitedRequests, ShardRoutingTest, ShardSplitTest, TestSolrQueryResponse, TestFastOutputStream, LeaderFailoverAfterPartitionTest]
[junit4] Completed [104/631 (1!)] on J1 in 63.96s, 1 test, 1 error <<< FAILURES!
[...truncated 51477 lines...]