You are viewing a plain text version of this content. The canonical link for it is here.
Posted to dev@lucene.apache.org by Apache Jenkins Server <je...@builds.apache.org> on 2016/06/23 13:07:00 UTC
[JENKINS] Lucene-Solr-Tests-6.x - Build # 284 - Failure
Build: https://builds.apache.org/job/Lucene-Solr-Tests-6.x/284/
1 tests failed.
FAILED: org.apache.solr.handler.TestReplicationHandler.doTestStressReplication
Error Message:
timed out waiting for collection1 startAt time to exceed: Thu Jun 23 14:37:02 CEST 2016
Stack Trace:
java.lang.AssertionError: timed out waiting for collection1 startAt time to exceed: Thu Jun 23 14:37:02 CEST 2016
at __randomizedtesting.SeedInfo.seed([F2A73B26F91730E7:290C3BE0FC3F5954]:0)
at org.junit.Assert.fail(Assert.java:93)
at org.apache.solr.handler.TestReplicationHandler.watchCoreStartAt(TestReplicationHandler.java:1508)
at org.apache.solr.handler.TestReplicationHandler.doTestStressReplication(TestReplicationHandler.java:858)
at sun.reflect.NativeMethodAccessorImpl.invoke0(Native Method)
at sun.reflect.NativeMethodAccessorImpl.invoke(NativeMethodAccessorImpl.java:62)
at sun.reflect.DelegatingMethodAccessorImpl.invoke(DelegatingMethodAccessorImpl.java:43)
at java.lang.reflect.Method.invoke(Method.java:498)
at com.carrotsearch.randomizedtesting.RandomizedRunner.invoke(RandomizedRunner.java:1764)
at com.carrotsearch.randomizedtesting.RandomizedRunner$8.evaluate(RandomizedRunner.java:871)
at com.carrotsearch.randomizedtesting.RandomizedRunner$9.evaluate(RandomizedRunner.java:907)
at com.carrotsearch.randomizedtesting.RandomizedRunner$10.evaluate(RandomizedRunner.java:921)
at com.carrotsearch.randomizedtesting.rules.SystemPropertiesRestoreRule$1.evaluate(SystemPropertiesRestoreRule.java:57)
at org.apache.lucene.util.TestRuleSetupTeardownChained$1.evaluate(TestRuleSetupTeardownChained.java:49)
at org.apache.lucene.util.AbstractBeforeAfterRule$1.evaluate(AbstractBeforeAfterRule.java:45)
at org.apache.lucene.util.TestRuleThreadAndTestName$1.evaluate(TestRuleThreadAndTestName.java:48)
at org.apache.lucene.util.TestRuleIgnoreAfterMaxFailures$1.evaluate(TestRuleIgnoreAfterMaxFailures.java:64)
at org.apache.lucene.util.TestRuleMarkFailure$1.evaluate(TestRuleMarkFailure.java:47)
at com.carrotsearch.randomizedtesting.rules.StatementAdapter.evaluate(StatementAdapter.java:36)
at com.carrotsearch.randomizedtesting.ThreadLeakControl$StatementRunner.run(ThreadLeakControl.java:367)
at com.carrotsearch.randomizedtesting.ThreadLeakControl.forkTimeoutingTask(ThreadLeakControl.java:809)
at com.carrotsearch.randomizedtesting.ThreadLeakControl$3.evaluate(ThreadLeakControl.java:460)
at com.carrotsearch.randomizedtesting.RandomizedRunner.runSingleTest(RandomizedRunner.java:880)
at com.carrotsearch.randomizedtesting.RandomizedRunner$5.evaluate(RandomizedRunner.java:781)
at com.carrotsearch.randomizedtesting.RandomizedRunner$6.evaluate(RandomizedRunner.java:816)
at com.carrotsearch.randomizedtesting.RandomizedRunner$7.evaluate(RandomizedRunner.java:827)
at com.carrotsearch.randomizedtesting.rules.StatementAdapter.evaluate(StatementAdapter.java:36)
at com.carrotsearch.randomizedtesting.rules.SystemPropertiesRestoreRule$1.evaluate(SystemPropertiesRestoreRule.java:57)
at org.apache.lucene.util.AbstractBeforeAfterRule$1.evaluate(AbstractBeforeAfterRule.java:45)
at com.carrotsearch.randomizedtesting.rules.StatementAdapter.evaluate(StatementAdapter.java:36)
at org.apache.lucene.util.TestRuleStoreClassName$1.evaluate(TestRuleStoreClassName.java:41)
at com.carrotsearch.randomizedtesting.rules.NoShadowingOrOverridesOnMethodsRule$1.evaluate(NoShadowingOrOverridesOnMethodsRule.java:40)
at com.carrotsearch.randomizedtesting.rules.NoShadowingOrOverridesOnMethodsRule$1.evaluate(NoShadowingOrOverridesOnMethodsRule.java:40)
at com.carrotsearch.randomizedtesting.rules.StatementAdapter.evaluate(StatementAdapter.java:36)
at com.carrotsearch.randomizedtesting.rules.StatementAdapter.evaluate(StatementAdapter.java:36)
at com.carrotsearch.randomizedtesting.rules.StatementAdapter.evaluate(StatementAdapter.java:36)
at org.apache.lucene.util.TestRuleAssertionsRequired$1.evaluate(TestRuleAssertionsRequired.java:53)
at org.apache.lucene.util.TestRuleMarkFailure$1.evaluate(TestRuleMarkFailure.java:47)
at org.apache.lucene.util.TestRuleIgnoreAfterMaxFailures$1.evaluate(TestRuleIgnoreAfterMaxFailures.java:64)
at org.apache.lucene.util.TestRuleIgnoreTestSuites$1.evaluate(TestRuleIgnoreTestSuites.java:54)
at com.carrotsearch.randomizedtesting.rules.StatementAdapter.evaluate(StatementAdapter.java:36)
at com.carrotsearch.randomizedtesting.ThreadLeakControl$StatementRunner.run(ThreadLeakControl.java:367)
at java.lang.Thread.run(Thread.java:745)
Build Log:
[...truncated 11003 lines...]
[junit4] Suite: org.apache.solr.handler.TestReplicationHandler
[junit4] 2> Creating dataDir: /x1/jenkins/jenkins-slave/workspace/Lucene-Solr-Tests-6.x/solr/build/solr-core/test/J0/temp/solr.handler.TestReplicationHandler_F2A73B26F91730E7-001/init-core-data-001
[junit4] 2> 521055 INFO (SUITE-TestReplicationHandler-seed#[F2A73B26F91730E7]-worker) [ ] o.a.s.SolrTestCaseJ4 Randomized ssl (false) and clientAuth (false) via: @org.apache.solr.SolrTestCaseJ4$SuppressSSL(bugUrl=None)
[junit4] 2> 521056 INFO (TEST-TestReplicationHandler.doTestReplicateAfterWrite2Slave-seed#[F2A73B26F91730E7]) [ ] o.a.s.SolrTestCaseJ4 ###Starting doTestReplicateAfterWrite2Slave
[junit4] 2> 521057 INFO (TEST-TestReplicationHandler.doTestReplicateAfterWrite2Slave-seed#[F2A73B26F91730E7]) [ ] o.a.s.SolrTestCaseJ4 Writing core.properties file to /x1/jenkins/jenkins-slave/workspace/Lucene-Solr-Tests-6.x/solr/build/solr-core/test/J0/temp/solr.handler.TestReplicationHandler_F2A73B26F91730E7-001/solr-instance-001/collection1
[junit4] 2> 521061 INFO (TEST-TestReplicationHandler.doTestReplicateAfterWrite2Slave-seed#[F2A73B26F91730E7]) [ ] o.e.j.s.Server jetty-9.3.8.v20160314
[junit4] 2> 521067 INFO (TEST-TestReplicationHandler.doTestReplicateAfterWrite2Slave-seed#[F2A73B26F91730E7]) [ ] o.e.j.s.h.ContextHandler Started o.e.j.s.ServletContextHandler@3ec607e8{/solr,null,AVAILABLE}
[junit4] 2> 521072 INFO (TEST-TestReplicationHandler.doTestReplicateAfterWrite2Slave-seed#[F2A73B26F91730E7]) [ ] o.e.j.s.ServerConnector Started ServerConnector@1c906064{HTTP/1.1,[http/1.1]}{127.0.0.1:35720}
[junit4] 2> 521072 INFO (TEST-TestReplicationHandler.doTestReplicateAfterWrite2Slave-seed#[F2A73B26F91730E7]) [ ] o.e.j.s.Server Started @524937ms
[junit4] 2> 521072 INFO (TEST-TestReplicationHandler.doTestReplicateAfterWrite2Slave-seed#[F2A73B26F91730E7]) [ ] o.a.s.c.s.e.JettySolrRunner Jetty properties: {solr.data.dir=/x1/jenkins/jenkins-slave/workspace/Lucene-Solr-Tests-6.x/solr/build/solr-core/test/J0/temp/solr.handler.TestReplicationHandler_F2A73B26F91730E7-001/solr-instance-001/collection1/data, hostContext=/solr, hostPort=35720}
[junit4] 2> 521072 INFO (TEST-TestReplicationHandler.doTestReplicateAfterWrite2Slave-seed#[F2A73B26F91730E7]) [ ] o.a.s.s.SolrDispatchFilter SolrDispatchFilter.init(): sun.misc.Launcher$AppClassLoader@73d16e93
[junit4] 2> 521072 INFO (TEST-TestReplicationHandler.doTestReplicateAfterWrite2Slave-seed#[F2A73B26F91730E7]) [ ] o.a.s.c.SolrResourceLoader new SolrResourceLoader for directory: '/x1/jenkins/jenkins-slave/workspace/Lucene-Solr-Tests-6.x/solr/build/solr-core/test/J0/temp/solr.handler.TestReplicationHandler_F2A73B26F91730E7-001/solr-instance-001'
[junit4] 2> 521072 INFO (TEST-TestReplicationHandler.doTestReplicateAfterWrite2Slave-seed#[F2A73B26F91730E7]) [ ] o.a.s.c.SolrResourceLoader JNDI not configured for solr (NoInitialContextEx)
[junit4] 2> 521072 INFO (TEST-TestReplicationHandler.doTestReplicateAfterWrite2Slave-seed#[F2A73B26F91730E7]) [ ] o.a.s.c.SolrResourceLoader solr home defaulted to 'solr/' (could not find system property or JNDI)
[junit4] 2> 521072 INFO (TEST-TestReplicationHandler.doTestReplicateAfterWrite2Slave-seed#[F2A73B26F91730E7]) [ ] o.a.s.c.SolrXmlConfig Loading container configuration from /x1/jenkins/jenkins-slave/workspace/Lucene-Solr-Tests-6.x/solr/build/solr-core/test/J0/temp/solr.handler.TestReplicationHandler_F2A73B26F91730E7-001/solr-instance-001/solr.xml
[junit4] 2> 521076 INFO (TEST-TestReplicationHandler.doTestReplicateAfterWrite2Slave-seed#[F2A73B26F91730E7]) [ ] o.a.s.c.CorePropertiesLocator Config-defined core root directory: /x1/jenkins/jenkins-slave/workspace/Lucene-Solr-Tests-6.x/solr/build/solr-core/test/J0/temp/solr.handler.TestReplicationHandler_F2A73B26F91730E7-001/solr-instance-001/.
[junit4] 2> 521076 INFO (TEST-TestReplicationHandler.doTestReplicateAfterWrite2Slave-seed#[F2A73B26F91730E7]) [ ] o.a.s.c.CoreContainer New CoreContainer 620364127
[junit4] 2> 521076 INFO (TEST-TestReplicationHandler.doTestReplicateAfterWrite2Slave-seed#[F2A73B26F91730E7]) [ ] o.a.s.c.CoreContainer Loading cores into CoreContainer [instanceDir=/x1/jenkins/jenkins-slave/workspace/Lucene-Solr-Tests-6.x/solr/build/solr-core/test/J0/temp/solr.handler.TestReplicationHandler_F2A73B26F91730E7-001/solr-instance-001]
[junit4] 2> 521076 WARN (TEST-TestReplicationHandler.doTestReplicateAfterWrite2Slave-seed#[F2A73B26F91730E7]) [ ] o.a.s.c.CoreContainer Couldn't add files from /x1/jenkins/jenkins-slave/workspace/Lucene-Solr-Tests-6.x/solr/build/solr-core/test/J0/temp/solr.handler.TestReplicationHandler_F2A73B26F91730E7-001/solr-instance-001/lib to classpath: /x1/jenkins/jenkins-slave/workspace/Lucene-Solr-Tests-6.x/solr/build/solr-core/test/J0/temp/solr.handler.TestReplicationHandler_F2A73B26F91730E7-001/solr-instance-001/lib
[junit4] 2> 521076 INFO (TEST-TestReplicationHandler.doTestReplicateAfterWrite2Slave-seed#[F2A73B26F91730E7]) [ ] o.a.s.h.c.HttpShardHandlerFactory created with socketTimeout : 90000,urlScheme : ,connTimeout : 15000,maxConnectionsPerHost : 20,maxConnections : 10000,corePoolSize : 0,maximumPoolSize : 2147483647,maxThreadIdleTime : 5,sizeOfQueue : -1,fairnessPolicy : false,useRetries : false,
[junit4] 2> 521077 INFO (TEST-TestReplicationHandler.doTestReplicateAfterWrite2Slave-seed#[F2A73B26F91730E7]) [ ] o.a.s.u.UpdateShardHandler Creating UpdateShardHandler HTTP client with params: socketTimeout=340000&connTimeout=45000&retry=true
[junit4] 2> 521077 INFO (TEST-TestReplicationHandler.doTestReplicateAfterWrite2Slave-seed#[F2A73B26F91730E7]) [ ] o.a.s.l.LogWatcher SLF4J impl is org.slf4j.impl.Log4jLoggerFactory
[junit4] 2> 521078 INFO (TEST-TestReplicationHandler.doTestReplicateAfterWrite2Slave-seed#[F2A73B26F91730E7]) [ ] o.a.s.l.LogWatcher Registering Log Listener [Log4j (org.slf4j.impl.Log4jLoggerFactory)]
[junit4] 2> 521078 INFO (TEST-TestReplicationHandler.doTestReplicateAfterWrite2Slave-seed#[F2A73B26F91730E7]) [ ] o.a.s.c.CoreContainer Security conf doesn't exist. Skipping setup for authorization module.
[junit4] 2> 521078 INFO (TEST-TestReplicationHandler.doTestReplicateAfterWrite2Slave-seed#[F2A73B26F91730E7]) [ ] o.a.s.c.CoreContainer No authentication plugin used.
[junit4] 2> 521078 INFO (TEST-TestReplicationHandler.doTestReplicateAfterWrite2Slave-seed#[F2A73B26F91730E7]) [ ] o.a.s.c.CorePropertiesLocator Looking for core definitions underneath /x1/jenkins/jenkins-slave/workspace/Lucene-Solr-Tests-6.x/solr/build/solr-core/test/J0/temp/solr.handler.TestReplicationHandler_F2A73B26F91730E7-001/solr-instance-001/.
[junit4] 2> 521079 INFO (TEST-TestReplicationHandler.doTestReplicateAfterWrite2Slave-seed#[F2A73B26F91730E7]) [ ] o.a.s.c.CoreDescriptor Created CoreDescriptor: {name=collection1, config=solrconfig.xml, loadOnStartup=true, schema=schema.xml, configSetProperties=configsetprops.json, transient=false, dataDir=data/}
[junit4] 2> 521079 INFO (TEST-TestReplicationHandler.doTestReplicateAfterWrite2Slave-seed#[F2A73B26F91730E7]) [ ] o.a.s.c.CorePropertiesLocator Found core collection1 in /x1/jenkins/jenkins-slave/workspace/Lucene-Solr-Tests-6.x/solr/build/solr-core/test/J0/temp/solr.handler.TestReplicationHandler_F2A73B26F91730E7-001/solr-instance-001/./collection1
[junit4] 2> 521079 INFO (TEST-TestReplicationHandler.doTestReplicateAfterWrite2Slave-seed#[F2A73B26F91730E7]) [ ] o.a.s.c.CorePropertiesLocator Found 1 core definitions
[junit4] 2> 521079 INFO (coreLoadExecutor-1407-thread-1) [ ] o.a.s.c.SolrResourceLoader new SolrResourceLoader for directory: '/x1/jenkins/jenkins-slave/workspace/Lucene-Solr-Tests-6.x/solr/build/solr-core/test/J0/temp/solr.handler.TestReplicationHandler_F2A73B26F91730E7-001/solr-instance-001/collection1'
[junit4] 2> 521079 INFO (TEST-TestReplicationHandler.doTestReplicateAfterWrite2Slave-seed#[F2A73B26F91730E7]) [ ] o.a.s.s.SolrDispatchFilter user.dir=/x1/jenkins/jenkins-slave/workspace/Lucene-Solr-Tests-6.x/solr/build/solr-core/test/J0
[junit4] 2> 521079 INFO (TEST-TestReplicationHandler.doTestReplicateAfterWrite2Slave-seed#[F2A73B26F91730E7]) [ ] o.a.s.s.SolrDispatchFilter SolrDispatchFilter.init() done
[junit4] 2> 521079 INFO (coreLoadExecutor-1407-thread-1) [ ] o.a.s.c.SolrResourceLoader JNDI not configured for solr (NoInitialContextEx)
[junit4] 2> 521079 INFO (coreLoadExecutor-1407-thread-1) [ ] o.a.s.c.SolrResourceLoader solr home defaulted to 'solr/' (could not find system property or JNDI)
[junit4] 2> 521084 INFO (coreLoadExecutor-1407-thread-1) [ ] o.a.s.c.SolrConfig current version of requestparams : -1
[junit4] 2> 521086 INFO (coreLoadExecutor-1407-thread-1) [ ] o.a.s.c.SolrConfig Using Lucene MatchVersion: 6.2.0
[junit4] 2> 521090 INFO (coreLoadExecutor-1407-thread-1) [ ] o.a.s.c.SolrConfig Loaded SolrConfig: solrconfig.xml
[junit4] 2> 521092 INFO (coreLoadExecutor-1407-thread-1) [ ] o.a.s.s.IndexSchema [collection1] Schema name=test
[junit4] 2> 521094 INFO (coreLoadExecutor-1407-thread-1) [ ] o.a.s.s.IndexSchema unique key field: id
[junit4] 2> 521095 INFO (coreLoadExecutor-1407-thread-1) [ ] o.a.s.c.ConfigSetProperties Did not find ConfigSet properties, assuming default properties: Can't find resource 'configsetprops.json' in classpath or '/x1/jenkins/jenkins-slave/workspace/Lucene-Solr-Tests-6.x/solr/build/solr-core/test/J0/temp/solr.handler.TestReplicationHandler_F2A73B26F91730E7-001/solr-instance-001/collection1'
[junit4] 2> 521095 INFO (coreLoadExecutor-1407-thread-1) [ ] o.a.s.c.CoreContainer Creating SolrCore 'collection1' using configuration from instancedir /x1/jenkins/jenkins-slave/workspace/Lucene-Solr-Tests-6.x/solr/build/solr-core/test/J0/temp/solr.handler.TestReplicationHandler_F2A73B26F91730E7-001/solr-instance-001/./collection1
[junit4] 2> 521095 INFO (coreLoadExecutor-1407-thread-1) [ x:collection1] o.a.s.c.SolrCore org.apache.solr.core.MockDirectoryFactory
[junit4] 2> 521095 INFO (coreLoadExecutor-1407-thread-1) [ x:collection1] o.a.s.c.SolrCore [[collection1] ] Opening new SolrCore at [/x1/jenkins/jenkins-slave/workspace/Lucene-Solr-Tests-6.x/solr/build/solr-core/test/J0/temp/solr.handler.TestReplicationHandler_F2A73B26F91730E7-001/solr-instance-001/collection1], dataDir=[/x1/jenkins/jenkins-slave/workspace/Lucene-Solr-Tests-6.x/solr/build/solr-core/test/J0/temp/solr.handler.TestReplicationHandler_F2A73B26F91730E7-001/solr-instance-001/./collection1/data/]
[junit4] 2> 521095 INFO (coreLoadExecutor-1407-thread-1) [ x:collection1] o.a.s.c.SolrCore JMX monitoring not detected for core: collection1
[junit4] 2> 521095 INFO (coreLoadExecutor-1407-thread-1) [ x:collection1] o.a.s.c.CachingDirectoryFactory return new directory for /x1/jenkins/jenkins-slave/workspace/Lucene-Solr-Tests-6.x/solr/build/solr-core/test/J0/temp/solr.handler.TestReplicationHandler_F2A73B26F91730E7-001/solr-instance-001/./collection1/data
[junit4] 2> 521095 INFO (coreLoadExecutor-1407-thread-1) [ x:collection1] o.a.s.c.SolrCore New index directory detected: old=null new=/x1/jenkins/jenkins-slave/workspace/Lucene-Solr-Tests-6.x/solr/build/solr-core/test/J0/temp/solr.handler.TestReplicationHandler_F2A73B26F91730E7-001/solr-instance-001/./collection1/data/index/
[junit4] 2> 521096 WARN (coreLoadExecutor-1407-thread-1) [ x:collection1] o.a.s.c.SolrCore [collection1] Solr index directory '/x1/jenkins/jenkins-slave/workspace/Lucene-Solr-Tests-6.x/solr/build/solr-core/test/J0/temp/solr.handler.TestReplicationHandler_F2A73B26F91730E7-001/solr-instance-001/./collection1/data/index' doesn't exist. Creating new index...
[junit4] 2> 521096 INFO (coreLoadExecutor-1407-thread-1) [ x:collection1] o.a.s.c.CachingDirectoryFactory return new directory for /x1/jenkins/jenkins-slave/workspace/Lucene-Solr-Tests-6.x/solr/build/solr-core/test/J0/temp/solr.handler.TestReplicationHandler_F2A73B26F91730E7-001/solr-instance-001/./collection1/data/index
[junit4] 2> 521096 INFO (coreLoadExecutor-1407-thread-1) [ x:collection1] o.a.s.u.RandomMergePolicy RandomMergePolicy wrapping class org.apache.lucene.index.MockRandomMergePolicy: org.apache.lucene.index.MockRandomMergePolicy@6609c040
[junit4] 2> 521096 INFO (coreLoadExecutor-1407-thread-1) [ x:collection1] o.a.s.c.SolrDeletionPolicy SolrDeletionPolicy.onCommit: commits: num=1
[junit4] 2> commit{dir=MockDirectoryWrapper(RAMDirectory@76d6900e lockFactory=org.apache.lucene.store.SingleInstanceLockFactory@58f73e58),segFN=segments_1,generation=1}
[junit4] 2> 521096 INFO (coreLoadExecutor-1407-thread-1) [ x:collection1] o.a.s.c.SolrDeletionPolicy newest commit generation = 1
[junit4] 2> 521096 INFO (OldIndexDirectoryCleanupThreadForCore-collection1) [ x:collection1] o.a.s.c.SolrCore Looking for old index directories to cleanup for core collection1 in /x1/jenkins/jenkins-slave/workspace/Lucene-Solr-Tests-6.x/solr/build/solr-core/test/J0/temp/solr.handler.TestReplicationHandler_F2A73B26F91730E7-001/solr-instance-001/./collection1/data/
[junit4] 2> 521097 INFO (coreLoadExecutor-1407-thread-1) [ x:collection1] o.a.s.c.SolrCore no updateRequestProcessorChain defined as default, creating implicit default
[junit4] 2> 521098 INFO (coreLoadExecutor-1407-thread-1) [ x:collection1] o.a.s.h.l.XMLLoader xsltCacheLifetimeSeconds=60
[junit4] 2> 521099 INFO (coreLoadExecutor-1407-thread-1) [ x:collection1] o.a.s.h.l.XMLLoader xsltCacheLifetimeSeconds=60
[junit4] 2> 521099 INFO (coreLoadExecutor-1407-thread-1) [ x:collection1] o.a.s.h.l.XMLLoader xsltCacheLifetimeSeconds=60
[junit4] 2> 521100 INFO (coreLoadExecutor-1407-thread-1) [ x:collection1] o.a.s.h.l.XMLLoader xsltCacheLifetimeSeconds=60
[junit4] 2> 521100 INFO (coreLoadExecutor-1407-thread-1) [ x:collection1] o.a.s.c.PluginBag requestHandler : 'lazy' created with startup=lazy
[junit4] 2> 521101 INFO (coreLoadExecutor-1407-thread-1) [ x:collection1] o.a.s.c.RequestHandlers Registered paths: /admin/mbeans,standard,lazy,/update/json/docs,/admin/luke,/export,/get,/admin/properties,/update/json,/admin/threads,/update/csv,/sql,/graph,/admin/segments,/admin/system,/replication,defaults,/config,/stream,/schema,/admin/plugins,/admin/logging,/admin/ping,/update,/admin/file
[junit4] 2> 521101 INFO (coreLoadExecutor-1407-thread-1) [ x:collection1] o.a.s.c.SolrCore Using default statsCache cache: org.apache.solr.search.stats.LocalStatsCache
[junit4] 2> 521101 INFO (coreLoadExecutor-1407-thread-1) [ x:collection1] o.a.s.u.CommitTracker Hard AutoCommit: disabled
[junit4] 2> 521101 INFO (coreLoadExecutor-1407-thread-1) [ x:collection1] o.a.s.u.CommitTracker Soft AutoCommit: disabled
[junit4] 2> 521101 INFO (coreLoadExecutor-1407-thread-1) [ x:collection1] o.a.s.u.RandomMergePolicy RandomMergePolicy wrapping class org.apache.lucene.index.AlcoholicMergePolicy: [AlcoholicMergePolicy: minMergeSize=0, mergeFactor=10, maxMergeSize=994943229, maxMergeSizeForForcedMerge=9223372036854775807, calibrateSizeByDeletes=true, maxMergeDocs=2147483647, maxCFSSegmentSizeMB=8.796093022207999E12, noCFSRatio=0.1]
[junit4] 2> 521102 INFO (coreLoadExecutor-1407-thread-1) [ x:collection1] o.a.s.c.SolrDeletionPolicy SolrDeletionPolicy.onInit: commits: num=1
[junit4] 2> commit{dir=MockDirectoryWrapper(RAMDirectory@76d6900e lockFactory=org.apache.lucene.store.SingleInstanceLockFactory@58f73e58),segFN=segments_1,generation=1}
[junit4] 2> 521102 INFO (coreLoadExecutor-1407-thread-1) [ x:collection1] o.a.s.c.SolrDeletionPolicy newest commit generation = 1
[junit4] 2> 521102 INFO (coreLoadExecutor-1407-thread-1) [ x:collection1] o.a.s.s.SolrIndexSearcher Opening [Searcher@6fd3cad2[collection1] main]
[junit4] 2> 521102 INFO (coreLoadExecutor-1407-thread-1) [ x:collection1] o.a.s.r.ManagedResourceStorage File-based storage initialized to use dir: /x1/jenkins/jenkins-slave/workspace/Lucene-Solr-Tests-6.x/solr/build/solr-core/test/J0/temp/solr.handler.TestReplicationHandler_F2A73B26F91730E7-001/solr-instance-001/collection1/conf
[junit4] 2> 521102 INFO (coreLoadExecutor-1407-thread-1) [ x:collection1] o.a.s.r.RestManager Initializing RestManager with initArgs: {storageDir=/x1/jenkins/jenkins-slave/workspace/Lucene-Solr-Tests-6.x/solr/build/solr-core/test/J0/temp/solr.handler.TestReplicationHandler_F2A73B26F91730E7-001/solr-instance-001/collection1/conf}
[junit4] 2> 521102 INFO (coreLoadExecutor-1407-thread-1) [ x:collection1] o.a.s.r.ManagedResourceStorage Reading _rest_managed.json using file:dir=/x1/jenkins/jenkins-slave/workspace/Lucene-Solr-Tests-6.x/solr/build/solr-core/test/J0/temp/solr.handler.TestReplicationHandler_F2A73B26F91730E7-001/solr-instance-001/collection1/conf
[junit4] 2> 521102 INFO (coreLoadExecutor-1407-thread-1) [ x:collection1] o.a.s.r.RestManager Initializing 0 registered ManagedResources
[junit4] 2> 521102 INFO (coreLoadExecutor-1407-thread-1) [ x:collection1] o.a.s.h.ReplicationHandler Replication enabled for following config files: schema.xml,xslt/dummy.xsl
[junit4] 2> 521102 INFO (coreLoadExecutor-1407-thread-1) [ x:collection1] o.a.s.h.ReplicationHandler Commits will be reserved for 10000
[junit4] 2> 521102 INFO (searcherExecutor-1408-thread-1-processing-x:collection1) [ x:collection1] o.a.s.c.SolrCore [collection1] Registered new searcher Searcher@6fd3cad2[collection1] main{ExitableDirectoryReader(UninvertingDirectoryReader())}
[junit4] 2> 521102 INFO (coreLoadExecutor-1407-thread-1) [ x:collection1] o.a.s.c.CoreContainer registering core: collection1
[junit4] 2> 521581 INFO (TEST-TestReplicationHandler.doTestReplicateAfterWrite2Slave-seed#[F2A73B26F91730E7]) [ ] o.a.s.SolrTestCaseJ4 Writing core.properties file to /x1/jenkins/jenkins-slave/workspace/Lucene-Solr-Tests-6.x/solr/build/solr-core/test/J0/temp/solr.handler.TestReplicationHandler_F2A73B26F91730E7-001/solr-instance-002/collection1
[junit4] 2> 521583 INFO (TEST-TestReplicationHandler.doTestReplicateAfterWrite2Slave-seed#[F2A73B26F91730E7]) [ ] o.e.j.s.Server jetty-9.3.8.v20160314
[junit4] 2> 521584 INFO (TEST-TestReplicationHandler.doTestReplicateAfterWrite2Slave-seed#[F2A73B26F91730E7]) [ ] o.e.j.s.h.ContextHandler Started o.e.j.s.ServletContextHandler@1c7a2f29{/solr,null,AVAILABLE}
[junit4] 2> 521584 INFO (TEST-TestReplicationHandler.doTestReplicateAfterWrite2Slave-seed#[F2A73B26F91730E7]) [ ] o.e.j.s.ServerConnector Started ServerConnector@44f2b5e4{HTTP/1.1,[http/1.1]}{127.0.0.1:41795}
[junit4] 2> 521584 INFO (TEST-TestReplicationHandler.doTestReplicateAfterWrite2Slave-seed#[F2A73B26F91730E7]) [ ] o.e.j.s.Server Started @525450ms
[junit4] 2> 521585 INFO (TEST-TestReplicationHandler.doTestReplicateAfterWrite2Slave-seed#[F2A73B26F91730E7]) [ ] o.a.s.c.s.e.JettySolrRunner Jetty properties: {solr.data.dir=/x1/jenkins/jenkins-slave/workspace/Lucene-Solr-Tests-6.x/solr/build/solr-core/test/J0/temp/solr.handler.TestReplicationHandler_F2A73B26F91730E7-001/solr-instance-002/collection1/data, hostContext=/solr, hostPort=41795}
[junit4] 2> 521585 INFO (TEST-TestReplicationHandler.doTestReplicateAfterWrite2Slave-seed#[F2A73B26F91730E7]) [ ] o.a.s.s.SolrDispatchFilter SolrDispatchFilter.init(): sun.misc.Launcher$AppClassLoader@73d16e93
[junit4] 2> 521585 INFO (TEST-TestReplicationHandler.doTestReplicateAfterWrite2Slave-seed#[F2A73B26F91730E7]) [ ] o.a.s.c.SolrResourceLoader new SolrResourceLoader for directory: '/x1/jenkins/jenkins-slave/workspace/Lucene-Solr-Tests-6.x/solr/build/solr-core/test/J0/temp/solr.handler.TestReplicationHandler_F2A73B26F91730E7-001/solr-instance-002'
[junit4] 2> 521585 INFO (TEST-TestReplicationHandler.doTestReplicateAfterWrite2Slave-seed#[F2A73B26F91730E7]) [ ] o.a.s.c.SolrResourceLoader JNDI not configured for solr (NoInitialContextEx)
[junit4] 2> 521585 INFO (TEST-TestReplicationHandler.doTestReplicateAfterWrite2Slave-seed#[F2A73B26F91730E7]) [ ] o.a.s.c.SolrResourceLoader solr home defaulted to 'solr/' (could not find system property or JNDI)
[junit4] 2> 521585 INFO (TEST-TestReplicationHandler.doTestReplicateAfterWrite2Slave-seed#[F2A73B26F91730E7]) [ ] o.a.s.c.SolrXmlConfig Loading container configuration from /x1/jenkins/jenkins-slave/workspace/Lucene-Solr-Tests-6.x/solr/build/solr-core/test/J0/temp/solr.handler.TestReplicationHandler_F2A73B26F91730E7-001/solr-instance-002/solr.xml
[junit4] 2> 521592 INFO (TEST-TestReplicationHandler.doTestReplicateAfterWrite2Slave-seed#[F2A73B26F91730E7]) [ ] o.a.s.c.CorePropertiesLocator Config-defined core root directory: /x1/jenkins/jenkins-slave/workspace/Lucene-Solr-Tests-6.x/solr/build/solr-core/test/J0/temp/solr.handler.TestReplicationHandler_F2A73B26F91730E7-001/solr-instance-002/.
[junit4] 2> 521592 INFO (TEST-TestReplicationHandler.doTestReplicateAfterWrite2Slave-seed#[F2A73B26F91730E7]) [ ] o.a.s.c.CoreContainer New CoreContainer 26039071
[junit4] 2> 521592 INFO (TEST-TestReplicationHandler.doTestReplicateAfterWrite2Slave-seed#[F2A73B26F91730E7]) [ ] o.a.s.c.CoreContainer Loading cores into CoreContainer [instanceDir=/x1/jenkins/jenkins-slave/workspace/Lucene-Solr-Tests-6.x/solr/build/solr-core/test/J0/temp/solr.handler.TestReplicationHandler_F2A73B26F91730E7-001/solr-instance-002]
[junit4] 2> 521592 WARN (TEST-TestReplicationHandler.doTestReplicateAfterWrite2Slave-seed#[F2A73B26F91730E7]) [ ] o.a.s.c.CoreContainer Couldn't add files from /x1/jenkins/jenkins-slave/workspace/Lucene-Solr-Tests-6.x/solr/build/solr-core/test/J0/temp/solr.handler.TestReplicationHandler_F2A73B26F91730E7-001/solr-instance-002/lib to classpath: /x1/jenkins/jenkins-slave/workspace/Lucene-Solr-Tests-6.x/solr/build/solr-core/test/J0/temp/solr.handler.TestReplicationHandler_F2A73B26F91730E7-001/solr-instance-002/lib
[junit4] 2> 521593 INFO (TEST-TestReplicationHandler.doTestReplicateAfterWrite2Slave-seed#[F2A73B26F91730E7]) [ ] o.a.s.h.c.HttpShardHandlerFactory created with socketTimeout : 90000,urlScheme : ,connTimeout : 15000,maxConnectionsPerHost : 20,maxConnections : 10000,corePoolSize : 0,maximumPoolSize : 2147483647,maxThreadIdleTime : 5,sizeOfQueue : -1,fairnessPolicy : false,useRetries : false,
[junit4] 2> 521593 INFO (TEST-TestReplicationHandler.doTestReplicateAfterWrite2Slave-seed#[F2A73B26F91730E7]) [ ] o.a.s.u.UpdateShardHandler Creating UpdateShardHandler HTTP client with params: socketTimeout=340000&connTimeout=45000&retry=true
[junit4] 2> 521594 INFO (TEST-TestReplicationHandler.doTestReplicateAfterWrite2Slave-seed#[F2A73B26F91730E7]) [ ] o.a.s.l.LogWatcher SLF4J impl is org.slf4j.impl.Log4jLoggerFactory
[junit4] 2> 521594 INFO (TEST-TestReplicationHandler.doTestReplicateAfterWrite2Slave-seed#[F2A73B26F91730E7]) [ ] o.a.s.l.LogWatcher Registering Log Listener [Log4j (org.slf4j.impl.Log4jLoggerFactory)]
[junit4] 2> 521594 INFO (TEST-TestReplicationHandler.doTestReplicateAfterWrite2Slave-seed#[F2A73B26F91730E7]) [ ] o.a.s.c.CoreContainer Security conf doesn't exist. Skipping setup for authorization module.
[junit4] 2> 521594 INFO (TEST-TestReplicationHandler.doTestReplicateAfterWrite2Slave-seed#[F2A73B26F91730E7]) [ ] o.a.s.c.CoreContainer No authentication plugin used.
[junit4] 2> 521594 INFO (TEST-TestReplicationHandler.doTestReplicateAfterWrite2Slave-seed#[F2A73B26F91730E7]) [ ] o.a.s.c.CorePropertiesLocator Looking for core definitions underneath /x1/jenkins/jenkins-slave/workspace/Lucene-Solr-Tests-6.x/solr/build/solr-core/test/J0/temp/solr.handler.TestReplicationHandler_F2A73B26F91730E7-001/solr-instance-002/.
[junit4] 2> 521595 INFO (TEST-TestReplicationHandler.doTestReplicateAfterWrite2Slave-seed#[F2A73B26F91730E7]) [ ] o.a.s.c.CoreDescriptor Created CoreDescriptor: {name=collection1, config=solrconfig.xml, loadOnStartup=true, schema=schema.xml, configSetProperties=configsetprops.json, transient=false, dataDir=data/}
[junit4] 2> 521595 INFO (TEST-TestReplicationHandler.doTestReplicateAfterWrite2Slave-seed#[F2A73B26F91730E7]) [ ] o.a.s.c.CorePropertiesLocator Found core collection1 in /x1/jenkins/jenkins-slave/workspace/Lucene-Solr-Tests-6.x/solr/build/solr-core/test/J0/temp/solr.handler.TestReplicationHandler_F2A73B26F91730E7-001/solr-instance-002/./collection1
[junit4] 2> 521595 INFO (TEST-TestReplicationHandler.doTestReplicateAfterWrite2Slave-seed#[F2A73B26F91730E7]) [ ] o.a.s.c.CorePropertiesLocator Found 1 core definitions
[junit4] 2> 521595 INFO (coreLoadExecutor-1417-thread-1) [ ] o.a.s.c.SolrResourceLoader new SolrResourceLoader for directory: '/x1/jenkins/jenkins-slave/workspace/Lucene-Solr-Tests-6.x/solr/build/solr-core/test/J0/temp/solr.handler.TestReplicationHandler_F2A73B26F91730E7-001/solr-instance-002/collection1'
[junit4] 2> 521595 INFO (TEST-TestReplicationHandler.doTestReplicateAfterWrite2Slave-seed#[F2A73B26F91730E7]) [ ] o.a.s.s.SolrDispatchFilter user.dir=/x1/jenkins/jenkins-slave/workspace/Lucene-Solr-Tests-6.x/solr/build/solr-core/test/J0
[junit4] 2> 521595 INFO (TEST-TestReplicationHandler.doTestReplicateAfterWrite2Slave-seed#[F2A73B26F91730E7]) [ ] o.a.s.s.SolrDispatchFilter SolrDispatchFilter.init() done
[junit4] 2> 521595 INFO (coreLoadExecutor-1417-thread-1) [ ] o.a.s.c.SolrResourceLoader JNDI not configured for solr (NoInitialContextEx)
[junit4] 2> 521595 INFO (coreLoadExecutor-1417-thread-1) [ ] o.a.s.c.SolrResourceLoader solr home defaulted to 'solr/' (could not find system property or JNDI)
[junit4] 2> 521600 INFO (coreLoadExecutor-1417-thread-1) [ ] o.a.s.c.SolrConfig current version of requestparams : -1
[junit4] 2> 521602 INFO (coreLoadExecutor-1417-thread-1) [ ] o.a.s.c.SolrConfig Using Lucene MatchVersion: 6.2.0
[junit4] 2> 521606 INFO (coreLoadExecutor-1417-thread-1) [ ] o.a.s.c.SolrConfig Loaded SolrConfig: solrconfig.xml
[junit4] 2> 521608 INFO (coreLoadExecutor-1417-thread-1) [ ] o.a.s.s.IndexSchema [collection1] Schema name=test
[junit4] 2> 521610 INFO (coreLoadExecutor-1417-thread-1) [ ] o.a.s.s.IndexSchema unique key field: id
[junit4] 2> 521610 INFO (coreLoadExecutor-1417-thread-1) [ ] o.a.s.c.ConfigSetProperties Did not find ConfigSet properties, assuming default properties: Can't find resource 'configsetprops.json' in classpath or '/x1/jenkins/jenkins-slave/workspace/Lucene-Solr-Tests-6.x/solr/build/solr-core/test/J0/temp/solr.handler.TestReplicationHandler_F2A73B26F91730E7-001/solr-instance-002/collection1'
[junit4] 2> 521610 INFO (coreLoadExecutor-1417-thread-1) [ ] o.a.s.c.CoreContainer Creating SolrCore 'collection1' using configuration from instancedir /x1/jenkins/jenkins-slave/workspace/Lucene-Solr-Tests-6.x/solr/build/solr-core/test/J0/temp/solr.handler.TestReplicationHandler_F2A73B26F91730E7-001/solr-instance-002/./collection1
[junit4] 2> 521611 INFO (coreLoadExecutor-1417-thread-1) [ x:collection1] o.a.s.c.SolrCore org.apache.solr.core.MockDirectoryFactory
[junit4] 2> 521611 INFO (coreLoadExecutor-1417-thread-1) [ x:collection1] o.a.s.c.SolrCore [[collection1] ] Opening new SolrCore at [/x1/jenkins/jenkins-slave/workspace/Lucene-Solr-Tests-6.x/solr/build/solr-core/test/J0/temp/solr.handler.TestReplicationHandler_F2A73B26F91730E7-001/solr-instance-002/collection1], dataDir=[/x1/jenkins/jenkins-slave/workspace/Lucene-Solr-Tests-6.x/solr/build/solr-core/test/J0/temp/solr.handler.TestReplicationHandler_F2A73B26F91730E7-001/solr-instance-002/./collection1/data/]
[junit4] 2> 521611 INFO (coreLoadExecutor-1417-thread-1) [ x:collection1] o.a.s.c.SolrCore JMX monitoring not detected for core: collection1
[junit4] 2> 521611 INFO (coreLoadExecutor-1417-thread-1) [ x:collection1] o.a.s.c.CachingDirectoryFactory return new directory for /x1/jenkins/jenkins-slave/workspace/Lucene-Solr-Tests-6.x/solr/build/solr-core/test/J0/temp/solr.handler.TestReplicationHandler_F2A73B26F91730E7-001/solr-instance-002/./collection1/data
[junit4] 2> 521611 INFO (coreLoadExecutor-1417-thread-1) [ x:collection1] o.a.s.c.SolrCore New index directory detected: old=null new=/x1/jenkins/jenkins-slave/workspace/Lucene-Solr-Tests-6.x/solr/build/solr-core/test/J0/temp/solr.handler.TestReplicationHandler_F2A73B26F91730E7-001/solr-instance-002/./collection1/data/index/
[junit4] 2> 521611 WARN (coreLoadExecutor-1417-thread-1) [ x:collection1] o.a.s.c.SolrCore [collection1] Solr index directory '/x1/jenkins/jenkins-slave/workspace/Lucene-Solr-Tests-6.x/solr/build/solr-core/test/J0/temp/solr.handler.TestReplicationHandler_F2A73B26F91730E7-001/solr-instance-002/./collection1/data/index' doesn't exist. Creating new index...
[junit4] 2> 521611 INFO (coreLoadExecutor-1417-thread-1) [ x:collection1] o.a.s.c.CachingDirectoryFactory return new directory for /x1/jenkins/jenkins-slave/workspace/Lucene-Solr-Tests-6.x/solr/build/solr-core/test/J0/temp/solr.handler.TestReplicationHandler_F2A73B26F91730E7-001/solr-instance-002/./collection1/data/index
[junit4] 2> 521611 INFO (coreLoadExecutor-1417-thread-1) [ x:collection1] o.a.s.u.RandomMergePolicy RandomMergePolicy wrapping class org.apache.lucene.index.MockRandomMergePolicy: org.apache.lucene.index.MockRandomMergePolicy@33d1b3dc
[junit4] 2> 521612 INFO (coreLoadExecutor-1417-thread-1) [ x:collection1] o.a.s.c.SolrDeletionPolicy SolrDeletionPolicy.onCommit: commits: num=1
[junit4] 2> commit{dir=MockDirectoryWrapper(RAMDirectory@76a607e3 lockFactory=org.apache.lucene.store.SingleInstanceLockFactory@4e313836),segFN=segments_1,generation=1}
[junit4] 2> 521612 INFO (coreLoadExecutor-1417-thread-1) [ x:collection1] o.a.s.c.SolrDeletionPolicy newest commit generation = 1
[junit4] 2> 521612 INFO (OldIndexDirectoryCleanupThreadForCore-collection1) [ x:collection1] o.a.s.c.SolrCore Looking for old index directories to cleanup for core collection1 in /x1/jenkins/jenkins-slave/workspace/Lucene-Solr-Tests-6.x/solr/build/solr-core/test/J0/temp/solr.handler.TestReplicationHandler_F2A73B26F91730E7-001/solr-instance-002/./collection1/data/
[junit4] 2> 521613 INFO (coreLoadExecutor-1417-thread-1) [ x:collection1] o.a.s.c.SolrCore no updateRequestProcessorChain defined as default, creating implicit default
[junit4] 2> 521614 INFO (coreLoadExecutor-1417-thread-1) [ x:collection1] o.a.s.h.l.XMLLoader xsltCacheLifetimeSeconds=60
[junit4] 2> 521614 INFO (coreLoadExecutor-1417-thread-1) [ x:collection1] o.a.s.h.l.XMLLoader xsltCacheLifetimeSeconds=60
[junit4] 2> 521615 INFO (coreLoadExecutor-1417-thread-1) [ x:collection1] o.a.s.h.l.XMLLoader xsltCacheLifetimeSeconds=60
[junit4] 2> 521615 INFO (coreLoadExecutor-1417-thread-1) [ x:collection1] o.a.s.h.l.XMLLoader xsltCacheLifetimeSeconds=60
[junit4] 2> 521616 INFO (coreLoadExecutor-1417-thread-1) [ x:collection1] o.a.s.c.PluginBag requestHandler : 'lazy' created with startup=lazy
[junit4] 2> 521616 INFO (coreLoadExecutor-1417-thread-1) [ x:collection1] o.a.s.c.RequestHandlers Registered paths: /admin/mbeans,standard,lazy,/update/json/docs,/admin/luke,/export,/get,/admin/properties,/update/json,/admin/threads,/update/csv,/sql,/graph,/admin/segments,/admin/system,/replication,defaults,/config,/stream,/schema,/admin/plugins,/admin/logging,/admin/ping,/update,/admin/file
[junit4] 2> 521616 INFO (coreLoadExecutor-1417-thread-1) [ x:collection1] o.a.s.c.SolrCore Using default statsCache cache: org.apache.solr.search.stats.LocalStatsCache
[junit4] 2> 521616 INFO (coreLoadExecutor-1417-thread-1) [ x:collection1] o.a.s.u.CommitTracker Hard AutoCommit: disabled
[junit4] 2> 521616 INFO (coreLoadExecutor-1417-thread-1) [ x:collection1] o.a.s.u.CommitTracker Soft AutoCommit: disabled
[junit4] 2> 521616 INFO (coreLoadExecutor-1417-thread-1) [ x:collection1] o.a.s.u.RandomMergePolicy RandomMergePolicy wrapping class org.apache.lucene.index.AlcoholicMergePolicy: [AlcoholicMergePolicy: minMergeSize=0, mergeFactor=10, maxMergeSize=994943229, maxMergeSizeForForcedMerge=9223372036854775807, calibrateSizeByDeletes=true, maxMergeDocs=2147483647, maxCFSSegmentSizeMB=8.796093022207999E12, noCFSRatio=0.1]
[junit4] 2> 521616 INFO (coreLoadExecutor-1417-thread-1) [ x:collection1] o.a.s.c.SolrDeletionPolicy SolrDeletionPolicy.onInit: commits: num=1
[junit4] 2> commit{dir=MockDirectoryWrapper(RAMDirectory@76a607e3 lockFactory=org.apache.lucene.store.SingleInstanceLockFactory@4e313836),segFN=segments_1,generation=1}
[junit4] 2> 521616 INFO (coreLoadExecutor-1417-thread-1) [ x:collection1] o.a.s.c.SolrDeletionPolicy newest commit generation = 1
[junit4] 2> 521616 INFO (coreLoadExecutor-1417-thread-1) [ x:collection1] o.a.s.s.SolrIndexSearcher Opening [Searcher@77bd01b2[collection1] main]
[junit4] 2> 521617 INFO (coreLoadExecutor-1417-thread-1) [ x:collection1] o.a.s.r.ManagedResourceStorage File-based storage initialized to use dir: /x1/jenkins/jenkins-slave/workspace/Lucene-Solr-Tests-6.x/solr/build/solr-core/test/J0/temp/solr.handler.TestReplicationHandler_F2A73B26F91730E7-001/solr-instance-002/collection1/conf
[junit4] 2> 521617 INFO (coreLoadExecutor-1417-thread-1) [ x:collection1] o.a.s.r.RestManager Initializing RestManager with initArgs: {storageDir=/x1/jenkins/jenkins-slave/workspace/Lucene-Solr-Tests-6.x/solr/build/solr-core/test/J0/temp/solr.handler.TestReplicationHandler_F2A73B26F91730E7-001/solr-instance-002/collection1/conf}
[junit4] 2> 521617 INFO (coreLoadExecutor-1417-thread-1) [ x:collection1] o.a.s.r.ManagedResourceStorage Reading _rest_managed.json using file:dir=/x1/jenkins/jenkins-slave/workspace/Lucene-Solr-Tests-6.x/solr/build/solr-core/test/J0/temp/solr.handler.TestReplicationHandler_F2A73B26F91730E7-001/solr-instance-002/collection1/conf
[junit4] 2> 521617 INFO (coreLoadExecutor-1417-thread-1) [ x:collection1] o.a.s.r.RestManager Initializing 0 registered ManagedResources
[junit4] 2> 521618 INFO (coreLoadExecutor-1417-thread-1) [ x:collection1] o.a.s.h.ReplicationHandler Poll scheduled at an interval of 1000ms
[junit4] 2> 521618 INFO (searcherExecutor-1418-thread-1-processing-x:collection1) [ x:collection1] o.a.s.c.SolrCore [collection1] Registered new searcher Searcher@77bd01b2[collection1] main{ExitableDirectoryReader(UninvertingDirectoryReader())}
[junit4] 2> 521618 INFO (coreLoadExecutor-1417-thread-1) [ x:collection1] o.a.s.c.CoreContainer registering core: collection1
[junit4] 2> 522099 INFO (qtp1024640044-2863) [ x:collection1] o.a.s.c.S.Request [collection1] webapp=/solr path=/select params={q=*:*&sort=id+desc&wt=javabin&version=2} hits=0 status=0 QTime=0
[junit4] 2> 522103 INFO (qtp1024640044-2864) [ x:collection1] o.a.s.u.p.LogUpdateProcessorFactory [collection1] webapp=/solr path=/update params={wt=javabin&version=2}{add=[0]} 0 2
[junit4] 2> 522105 INFO (qtp1024640044-2865) [ x:collection1] o.a.s.u.p.LogUpdateProcessorFactory [collection1] webapp=/solr path=/update params={wt=javabin&version=2}{add=[1]} 0 0
[junit4] 2> 522106 INFO (qtp1024640044-2866) [ x:collection1] o.a.s.u.p.LogUpdateProcessorFactory [collection1] webapp=/solr path=/update params={wt=javabin&version=2}{add=[2]} 0 0
[junit4] 2> 522108 INFO (qtp1024640044-2867) [ x:collection1] o.a.s.u.p.LogUpdateProcessorFactory [collection1] webapp=/solr path=/update params={wt=javabin&version=2}{add=[3]} 0 0
[junit4] 2> 522109 INFO (qtp1024640044-2860) [ x:collection1] o.a.s.u.p.LogUpdateProcessorFactory [collection1] webapp=/solr path=/update params={wt=javabin&version=2}{add=[4]} 0 0
[junit4] 2> 522111 INFO (qtp1024640044-2863) [ x:collection1] o.a.s.u.p.LogUpdateProcessorFactory [collection1] webapp=/solr path=/update params={wt=javabin&version=2}{add=[5]} 0 0
[junit4] 2> 522112 INFO (qtp1024640044-2864) [ x:collection1] o.a.s.u.p.LogUpdateProcessorFactory [collection1] webapp=/solr path=/update params={wt=javabin&version=2}{add=[6]} 0 0
[junit4] 2> 522114 INFO (qtp1024640044-2865) [ x:collection1] o.a.s.u.p.LogUpdateProcessorFactory [collection1] webapp=/solr path=/update params={wt=javabin&version=2}{add=[7]} 0 0
[junit4] 2> 522115 INFO (qtp1024640044-2866) [ x:collection1] o.a.s.u.p.LogUpdateProcessorFactory [collection1] webapp=/solr path=/update params={wt=javabin&version=2}{add=[8]} 0 0
[junit4] 2> 522117 INFO (qtp1024640044-2867) [ x:collection1] o.a.s.u.p.LogUpdateProcessorFactory [collection1] webapp=/solr path=/update params={wt=javabin&version=2}{add=[9]} 0 0
[junit4] 2> 522119 INFO (qtp1024640044-2860) [ x:collection1] o.a.s.u.p.LogUpdateProcessorFactory [collection1] webapp=/solr path=/update params={wt=javabin&version=2}{add=[10]} 0 0
[junit4] 2> 522120 INFO (qtp1024640044-2863) [ x:collection1] o.a.s.u.p.LogUpdateProcessorFactory [collection1] webapp=/solr path=/update params={wt=javabin&version=2}{add=[11]} 0 0
[junit4] 2> 522122 INFO (qtp1024640044-2864) [ x:collection1] o.a.s.u.p.LogUpdateProcessorFactory [collection1] webapp=/solr path=/update params={wt=javabin&version=2}{add=[12]} 0 0
[junit4] 2> 522123 INFO (qtp1024640044-2864) [ x:collection1] o.a.s.u.p.LogUpdateProcessorFactory [collection1] webapp=/solr path=/update params={wt=javabin&version=2}{add=[13]} 0 0
[junit4] 2> 522125 INFO (qtp1024640044-2864) [ x:collection1] o.a.s.u.p.LogUpdateProcessorFactory [collection1] webapp=/solr path=/update params={wt=javabin&version=2}{add=[14]} 0 0
[junit4] 2> 522127 INFO (qtp1024640044-2867) [ x:collection1] o.a.s.u.p.LogUpdateProcessorFactory [collection1] webapp=/solr path=/update params={wt=javabin&version=2}{add=[15]} 0 0
[junit4] 2> 522128 INFO (qtp1024640044-2860) [ x:collection1] o.a.s.u.p.LogUpdateProcessorFactory [collection1] webapp=/solr path=/update params={wt=javabin&version=2}{add=[16]} 0 0
[junit4] 2> 522130 INFO (qtp1024640044-2863) [ x:collection1] o.a.s.u.p.LogUpdateProcessorFactory [collection1] webapp=/solr path=/update params={wt=javabin&version=2}{add=[17]} 0 0
[junit4] 2> 522131 INFO (qtp1024640044-2865) [ x:collection1] o.a.s.u.p.LogUpdateProcessorFactory [collection1] webapp=/solr path=/update params={wt=javabin&version=2}{add=[18]} 0 0
[junit4] 2> 522133 INFO (qtp1024640044-2866) [ x:collection1] o.a.s.u.p.LogUpdateProcessorFactory [collection1] webapp=/solr path=/update params={wt=javabin&version=2}{add=[19]} 0 0
[junit4] 2> 522134 INFO (qtp1024640044-2864) [ x:collection1] o.a.s.u.p.LogUpdateProcessorFactory [collection1] webapp=/solr path=/update params={wt=javabin&version=2}{add=[20]} 0 0
[junit4] 2> 522136 INFO (qtp1024640044-2867) [ x:collection1] o.a.s.u.p.LogUpdateProcessorFactory [collection1] webapp=/solr path=/update params={wt=javabin&version=2}{add=[21]} 0 0
[junit4] 2> 522137 INFO (qtp1024640044-2860) [ x:collection1] o.a.s.u.p.LogUpdateProcessorFactory [collection1] webapp=/solr path=/update params={wt=javabin&version=2}{add=[22]} 0 0
[junit4] 2> 522139 INFO (qtp1024640044-2863) [ x:collection1] o.a.s.u.p.LogUpdateProcessorFactory [collection1] webapp=/solr path=/update params={wt=javabin&version=2}{add=[23]} 0 0
[junit4] 2> 522140 INFO (qtp1024640044-2865) [ x:collection1] o.a.s.u.p.LogUpdateProcessorFactory [collection1] webapp=/solr path=/update params={wt=javabin&version=2}{add=[24]} 0 0
[junit4] 2> 522142 INFO (qtp1024640044-2866) [ x:collection1] o.a.s.u.p.LogUpdateProcessorFactory [collection1] webapp=/solr path=/update params={wt=javabin&version=2}{add=[25]} 0 0
[junit4] 2> 522143 INFO (qtp1024640044-2864) [ x:collection1] o.a.s.u.p.LogUpdateProcessorFactory [collection1] webapp=/solr path=/update params={wt=javabin&version=2}{add=[26]} 0 0
[junit4] 2> 522145 INFO (qtp1024640044-2867) [ x:collection1] o.a.s.u.p.LogUpdateProcessorFactory [collection1] webapp=/solr path=/update params={wt=javabin&version=2}{add=[27]} 0 0
[junit4] 2> 522146 INFO (qtp1024640044-2860) [ x:collection1] o.a.s.u.p.LogUpdateProcessorFactory [collection1] webapp=/solr path=/update params={wt=javabin&version=2}{add=[28]} 0 0
[junit4] 2> 522148 INFO (qtp1024640044-2863) [ x:collection1] o.a.s.u.p.LogUpdateProcessorFactory [collection1] webapp=/solr path=/update params={wt=javabin&version=2}{add=[29]} 0 0
[junit4] 2> 522149 INFO (qtp1024640044-2865) [ x:collection1] o.a.s.u.p.LogUpdateProcessorFactory [collection1] webapp=/solr path=/update params={wt=javabin&version=2}{add=[30]} 0 0
[junit4] 2> 522151 INFO (qtp1024640044-2866) [ x:collection1] o.a.s.u.p.LogUpdateProcessorFactory [collection1] webapp=/solr path=/update params={wt=javabin&version=2}{add=[31]} 0 0
[junit4] 2> 522152 INFO (qtp1024640044-2864) [ x:collection1] o.a.s.u.p.LogUpdateProcessorFactory [collection1] webapp=/solr path=/update params={wt=javabin&version=2}{add=[32]} 0 0
[junit4] 2> 522154 INFO (qtp1024640044-2867) [ x:collection1] o.a.s.u.p.LogUpdateProcessorFactory [collection1] webapp=/solr path=/update params={wt=javabin&version=2}{add=[33]} 0 0
[junit4] 2> 522155 INFO (qtp1024640044-2860) [ x:collection1] o.a.s.u.p.LogUpdateProcessorFactory [collection1] webapp=/solr path=/update params={wt=javabin&version=2}{add=[34]} 0 0
[junit4] 2> 522157 INFO (qtp1024640044-2863) [ x:collection1] o.a.s.u.p.LogUpdateProcessorFactory [collection1] webapp=/solr path=/update params={wt=javabin&version=2}{add=[35]} 0 0
[junit4] 2> 522158 INFO (qtp1024640044-2865) [ x:collection1] o.a.s.u.p.LogUpdateProcessorFactory [collection1] webapp=/solr path=/update params={wt=javabin&version=2}{add=[36]} 0 0
[junit4] 2> 522160 INFO (qtp1024640044-2866) [ x:collection1] o.a.s.u.p.LogUpdateProcessorFactory [collection1] webapp=/solr path=/update params={wt=javabin&version=2}{add=[37]} 0 0
[junit4] 2> 522161 INFO (qtp1024640044-2864) [ x:collection1] o.a.s.u.p.LogUpdateProcessorFactory [collection1] webapp=/solr path=/update params={wt=javabin&version=2}{add=[38]} 0 0
[junit4] 2> 522163 INFO (qtp1024640044-2867) [ x:collection1] o.a.s.u.p.LogUpdateProcessorFactory [collection1] webapp=/solr path=/update params={wt=javabin&version=2}{add=[39]} 0 0
[junit4] 2> 522164 INFO (qtp1024640044-2860) [ x:collection1] o.a.s.u.p.LogUpdateProcessorFactory [collection1] webapp=/solr path=/update params={wt=javabin&version=2}{add=[40]} 0 0
[junit4] 2> 522166 INFO (qtp1024640044-2863) [ x:collection1] o.a.s.u.p.LogUpdateProcessorFactory [collection1] webapp=/solr path=/update params={wt=javabin&version=2}{add=[41]} 0 0
[junit4] 2> 522168 INFO (qtp1024640044-2865) [ x:collection1] o.a.s.u.p.LogUpdateProcessorFactory [collection1] webapp=/solr path=/update params={wt=javabin&version=2}{add=[42]} 0 0
[junit4] 2> 522169 INFO (qtp1024640044-2866) [ x:collection1] o.a.s.u.p.LogUpdateProcessorFactory [collection1] webapp=/solr path=/update params={wt=javabin&version=2}{add=[43]} 0 0
[junit4] 2> 522171 INFO (qtp1024640044-2864) [ x:collection1] o.a.s.u.p.LogUpdateProcessorFactory [collection1] webapp=/solr path=/update params={wt=javabin&version=2}{add=[44]} 0 0
[junit4] 2> 522180 INFO (qtp1024640044-2867) [ x:collection1] o.a.s.u.p.LogUpdateProcessorFactory [collection1] webapp=/solr path=/update params={wt=javabin&version=2}{add=[45]} 0 0
[junit4] 2> 522182 INFO (qtp1024640044-2860) [ x:collection1] o.a.s.u.p.LogUpdateProcessorFactory [collection1] webapp=/solr path=/update params={wt=javabin&version=2}{add=[46]} 0 0
[junit4] 2> 522183 INFO (qtp1024640044-2860) [ x:collection1] o.a.s.u.p.LogUpdateProcessorFactory [collection1] webapp=/solr path=/update params={wt=javabin&version=2}{add=[47]} 0 0
[junit4] 2> 522185 INFO (qtp1024640044-2860) [ x:collection1] o.a.s.u.p.LogUpdateProcessorFactory [collection1] webapp=/solr path=/update params={wt=javabin&version=2}{add=[48]} 0 0
[junit4] 2> 522187 INFO (qtp1024640044-2860) [ x:collection1] o.a.s.u.p.LogUpdateProcessorFactory [collection1] webapp=/solr path=/update params={wt=javabin&version=2}{add=[49]} 0 0
[junit4] 2> 522188 INFO (qtp1024640044-2860) [ x:collection1] o.a.s.u.p.LogUpdateProcessorFactory [collection1] webapp=/solr path=/update params={wt=javabin&version=2}{add=[50]} 0 0
[junit4] 2> 522190 INFO (qtp1024640044-2867) [ x:collection1] o.a.s.u.p.LogUpdateProcessorFactory [collection1] webapp=/solr path=/update params={wt=javabin&version=2}{add=[51]} 0 0
[junit4] 2> 522191 INFO (qtp1024640044-2863) [ x:collection1] o.a.s.u.p.LogUpdateProcessorFactory [collection1] webapp=/solr path=/update params={wt=javabin&version=2}{add=[52]} 0 0
[junit4] 2> 522193 INFO (qtp1024640044-2865) [ x:collection1] o.a.s.u.p.LogUpdateProcessorFactory [collection1] webapp=/solr path=/update params={wt=javabin&version=2}{add=[53]} 0 0
[junit4] 2> 522194 INFO (qtp1024640044-2866) [ x:collection1] o.a.s.u.p.LogUpdateProcessorFactory [collection1] webapp=/solr path=/update params={wt=javabin&version=2}{add=[54]} 0 0
[junit4] 2> 522196 INFO (qtp1024640044-2866) [ x:collection1] o.a.s.u.p.LogUpdateProcessorFactory [collection1] webapp=/solr path=/update params={wt=javabin&version=2}{add=[55]} 0 0
[junit4] 2> 522197 INFO (qtp1024640044-2866) [ x:collection1] o.a.s.u.p.LogUpdateProcessorFactory [collection1] webapp=/solr path=/update params={wt=javabin&version=2}{add=[56]} 0 0
[junit4] 2> 522199 INFO (qtp1024640044-2867) [ x:collection1] o.a.s.u.p.LogUpdateProcessorFactory [collection1] webapp=/solr path=/update params={wt=javabin&version=2}{add=[57]} 0 0
[junit4] 2> 522200 INFO (qtp1024640044-2863) [ x:collection1] o.a.s.u.p.LogUpdateProcessorFactory [collection1] webapp=/solr path=/update params={wt=javabin&version=2}{add=[58]} 0 0
[junit4] 2> 522202 INFO (qtp1024640044-2865) [ x:collection1] o.a.s.u.p.LogUpdateProcessorFactory [collection1] webapp=/solr path=/update params={wt=javabin&version=2}{add=[59]} 0 0
[junit4] 2> 522203 INFO (qtp1024640044-2865) [ x:collection1] o.a.s.u.p.LogUpdateProcessorFactory [collection1] webapp=/solr path=/update params={wt=javabin&version=2}{add=[60]} 0 0
[junit4] 2> 522205 INFO (qtp1024640044-2865) [ x:collection1] o.a.s.u.p.LogUpdateProcessorFactory [collection1] webapp=/solr path=/update params={wt=javabin&version=2}{add=[61]} 0 0
[junit4] 2> 522206 INFO (qtp1024640044-2865) [ x:collection1] o.a.s.u.p.LogUpdateProcessorFactory [collection1] webapp=/solr path=/update params={wt=javabin&version=2}{add=[62]} 0 0
[junit4] 2> 522208 INFO (qtp1024640044-2867) [ x:collection1] o.a.s.u.p.LogUpdateProcessorFactory [collection1] webapp=/solr path=/update params={wt=javabin&version=2}{add=[63]} 0 0
[junit4] 2> 522209 INFO (qtp1024640044-2863) [ x:collection1] o.a.s.u.p.LogUpdateProcessorFactory [collection1] webapp=/solr path=/update params={wt=javabin&version=2}{add=[64]} 0 0
[junit4] 2> 522211 INFO (qtp1024640044-2864) [ x:collection1] o.a.s.u.p.LogUpdateProcessorFactory [collection1] webapp=/solr path=/update params={wt=javabin&version=2}{add=[65]} 0 0
[junit4] 2> 522212 INFO (qtp1024640044-2864) [ x:collection1] o.a.s.u.p.LogUpdateProcessorFactory [collection1] webapp=/solr path=/update params={wt=javabin&version=2}{add=[66]} 0 0
[junit4] 2> 522214 INFO (qtp1024640044-2866) [ x:collection1] o.a.s.u.p.LogUpdateProcessorFactory [collection1] webapp=/solr path=/update params={wt=javabin&version=2}{add=[67]} 0 0
[junit4] 2> 522215 INFO (qtp1024640044-2866) [ x:collection1] o.a.s.u.p.LogUpdateProcessorFactory [collection1] webapp=/solr path=/update params={wt=javabin&version=2}{add=[68]} 0 0
[junit4] 2> 522217 INFO (qtp1024640044-2867) [ x:collection1] o.a.s.u.p.LogUpdateProcessorFactory [collection1] webapp=/solr path=/update params={wt=javabin&version=2}{add=[69]} 0 0
[junit4] 2> 522218 INFO (qtp1024640044-2863) [ x:collection1] o.a.s.u.p.LogUpdateProcessorFactory [collection1] webapp=/solr path=/update params={wt=javabin&version=2}{add=[70]} 0 0
[junit4] 2> 522220 INFO (qtp1024640044-2860) [ x:collection1] o.a.s.u.p.LogUpdateProcessorFactory [collection1] webapp=/solr path=/update params={wt=javabin&version=2}{add=[71]} 0 0
[junit4] 2> 522221 INFO (qtp1024640044-2860) [ x:collection1] o.a.s.u.p.LogUpdateProcessorFactory [collection1] webapp=/solr path=/update params={wt=javabin&version=2}{add=[72]} 0 0
[junit4] 2> 522223 INFO (qtp1024640044-2865) [ x:collection1] o.a.s.u.p.LogUpdateProcessorFactory [collection1] webapp=/solr path=/update params={wt=javabin&version=2}{add=[73]} 0 0
[junit4] 2> 522224 INFO (qtp1024640044-2866) [ x:collection1] o.a.s.u.p.LogUpdateProcessorFactory [collection1] webapp=/solr path=/update params={wt=javabin&version=2}{add=[74]} 0 0
[junit4] 2> 522226 INFO (qtp1024640044-2867) [ x:collection1] o.a.s.u.p.LogUpdateProcessorFactory [collection1] webapp=/solr path=/update params={wt=javabin&version=2}{add=[75]} 0 0
[junit4] 2> 522227 INFO (qtp1024640044-2863) [ x:collection1] o.a.s.u.p.LogUpdateProcessorFactory [collection1] webapp=/solr path=/update params={wt=javabin&version=2}{add=[76]} 0 0
[junit4] 2> 522229 INFO (qtp1024640044-2864) [ x:collection1] o.a.s.u.p.LogUpdateProcessorFactory [collection1] webapp=/solr path=/update params={wt=javabin&version=2}{add=[77]} 0 0
[junit4] 2> 522230 INFO (qtp1024640044-2860) [ x:collection1] o.a.s.u.p.LogUpdateProcessorFactory [collection1] webapp=/solr path=/update params={wt=javabin&version=2}{add=[78]} 0 0
[junit4] 2> 522232 INFO (qtp1024640044-2865) [ x:collection1] o.a.s.u.p.LogUpdateProcessorFactory [collection1] webapp=/solr path=/update params={wt=javabin&version=2}{add=[79]} 0 0
[junit4] 2> 522233 INFO (qtp1024640044-2866) [ x:collection1] o.a.s.u.p.LogUpdateProcessorFactory [collection1] webapp=/solr path=/update params={wt=javabin&version=2}{add=[80]} 0 0
[junit4] 2> 522235 INFO (qtp1024640044-2867) [ x:collection1] o.a.s.u.p.LogUpdateProcessorFactory [collection1] webapp=/solr path=/update params={wt=javabin&version=2}{add=[81]} 0 0
[junit4] 2> 522236 INFO (qtp1024640044-2863) [ x:collection1] o.a.s.u.p.LogUpdateProcessorFactory [collection1] webapp=/solr path=/update params={wt=javabin&version=2}{add=[82]} 0 0
[junit4] 2> 522238 INFO (qtp1024640044-2864) [ x:collection1] o.a.s.u.p.LogUpdateProcessorFactory [collection1] webapp=/solr path=/update params={wt=javabin&version=2}{add=[83]} 0 0
[junit4] 2> 522239 INFO (qtp1024640044-2860) [ x:collection1] o.a.s.u.p.LogUpdateProcessorFactory [collection1] webapp=/solr path=/update params={wt=javabin&version=2}{add=[84]} 0 0
[junit4] 2> 522241 INFO (qtp1024640044-2865) [ x:collection1] o.a.s.u.p.LogUpdateProcessorFactory [collection1] webapp=/solr path=/update params={wt=javabin&version=2}{add=[85]} 0 0
[junit4] 2> 522242 INFO (qtp1024640044-2866) [ x:collection1] o.a.s.u.p.LogUpdateProcessorFactory [collection1] webapp=/solr path=/update params={wt=javabin&version=2}{add=[86]} 0 0
[junit4] 2> 522244 INFO (qtp1024640044-2867) [ x:collection1] o.a.s.u.p.LogUpdateProcessorFactory [collection1] webapp=/solr path=/update params={wt=javabin&version=2}{add=[87]} 0 0
[junit4] 2> 522245 INFO (qtp1024640044-2863) [ x:collection1] o.a.s.u.p.LogUpdateProcessorFactory [collection1] webapp=/solr path=/update params={wt=javabin&version=2}{add=[88]} 0 0
[junit4] 2> 522246 INFO (qtp1024640044-2864) [ x:collection1] o.a.s.u.p.LogUpdateProcessorFactory [collection1] webapp=/solr path=/update params={wt=javabin&version=2}{add=[89]} 0 0
[junit4] 2> 522248 INFO (qtp1024640044-2864) [ x:collection1] o.a.s.u.p.LogUpdateProcessorFactory [collection1] webapp=/solr path=/update params={wt=javabin&version=2}{add=[90]} 0 0
[junit4] 2> 522249 INFO (qtp1024640044-2865) [ x:collection1] o.a.s.u.p.LogUpdateProcessorFactory [collection1] webapp=/solr path=/update params={wt=javabin&version=2}{add=[91]} 0 0
[junit4] 2> 522251 INFO (qtp1024640044-2866) [ x:collection1] o.a.s.u.p.LogUpdateProcessorFactory [collection1] webapp=/solr path=/update params={wt=javabin&version=2}{add=[92]} 0 0
[junit4] 2> 522252 INFO (qtp1024640044-2867) [ x:collection1] o.a.s.u.p.LogUpdateProcessorFactory [collection1] webapp=/solr path=/update params={wt=javabin&version=2}{add=[93]} 0 0
[junit4] 2> 522254 INFO (qtp1024640044-2863) [ x:collection1] o.a.s.u.p.LogUpdateProcessorFactory [collection1] webapp=/solr path=/update params={wt=javabin&version=2}{add=[94]} 0 0
[junit4] 2> 522255 INFO (qtp1024640044-2860) [ x:collection1] o.a.s.u.p.LogUpdateProcessorFactory [collection1] webapp=/solr path=/update params={wt=javabin&version=2}{add=[95]} 0 0
[junit4] 2> 522257 INFO (qtp1024640044-2864) [ x:collection1] o.a.s.u.p.LogUpdateProcessorFactory [collection1] webapp=/solr path=/update params={wt=javabin&version=2}{add=[96]} 0 0
[junit4] 2> 522258 INFO (qtp1024640044-2865) [ x:collection1] o.a.s.u.p.LogUpdateProcessorFactory [collection1] webapp=/solr path=/update params={wt=javabin&version=2}{add=[97]} 0 0
[junit4] 2> 522260 INFO (qtp1024640044-2866) [ x:collection1] o.a.s.u.p.LogUpdateProcessorFactory [collection1] webapp=/solr path=/update params={wt=javabin&version=2}{add=[98]} 0 0
[junit4] 2> 522261 INFO (qtp1024640044-2867) [ x:collection1] o.a.s.u.p.LogUpdateProcessorFactory [collection1] webapp=/solr path=/update params={wt=javabin&version=2}{add=[99]} 0 0
[junit4] 2> 522263 INFO (qtp1024640044-2863) [ x:collection1] o.a.s.u.p.LogUpdateProcessorFactory [collection1] webapp=/solr path=/update params={wt=javabin&version=2}{add=[100]} 0 0
[junit4] 2> 522264 INFO (qtp1024640044-2860) [ x:collection1] o.a.s.u.p.LogUpdateProcessorFactory [collection1] webapp=/solr path=/update params={wt=javabin&version=2}{add=[101]} 0 0
[junit4] 2> 522266 INFO (qtp1024640044-2864) [ x:collection1] o.a.s.u.p.LogUpdateProcessorFactory [collection1] webapp=/solr path=/update params={wt=javabin&version=2}{add=[102]} 0 0
[junit4] 2> 522267 INFO (qtp1024640044-2865) [ x:collection1] o.a.s.u.p.LogUpdateProcessorFactory [collection1] webapp=/solr path=/update params={wt=javabin&version=2}{add=[103]} 0 0
[junit4] 2> 522269 INFO (qtp1024640044-2866) [ x:collection1] o.a.s.u.p.LogUpdateProcessorFactory [collection1] webapp=/solr path=/update params={wt=javabin&version=2}{add=[104]} 0 0
[junit4] 2> 522270 INFO (qtp1024640044-2867) [ x:collection1] o.a.s.u.p.LogUpdateProcessorFactory [collection1] webapp=/solr path=/update params={wt=javabin&version=2}{add=[105]} 0 0
[junit4] 2> 522272 INFO (qtp1024640044-2863) [ x:collection1] o.a.s.u.p.LogUpdateProcessorFactory [collection1] webapp=/solr path=/update params={wt=javabin&version=2}{add=[106]} 0 0
[junit4] 2> 522274 INFO (qtp1024640044-2860) [ x:collection1] o.a.s.u.p.LogUpdateProcessorFactory [collection1] webapp=/solr path=/update params={wt=javabin&version=2}{add=[107]} 0 0
[junit4] 2> 522275 INFO (qtp1024640044-2864) [ x:collection1] o.a.s.u.p.LogUpdateProcessorFactory [collection1] webapp=/solr path=/update params={wt=javabin&version=2}{add=[108]} 0 0
[junit4] 2> 522277 INFO (qtp1024640044-2864) [ x:collection1] o.a.s.u.p.LogUpdateProcessorFactory [collection1] webapp=/solr path=/update params={wt=javabin&version=2}{add=[109]} 0 0
[junit4] 2> 522279 INFO (qtp1024640044-2864) [ x:collection1] o.a.s.u.p.LogUpdateProcessorFactory [collection1] webapp=/solr path=/update params={wt=javabin&version=2}{add=[110]} 0 0
[junit4] 2> 522280 INFO (qtp1024640044-2867) [ x:collection1] o.a.s.u.p.LogUpdateProcessorFactory [collection1] webapp=/solr path=/update params={wt=javabin&version=2}{add=[111]} 0 0
[junit4] 2> 522282 INFO (qtp1024640044-2863) [ x:collection1] o.a.s.u.p.LogUpdateProcessorFactory [collection1] webapp=/solr path=/update params={wt=javabin&version=2}{add=[112]} 0 0
[junit4] 2> 522283 INFO (qtp1024640044-2860) [ x:collection1] o.a.s.u.p.LogUpdateProcessorFactory [collection1] webapp=/solr path=/update params={wt=javabin&version=2}{add=[113]} 0 0
[junit4] 2> 522285 INFO (qtp1024640044-2865) [ x:collection1] o.a.s.u.p.LogUpdateProcessorFactory [collection1] webapp=/solr path=/update params={wt=javabin&version=2}{add=[114]} 0 0
[junit4] 2> 522286 INFO (qtp1024640044-2865) [ x:collection1] o.a.s.u.p.LogUpdateProcessorFactory [collection1] webapp=/solr path=/update params={wt=javabin&version=2}{add=[115]} 0 0
[junit4] 2> 522288 INFO (qtp1024640044-2864) [ x:collection1] o.a.s.u.p.LogUpdateProcessorFactory [collection1] webapp=/solr path=/update params={wt=javabin&version=2}{add=[116]} 0 0
[junit4] 2> 522289 INFO (qtp1024640044-2867) [ x:collection1] o.a.s.u.p.LogUpdateProcessorFactory [collection1] webapp=/solr path=/update params={wt=javabin&version=2}{add=[117]} 0 0
[junit4] 2> 522291 INFO (qtp1024640044-2867) [ x:collection1] o.a.s.u.p.LogUpdateProcessorFactory [collection1] webapp=/solr path=/update params={wt=javabin&version=2}{add=[118]} 0 0
[junit4] 2> 522311 INFO (qtp1024640044-2860) [ x:collection1] o.a.s.u.p.LogUpdateProcessorFactory [collection1] webapp=/solr path=/update params={wt=javabin&version=2}{add=[119]} 0 0
[junit4] 2> 522313 INFO (qtp1024640044-2860) [ x:collection1] o.a.s.u.p.LogUpdateProcessorFactory [collection1] webapp=/solr path=/update params={wt=javabin&version=2}{add=[120]} 0 0
[junit4] 2> 522314 INFO (qtp1024640044-2865) [ x:collection1] o.a.s.u.p.LogUpdateProcessorFactory [collection1] webapp=/solr path=/update params={wt=javabin&version=2}{add=[121]} 0 0
[junit4] 2> 522316 INFO (qtp1024640044-2864) [ x:collection1] o.a.s.u.p.LogUpdateProcessorFactory [collection1] webapp=/solr path=/update params={wt=javabin&version=2}{add=[122]} 0 0
[junit4] 2> 522317 INFO (qtp1024640044-2863) [ x:collection1] o.a.s.u.p.LogUpdateProcessorFactory [collection1] webapp=/solr path=/update params={wt=javabin&version=2}{add=[123]} 0 0
[junit4] 2> 522319 INFO (qtp1024640044-2867) [ x:collection1] o.a.s.u.p.LogUpdateProcessorFactory [collection1] webapp=/solr path=/update params={wt=javabin&version=2}{add=[124]} 0 0
[junit4] 2> 522320 INFO (qtp1024640044-2866) [ x:collection1] o.a.s.u.p.LogUpdateProcessorFactory [collection1] webapp=/solr path=/update params={wt=javabin&version=2}{add=[125]} 0 0
[junit4] 2> 522322 INFO (qtp1024640044-2866) [ x:collection1] o.a.s.u.p.LogUpdateProcessorFactory [collection1] webapp=/solr path=/update params={wt=javabin&version=2}{add=[126]} 0 0
[junit4] 2> 522323 INFO (qtp1024640044-2865) [ x:collection1] o.a.s.u.p.LogUpdateProcessorFactory [collection1] webapp=/solr path=/update params={wt=javabin&version=2}{add=[127]} 0 0
[junit4] 2> 522325 INFO (qtp1024640044-2864) [ x:collection1] o.a.s.u.p.LogUpdateProcessorFactory [collection1] webapp=/solr path=/update params={wt=javabin&version=2}{add=[128]} 0 0
[junit4] 2> 522326 INFO (qtp1024640044-2863) [ x:collection1] o.a.s.u.p.LogUpdateProcessorFactory [collection1] webapp=/solr path=/update params={wt=javabin&version=2}{add=[129]} 0 0
[junit4] 2> 522328 INFO (qtp1024640044-2867) [ x:collection1] o.a.s.u.p.LogUpdateProcessorFactory [collection1] webapp=/solr path=/update params={wt=javabin&version=2}{add=[130]} 0 0
[junit4] 2> 522331 INFO (qtp1024640044-2860) [ x:collection1] o.a.s.u.p.LogUpdateProcessorFactory [collection1] webapp=/solr path=/update params={wt=javabin&version=2}{add=[131]} 0 0
[junit4] 2> 522333 INFO (qtp1024640044-2866) [ x:collection1] o.a.s.u.p.LogUpdateProcessorFactory [collection1] webapp=/solr path=/update params={wt=javabin&version=2}{add=[132]} 0 0
[junit4] 2> 522334 INFO (qtp1024640044-2865) [ x:collection1] o.a.s.u.p.LogUpdateProcessorFactory [collection1] webapp=/solr path=/update params={wt=javabin&version=2}{add=[133]} 0 0
[junit4] 2> 522336 INFO (qtp1024640044-2864) [ x:collection1] o.a.s.u.p.LogUpdateProcessorFactory [collection1] webapp=/solr path=/update params={wt=javabin&version=2}{add=[134]} 0 0
[junit4] 2> 522337 INFO (qtp1024640044-2864) [ x:collection1] o.a.s.u.p.LogUpdateProcessorFactory [collection1] webapp=/solr path=/update params={wt=javabin&version=2}{add=[135]} 0 0
[junit4] 2> 522339 INFO (qtp1024640044-2867) [ x:collection1] o.a.s.u.p.LogUpdateProcessorFactory [collection1] webapp=/solr path=/update params={wt=javabin&version=2}{add=[136]} 0 0
[junit4] 2> 522340 INFO (qtp1024640044-2860) [ x:collection1] o.a.s.u.p.LogUpdateProcessorFactory [collection1] webapp=/solr path=/update params={wt=javabin&version=2}{add=[137]} 0 0
[junit4] 2> 522342 INFO (qtp1024640044-2866) [ x:collection1] o.a.s.u.p.LogUpdateProcessorFactory [collection1] webapp=/solr path=/update params={wt=javabin&version=2}{add=[138]} 0 0
[junit4] 2> 522343 INFO (qtp1024640044-2865) [ x:collection1] o.a.s.u.p.LogUpdateProcessorFactory [collection1] webapp=/solr path=/update params={wt=javabin&version=2}{add=[139]} 0 0
[junit4] 2> 522345 INFO (qtp1024640044-2863) [ x:collection1] o.a.s.u.p.LogUpdateProcessorFactory [collection1] webapp=/solr path=/update params={wt=javabin&version=2}{add=[140]} 0 0
[junit4] 2> 522347 INFO (qtp1024640044-2867) [ x:collection1] o.a.s.c.S.Request [collection1] webapp=/solr path=/replication params={qt=/replication&wt=javabin&version=2&command=indexversion} status=0 QTime=0
[junit4] 2> 522347 INFO (qtp1024640044-2863) [ x:collection1] o.a.s.u.p.LogUpdateProcessorFactory [collection1] webapp=/solr path=/update params={wt=javabin&version=2}{add=[141]} 0 0
[junit4] 2> 522348 INFO (qtp1024640044-2860) [ x:collection1] o.a.s.u.p.LogUpdateProcessorFactory [collection1] webapp=/solr path=/update params={wt=javabin&version=2}{add=[142]} 0 0
[junit4] 2> 522350 INFO (qtp1024640044-2865) [ x:collection1] o.a.s.u.p.LogUpdateProcessorFactory [collection1] webapp=/solr path=/update params={wt=javabin&version=2}{add=[143]} 0 0
[junit4] 2> 522351 INFO (qtp1024640044-2864) [ x:collection1] o.a.s.u.p.LogUpdateProcessorFactory [collection1] webapp=/solr path=/update params={wt=javabin&version=2}{add=[144]} 0 0
[junit4] 2> 522352 INFO (qtp1024640044-2861) [ x:collection1] o.a.s.u.p.LogUpdateProcessorFactory [collection1] webapp=/solr path=/update params={wt=javabin&version=2}{add=[145]} 0 0
[junit4] 2> 522354 INFO (qtp1024640044-2866) [ x:collection1] o.a.s.u.p.LogUpdateProcessorFactory [collection1] webapp=/solr path=/update params={wt=javabin&version=2}{add=[146]} 0 0
[junit4] 2> 522355 INFO (qtp1024640044-2863) [ x:collection1] o.a.s.u.p.LogUpdateProcessorFactory [collection1] webapp=/solr path=/update params={wt=javabin&version=2}{add=[147]} 0 0
[junit4] 2> 522357 INFO (qtp1024640044-2863) [ x:collection1] o.a.s.u.p.LogUpdateProcessorFactory [collection1] webapp=/solr path=/update params={wt=javabin&version=2}{add=[148]} 0 0
[junit4] 2> 522358 INFO (qtp1024640044-2865) [ x:collection1] o.a.s.u.p.LogUpdateProcessorFactory [collection1] webapp=/solr path=/update params={wt=javabin&version=2}{add=[149]} 0 0
[junit4] 2> 522360 INFO (qtp1024640044-2864) [ x:collection1] o.a.s.u.p.LogUpdateProcessorFactory [collection1] webapp=/solr path=/update params={wt=javabin&version=2}{add=[150]} 0 0
[junit4] 2> 522361 INFO (qtp1024640044-2861) [ x:collection1] o.a.s.u.p.LogUpdateProcessorFactory [collection1] webapp=/solr path=/update params={wt=javabin&version=2}{add=[151]} 0 0
[junit4] 2> 522363 INFO (qtp1024640044-2866) [ x:collection1] o.a.s.u.p.LogUpdateProcessorFactory [collection1] webapp=/solr path=/update params={wt=javabin&version=2}{add=[152]} 0 0
[junit4] 2> 522364 INFO (qtp1024640044-2860) [ x:collection1] o.a.s.u.p.LogUpdateProcessorFactory [collection1] webapp=/solr path=/update params={wt=javabin&version=2}{add=[153]} 0 0
[junit4] 2> 522366 INFO (qtp1024640044-2863) [ x:collection1] o.a.s.u.p.LogUpdateProcessorFactory [collection1] webapp=/solr path=/update params={wt=javabin&version=2}{add=[154]} 0 0
[junit4] 2> 522367 INFO (qtp1024640044-2865) [ x:collection1] o.a.s.u.p.LogUpdateProcessorFactory [collection1] webapp=/solr path=/update params={wt=javabin&version=2}{add=[155]} 0 0
[junit4] 2> 522369 INFO (qtp1024640044-2864) [ x:collection1] o.a.s.u.p.LogUpdateProcessorFactory [collection1] webapp=/solr path=/update params={wt=javabin&version=2}{add=[156]} 0 0
[junit4] 2> 522370 INFO (qtp1024640044-2861) [ x:collection1] o.a.s.u.p.LogUpdateProcessorFactory [collection1] webapp=/solr path=/update params={wt=javabin&version=2}{add=[157]} 0 0
[junit4] 2> 522372 INFO (qtp1024640044-2866) [ x:collection1] o.a.s.u.p.LogUpdateProcessorFactory [collection1] webapp=/solr path=/update params={wt=javabin&version=2}{add=[158]} 0 0
[junit4] 2> 522373 INFO (qtp1024640044-2860) [ x:collection1] o.a.s.u.p.LogUpdateProcessorFactory [collection1] webapp=/solr path=/update params={wt=javabin&version=2}{add=[159]} 0 0
[junit4] 2> 522375 INFO (qtp1024640044-2860) [ x:collection1] o.a.s.u.p.LogUpdateProcessorFactory [collection1] webapp=/solr path=/update params={wt=javabin&version=2}{add=[160]} 0 0
[junit4] 2> 522376 INFO (qtp1024640044-2865) [ x:collection1] o.a.s.u.p.LogUpdateProcessorFactory [collection1] webapp=/solr path=/update params={wt=javabin&version=2}{add=[161]} 0 0
[junit4] 2> 522378 INFO (qtp1024640044-2864) [ x:collection1] o.a.s.u.p.LogUpdateProcessorFactory [collection1] webapp=/solr path=/update params={wt=javabin&version=2}{add=[162]} 0 0
[junit4] 2> 522379 INFO (qtp1024640044-2861) [ x:collection1] o.a.s.u.p.LogUpdateProcessorFactory [collection1] webapp=/solr path=/update params={wt=javabin&version=2}{add=[163]} 0 0
[junit4] 2> 522381 INFO (qtp1024640044-2866) [ x:collection1] o.a.s.u.p.LogUpdateProcessorFactory [collection1] webapp=/solr path=/update params={wt=javabin&version=2}{add=[164]} 0 0
[junit4] 2> 522382 INFO (qtp1024640044-2863) [ x:collection1] o.a.s.u.p.LogUpdateProcessorFactory [collection1] webapp=/solr path=/update params={wt=javabin&version=2}{add=[165]} 0 0
[junit4] 2> 522383 INFO (qtp1024640044-2863) [ x:collection1] o.a.s.u.p.LogUpdateProcessorFactory [collection1] webapp=/solr path=/update params={wt=javabin&version=2}{add=[166]} 0 0
[junit4] 2> 522385 INFO (qtp1024640044-2865) [ x:collection1] o.a.s.u.p.LogUpdateProcessorFactory [collection1] webapp=/solr path=/update params={wt=javabin&version=2}{add=[167]} 0 0
[junit4] 2> 522386 INFO (qtp1024640044-2864) [ x:collection1] o.a.s.u.p.LogUpdateProcessorFactory [collection1] webapp=/solr path=/update params={wt=javabin&version=2}{add=[168]} 0 0
[junit4] 2> 522388 INFO (qtp1024640044-2861) [ x:collection1] o.a.s.u.p.LogUpdateProcessorFactory [collection1] webapp=/solr path=/update params={wt=javabin&version=2}{add=[169]} 0 0
[junit4] 2> 522389 INFO (qtp1024640044-2866) [ x:collection1] o.a.s.u.p.LogUpdateProcessorFactory [collection1] webapp=/solr path=/update params={wt=javabin&version=2}{add=[170]} 0 0
[junit4] 2> 522391 INFO (qtp1024640044-2860) [ x:collection1] o.a.s.u.p.LogUpdateProcessorFactory [collection1] webapp=/solr path=/update params={wt=javabin&version=2}{add=[171]} 0 0
[junit4] 2> 522392 INFO (qtp1024640044-2863) [ x:collection1] o.a.s.u.p.LogUpdateProcessorFactory [collection1] webapp=/solr path=/update params={wt=javabin&version=2}{add=[172]} 0 0
[junit4] 2> 522394 INFO (qtp1024640044-2865) [ x:collection1] o.a.s.u.p.LogUpdateProcessorFactory [collection1] webapp=/solr path=/update params={wt=javabin&version=2}{add=[173]} 0 0
[junit4] 2> 522395 INFO (qtp1024640044-2864) [ x:collection1] o.a.s.u.p.LogUpdateProcessorFactory [collection1] webapp=/solr path=/update params={wt=javabin&version=2}{add=[174]} 0 0
[junit4] 2> 522397 INFO (qtp1024640044-2861) [ x:collection1] o.a.s.u.p.LogUpdateProcessorFactory [collection1] webapp=/solr path=/update params={wt=javabin&version=2}{add=[175]} 0 0
[junit4] 2> 522398 INFO (qtp1024640044-2866) [ x:collection1] o.a.s.u.p.LogUpdateProcessorFactory [collection1] webapp=/solr path=/update params={wt=javabin&version=2}{add=[176]} 0 0
[junit4] 2> 522400 INFO (qtp1024640044-2860) [ x:collection1] o.a.s.u.p.LogUpdateProcessorFactory [collection1] webapp=/solr path=/update params={wt=javabin&version=2}{add=[177]} 0 0
[junit4] 2> 522401 INFO (qtp1024640044-2860) [ x:collection1] o.a.s.u.p.LogUpdateProcessorFactory [collection1] webapp=/solr path=/update params={wt=javabin&version=2}{add=[178]} 0 0
[junit4] 2> 522403 INFO (qtp1024640044-2865) [ x:collection1] o.a.s.u.p.LogUpdateProcessorFactory [collection1] webapp=/solr path=/update params={wt=javabin&version=2}{add=[179]} 0 0
[junit4] 2> 522404 INFO (qtp1024640044-2864) [ x:collection1] o.a.s.u.p.LogUpdateProcessorFactory [collection1] webapp=/solr path=/update params={wt=javabin&version=2}{add=[180]} 0 0
[junit4] 2> 522406 INFO (qtp1024640044-2861) [ x:collection1] o.a.s.u.p.LogUpdateProcessorFactory [collection1] webapp=/solr path=/update params={wt=javabin&version=2}{add=[181]} 0 0
[junit4] 2> 522407 INFO (qtp1024640044-2866) [ x:collection1] o.a.s.u.p.LogUpdateProcessorFactory [collection1] webapp=/solr path=/update params={wt=javabin&version=2}{add=[182]} 0 0
[junit4] 2> 522409 INFO (qtp1024640044-2863) [ x:collection1] o.a.s.u.p.LogUpdateProcessorFactory [collection1] webapp=/solr path=/update params={wt=javabin&version=2}{add=[183]} 0 0
[junit4] 2> 522410 INFO (qtp1024640044-2863) [ x:collection1] o.a.s.u.p.LogUpdateProcessorFactory [collection1] webapp=/solr path=/update params={wt=javabin&version=2}{add=[184]} 0 0
[junit4] 2> 522412 INFO (qtp1024640044-2865) [ x:collection1] o.a.s.u.p.LogUpdateProcessorFactory [collection1] webapp=/solr path=/update params={wt=javabin&version=2}{add=[185]} 0 0
[junit4] 2> 522413 INFO (qtp1024640044-2864) [ x:collection1] o.a.s.u.p.LogUpdateProcessorFactory [collection1] webapp=/solr path=/update params={wt=javabin&version=2}{add=[186]} 0 0
[junit4] 2> 522415 INFO (qtp1024640044-2861) [ x:collection1] o.a.s.u.p.LogUpdateProcessorFactory [collection1] webapp=/solr path=/update params={wt=javabin&version=2}{add=[187]} 0 0
[junit4] 2> 522416 INFO (qtp1024640044-2866) [ x:collection1] o.a.s.u.p.LogUpdateProcessorFactory [collection1] webapp=/solr path=/update params={wt=javabin&version=2}{add=[188]} 0 0
[junit4] 2> 522420 INFO (qtp1024640044-2860) [ x:collection1] o.a.s.u.p.LogUpdateProcessorFactory [collection1] webapp=/solr path=/update params={wt=javabin&version=2}{add=[189]} 0 0
[junit4] 2> 522421 INFO (qtp1024640044-2863) [ x:collection1] o.a.s.u.p.LogUpdateProcessorFactory [collection1] webapp=/solr path=/update params={wt=javabin&version=2}{add=[190]} 0 0
[junit4] 2> 522423 INFO (qtp1024640044-2863) [ x:collection1] o.a.s.u.p.LogUpdateProcessorFactory [collection1] webapp=/solr path=/update params={wt=javabin&version=2}{add=[191]} 0 0
[junit4] 2> 522424 INFO (qtp1024640044-2863) [ x:collection1] o.a.s.u.p.LogUpdateProcessorFactory [collection1] webapp=/solr path=/update params={wt=javabin&version=2}{add=[192]} 0 0
[junit4] 2> 522426 INFO (qtp1024640044-2861) [ x:collection1] o.a.s.u.p.LogUpdateProcessorFactory [collection1] webapp=/solr path=/update params={wt=javabin&version=2}{add=[193]} 0 0
[junit4] 2> 522427 INFO (qtp1024640044-2861) [ x:collection1] o.a.s.u.p.LogUpdateProcessorFactory [collection1] webapp=/solr path=/update params={wt=javabin&version=2}{add=[194]} 0 0
[junit4] 2> 522429 INFO (qtp1024640044-2860) [ x:collection1] o.a.s.u.p.LogUpdateProcessorFactory [collection1] webapp=/solr path=/update params={wt=javabin&version=2}{add=[195]} 0 0
[junit4] 2> 522430 INFO (qtp1024640044-2860) [ x:collection1] o.a.s.u.p.LogUpdateProcessorFactory [collection1] webapp=/solr path=/update params={wt=javabin&version=2}{add=[196]} 0 0
[junit4] 2> 522432 INFO (qtp1024640044-2860) [ x:collection1] o.a.s.u.p.LogUpdateProcessorFactory [collection1] webapp=/solr path=/update params={wt=javabin&version=2}{add=[197]} 0 0
[junit4] 2> 522433 INFO (qtp1024640044-2860) [ x:collection1] o.a.s.u.p.LogUpdateProcessorFactory [collection1] webapp=/solr path=/update params={wt=javabin&version=2}{add=[198]} 0 0
[junit4] 2> 522435 INFO (qtp1024640044-2866) [ x:collection1] o.a.s.u.p.LogUpdateProcessorFactory [collection1] webapp=/solr path=/update params={wt=javabin&version=2}{add=[199]} 0 0
[junit4] 2> 522436 INFO (qtp1024640044-2861) [ x:collection1] o.a.s.u.p.LogUpdateProcessorFactory [collection1] webapp=/solr path=/update params={wt=javabin&version=2}{add=[200]} 0 0
[junit4] 2> 522438 INFO (qtp1024640044-2865) [ x:collection1] o.a.s.u.p.LogUpdateProcessorFactory [collection1] webapp=/solr path=/update params={wt=javabin&version=2}{add=[201]} 0 0
[junit4] 2> 522439 INFO (qtp1024640044-2864) [ x:collection1] o.a.s.u.p.LogUpdateProcessorFactory [collection1] webapp=/solr path=/update params={wt=javabin&version=2}{add=[202]} 0 0
[junit4] 2> 522441 INFO (qtp1024640044-2863) [ x:collection1] o.a.s.u.p.LogUpdateProcessorFactory [collection1] webapp=/solr path=/update params={wt=javabin&version=2}{add=[203]} 0 0
[junit4] 2> 522442 INFO (qtp1024640044-2860) [ x:collection1] o.a.s.u.p.LogUpdateProcessorFactory [collection1] webapp=/solr path=/update params={wt=javabin&version=2}{add=[204]} 0 0
[junit4] 2> 522444 INFO (qtp1024640044-2866) [ x:collection1] o.a.s.u.p.LogUpdateProcessorFactory [collection1] webapp=/solr path=/update params={wt=javabin&version=2}{add=[205]} 0 0
[junit4] 2> 522445 INFO (qtp1024640044-2866) [ x:collection1] o.a.s.u.p.LogUpdateProcessorFactory [collection1] webapp=/solr path=/update params={wt=javabin&version=2}{add=[206]} 0 0
[junit4] 2> 522447 INFO (qtp1024640044-2865) [ x:collection1] o.a.s.u.p.LogUpdateProcessorFactory [collection1] webapp=/solr path=/update params={wt=javabin&version=2}{add=[207]} 0 0
[junit4] 2> 522448 INFO (qtp1024640044-2864) [ x:collection1] o.a.s.u.p.LogUpdateProcessorFactory [collection1] webapp=/solr path=/update params={wt=javabin&version=2}{add=[208]} 0 0
[junit4] 2> 522450 INFO (qtp1024640044-2863) [ x:collection1] o.a.s.u.p.LogUpdateProcessorFactory [collection1] webapp=/solr path=/update params={wt=javabin&version=2}{add=[209]} 0 0
[junit4] 2> 522451 INFO (qtp1024640044-2863) [ x:collection1] o.a.s.u.p.LogUpdateProcessorFactory [collection1] webapp=/solr path=/update params={wt=javabin&version=2}{add=[210]} 0 0
[junit4] 2> 522453 INFO (qtp1024640044-2861) [ x:collection1] o.a.s.u.p.LogUpdateProcessorFactory [collection1] webapp=/solr path=/update params={wt=javabin&version=2}{add=[211]} 0 0
[junit4] 2> 522454 INFO (qtp1024640044-2866) [ x:collection1] o.a.s.u.p.LogUpdateProcessorFactory [collection1] webapp=/solr path=/update params={wt=javabin&version=2}{add=[212]} 0 0
[junit4] 2> 522456 INFO (qtp1024640044-2865) [ x:collection1] o.a.s.u.p.LogUpdateProcessorFactory [collection1] webapp=/solr path=/update params={wt=javabin&version=2}{add=[213]} 0 0
[junit4] 2> 522457 INFO (qtp1024640044-2864) [ x:collection1] o.a.s.u.p.LogUpdateProcessorFactory [collection1] webapp=/solr path=/update params={wt=javabin&version=2}{add=[214]} 0 0
[junit4] 2> 522459 INFO (qtp1024640044-2860) [ x:collection1] o.a.s.u.p.LogUpdateProcessorFactory [collection1] webapp=/solr path=/update params={wt=javabin&version=2}{add=[215]} 0 0
[junit4] 2> 522460 INFO (qtp1024640044-2860) [ x:collection1] o.a.s.u.p.LogUpdateProcessorFactory [collection1] webapp=/solr path=/update params={wt=javabin&version=2}{add=[216]} 0 0
[junit4] 2> 522461 INFO (qtp1024640044-2861) [ x:collection1] o.a.s.u.p.LogUpdateProcessorFactory [collection1] webapp=/solr path=/update params={wt=javabin&version=2}{add=[217]} 0 0
[junit4] 2> 522463 INFO (qtp1024640044-2861) [ x:collection1] o.a.s.u.p.LogUpdateProcessorFactory [collection1] webapp=/solr path=/update params={wt=javabin&version=2}{add=[218]} 0 0
[junit4] 2> 522464 INFO (qtp1024640044-2865) [ x:collection1] o.a.s.u.p.LogUpdateProcessorFactory [collection1] webapp=/solr path=/update params={wt=javabin&version=2}{add=[219]} 0 0
[junit4] 2> 522466 INFO (qtp1024640044-2864) [ x:collection1] o.a.s.u.p.LogUpdateProcessorFactory [collection1] webapp=/solr path=/update params={wt=javabin&version=2}{add=[220]} 0 0
[junit4] 2> 522467 INFO (qtp1024640044-2863) [ x:collection1] o.a.s.u.p.LogUpdateProcessorFactory [collection1] webapp=/solr path=/update params={wt=javabin&version=2}{add=[221]} 0 0
[junit4] 2> 522469 INFO (qtp1024640044-2863) [ x:collection1] o.a.s.u.p.LogUpdateProcessorFactory [collection1] webapp=/solr path=/update params={wt=javabin&version=2}{add=[222]} 0 0
[junit4] 2> 522470 INFO (qtp1024640044-2866) [ x:collection1] o.a.s.u.p.LogUpdateProcessorFactory [collection1] webapp=/solr path=/update params={wt=javabin&version=2}{add=[223]} 0 0
[junit4] 2> 522472 INFO (qtp1024640044-2866) [ x:collection1] o.a.s.u.p.LogUpdateProcessorFactory [collection1] webapp=/solr path=/update params={wt=javabin&version=2}{add=[224]} 0 0
[junit4] 2> 522473 INFO (qtp1024640044-2865) [ x:collection1] o.a.s.u.p.LogUpdateProcessorFactory [collection1] webapp=/solr path=/update params={wt=javabin&version=2}{add=[225]} 0 0
[junit4] 2> 522475 INFO (qtp1024640044-2864) [ x:collection1] o.a.s.u.p.LogUpdateProcessorFactory [collection1] webapp=/solr path=/update params={wt=javabin&version=2}{add=[226]} 0 0
[junit4] 2> 522476 INFO (qtp1024640044-2860) [ x:collection1] o.a.s.u.p.LogUpdateProcessorFactory [collection1] webapp=/solr path=/update params={wt=javabin&version=2}{add=[227]} 0 0
[junit4] 2> 522478 INFO (qtp1024640044-2863) [ x:collection1] o.a.s.u.p.LogUpdateProcessorFactory [collection1] webapp=/solr path=/update params={wt=javabin&version=2}{add=[228]} 0 0
[junit4] 2> 522479 INFO (qtp1024640044-2861) [ x:collection1] o.a.s.u.p.LogUpdateProcessorFactory [collection1] webapp=/solr path=/update params={wt=javabin&version=2}{add=[229]} 0 0
[junit4] 2> 522481 INFO (qtp1024640044-2861) [ x:collection1] o.a.s.u.p.LogUpdateProcessorFactory [collection1] webapp=/solr path=/update params={wt=javabin&version=2}{add=[230]} 0 0
[junit4] 2> 522482 INFO (qtp1024640044-2865) [ x:collection1] o.a.s.u.p.LogUpdateProcessorFactory [collection1] webapp=/solr path=/update params={wt=javabin&version=2}{add=[231]} 0 0
[junit4] 2> 522484 INFO (qtp1024640044-2864) [ x:collection1] o.a.s.u.p.LogUpdateProcessorFactory [collection1] webapp=/solr path=/update params={wt=javabin&version=2}{add=[232]} 0 0
[junit4] 2> 522485 INFO (qtp1024640044-2860) [ x:collection1] o.a.s.u.p.LogUpdateProcessorFactory [collection1] webapp=/solr path=/update params={wt=javabin&version=2}{add=[233]} 0 0
[junit4] 2> 522487 INFO (qtp1024640044-2860) [ x:collection1] o.a.s.u.p.LogUpdateProcessorFactory [collection1] webapp=/solr path=/update params={wt=javabin&version=2}{add=[234]} 0 0
[junit4] 2> 522488 INFO (qtp1024640044-2866) [ x:collection1] o.a.s.u.p.LogUpdateProcessorFactory [collection1] webapp=/solr path=/update params={wt=javabin&version=2}{add=[235]} 0 0
[junit4] 2> 522490 INFO (qtp1024640044-2866) [ x:collection1] o.a.s.u.p.LogUpdateProcessorFactory [collection1] webapp=/solr path=/update params={wt=javabin&version=2}{add=[236]} 0 0
[junit4] 2> 522491 INFO (qtp1024640044-2865) [ x:collection1] o.a.s.u.p.LogUpdateProcessorFactory [collection1] webapp=/solr path=/update params={wt=javabin&version=2}{add=[237]} 0 0
[junit4] 2> 522492 INFO (qtp1024640044-2864) [ x:collection1] o.a.s.u.p.LogUpdateProcessorFactory [collection1] webapp=/solr path=/update params={wt=javabin&version=2}{add=[238]} 0 0
[junit4] 2> 522494 INFO (qtp1024640044-2863) [ x:collection1] o.a.s.u.p.LogUpdateProcessorFactory [collection1] webapp=/solr path=/update params={wt=javabin&version=2}{add=[239]} 0 0
[junit4] 2> 522495 INFO (qtp1024640044-2863) [ x:collection1] o.a.s.u.p.LogUpdateProcessorFactory [collection1] webapp=/solr path=/update params={wt=javabin&version=2}{add=[240]} 0 0
[junit4] 2> 522497 INFO (qtp1024640044-2861) [ x:collection1] o.a.s.u.p.LogUpdateProcessorFactory [collection1] webapp=/solr path=/update params={wt=javabin&version=2}{add=[241]} 0 0
[junit4] 2> 522498 INFO (qtp1024640044-2866) [ x:collection1] o.a.s.u.p.LogUpdateProcessorFactory [collection1] webapp=/solr path=/update params={wt=javabin&version=2}{add=[242]} 0 0
[junit4] 2> 522500 INFO (qtp1024640044-2865) [ x:collection1] o.a.s.u.p.LogUpdateProcessorFactory [collection1] webapp=/solr path=/update params={wt=javabin&version=2}{add=[243]} 0 0
[junit4] 2> 522501 INFO (qtp1024640044-2864) [ x:collection1] o.a.s.u.p.LogUpdateProcessorFactory [collection1] webapp=/solr path=/update params={wt=javabin&version=2}{add=[244]} 0 0
[junit4] 2> 522503 INFO (qtp1024640044-2860) [ x:collection1] o.a.s.u.p.LogUpdateProcessorFactory [collection1] webapp=/solr path=/update params={wt=javabin&version=2}{add=[245]} 0 0
[junit4] 2> 522505 INFO (qtp1024640044-2863) [ x:collection1] o.a.s.u.p.LogUpdateProcessorFactory [collection1] webapp=/solr path=/update params={wt=javabin&version=2}{add=[246]} 0 0
[junit4] 2> 522506 INFO (qtp1024640044-2861) [ x:collection1] o.a.s.u.p.LogUpdateProcessorFactory [collection1] webapp=/solr path=/update params={wt=javabin&version=2}{add=[247]} 0 0
[junit4] 2> 522508 INFO (qtp1024640044-2866) [ x:collection1] o.a.s.u.p.LogUpdateProcessorFactory [collection1] webapp=/solr path=/update params={wt=javabin&version=2}{add=[248]} 0 0
[junit4] 2> 522509 INFO (qtp1024640044-2865) [ x:collection1] o.a.s.u.p.LogUpdateProcessorFactory [collection1] webapp=/solr path=/update params={wt=javabin&version=2}{add=[249]} 0 0
[junit4] 2> 522511 INFO (qtp1024640044-2864) [ x:collection1] o.a.s.u.p.LogUpdateProcessorFactory [collection1] webapp=/solr path=/update params={wt=javabin&version=2}{add=[250]} 0 0
[junit4] 2> 522512 INFO (qtp1024640044-2860) [ x:collection1] o.a.s.u.p.LogUpdateProcessorFactory [collection1] webapp=/solr path=/update params={wt=javabin&version=2}{add=[251]} 0 0
[junit4] 2> 522516 INFO (qtp1024640044-2863) [ x:collection1] o.a.s.u.p.LogUpdateProcessorFactory [collection1] webapp=/solr path=/update params={wt=javabin&version=2}{add=[252]} 0 0
[junit4] 2> 522517 INFO (qtp1024640044-2861) [ x:collection1] o.a.s.u.p.LogUpdateProcessorFactory [collection1] webapp=/solr path=/update params={wt=javabin&version=2}{add=[253]} 0 0
[junit4] 2> 522521 INFO (qtp1024640044-2861) [ x:collection1] o.a.s.u.p.LogUpdateProcessorFactory [collection1] webapp=/solr path=/update params={wt=javabin&version=2}{add=[254]} 0 0
[junit4] 2> 522523 INFO (qtp1024640044-2865) [ x:collection1] o.a.s.u.p.LogUpdateProcessorFactory [collection1] webapp=/solr path=/update params={wt=javabin&version=2}{add=[255]} 0 0
[junit4] 2> 522525 INFO (qtp1024640044-2864) [ x:collection1] o.a.s.u.p.LogUpdateProcessorFactory [collection1] webapp=/solr path=/update params={wt=javabin&version=2}{add=[256]} 0 0
[junit4] 2> 522527 INFO (qtp1024640044-2860) [ x:collection1] o.a.s.u.p.LogUpdateProcessorFactory [collection1] webapp=/solr path=/update params={wt=javabin&version=2}{add=[257]} 0 0
[junit4] 2> 522528 INFO (qtp1024640044-2860) [ x:collection1] o.a.s.u.p.LogUpdateProcessorFactory [collection1] webapp=/solr path=/update params={wt=javabin&version=2}{add=[258]} 0 0
[junit4] 2> 522530 INFO (qtp1024640044-2866) [ x:collection1] o.a.s.u.p.LogUpdateProcessorFactory [collection1] webapp=/solr path=/update params={wt=javabin&v
[...truncated too long message...]
oseExecutor-2054-thread-1) [ x:collection1] o.a.s.c.SolrDeletionPolicy newest commit generation = 3
[junit4] 2> 609550 INFO (coreCloseExecutor-2054-thread-1) [ x:collection1] o.a.s.c.SolrCore [collection1] Closing main searcher on request.
[junit4] 2> 609550 INFO (coreCloseExecutor-2054-thread-1) [ x:collection1] o.a.s.c.CachingDirectoryFactory Closing NRTCachingDirectoryFactory - 2 directories currently being tracked
[junit4] 2> 609550 INFO (coreCloseExecutor-2054-thread-1) [ x:collection1] o.a.s.c.CachingDirectoryFactory looking to close /x1/jenkins/jenkins-slave/workspace/Lucene-Solr-Tests-6.x/solr/build/solr-core/test/J0/temp/solr.handler.TestReplicationHandler_F2A73B26F91730E7-001/solr-instance-029/collection1/data [CachedDir<<refCount=0;path=/x1/jenkins/jenkins-slave/workspace/Lucene-Solr-Tests-6.x/solr/build/solr-core/test/J0/temp/solr.handler.TestReplicationHandler_F2A73B26F91730E7-001/solr-instance-029/collection1/data;done=false>>]
[junit4] 2> 609550 INFO (coreCloseExecutor-2054-thread-1) [ x:collection1] o.a.s.c.CachingDirectoryFactory Closing directory, CoreContainer#isShutdown=true
[junit4] 2> 609550 INFO (coreCloseExecutor-2054-thread-1) [ x:collection1] o.a.s.c.CachingDirectoryFactory Closing directory: /x1/jenkins/jenkins-slave/workspace/Lucene-Solr-Tests-6.x/solr/build/solr-core/test/J0/temp/solr.handler.TestReplicationHandler_F2A73B26F91730E7-001/solr-instance-029/collection1/data
[junit4] 2> 609550 INFO (coreCloseExecutor-2054-thread-1) [ x:collection1] o.a.s.c.CachingDirectoryFactory looking to close /x1/jenkins/jenkins-slave/workspace/Lucene-Solr-Tests-6.x/solr/build/solr-core/test/J0/temp/solr.handler.TestReplicationHandler_F2A73B26F91730E7-001/solr-instance-029/collection1/data/index [CachedDir<<refCount=0;path=/x1/jenkins/jenkins-slave/workspace/Lucene-Solr-Tests-6.x/solr/build/solr-core/test/J0/temp/solr.handler.TestReplicationHandler_F2A73B26F91730E7-001/solr-instance-029/collection1/data/index;done=false>>]
[junit4] 2> 609550 INFO (coreCloseExecutor-2054-thread-1) [ x:collection1] o.a.s.c.CachingDirectoryFactory Closing directory, CoreContainer#isShutdown=true
[junit4] 2> 609550 INFO (coreCloseExecutor-2054-thread-1) [ x:collection1] o.a.s.c.CachingDirectoryFactory Closing directory: /x1/jenkins/jenkins-slave/workspace/Lucene-Solr-Tests-6.x/solr/build/solr-core/test/J0/temp/solr.handler.TestReplicationHandler_F2A73B26F91730E7-001/solr-instance-029/collection1/data/index
[junit4] 2> 609551 INFO (TEST-TestReplicationHandler.testRateLimitedReplication-seed#[F2A73B26F91730E7]) [ ] o.e.j.s.h.ContextHandler Stopped o.e.j.s.ServletContextHandler@c0e1d19{/solr,null,UNAVAILABLE}
[junit4] 2> 609552 INFO (TEST-TestReplicationHandler.testRateLimitedReplication-seed#[F2A73B26F91730E7]) [ ] o.e.j.s.ServerConnector Stopped ServerConnector@2d5e6213{HTTP/1.1,[http/1.1]}{127.0.0.1:0}
[junit4] 2> 609552 INFO (TEST-TestReplicationHandler.testRateLimitedReplication-seed#[F2A73B26F91730E7]) [ ] o.a.s.c.CoreContainer Shutting down CoreContainer instance=263374201
[junit4] 2> 609552 INFO (coreCloseExecutor-2056-thread-1) [ x:collection1] o.a.s.c.SolrCore [collection1] CLOSING SolrCore org.apache.solr.core.SolrCore@164f153e
[junit4] 2> 609552 INFO (coreCloseExecutor-2056-thread-1) [ x:collection1] o.a.s.u.DirectUpdateHandler2 closing DirectUpdateHandler2{commits=0,autocommits=0,soft autocommits=0,optimizes=0,rollbacks=0,expungeDeletes=0,docsPending=0,adds=0,deletesById=0,deletesByQuery=0,errors=0,cumulative_adds=0,cumulative_deletesById=0,cumulative_deletesByQuery=0,cumulative_errors=0}
[junit4] 2> 609552 INFO (coreCloseExecutor-2056-thread-1) [ x:collection1] o.a.s.u.SolrCoreState Closing SolrCoreState
[junit4] 2> 609552 INFO (coreCloseExecutor-2056-thread-1) [ x:collection1] o.a.s.u.DefaultSolrCoreState SolrCoreState ref count has reached 0 - closing IndexWriter
[junit4] 2> 609552 INFO (coreCloseExecutor-2056-thread-1) [ x:collection1] o.a.s.u.DefaultSolrCoreState closing IndexWriter with IndexWriterCloser
[junit4] 2> 609554 INFO (coreCloseExecutor-2056-thread-1) [ x:collection1] o.a.s.c.SolrCore [collection1] Closing main searcher on request.
[junit4] 2> 609554 INFO (coreCloseExecutor-2056-thread-1) [ x:collection1] o.a.s.c.CachingDirectoryFactory Closing NRTCachingDirectoryFactory - 2 directories currently being tracked
[junit4] 2> 609554 INFO (coreCloseExecutor-2056-thread-1) [ x:collection1] o.a.s.c.CachingDirectoryFactory looking to close /x1/jenkins/jenkins-slave/workspace/Lucene-Solr-Tests-6.x/solr/build/solr-core/test/J0/temp/solr.handler.TestReplicationHandler_F2A73B26F91730E7-001/solr-instance-030/collection1/data [CachedDir<<refCount=0;path=/x1/jenkins/jenkins-slave/workspace/Lucene-Solr-Tests-6.x/solr/build/solr-core/test/J0/temp/solr.handler.TestReplicationHandler_F2A73B26F91730E7-001/solr-instance-030/collection1/data;done=false>>]
[junit4] 2> 609554 INFO (coreCloseExecutor-2056-thread-1) [ x:collection1] o.a.s.c.CachingDirectoryFactory Closing directory, CoreContainer#isShutdown=true
[junit4] 2> 609554 INFO (coreCloseExecutor-2056-thread-1) [ x:collection1] o.a.s.c.CachingDirectoryFactory Closing directory: /x1/jenkins/jenkins-slave/workspace/Lucene-Solr-Tests-6.x/solr/build/solr-core/test/J0/temp/solr.handler.TestReplicationHandler_F2A73B26F91730E7-001/solr-instance-030/collection1/data
[junit4] 2> 609555 INFO (coreCloseExecutor-2056-thread-1) [ x:collection1] o.a.s.c.CachingDirectoryFactory looking to close /x1/jenkins/jenkins-slave/workspace/Lucene-Solr-Tests-6.x/solr/build/solr-core/test/J0/temp/solr.handler.TestReplicationHandler_F2A73B26F91730E7-001/solr-instance-030/collection1/data/index [CachedDir<<refCount=0;path=/x1/jenkins/jenkins-slave/workspace/Lucene-Solr-Tests-6.x/solr/build/solr-core/test/J0/temp/solr.handler.TestReplicationHandler_F2A73B26F91730E7-001/solr-instance-030/collection1/data/index;done=false>>]
[junit4] 2> 609555 INFO (coreCloseExecutor-2056-thread-1) [ x:collection1] o.a.s.c.CachingDirectoryFactory Closing directory, CoreContainer#isShutdown=true
[junit4] 2> 609555 INFO (coreCloseExecutor-2056-thread-1) [ x:collection1] o.a.s.c.CachingDirectoryFactory Closing directory: /x1/jenkins/jenkins-slave/workspace/Lucene-Solr-Tests-6.x/solr/build/solr-core/test/J0/temp/solr.handler.TestReplicationHandler_F2A73B26F91730E7-001/solr-instance-030/collection1/data/index
[junit4] 2> 609555 INFO (TEST-TestReplicationHandler.testRateLimitedReplication-seed#[F2A73B26F91730E7]) [ ] o.e.j.s.h.ContextHandler Stopped o.e.j.s.ServletContextHandler@39749b4b{/solr,null,UNAVAILABLE}
[junit4] 2> 609556 INFO (SUITE-TestReplicationHandler-seed#[F2A73B26F91730E7]-worker) [ ] o.a.s.SolrTestCaseJ4 ###deleteCore
[junit4] 2> NOTE: leaving temporary files on disk at: /x1/jenkins/jenkins-slave/workspace/Lucene-Solr-Tests-6.x/solr/build/solr-core/test/J0/temp/solr.handler.TestReplicationHandler_F2A73B26F91730E7-001
[junit4] 2> NOTE: test params are: codec=SimpleText, sim=RandomSimilarity(queryNorm=true,coord=yes): {}, locale=es-CR, timezone=Antarctica/Troll
[junit4] 2> NOTE: Linux 3.13.0-85-generic amd64/Oracle Corporation 1.8.0_74 (64-bit)/cpus=4,threads=1,free=163699152,total=529006592
[junit4] 2> NOTE: All tests run in this JVM: [DefaultValueUpdateProcessorTest, TestStressUserVersions, TestBinaryField, TestDistributedSearch, TestRebalanceLeaders, TestExceedMaxTermLength, ParsingFieldUpdateProcessorsTest, TestManagedStopFilterFactory, RequestLoggingTest, PreAnalyzedFieldTest, TestJoin, IndexSchemaRuntimeFieldTest, TestStressLucene, SortSpecParsingTest, TestUninvertingReader, BasicZkTest, CopyFieldTest, JsonLoaderTest, TestPhraseSuggestions, SyncSliceTest, TestOmitPositions, SolrCloudExampleTest, TestSolrQueryParserDefaultOperatorResource, CloneFieldUpdateProcessorFactoryTest, TestSQLHandler, TlogReplayBufferedWhileIndexingTest, DistributedFacetPivotLongTailTest, TestHighlightDedupGrouping, TestFaceting, PingRequestHandlerTest, TestSortByMinMaxFunction, DistributedFacetPivotWhiteBoxTest, ActionThrottleTest, DistributedQueryElevationComponentTest, TestFastOutputStream, DateFieldTest, DisMaxRequestHandlerTest, PeerSyncTest, TestAtomicUpdateErrorCases, BlockJoinFacetRandomTest, TestFieldTypeResource, TestPerFieldSimilarityWithDefaultOverride, SSLMigrationTest, InfoHandlerTest, HdfsBasicDistributedZk2Test, EchoParamsTest, TestReplicationHandlerBackup, LeaderElectionIntegrationTest, TestReplicationHandler]
[junit4] Completed [146/615 (1!)] on J0 in 88.52s, 15 tests, 1 failure, 1 skipped <<< FAILURES!
[...truncated 1538 lines...]
BUILD FAILED
/x1/jenkins/jenkins-slave/workspace/Lucene-Solr-Tests-6.x/build.xml:740: The following error occurred while executing this line:
/x1/jenkins/jenkins-slave/workspace/Lucene-Solr-Tests-6.x/build.xml:684: The following error occurred while executing this line:
/x1/jenkins/jenkins-slave/workspace/Lucene-Solr-Tests-6.x/build.xml:59: The following error occurred while executing this line:
/x1/jenkins/jenkins-slave/workspace/Lucene-Solr-Tests-6.x/solr/build.xml:233: The following error occurred while executing this line:
/x1/jenkins/jenkins-slave/workspace/Lucene-Solr-Tests-6.x/solr/common-build.xml:530: The following error occurred while executing this line:
/x1/jenkins/jenkins-slave/workspace/Lucene-Solr-Tests-6.x/lucene/common-build.xml:1427: The following error occurred while executing this line:
/x1/jenkins/jenkins-slave/workspace/Lucene-Solr-Tests-6.x/lucene/common-build.xml:984: There were test failures: 615 suites (10 ignored), 2591 tests, 1 failure, 87 ignored (72 assumptions) [seed: F2A73B26F91730E7]
Total time: 66 minutes 2 seconds
Build step 'Invoke Ant' marked build as failure
Archiving artifacts
Recording test results
Email was triggered for: Failure - Any
Sending email for trigger: Failure - Any
[JENKINS] Lucene-Solr-Tests-6.x - Build # 285 - Still Failing
Posted by Apache Jenkins Server <je...@builds.apache.org>.
Build: https://builds.apache.org/job/Lucene-Solr-Tests-6.x/285/
1 tests failed.
FAILED: org.apache.solr.handler.TestReqParamsAPI.test
Error Message:
Could not get expected value 'CY val modified' for path 'response/params/y/c' full output: { "responseHeader":{ "status":0, "QTime":0}, "response":{ "znodeVersion":1, "params":{ "x":{ "a":"A val", "b":"B val", "":{"v":0}}, "y":{ "c":"CY val", "b":"BY val", "i":20, "d":[ "val 1", "val 2"], "":{"v":0}}}}}, from server: https://127.0.0.1:59972/collection1
Stack Trace:
java.lang.AssertionError: Could not get expected value 'CY val modified' for path 'response/params/y/c' full output: {
"responseHeader":{
"status":0,
"QTime":0},
"response":{
"znodeVersion":1,
"params":{
"x":{
"a":"A val",
"b":"B val",
"":{"v":0}},
"y":{
"c":"CY val",
"b":"BY val",
"i":20,
"d":[
"val 1",
"val 2"],
"":{"v":0}}}}}, from server: https://127.0.0.1:59972/collection1
at __randomizedtesting.SeedInfo.seed([63F3FC14C09E69F1:EBA7C3CE6E620409]:0)
at org.junit.Assert.fail(Assert.java:93)
at org.junit.Assert.assertTrue(Assert.java:43)
at org.apache.solr.core.TestSolrConfigHandler.testForResponseElement(TestSolrConfigHandler.java:481)
at org.apache.solr.handler.TestReqParamsAPI.testReqParams(TestReqParamsAPI.java:194)
at org.apache.solr.handler.TestReqParamsAPI.test(TestReqParamsAPI.java:61)
at sun.reflect.NativeMethodAccessorImpl.invoke0(Native Method)
at sun.reflect.NativeMethodAccessorImpl.invoke(NativeMethodAccessorImpl.java:62)
at sun.reflect.DelegatingMethodAccessorImpl.invoke(DelegatingMethodAccessorImpl.java:43)
at java.lang.reflect.Method.invoke(Method.java:498)
at com.carrotsearch.randomizedtesting.RandomizedRunner.invoke(RandomizedRunner.java:1764)
at com.carrotsearch.randomizedtesting.RandomizedRunner$8.evaluate(RandomizedRunner.java:871)
at com.carrotsearch.randomizedtesting.RandomizedRunner$9.evaluate(RandomizedRunner.java:907)
at com.carrotsearch.randomizedtesting.RandomizedRunner$10.evaluate(RandomizedRunner.java:921)
at org.apache.solr.BaseDistributedSearchTestCase$ShardsRepeatRule$ShardsFixedStatement.callStatement(BaseDistributedSearchTestCase.java:992)
at org.apache.solr.BaseDistributedSearchTestCase$ShardsRepeatRule$ShardsStatement.evaluate(BaseDistributedSearchTestCase.java:967)
at com.carrotsearch.randomizedtesting.rules.SystemPropertiesRestoreRule$1.evaluate(SystemPropertiesRestoreRule.java:57)
at org.apache.lucene.util.TestRuleSetupTeardownChained$1.evaluate(TestRuleSetupTeardownChained.java:49)
at org.apache.lucene.util.AbstractBeforeAfterRule$1.evaluate(AbstractBeforeAfterRule.java:45)
at org.apache.lucene.util.TestRuleThreadAndTestName$1.evaluate(TestRuleThreadAndTestName.java:48)
at org.apache.lucene.util.TestRuleIgnoreAfterMaxFailures$1.evaluate(TestRuleIgnoreAfterMaxFailures.java:64)
at org.apache.lucene.util.TestRuleMarkFailure$1.evaluate(TestRuleMarkFailure.java:47)
at com.carrotsearch.randomizedtesting.rules.StatementAdapter.evaluate(StatementAdapter.java:36)
at com.carrotsearch.randomizedtesting.ThreadLeakControl$StatementRunner.run(ThreadLeakControl.java:367)
at com.carrotsearch.randomizedtesting.ThreadLeakControl.forkTimeoutingTask(ThreadLeakControl.java:809)
at com.carrotsearch.randomizedtesting.ThreadLeakControl$3.evaluate(ThreadLeakControl.java:460)
at com.carrotsearch.randomizedtesting.RandomizedRunner.runSingleTest(RandomizedRunner.java:880)
at com.carrotsearch.randomizedtesting.RandomizedRunner$5.evaluate(RandomizedRunner.java:781)
at com.carrotsearch.randomizedtesting.RandomizedRunner$6.evaluate(RandomizedRunner.java:816)
at com.carrotsearch.randomizedtesting.RandomizedRunner$7.evaluate(RandomizedRunner.java:827)
at com.carrotsearch.randomizedtesting.rules.StatementAdapter.evaluate(StatementAdapter.java:36)
at com.carrotsearch.randomizedtesting.rules.SystemPropertiesRestoreRule$1.evaluate(SystemPropertiesRestoreRule.java:57)
at org.apache.lucene.util.AbstractBeforeAfterRule$1.evaluate(AbstractBeforeAfterRule.java:45)
at com.carrotsearch.randomizedtesting.rules.StatementAdapter.evaluate(StatementAdapter.java:36)
at org.apache.lucene.util.TestRuleStoreClassName$1.evaluate(TestRuleStoreClassName.java:41)
at com.carrotsearch.randomizedtesting.rules.NoShadowingOrOverridesOnMethodsRule$1.evaluate(NoShadowingOrOverridesOnMethodsRule.java:40)
at com.carrotsearch.randomizedtesting.rules.NoShadowingOrOverridesOnMethodsRule$1.evaluate(NoShadowingOrOverridesOnMethodsRule.java:40)
at com.carrotsearch.randomizedtesting.rules.StatementAdapter.evaluate(StatementAdapter.java:36)
at com.carrotsearch.randomizedtesting.rules.StatementAdapter.evaluate(StatementAdapter.java:36)
at com.carrotsearch.randomizedtesting.rules.StatementAdapter.evaluate(StatementAdapter.java:36)
at org.apache.lucene.util.TestRuleAssertionsRequired$1.evaluate(TestRuleAssertionsRequired.java:53)
at org.apache.lucene.util.TestRuleMarkFailure$1.evaluate(TestRuleMarkFailure.java:47)
at org.apache.lucene.util.TestRuleIgnoreAfterMaxFailures$1.evaluate(TestRuleIgnoreAfterMaxFailures.java:64)
at org.apache.lucene.util.TestRuleIgnoreTestSuites$1.evaluate(TestRuleIgnoreTestSuites.java:54)
at com.carrotsearch.randomizedtesting.rules.StatementAdapter.evaluate(StatementAdapter.java:36)
at com.carrotsearch.randomizedtesting.ThreadLeakControl$StatementRunner.run(ThreadLeakControl.java:367)
at java.lang.Thread.run(Thread.java:745)
Build Log:
[...truncated 11142 lines...]
[junit4] Suite: org.apache.solr.handler.TestReqParamsAPI
[junit4] 2> Creating dataDir: /x1/jenkins/jenkins-slave/workspace/Lucene-Solr-Tests-6.x/solr/build/solr-core/test/J1/temp/solr.handler.TestReqParamsAPI_63F3FC14C09E69F1-001/init-core-data-001
[junit4] 2> 607468 INFO (SUITE-TestReqParamsAPI-seed#[63F3FC14C09E69F1]-worker) [ ] o.a.s.SolrTestCaseJ4 Randomized ssl (true) and clientAuth (true) via: @org.apache.solr.util.RandomizeSSL(reason=, ssl=NaN, value=NaN, clientAuth=NaN)
[junit4] 2> 607468 INFO (SUITE-TestReqParamsAPI-seed#[63F3FC14C09E69F1]-worker) [ ] o.a.s.BaseDistributedSearchTestCase Setting hostContext system property: /
[junit4] 2> 607469 INFO (TEST-TestReqParamsAPI.test-seed#[63F3FC14C09E69F1]) [ ] o.a.s.c.ZkTestServer STARTING ZK TEST SERVER
[junit4] 2> 607474 INFO (Thread-1182) [ ] o.a.s.c.ZkTestServer client port:0.0.0.0/0.0.0.0:0
[junit4] 2> 607474 INFO (Thread-1182) [ ] o.a.s.c.ZkTestServer Starting server
[junit4] 2> 607574 INFO (TEST-TestReqParamsAPI.test-seed#[63F3FC14C09E69F1]) [ ] o.a.s.c.ZkTestServer start zk server on port:41810
[junit4] 2> 607574 INFO (TEST-TestReqParamsAPI.test-seed#[63F3FC14C09E69F1]) [ ] o.a.s.c.c.SolrZkClient Using default ZkCredentialsProvider
[junit4] 2> 607575 INFO (TEST-TestReqParamsAPI.test-seed#[63F3FC14C09E69F1]) [ ] o.a.s.c.c.ConnectionManager Waiting for client to connect to ZooKeeper
[junit4] 2> 607582 INFO (zkCallback-487-thread-1) [ ] o.a.s.c.c.ConnectionManager Watcher org.apache.solr.common.cloud.ConnectionManager@5ef5b80c name:ZooKeeperConnection Watcher:127.0.0.1:41810 got event WatchedEvent state:SyncConnected type:None path:null path:null type:None
[junit4] 2> 607583 INFO (TEST-TestReqParamsAPI.test-seed#[63F3FC14C09E69F1]) [ ] o.a.s.c.c.ConnectionManager Client is connected to ZooKeeper
[junit4] 2> 607583 INFO (TEST-TestReqParamsAPI.test-seed#[63F3FC14C09E69F1]) [ ] o.a.s.c.c.SolrZkClient Using default ZkACLProvider
[junit4] 2> 607583 INFO (TEST-TestReqParamsAPI.test-seed#[63F3FC14C09E69F1]) [ ] o.a.s.c.c.SolrZkClient makePath: /solr
[junit4] 2> 607587 INFO (TEST-TestReqParamsAPI.test-seed#[63F3FC14C09E69F1]) [ ] o.a.s.c.c.SolrZkClient Using default ZkCredentialsProvider
[junit4] 2> 607590 INFO (TEST-TestReqParamsAPI.test-seed#[63F3FC14C09E69F1]) [ ] o.a.s.c.c.ConnectionManager Waiting for client to connect to ZooKeeper
[junit4] 2> 607590 INFO (zkCallback-488-thread-1) [ ] o.a.s.c.c.ConnectionManager Watcher org.apache.solr.common.cloud.ConnectionManager@79af2efa name:ZooKeeperConnection Watcher:127.0.0.1:41810/solr got event WatchedEvent state:SyncConnected type:None path:null path:null type:None
[junit4] 2> 607590 INFO (TEST-TestReqParamsAPI.test-seed#[63F3FC14C09E69F1]) [ ] o.a.s.c.c.ConnectionManager Client is connected to ZooKeeper
[junit4] 2> 607591 INFO (TEST-TestReqParamsAPI.test-seed#[63F3FC14C09E69F1]) [ ] o.a.s.c.c.SolrZkClient Using default ZkACLProvider
[junit4] 2> 607591 INFO (TEST-TestReqParamsAPI.test-seed#[63F3FC14C09E69F1]) [ ] o.a.s.c.c.SolrZkClient makePath: /collections/collection1
[junit4] 2> 607592 INFO (TEST-TestReqParamsAPI.test-seed#[63F3FC14C09E69F1]) [ ] o.a.s.c.c.SolrZkClient makePath: /collections/collection1/shards
[junit4] 2> 607593 INFO (TEST-TestReqParamsAPI.test-seed#[63F3FC14C09E69F1]) [ ] o.a.s.c.c.SolrZkClient makePath: /collections/control_collection
[junit4] 2> 607593 INFO (TEST-TestReqParamsAPI.test-seed#[63F3FC14C09E69F1]) [ ] o.a.s.c.c.SolrZkClient makePath: /collections/control_collection/shards
[junit4] 2> 607594 INFO (TEST-TestReqParamsAPI.test-seed#[63F3FC14C09E69F1]) [ ] o.a.s.c.AbstractZkTestCase put /x1/jenkins/jenkins-slave/workspace/Lucene-Solr-Tests-6.x/solr/core/src/test-files/solr/collection1/conf/solrconfig-tlog.xml to /configs/conf1/solrconfig.xml
[junit4] 2> 607594 INFO (TEST-TestReqParamsAPI.test-seed#[63F3FC14C09E69F1]) [ ] o.a.s.c.c.SolrZkClient makePath: /configs/conf1/solrconfig.xml
[junit4] 2> 607595 INFO (TEST-TestReqParamsAPI.test-seed#[63F3FC14C09E69F1]) [ ] o.a.s.c.AbstractZkTestCase put /x1/jenkins/jenkins-slave/workspace/Lucene-Solr-Tests-6.x/solr/core/src/test-files/solr/collection1/conf/schema.xml to /configs/conf1/schema.xml
[junit4] 2> 607595 INFO (TEST-TestReqParamsAPI.test-seed#[63F3FC14C09E69F1]) [ ] o.a.s.c.c.SolrZkClient makePath: /configs/conf1/schema.xml
[junit4] 2> 607596 INFO (TEST-TestReqParamsAPI.test-seed#[63F3FC14C09E69F1]) [ ] o.a.s.c.AbstractZkTestCase put /x1/jenkins/jenkins-slave/workspace/Lucene-Solr-Tests-6.x/solr/core/src/test-files/solr/collection1/conf/solrconfig.snippet.randomindexconfig.xml to /configs/conf1/solrconfig.snippet.randomindexconfig.xml
[junit4] 2> 607596 INFO (TEST-TestReqParamsAPI.test-seed#[63F3FC14C09E69F1]) [ ] o.a.s.c.c.SolrZkClient makePath: /configs/conf1/solrconfig.snippet.randomindexconfig.xml
[junit4] 2> 607597 INFO (TEST-TestReqParamsAPI.test-seed#[63F3FC14C09E69F1]) [ ] o.a.s.c.AbstractZkTestCase put /x1/jenkins/jenkins-slave/workspace/Lucene-Solr-Tests-6.x/solr/core/src/test-files/solr/collection1/conf/stopwords.txt to /configs/conf1/stopwords.txt
[junit4] 2> 607597 INFO (TEST-TestReqParamsAPI.test-seed#[63F3FC14C09E69F1]) [ ] o.a.s.c.c.SolrZkClient makePath: /configs/conf1/stopwords.txt
[junit4] 2> 607598 INFO (TEST-TestReqParamsAPI.test-seed#[63F3FC14C09E69F1]) [ ] o.a.s.c.AbstractZkTestCase put /x1/jenkins/jenkins-slave/workspace/Lucene-Solr-Tests-6.x/solr/core/src/test-files/solr/collection1/conf/protwords.txt to /configs/conf1/protwords.txt
[junit4] 2> 607598 INFO (TEST-TestReqParamsAPI.test-seed#[63F3FC14C09E69F1]) [ ] o.a.s.c.c.SolrZkClient makePath: /configs/conf1/protwords.txt
[junit4] 2> 607600 INFO (TEST-TestReqParamsAPI.test-seed#[63F3FC14C09E69F1]) [ ] o.a.s.c.AbstractZkTestCase put /x1/jenkins/jenkins-slave/workspace/Lucene-Solr-Tests-6.x/solr/core/src/test-files/solr/collection1/conf/currency.xml to /configs/conf1/currency.xml
[junit4] 2> 607600 INFO (TEST-TestReqParamsAPI.test-seed#[63F3FC14C09E69F1]) [ ] o.a.s.c.c.SolrZkClient makePath: /configs/conf1/currency.xml
[junit4] 2> 607600 INFO (TEST-TestReqParamsAPI.test-seed#[63F3FC14C09E69F1]) [ ] o.a.s.c.AbstractZkTestCase put /x1/jenkins/jenkins-slave/workspace/Lucene-Solr-Tests-6.x/solr/core/src/test-files/solr/collection1/conf/enumsConfig.xml to /configs/conf1/enumsConfig.xml
[junit4] 2> 607600 INFO (TEST-TestReqParamsAPI.test-seed#[63F3FC14C09E69F1]) [ ] o.a.s.c.c.SolrZkClient makePath: /configs/conf1/enumsConfig.xml
[junit4] 2> 607601 INFO (TEST-TestReqParamsAPI.test-seed#[63F3FC14C09E69F1]) [ ] o.a.s.c.AbstractZkTestCase put /x1/jenkins/jenkins-slave/workspace/Lucene-Solr-Tests-6.x/solr/core/src/test-files/solr/collection1/conf/open-exchange-rates.json to /configs/conf1/open-exchange-rates.json
[junit4] 2> 607601 INFO (TEST-TestReqParamsAPI.test-seed#[63F3FC14C09E69F1]) [ ] o.a.s.c.c.SolrZkClient makePath: /configs/conf1/open-exchange-rates.json
[junit4] 2> 607602 INFO (TEST-TestReqParamsAPI.test-seed#[63F3FC14C09E69F1]) [ ] o.a.s.c.AbstractZkTestCase put /x1/jenkins/jenkins-slave/workspace/Lucene-Solr-Tests-6.x/solr/core/src/test-files/solr/collection1/conf/mapping-ISOLatin1Accent.txt to /configs/conf1/mapping-ISOLatin1Accent.txt
[junit4] 2> 607602 INFO (TEST-TestReqParamsAPI.test-seed#[63F3FC14C09E69F1]) [ ] o.a.s.c.c.SolrZkClient makePath: /configs/conf1/mapping-ISOLatin1Accent.txt
[junit4] 2> 607602 INFO (TEST-TestReqParamsAPI.test-seed#[63F3FC14C09E69F1]) [ ] o.a.s.c.AbstractZkTestCase put /x1/jenkins/jenkins-slave/workspace/Lucene-Solr-Tests-6.x/solr/core/src/test-files/solr/collection1/conf/old_synonyms.txt to /configs/conf1/old_synonyms.txt
[junit4] 2> 607602 INFO (TEST-TestReqParamsAPI.test-seed#[63F3FC14C09E69F1]) [ ] o.a.s.c.c.SolrZkClient makePath: /configs/conf1/old_synonyms.txt
[junit4] 2> 607603 INFO (TEST-TestReqParamsAPI.test-seed#[63F3FC14C09E69F1]) [ ] o.a.s.c.AbstractZkTestCase put /x1/jenkins/jenkins-slave/workspace/Lucene-Solr-Tests-6.x/solr/core/src/test-files/solr/collection1/conf/synonyms.txt to /configs/conf1/synonyms.txt
[junit4] 2> 607603 INFO (TEST-TestReqParamsAPI.test-seed#[63F3FC14C09E69F1]) [ ] o.a.s.c.c.SolrZkClient makePath: /configs/conf1/synonyms.txt
[junit4] 2> 607604 INFO (TEST-TestReqParamsAPI.test-seed#[63F3FC14C09E69F1]) [ ] o.a.s.c.c.SolrZkClient Using default ZkCredentialsProvider
[junit4] 2> 607608 INFO (TEST-TestReqParamsAPI.test-seed#[63F3FC14C09E69F1]) [ ] o.a.s.c.c.ConnectionManager Waiting for client to connect to ZooKeeper
[junit4] 2> 607609 INFO (zkCallback-490-thread-1) [ ] o.a.s.c.c.ConnectionManager Watcher org.apache.solr.common.cloud.ConnectionManager@6ccbafb name:ZooKeeperConnection Watcher:127.0.0.1:41810/solr got event WatchedEvent state:SyncConnected type:None path:null path:null type:None
[junit4] 2> 607609 INFO (TEST-TestReqParamsAPI.test-seed#[63F3FC14C09E69F1]) [ ] o.a.s.c.c.ConnectionManager Client is connected to ZooKeeper
[junit4] 2> 607609 INFO (TEST-TestReqParamsAPI.test-seed#[63F3FC14C09E69F1]) [ ] o.a.s.c.c.SolrZkClient Using default ZkACLProvider
[junit4] 2> 607697 INFO (TEST-TestReqParamsAPI.test-seed#[63F3FC14C09E69F1]) [ ] o.a.s.SolrTestCaseJ4 Writing core.properties file to /x1/jenkins/jenkins-slave/workspace/Lucene-Solr-Tests-6.x/solr/build/solr-core/test/J1/temp/solr.handler.TestReqParamsAPI_63F3FC14C09E69F1-001/control-001/cores/collection1
[junit4] 2> 607703 INFO (TEST-TestReqParamsAPI.test-seed#[63F3FC14C09E69F1]) [ ] o.e.j.s.Server jetty-9.3.8.v20160314
[junit4] 2> 607704 INFO (TEST-TestReqParamsAPI.test-seed#[63F3FC14C09E69F1]) [ ] o.e.j.s.h.ContextHandler Started o.e.j.s.ServletContextHandler@7b76ff57{/,null,AVAILABLE}
[junit4] 2> 607715 INFO (TEST-TestReqParamsAPI.test-seed#[63F3FC14C09E69F1]) [ ] o.e.j.s.ServerConnector Started ServerConnector@49a62e21{SSL,[ssl, http/1.1]}{127.0.0.1:39026}
[junit4] 2> 607715 INFO (TEST-TestReqParamsAPI.test-seed#[63F3FC14C09E69F1]) [ ] o.e.j.s.Server Started @611872ms
[junit4] 2> 607715 INFO (TEST-TestReqParamsAPI.test-seed#[63F3FC14C09E69F1]) [ ] o.a.s.c.s.e.JettySolrRunner Jetty properties: {solr.data.dir=/x1/jenkins/jenkins-slave/workspace/Lucene-Solr-Tests-6.x/solr/build/solr-core/test/J1/temp/solr.handler.TestReqParamsAPI_63F3FC14C09E69F1-001/tempDir-001/control/data, hostContext=/, hostPort=39026, coreRootDirectory=/x1/jenkins/jenkins-slave/workspace/Lucene-Solr-Tests-6.x/solr/build/solr-core/test/J1/temp/solr.handler.TestReqParamsAPI_63F3FC14C09E69F1-001/control-001/cores}
[junit4] 2> 607715 INFO (TEST-TestReqParamsAPI.test-seed#[63F3FC14C09E69F1]) [ ] o.a.s.s.SolrDispatchFilter SolrDispatchFilter.init(): sun.misc.Launcher$AppClassLoader@73d16e93
[junit4] 2> 607715 INFO (TEST-TestReqParamsAPI.test-seed#[63F3FC14C09E69F1]) [ ] o.a.s.c.SolrResourceLoader new SolrResourceLoader for directory: '/x1/jenkins/jenkins-slave/workspace/Lucene-Solr-Tests-6.x/solr/build/solr-core/test/J1/temp/solr.handler.TestReqParamsAPI_63F3FC14C09E69F1-001/control-001'
[junit4] 2> 607715 INFO (TEST-TestReqParamsAPI.test-seed#[63F3FC14C09E69F1]) [ ] o.a.s.c.SolrResourceLoader JNDI not configured for solr (NoInitialContextEx)
[junit4] 2> 607715 INFO (TEST-TestReqParamsAPI.test-seed#[63F3FC14C09E69F1]) [ ] o.a.s.c.SolrResourceLoader solr home defaulted to 'solr/' (could not find system property or JNDI)
[junit4] 2> 607715 INFO (TEST-TestReqParamsAPI.test-seed#[63F3FC14C09E69F1]) [ ] o.a.s.c.c.SolrZkClient Using default ZkCredentialsProvider
[junit4] 2> 607716 INFO (TEST-TestReqParamsAPI.test-seed#[63F3FC14C09E69F1]) [ ] o.a.s.c.c.ConnectionManager Waiting for client to connect to ZooKeeper
[junit4] 2> 607719 INFO (zkCallback-491-thread-1) [ ] o.a.s.c.c.ConnectionManager Watcher org.apache.solr.common.cloud.ConnectionManager@1351a0c1 name:ZooKeeperConnection Watcher:127.0.0.1:41810/solr got event WatchedEvent state:SyncConnected type:None path:null path:null type:None
[junit4] 2> 607719 INFO (TEST-TestReqParamsAPI.test-seed#[63F3FC14C09E69F1]) [ ] o.a.s.c.c.ConnectionManager Client is connected to ZooKeeper
[junit4] 2> 607719 INFO (TEST-TestReqParamsAPI.test-seed#[63F3FC14C09E69F1]) [ ] o.a.s.c.c.SolrZkClient Using default ZkACLProvider
[junit4] 2> 607728 INFO (TEST-TestReqParamsAPI.test-seed#[63F3FC14C09E69F1]) [ ] o.a.s.s.SolrDispatchFilter Loading solr.xml from SolrHome (not found in ZooKeeper)
[junit4] 2> 607728 INFO (TEST-TestReqParamsAPI.test-seed#[63F3FC14C09E69F1]) [ ] o.a.s.c.SolrXmlConfig Loading container configuration from /x1/jenkins/jenkins-slave/workspace/Lucene-Solr-Tests-6.x/solr/build/solr-core/test/J1/temp/solr.handler.TestReqParamsAPI_63F3FC14C09E69F1-001/control-001/solr.xml
[junit4] 2> 607732 INFO (TEST-TestReqParamsAPI.test-seed#[63F3FC14C09E69F1]) [ ] o.a.s.c.CorePropertiesLocator Config-defined core root directory: /x1/jenkins/jenkins-slave/workspace/Lucene-Solr-Tests-6.x/solr/build/solr-core/test/J1/temp/solr.handler.TestReqParamsAPI_63F3FC14C09E69F1-001/control-001/cores
[junit4] 2> 607732 INFO (TEST-TestReqParamsAPI.test-seed#[63F3FC14C09E69F1]) [ ] o.a.s.c.CoreContainer New CoreContainer 1013421179
[junit4] 2> 607732 INFO (TEST-TestReqParamsAPI.test-seed#[63F3FC14C09E69F1]) [ ] o.a.s.c.CoreContainer Loading cores into CoreContainer [instanceDir=/x1/jenkins/jenkins-slave/workspace/Lucene-Solr-Tests-6.x/solr/build/solr-core/test/J1/temp/solr.handler.TestReqParamsAPI_63F3FC14C09E69F1-001/control-001]
[junit4] 2> 607732 WARN (TEST-TestReqParamsAPI.test-seed#[63F3FC14C09E69F1]) [ ] o.a.s.c.CoreContainer Couldn't add files from /x1/jenkins/jenkins-slave/workspace/Lucene-Solr-Tests-6.x/solr/build/solr-core/test/J1/temp/solr.handler.TestReqParamsAPI_63F3FC14C09E69F1-001/control-001/lib to classpath: /x1/jenkins/jenkins-slave/workspace/Lucene-Solr-Tests-6.x/solr/build/solr-core/test/J1/temp/solr.handler.TestReqParamsAPI_63F3FC14C09E69F1-001/control-001/lib
[junit4] 2> 607732 INFO (TEST-TestReqParamsAPI.test-seed#[63F3FC14C09E69F1]) [ ] o.a.s.h.c.HttpShardHandlerFactory created with socketTimeout : 90000,urlScheme : ,connTimeout : 15000,maxConnectionsPerHost : 20,maxConnections : 10000,corePoolSize : 0,maximumPoolSize : 2147483647,maxThreadIdleTime : 5,sizeOfQueue : -1,fairnessPolicy : false,useRetries : false,
[junit4] 2> 607733 INFO (TEST-TestReqParamsAPI.test-seed#[63F3FC14C09E69F1]) [ ] o.a.s.u.UpdateShardHandler Creating UpdateShardHandler HTTP client with params: socketTimeout=340000&connTimeout=45000&retry=true
[junit4] 2> 607733 INFO (TEST-TestReqParamsAPI.test-seed#[63F3FC14C09E69F1]) [ ] o.a.s.l.LogWatcher SLF4J impl is org.slf4j.impl.Log4jLoggerFactory
[junit4] 2> 607733 INFO (TEST-TestReqParamsAPI.test-seed#[63F3FC14C09E69F1]) [ ] o.a.s.l.LogWatcher Registering Log Listener [Log4j (org.slf4j.impl.Log4jLoggerFactory)]
[junit4] 2> 607734 INFO (TEST-TestReqParamsAPI.test-seed#[63F3FC14C09E69F1]) [ ] o.a.s.c.ZkContainer Zookeeper client=127.0.0.1:41810/solr
[junit4] 2> 607734 INFO (TEST-TestReqParamsAPI.test-seed#[63F3FC14C09E69F1]) [ ] o.a.s.c.ZkController zkHost includes chroot
[junit4] 2> 607734 INFO (TEST-TestReqParamsAPI.test-seed#[63F3FC14C09E69F1]) [ ] o.a.s.c.c.SolrZkClient Using default ZkCredentialsProvider
[junit4] 2> 607751 INFO (TEST-TestReqParamsAPI.test-seed#[63F3FC14C09E69F1]) [ ] o.a.s.c.c.ConnectionManager Waiting for client to connect to ZooKeeper
[junit4] 2> 607751 INFO (zkCallback-494-thread-1) [ ] o.a.s.c.c.ConnectionManager Watcher org.apache.solr.common.cloud.ConnectionManager@12dde343 name:ZooKeeperConnection Watcher:127.0.0.1:41810 got event WatchedEvent state:SyncConnected type:None path:null path:null type:None
[junit4] 2> 607751 INFO (TEST-TestReqParamsAPI.test-seed#[63F3FC14C09E69F1]) [ ] o.a.s.c.c.ConnectionManager Client is connected to ZooKeeper
[junit4] 2> 607752 INFO (TEST-TestReqParamsAPI.test-seed#[63F3FC14C09E69F1]) [ ] o.a.s.c.c.SolrZkClient Using default ZkACLProvider
[junit4] 2> 607752 INFO (TEST-TestReqParamsAPI.test-seed#[63F3FC14C09E69F1]) [n:127.0.0.1:39026_ ] o.a.s.c.ZkController Added new OnReconnect listener org.apache.solr.cloud.ZkController$$Lambda$69/259333065@228ac099
[junit4] 2> 607755 INFO (TEST-TestReqParamsAPI.test-seed#[63F3FC14C09E69F1]) [n:127.0.0.1:39026_ ] o.a.s.c.c.ConnectionManager Waiting for client to connect to ZooKeeper
[junit4] 2> 607774 INFO (zkCallback-495-thread-1-processing-n:127.0.0.1:39026_) [n:127.0.0.1:39026_ ] o.a.s.c.c.ConnectionManager Watcher org.apache.solr.common.cloud.ConnectionManager@43dd78b7 name:ZooKeeperConnection Watcher:127.0.0.1:41810/solr got event WatchedEvent state:SyncConnected type:None path:null path:null type:None
[junit4] 2> 607774 INFO (TEST-TestReqParamsAPI.test-seed#[63F3FC14C09E69F1]) [n:127.0.0.1:39026_ ] o.a.s.c.c.ConnectionManager Client is connected to ZooKeeper
[junit4] 2> 607776 INFO (TEST-TestReqParamsAPI.test-seed#[63F3FC14C09E69F1]) [n:127.0.0.1:39026_ ] o.a.s.c.c.SolrZkClient makePath: /overseer/queue
[junit4] 2> 607777 INFO (TEST-TestReqParamsAPI.test-seed#[63F3FC14C09E69F1]) [n:127.0.0.1:39026_ ] o.a.s.c.c.SolrZkClient makePath: /overseer/collection-queue-work
[junit4] 2> 607779 INFO (TEST-TestReqParamsAPI.test-seed#[63F3FC14C09E69F1]) [n:127.0.0.1:39026_ ] o.a.s.c.c.SolrZkClient makePath: /overseer/collection-map-running
[junit4] 2> 607779 INFO (TEST-TestReqParamsAPI.test-seed#[63F3FC14C09E69F1]) [n:127.0.0.1:39026_ ] o.a.s.c.c.SolrZkClient makePath: /overseer/collection-map-completed
[junit4] 2> 607780 INFO (TEST-TestReqParamsAPI.test-seed#[63F3FC14C09E69F1]) [n:127.0.0.1:39026_ ] o.a.s.c.c.SolrZkClient makePath: /overseer/collection-map-failure
[junit4] 2> 607781 INFO (TEST-TestReqParamsAPI.test-seed#[63F3FC14C09E69F1]) [n:127.0.0.1:39026_ ] o.a.s.c.c.SolrZkClient makePath: /live_nodes
[junit4] 2> 607782 INFO (TEST-TestReqParamsAPI.test-seed#[63F3FC14C09E69F1]) [n:127.0.0.1:39026_ ] o.a.s.c.c.SolrZkClient makePath: /aliases.json
[junit4] 2> 607782 INFO (TEST-TestReqParamsAPI.test-seed#[63F3FC14C09E69F1]) [n:127.0.0.1:39026_ ] o.a.s.c.c.SolrZkClient makePath: /clusterstate.json
[junit4] 2> 607783 INFO (TEST-TestReqParamsAPI.test-seed#[63F3FC14C09E69F1]) [n:127.0.0.1:39026_ ] o.a.s.c.c.SolrZkClient makePath: /security.json
[junit4] 2> 607783 INFO (TEST-TestReqParamsAPI.test-seed#[63F3FC14C09E69F1]) [n:127.0.0.1:39026_ ] o.a.s.c.c.ZkStateReader Updating cluster state from ZooKeeper...
[junit4] 2> 607784 INFO (TEST-TestReqParamsAPI.test-seed#[63F3FC14C09E69F1]) [n:127.0.0.1:39026_ ] o.a.s.c.c.ZkStateReader Loaded cluster properties: {urlScheme=https}
[junit4] 2> 607784 INFO (TEST-TestReqParamsAPI.test-seed#[63F3FC14C09E69F1]) [n:127.0.0.1:39026_ ] o.a.s.c.c.ZkStateReader Updated live nodes from ZooKeeper... (0) -> (0)
[junit4] 2> 607785 INFO (TEST-TestReqParamsAPI.test-seed#[63F3FC14C09E69F1]) [n:127.0.0.1:39026_ ] o.a.s.c.c.SolrZkClient makePath: /overseer_elect
[junit4] 2> 607785 INFO (TEST-TestReqParamsAPI.test-seed#[63F3FC14C09E69F1]) [n:127.0.0.1:39026_ ] o.a.s.c.c.SolrZkClient makePath: /overseer_elect/election
[junit4] 2> 607786 INFO (TEST-TestReqParamsAPI.test-seed#[63F3FC14C09E69F1]) [n:127.0.0.1:39026_ ] o.a.s.c.Overseer Overseer (id=null) closing
[junit4] 2> 607786 INFO (TEST-TestReqParamsAPI.test-seed#[63F3FC14C09E69F1]) [n:127.0.0.1:39026_ ] o.a.s.c.LeaderElector Joined leadership election with path: /overseer_elect/election/96126114081210373-127.0.0.1:39026_-n_0000000000
[junit4] 2> 607786 INFO (TEST-TestReqParamsAPI.test-seed#[63F3FC14C09E69F1]) [n:127.0.0.1:39026_ ] o.a.s.c.OverseerElectionContext I am going to be the leader 127.0.0.1:39026_
[junit4] 2> 607786 INFO (TEST-TestReqParamsAPI.test-seed#[63F3FC14C09E69F1]) [n:127.0.0.1:39026_ ] o.a.s.c.c.SolrZkClient makePath: /overseer_elect/leader
[junit4] 2> 607787 INFO (TEST-TestReqParamsAPI.test-seed#[63F3FC14C09E69F1]) [n:127.0.0.1:39026_ ] o.a.s.c.Overseer Overseer (id=96126114081210373-127.0.0.1:39026_-n_0000000000) starting
[junit4] 2> 607788 INFO (TEST-TestReqParamsAPI.test-seed#[63F3FC14C09E69F1]) [n:127.0.0.1:39026_ ] o.a.s.c.c.SolrZkClient makePath: /overseer/queue-work
[junit4] 2> 607790 INFO (TEST-TestReqParamsAPI.test-seed#[63F3FC14C09E69F1]) [n:127.0.0.1:39026_ ] o.a.s.c.OverseerAutoReplicaFailoverThread Starting OverseerAutoReplicaFailoverThread autoReplicaFailoverWorkLoopDelay=10000 autoReplicaFailoverWaitAfterExpiration=30000 autoReplicaFailoverBadNodeExpiration=60000
[junit4] 2> 607790 INFO (OverseerStateUpdate-96126114081210373-127.0.0.1:39026_-n_0000000000) [n:127.0.0.1:39026_ ] o.a.s.c.Overseer Starting to work on the main queue
[junit4] 2> 607791 INFO (OverseerCollectionConfigSetProcessor-96126114081210373-127.0.0.1:39026_-n_0000000000) [n:127.0.0.1:39026_ ] o.a.s.c.OverseerTaskProcessor Process current queue of overseer operations
[junit4] 2> 607804 INFO (TEST-TestReqParamsAPI.test-seed#[63F3FC14C09E69F1]) [n:127.0.0.1:39026_ ] o.a.s.c.ZkController Register node as live in ZooKeeper:/live_nodes/127.0.0.1:39026_
[junit4] 2> 607807 INFO (TEST-TestReqParamsAPI.test-seed#[63F3FC14C09E69F1]) [n:127.0.0.1:39026_ ] o.a.s.c.c.SolrZkClient makePath: /live_nodes/127.0.0.1:39026_
[junit4] 2> 607808 INFO (OverseerStateUpdate-96126114081210373-127.0.0.1:39026_-n_0000000000) [n:127.0.0.1:39026_ ] o.a.s.c.c.ZkStateReader Updated live nodes from ZooKeeper... (0) -> (0)
[junit4] 2> 607808 INFO (zkCallback-495-thread-1-processing-n:127.0.0.1:39026_) [n:127.0.0.1:39026_ ] o.a.s.c.c.ZkStateReader A live node change: [WatchedEvent state:SyncConnected type:NodeChildrenChanged path:/live_nodes], has occurred - updating... (live nodes size: [0])
[junit4] 2> 607808 INFO (zkCallback-495-thread-1-processing-n:127.0.0.1:39026_) [n:127.0.0.1:39026_ ] o.a.s.c.c.ZkStateReader Updated live nodes from ZooKeeper... (0) -> (1)
[junit4] 2> 607817 INFO (TEST-TestReqParamsAPI.test-seed#[63F3FC14C09E69F1]) [n:127.0.0.1:39026_ ] o.a.s.c.CoreContainer Security conf doesn't exist. Skipping setup for authorization module.
[junit4] 2> 607817 INFO (TEST-TestReqParamsAPI.test-seed#[63F3FC14C09E69F1]) [n:127.0.0.1:39026_ ] o.a.s.c.CoreContainer No authentication plugin used.
[junit4] 2> 607818 INFO (TEST-TestReqParamsAPI.test-seed#[63F3FC14C09E69F1]) [n:127.0.0.1:39026_ ] o.a.s.c.CorePropertiesLocator Looking for core definitions underneath /x1/jenkins/jenkins-slave/workspace/Lucene-Solr-Tests-6.x/solr/build/solr-core/test/J1/temp/solr.handler.TestReqParamsAPI_63F3FC14C09E69F1-001/control-001/cores
[junit4] 2> 607818 INFO (TEST-TestReqParamsAPI.test-seed#[63F3FC14C09E69F1]) [n:127.0.0.1:39026_ ] o.a.s.c.CoreDescriptor Created CoreDescriptor: {name=collection1, config=solrconfig.xml, transient=false, schema=schema.xml, loadOnStartup=true, configSetProperties=configsetprops.json, collection=control_collection, coreNodeName=, dataDir=data/, shard=}
[junit4] 2> 607818 INFO (TEST-TestReqParamsAPI.test-seed#[63F3FC14C09E69F1]) [n:127.0.0.1:39026_ ] o.a.s.c.CorePropertiesLocator Found core collection1 in /x1/jenkins/jenkins-slave/workspace/Lucene-Solr-Tests-6.x/solr/build/solr-core/test/J1/temp/solr.handler.TestReqParamsAPI_63F3FC14C09E69F1-001/control-001/cores/collection1
[junit4] 2> 607818 INFO (TEST-TestReqParamsAPI.test-seed#[63F3FC14C09E69F1]) [n:127.0.0.1:39026_ ] o.a.s.c.CorePropertiesLocator Found 1 core definitions
[junit4] 2> 607819 INFO (coreLoadExecutor-1518-thread-1-processing-n:127.0.0.1:39026_) [n:127.0.0.1:39026_ c:control_collection x:collection1] o.a.s.c.ZkController publishing state=down
[junit4] 2> 607819 INFO (coreLoadExecutor-1518-thread-1-processing-n:127.0.0.1:39026_) [n:127.0.0.1:39026_ c:control_collection x:collection1] o.a.s.c.ZkController numShards not found on descriptor - reading it from system property
[junit4] 2> 607820 INFO (coreLoadExecutor-1518-thread-1-processing-n:127.0.0.1:39026_) [n:127.0.0.1:39026_ c:control_collection x:collection1] o.a.s.c.ZkController Collection control_collection not visible yet, but flagging it so a watch is registered when it becomes visible
[junit4] 2> 607820 INFO (coreLoadExecutor-1518-thread-1-processing-n:127.0.0.1:39026_) [n:127.0.0.1:39026_ c:control_collection x:collection1] o.a.s.c.c.ZkStateReader Deleting data for [control_collection]
[junit4] 2> 607825 INFO (TEST-TestReqParamsAPI.test-seed#[63F3FC14C09E69F1]) [n:127.0.0.1:39026_ ] o.a.s.s.SolrDispatchFilter user.dir=/x1/jenkins/jenkins-slave/workspace/Lucene-Solr-Tests-6.x/solr/build/solr-core/test/J1
[junit4] 2> 607825 INFO (TEST-TestReqParamsAPI.test-seed#[63F3FC14C09E69F1]) [n:127.0.0.1:39026_ ] o.a.s.s.SolrDispatchFilter SolrDispatchFilter.init() done
[junit4] 2> 607826 INFO (coreLoadExecutor-1518-thread-1-processing-n:127.0.0.1:39026_) [n:127.0.0.1:39026_ c:control_collection x:collection1] o.a.s.c.ZkController look for our core node name
[junit4] 2> 607826 INFO (OverseerStateUpdate-96126114081210373-127.0.0.1:39026_-n_0000000000) [n:127.0.0.1:39026_ ] o.a.s.c.Overseer processMessage: queueSize: 1, message = {
[junit4] 2> "core":"collection1",
[junit4] 2> "roles":null,
[junit4] 2> "base_url":"https://127.0.0.1:39026",
[junit4] 2> "node_name":"127.0.0.1:39026_",
[junit4] 2> "numShards":"1",
[junit4] 2> "state":"down",
[junit4] 2> "shard":null,
[junit4] 2> "collection":"control_collection",
[junit4] 2> "operation":"state"} current state version: 0
[junit4] 2> 607826 INFO (OverseerStateUpdate-96126114081210373-127.0.0.1:39026_-n_0000000000) [n:127.0.0.1:39026_ ] o.a.s.c.o.ReplicaMutator Update state numShards=1 message={
[junit4] 2> "core":"collection1",
[junit4] 2> "roles":null,
[junit4] 2> "base_url":"https://127.0.0.1:39026",
[junit4] 2> "node_name":"127.0.0.1:39026_",
[junit4] 2> "numShards":"1",
[junit4] 2> "state":"down",
[junit4] 2> "shard":null,
[junit4] 2> "collection":"control_collection",
[junit4] 2> "operation":"state"}
[junit4] 2> 607828 INFO (OverseerStateUpdate-96126114081210373-127.0.0.1:39026_-n_0000000000) [n:127.0.0.1:39026_ ] o.a.s.c.o.ClusterStateMutator building a new cName: control_collection
[junit4] 2> 607828 INFO (OverseerStateUpdate-96126114081210373-127.0.0.1:39026_-n_0000000000) [n:127.0.0.1:39026_ ] o.a.s.c.o.ReplicaMutator Assigning new node to shard shard=shard1
[junit4] 2> 607831 INFO (zkCallback-495-thread-1-processing-n:127.0.0.1:39026_) [n:127.0.0.1:39026_ ] o.a.s.c.c.ZkStateReader A cluster state change: [WatchedEvent state:SyncConnected type:NodeDataChanged path:/clusterstate.json], has occurred - updating... (live nodes size: [1])
[junit4] 2> 608828 INFO (coreLoadExecutor-1518-thread-1-processing-n:127.0.0.1:39026_) [n:127.0.0.1:39026_ c:control_collection x:collection1] o.a.s.c.ZkController waiting to find shard id in clusterstate for collection1
[junit4] 2> 608828 INFO (coreLoadExecutor-1518-thread-1-processing-n:127.0.0.1:39026_) [n:127.0.0.1:39026_ c:control_collection x:collection1] o.a.s.c.ZkController Check for collection zkNode:control_collection
[junit4] 2> 608828 INFO (coreLoadExecutor-1518-thread-1-processing-n:127.0.0.1:39026_) [n:127.0.0.1:39026_ c:control_collection x:collection1] o.a.s.c.ZkController Collection zkNode exists
[junit4] 2> 608828 INFO (coreLoadExecutor-1518-thread-1-processing-n:127.0.0.1:39026_) [n:127.0.0.1:39026_ c:control_collection x:collection1] o.a.s.c.c.ZkStateReader Load collection config from: [/collections/control_collection]
[junit4] 2> 608829 INFO (coreLoadExecutor-1518-thread-1-processing-n:127.0.0.1:39026_) [n:127.0.0.1:39026_ c:control_collection x:collection1] o.a.s.c.c.ZkStateReader path=[/collections/control_collection] [configName]=[conf1] specified config exists in ZooKeeper
[junit4] 2> 608829 INFO (coreLoadExecutor-1518-thread-1-processing-n:127.0.0.1:39026_) [n:127.0.0.1:39026_ c:control_collection x:collection1] o.a.s.c.SolrResourceLoader new SolrResourceLoader for directory: '/x1/jenkins/jenkins-slave/workspace/Lucene-Solr-Tests-6.x/solr/build/solr-core/test/J1/temp/solr.handler.TestReqParamsAPI_63F3FC14C09E69F1-001/control-001/cores/collection1'
[junit4] 2> 608829 INFO (coreLoadExecutor-1518-thread-1-processing-n:127.0.0.1:39026_) [n:127.0.0.1:39026_ c:control_collection x:collection1] o.a.s.c.SolrResourceLoader JNDI not configured for solr (NoInitialContextEx)
[junit4] 2> 608829 INFO (coreLoadExecutor-1518-thread-1-processing-n:127.0.0.1:39026_) [n:127.0.0.1:39026_ c:control_collection x:collection1] o.a.s.c.SolrResourceLoader solr home defaulted to 'solr/' (could not find system property or JNDI)
[junit4] 2> 608830 INFO (coreLoadExecutor-1518-thread-1-processing-n:127.0.0.1:39026_) [n:127.0.0.1:39026_ c:control_collection x:collection1] o.a.s.c.Config loaded config solrconfig.xml with version 0
[junit4] 2> 608833 INFO (coreLoadExecutor-1518-thread-1-processing-n:127.0.0.1:39026_) [n:127.0.0.1:39026_ c:control_collection x:collection1] o.a.s.c.SolrConfig current version of requestparams : -1
[junit4] 2> 608836 WARN (coreLoadExecutor-1518-thread-1-processing-n:127.0.0.1:39026_) [n:127.0.0.1:39026_ c:control_collection x:collection1] o.a.s.c.Config Beginning with Solr 5.5, <mergePolicy> is deprecated, use <mergePolicyFactory> instead.
[junit4] 2> 608837 INFO (coreLoadExecutor-1518-thread-1-processing-n:127.0.0.1:39026_) [n:127.0.0.1:39026_ c:control_collection x:collection1] o.a.s.c.SolrConfig Using Lucene MatchVersion: 6.2.0
[junit4] 2> 608844 INFO (coreLoadExecutor-1518-thread-1-processing-n:127.0.0.1:39026_) [n:127.0.0.1:39026_ c:control_collection x:collection1] o.a.s.c.SolrConfig Loaded SolrConfig: solrconfig.xml
[junit4] 2> 608848 INFO (coreLoadExecutor-1518-thread-1-processing-n:127.0.0.1:39026_) [n:127.0.0.1:39026_ c:control_collection x:collection1] o.a.s.s.IndexSchema [collection1] Schema name=test
[junit4] 2> 608921 INFO (coreLoadExecutor-1518-thread-1-processing-n:127.0.0.1:39026_) [n:127.0.0.1:39026_ c:control_collection x:collection1] o.a.s.s.OpenExchangeRatesOrgProvider Initialized with rates=open-exchange-rates.json, refreshInterval=1440.
[junit4] 2> 608925 INFO (coreLoadExecutor-1518-thread-1-processing-n:127.0.0.1:39026_) [n:127.0.0.1:39026_ c:control_collection x:collection1] o.a.s.s.IndexSchema default search field in schema is text
[junit4] 2> 608926 INFO (coreLoadExecutor-1518-thread-1-processing-n:127.0.0.1:39026_) [n:127.0.0.1:39026_ c:control_collection x:collection1] o.a.s.s.IndexSchema unique key field: id
[junit4] 2> 608930 INFO (coreLoadExecutor-1518-thread-1-processing-n:127.0.0.1:39026_) [n:127.0.0.1:39026_ c:control_collection x:collection1] o.a.s.s.FileExchangeRateProvider Reloading exchange rates from file currency.xml
[junit4] 2> 608931 INFO (coreLoadExecutor-1518-thread-1-processing-n:127.0.0.1:39026_) [n:127.0.0.1:39026_ c:control_collection x:collection1] o.a.s.s.FileExchangeRateProvider Reloading exchange rates from file currency.xml
[junit4] 2> 608933 INFO (coreLoadExecutor-1518-thread-1-processing-n:127.0.0.1:39026_) [n:127.0.0.1:39026_ c:control_collection x:collection1] o.a.s.s.OpenExchangeRatesOrgProvider Reloading exchange rates from open-exchange-rates.json
[junit4] 2> 608933 INFO (coreLoadExecutor-1518-thread-1-processing-n:127.0.0.1:39026_) [n:127.0.0.1:39026_ c:control_collection x:collection1] o.a.s.s.OpenExchangeRatesOrgProvider Reloading exchange rates from open-exchange-rates.json
[junit4] 2> 608934 INFO (coreLoadExecutor-1518-thread-1-processing-n:127.0.0.1:39026_) [n:127.0.0.1:39026_ c:control_collection x:collection1] o.a.s.c.ConfigSetProperties Did not find ConfigSet properties, assuming default properties: Can't find resource 'configsetprops.json' in classpath or '/configs/conf1', cwd=/x1/jenkins/jenkins-slave/workspace/Lucene-Solr-Tests-6.x/solr/build/solr-core/test/J1
[junit4] 2> 608934 INFO (coreLoadExecutor-1518-thread-1-processing-n:127.0.0.1:39026_) [n:127.0.0.1:39026_ c:control_collection x:collection1] o.a.s.c.CoreContainer Creating SolrCore 'collection1' using configuration from collection control_collection
[junit4] 2> 608934 INFO (coreLoadExecutor-1518-thread-1-processing-n:127.0.0.1:39026_) [n:127.0.0.1:39026_ c:control_collection s:shard1 r:core_node1 x:collection1] o.a.s.c.SolrCore org.apache.solr.core.MockDirectoryFactory
[junit4] 2> 608934 INFO (coreLoadExecutor-1518-thread-1-processing-n:127.0.0.1:39026_) [n:127.0.0.1:39026_ c:control_collection s:shard1 r:core_node1 x:collection1] o.a.s.c.SolrCore [[collection1] ] Opening new SolrCore at [/x1/jenkins/jenkins-slave/workspace/Lucene-Solr-Tests-6.x/solr/build/solr-core/test/J1/temp/solr.handler.TestReqParamsAPI_63F3FC14C09E69F1-001/control-001/cores/collection1], dataDir=[/x1/jenkins/jenkins-slave/workspace/Lucene-Solr-Tests-6.x/solr/build/solr-core/test/J1/temp/solr.handler.TestReqParamsAPI_63F3FC14C09E69F1-001/control-001/cores/collection1/data/]
[junit4] 2> 608934 INFO (coreLoadExecutor-1518-thread-1-processing-n:127.0.0.1:39026_) [n:127.0.0.1:39026_ c:control_collection s:shard1 r:core_node1 x:collection1] o.a.s.c.JmxMonitoredMap JMX monitoring is enabled. Adding Solr mbeans to JMX Server: com.sun.jmx.mbeanserver.JmxMBeanServer@2249d19e
[junit4] 2> 608935 INFO (coreLoadExecutor-1518-thread-1-processing-n:127.0.0.1:39026_) [n:127.0.0.1:39026_ c:control_collection s:shard1 r:core_node1 x:collection1] o.a.s.c.CachingDirectoryFactory return new directory for /x1/jenkins/jenkins-slave/workspace/Lucene-Solr-Tests-6.x/solr/build/solr-core/test/J1/temp/solr.handler.TestReqParamsAPI_63F3FC14C09E69F1-001/control-001/cores/collection1/data
[junit4] 2> 608935 INFO (coreLoadExecutor-1518-thread-1-processing-n:127.0.0.1:39026_) [n:127.0.0.1:39026_ c:control_collection s:shard1 r:core_node1 x:collection1] o.a.s.c.SolrCore New index directory detected: old=null new=/x1/jenkins/jenkins-slave/workspace/Lucene-Solr-Tests-6.x/solr/build/solr-core/test/J1/temp/solr.handler.TestReqParamsAPI_63F3FC14C09E69F1-001/control-001/cores/collection1/data/index/
[junit4] 2> 608935 WARN (coreLoadExecutor-1518-thread-1-processing-n:127.0.0.1:39026_) [n:127.0.0.1:39026_ c:control_collection s:shard1 r:core_node1 x:collection1] o.a.s.c.SolrCore [collection1] Solr index directory '/x1/jenkins/jenkins-slave/workspace/Lucene-Solr-Tests-6.x/solr/build/solr-core/test/J1/temp/solr.handler.TestReqParamsAPI_63F3FC14C09E69F1-001/control-001/cores/collection1/data/index' doesn't exist. Creating new index...
[junit4] 2> 608935 INFO (coreLoadExecutor-1518-thread-1-processing-n:127.0.0.1:39026_) [n:127.0.0.1:39026_ c:control_collection s:shard1 r:core_node1 x:collection1] o.a.s.c.CachingDirectoryFactory return new directory for /x1/jenkins/jenkins-slave/workspace/Lucene-Solr-Tests-6.x/solr/build/solr-core/test/J1/temp/solr.handler.TestReqParamsAPI_63F3FC14C09E69F1-001/control-001/cores/collection1/data/index
[junit4] 2> 608935 INFO (coreLoadExecutor-1518-thread-1-processing-n:127.0.0.1:39026_) [n:127.0.0.1:39026_ c:control_collection s:shard1 r:core_node1 x:collection1] o.a.s.u.RandomMergePolicy RandomMergePolicy wrapping class org.apache.lucene.index.LogDocMergePolicy: [LogDocMergePolicy: minMergeSize=1000, mergeFactor=42, maxMergeSize=9223372036854775807, maxMergeSizeForForcedMerge=9223372036854775807, calibrateSizeByDeletes=false, maxMergeDocs=2147483647, maxCFSSegmentSizeMB=8.796093022207999E12, noCFSRatio=1.0]
[junit4] 2> 608935 INFO (coreLoadExecutor-1518-thread-1-processing-n:127.0.0.1:39026_) [n:127.0.0.1:39026_ c:control_collection s:shard1 r:core_node1 x:collection1] o.a.s.c.SolrDeletionPolicy SolrDeletionPolicy.onCommit: commits: num=1
[junit4] 2> commit{dir=MockDirectoryWrapper(RAMDirectory@34e09f74 lockFactory=org.apache.lucene.store.SingleInstanceLockFactory@1a878bbf),segFN=segments_1,generation=1}
[junit4] 2> 608935 INFO (coreLoadExecutor-1518-thread-1-processing-n:127.0.0.1:39026_) [n:127.0.0.1:39026_ c:control_collection s:shard1 r:core_node1 x:collection1] o.a.s.c.SolrDeletionPolicy newest commit generation = 1
[junit4] 2> 608937 INFO (coreLoadExecutor-1518-thread-1-processing-n:127.0.0.1:39026_) [n:127.0.0.1:39026_ c:control_collection s:shard1 r:core_node1 x:collection1] o.a.s.u.p.UpdateRequestProcessorChain creating updateRequestProcessorChain "nodistrib"
[junit4] 2> 608937 INFO (coreLoadExecutor-1518-thread-1-processing-n:127.0.0.1:39026_) [n:127.0.0.1:39026_ c:control_collection s:shard1 r:core_node1 x:collection1] o.a.s.u.p.UpdateRequestProcessorChain creating updateRequestProcessorChain "dedupe"
[junit4] 2> 608938 INFO (coreLoadExecutor-1518-thread-1-processing-n:127.0.0.1:39026_) [n:127.0.0.1:39026_ c:control_collection s:shard1 r:core_node1 x:collection1] o.a.s.u.p.UpdateRequestProcessorChain inserting DistributedUpdateProcessorFactory into updateRequestProcessorChain "dedupe"
[junit4] 2> 608938 INFO (coreLoadExecutor-1518-thread-1-processing-n:127.0.0.1:39026_) [n:127.0.0.1:39026_ c:control_collection s:shard1 r:core_node1 x:collection1] o.a.s.u.p.UpdateRequestProcessorChain creating updateRequestProcessorChain "stored_sig"
[junit4] 2> 608938 INFO (OldIndexDirectoryCleanupThreadForCore-collection1) [n:127.0.0.1:39026_ c:control_collection s:shard1 r:core_node1 x:collection1] o.a.s.c.SolrCore Looking for old index directories to cleanup for core collection1 in /x1/jenkins/jenkins-slave/workspace/Lucene-Solr-Tests-6.x/solr/build/solr-core/test/J1/temp/solr.handler.TestReqParamsAPI_63F3FC14C09E69F1-001/control-001/cores/collection1/data/
[junit4] 2> 608938 WARN (OldIndexDirectoryCleanupThreadForCore-collection1) [n:127.0.0.1:39026_ c:control_collection s:shard1 r:core_node1 x:collection1] o.a.s.c.DirectoryFactory /x1/jenkins/jenkins-slave/workspace/Lucene-Solr-Tests-6.x/solr/build/solr-core/test/J1/temp/solr.handler.TestReqParamsAPI_63F3FC14C09E69F1-001/control-001/cores/collection1/data/ does not point to a valid data directory; skipping clean-up of old index directories.
[junit4] 2> 608938 INFO (coreLoadExecutor-1518-thread-1-processing-n:127.0.0.1:39026_) [n:127.0.0.1:39026_ c:control_collection s:shard1 r:core_node1 x:collection1] o.a.s.u.p.UpdateRequestProcessorChain inserting DistributedUpdateProcessorFactory into updateRequestProcessorChain "stored_sig"
[junit4] 2> 608944 INFO (coreLoadExecutor-1518-thread-1-processing-n:127.0.0.1:39026_) [n:127.0.0.1:39026_ c:control_collection s:shard1 r:core_node1 x:collection1] o.a.s.u.p.UpdateRequestProcessorChain creating updateRequestProcessorChain "distrib-dup-test-chain-explicit"
[junit4] 2> 608944 INFO (coreLoadExecutor-1518-thread-1-processing-n:127.0.0.1:39026_) [n:127.0.0.1:39026_ c:control_collection s:shard1 r:core_node1 x:collection1] o.a.s.u.p.UpdateRequestProcessorChain creating updateRequestProcessorChain "distrib-dup-test-chain-implicit"
[junit4] 2> 608944 INFO (coreLoadExecutor-1518-thread-1-processing-n:127.0.0.1:39026_) [n:127.0.0.1:39026_ c:control_collection s:shard1 r:core_node1 x:collection1] o.a.s.u.p.UpdateRequestProcessorChain inserting DistributedUpdateProcessorFactory into updateRequestProcessorChain "distrib-dup-test-chain-implicit"
[junit4] 2> 608944 INFO (coreLoadExecutor-1518-thread-1-processing-n:127.0.0.1:39026_) [n:127.0.0.1:39026_ c:control_collection s:shard1 r:core_node1 x:collection1] o.a.s.c.SolrCore no updateRequestProcessorChain defined as default, creating implicit default
[junit4] 2> 608944 WARN (coreLoadExecutor-1518-thread-1-processing-n:127.0.0.1:39026_) [n:127.0.0.1:39026_ c:control_collection s:shard1 r:core_node1 x:collection1] o.a.s.c.RequestHandlers INVALID paramSet a in requestHandler {type = requestHandler,name = /dump,class = DumpRequestHandler,args = {defaults={a=A,b=B}}}
[junit4] 2> 608946 INFO (coreLoadExecutor-1518-thread-1-processing-n:127.0.0.1:39026_) [n:127.0.0.1:39026_ c:control_collection s:shard1 r:core_node1 x:collection1] o.a.s.h.l.XMLLoader xsltCacheLifetimeSeconds=60
[junit4] 2> 608946 INFO (coreLoadExecutor-1518-thread-1-processing-n:127.0.0.1:39026_) [n:127.0.0.1:39026_ c:control_collection s:shard1 r:core_node1 x:collection1] o.a.s.h.l.XMLLoader xsltCacheLifetimeSeconds=60
[junit4] 2> 608947 INFO (coreLoadExecutor-1518-thread-1-processing-n:127.0.0.1:39026_) [n:127.0.0.1:39026_ c:control_collection s:shard1 r:core_node1 x:collection1] o.a.s.h.l.XMLLoader xsltCacheLifetimeSeconds=60
[junit4] 2> 608947 INFO (coreLoadExecutor-1518-thread-1-processing-n:127.0.0.1:39026_) [n:127.0.0.1:39026_ c:control_collection s:shard1 r:core_node1 x:collection1] o.a.s.h.l.XMLLoader xsltCacheLifetimeSeconds=60
[junit4] 2> 608949 INFO (coreLoadExecutor-1518-thread-1-processing-n:127.0.0.1:39026_) [n:127.0.0.1:39026_ c:control_collection s:shard1 r:core_node1 x:collection1] o.a.s.c.RequestHandlers Registered paths: /admin/mbeans,standard,/update/json/docs,/admin/luke,/export,/get,/admin/properties,/update/json,/admin/threads,/dump,/update/csv,/sql,/graph,/admin/segments,/admin/system,/replication,/config,/stream,/schema,/admin/plugins,/admin/logging,/admin/ping,/update,/admin/file
[junit4] 2> 608949 INFO (coreLoadExecutor-1518-thread-1-processing-n:127.0.0.1:39026_) [n:127.0.0.1:39026_ c:control_collection s:shard1 r:core_node1 x:collection1] o.a.s.c.SolrCore Using default statsCache cache: org.apache.solr.search.stats.LocalStatsCache
[junit4] 2> 608951 INFO (coreLoadExecutor-1518-thread-1-processing-n:127.0.0.1:39026_) [n:127.0.0.1:39026_ c:control_collection s:shard1 r:core_node1 x:collection1] o.a.s.u.UpdateHandler Using UpdateLog implementation: org.apache.solr.update.UpdateLog
[junit4] 2> 608951 INFO (coreLoadExecutor-1518-thread-1-processing-n:127.0.0.1:39026_) [n:127.0.0.1:39026_ c:control_collection s:shard1 r:core_node1 x:collection1] o.a.s.u.UpdateLog Initializing UpdateLog: dataDir= defaultSyncLevel=FLUSH numRecordsToKeep=100 maxNumLogsToKeep=10 numVersionBuckets=65536
[junit4] 2> 608951 INFO (coreLoadExecutor-1518-thread-1-processing-n:127.0.0.1:39026_) [n:127.0.0.1:39026_ c:control_collection s:shard1 r:core_node1 x:collection1] o.a.s.u.CommitTracker Hard AutoCommit: disabled
[junit4] 2> 608951 INFO (coreLoadExecutor-1518-thread-1-processing-n:127.0.0.1:39026_) [n:127.0.0.1:39026_ c:control_collection s:shard1 r:core_node1 x:collection1] o.a.s.u.CommitTracker Soft AutoCommit: disabled
[junit4] 2> 608952 INFO (coreLoadExecutor-1518-thread-1-processing-n:127.0.0.1:39026_) [n:127.0.0.1:39026_ c:control_collection s:shard1 r:core_node1 x:collection1] o.a.s.u.RandomMergePolicy RandomMergePolicy wrapping class org.apache.lucene.index.TieredMergePolicy: [TieredMergePolicy: maxMergeAtOnce=46, maxMergeAtOnceExplicit=46, maxMergedSegmentMB=87.49609375, floorSegmentMB=2.173828125, forceMergeDeletesPctAllowed=18.033257637527253, segmentsPerTier=28.0, maxCFSSegmentSizeMB=8.796093022207999E12, noCFSRatio=1.0
[junit4] 2> 608952 INFO (coreLoadExecutor-1518-thread-1-processing-n:127.0.0.1:39026_) [n:127.0.0.1:39026_ c:control_collection s:shard1 r:core_node1 x:collection1] o.a.s.c.SolrDeletionPolicy SolrDeletionPolicy.onInit: commits: num=1
[junit4] 2> commit{dir=MockDirectoryWrapper(RAMDirectory@34e09f74 lockFactory=org.apache.lucene.store.SingleInstanceLockFactory@1a878bbf),segFN=segments_1,generation=1}
[junit4] 2> 608952 INFO (coreLoadExecutor-1518-thread-1-processing-n:127.0.0.1:39026_) [n:127.0.0.1:39026_ c:control_collection s:shard1 r:core_node1 x:collection1] o.a.s.c.SolrDeletionPolicy newest commit generation = 1
[junit4] 2> 608952 INFO (coreLoadExecutor-1518-thread-1-processing-n:127.0.0.1:39026_) [n:127.0.0.1:39026_ c:control_collection s:shard1 r:core_node1 x:collection1] o.a.s.s.SolrIndexSearcher Opening [Searcher@13d19d0f[collection1] main]
[junit4] 2> 608952 INFO (coreLoadExecutor-1518-thread-1-processing-n:127.0.0.1:39026_) [n:127.0.0.1:39026_ c:control_collection s:shard1 r:core_node1 x:collection1] o.a.s.c.c.ZkStateReader Load collection config from: [/collections/control_collection]
[junit4] 2> 608953 INFO (coreLoadExecutor-1518-thread-1-processing-n:127.0.0.1:39026_) [n:127.0.0.1:39026_ c:control_collection s:shard1 r:core_node1 x:collection1] o.a.s.c.c.ZkStateReader path=[/collections/control_collection] [configName]=[conf1] specified config exists in ZooKeeper
[junit4] 2> 608953 INFO (coreLoadExecutor-1518-thread-1-processing-n:127.0.0.1:39026_) [n:127.0.0.1:39026_ c:control_collection s:shard1 r:core_node1 x:collection1] o.a.s.r.ManagedResourceStorage Setting up ZooKeeper-based storage for the RestManager with znodeBase: /configs/conf1
[junit4] 2> 608953 INFO (coreLoadExecutor-1518-thread-1-processing-n:127.0.0.1:39026_) [n:127.0.0.1:39026_ c:control_collection s:shard1 r:core_node1 x:collection1] o.a.s.r.ManagedResourceStorage Configured ZooKeeperStorageIO with znodeBase: /configs/conf1
[junit4] 2> 608953 INFO (coreLoadExecutor-1518-thread-1-processing-n:127.0.0.1:39026_) [n:127.0.0.1:39026_ c:control_collection s:shard1 r:core_node1 x:collection1] o.a.s.r.RestManager Initializing RestManager with initArgs: {}
[junit4] 2> 608954 INFO (coreLoadExecutor-1518-thread-1-processing-n:127.0.0.1:39026_) [n:127.0.0.1:39026_ c:control_collection s:shard1 r:core_node1 x:collection1] o.a.s.r.ManagedResourceStorage Reading _rest_managed.json using ZooKeeperStorageIO:path=/configs/conf1
[junit4] 2> 608954 INFO (coreLoadExecutor-1518-thread-1-processing-n:127.0.0.1:39026_) [n:127.0.0.1:39026_ c:control_collection s:shard1 r:core_node1 x:collection1] o.a.s.r.ManagedResourceStorage No data found for znode /configs/conf1/_rest_managed.json
[junit4] 2> 608954 INFO (coreLoadExecutor-1518-thread-1-processing-n:127.0.0.1:39026_) [n:127.0.0.1:39026_ c:control_collection s:shard1 r:core_node1 x:collection1] o.a.s.r.ManagedResourceStorage Loaded null at path _rest_managed.json using ZooKeeperStorageIO:path=/configs/conf1
[junit4] 2> 608954 INFO (coreLoadExecutor-1518-thread-1-processing-n:127.0.0.1:39026_) [n:127.0.0.1:39026_ c:control_collection s:shard1 r:core_node1 x:collection1] o.a.s.r.RestManager Initializing 0 registered ManagedResources
[junit4] 2> 608955 INFO (coreLoadExecutor-1518-thread-1-processing-n:127.0.0.1:39026_) [n:127.0.0.1:39026_ c:control_collection s:shard1 r:core_node1 x:collection1] o.a.s.h.ReplicationHandler Commits will be reserved for 10000
[junit4] 2> 608956 INFO (searcherExecutor-1519-thread-1-processing-n:127.0.0.1:39026_ x:collection1 s:shard1 c:control_collection r:core_node1) [n:127.0.0.1:39026_ c:control_collection s:shard1 r:core_node1 x:collection1] o.a.s.c.SolrCore [collection1] Registered new searcher Searcher@13d19d0f[collection1] main{ExitableDirectoryReader(UninvertingDirectoryReader())}
[junit4] 2> 608956 INFO (coreLoadExecutor-1518-thread-1-processing-n:127.0.0.1:39026_) [n:127.0.0.1:39026_ c:control_collection s:shard1 r:core_node1 x:collection1] o.a.s.u.UpdateLog Looking up max value of version field to seed version buckets
[junit4] 2> 608956 INFO (coreLoadExecutor-1518-thread-1-processing-n:127.0.0.1:39026_) [n:127.0.0.1:39026_ c:control_collection s:shard1 r:core_node1 x:collection1] o.a.s.u.VersionInfo Refreshing highest value of _version_ for 65536 version buckets from index
[junit4] 2> 608956 INFO (coreLoadExecutor-1518-thread-1-processing-n:127.0.0.1:39026_) [n:127.0.0.1:39026_ c:control_collection s:shard1 r:core_node1 x:collection1] o.a.s.u.VersionInfo No terms found for _version_, cannot seed version bucket highest value from index
[junit4] 2> 608956 INFO (coreLoadExecutor-1518-thread-1-processing-n:127.0.0.1:39026_) [n:127.0.0.1:39026_ c:control_collection s:shard1 r:core_node1 x:collection1] o.a.s.u.UpdateLog Could not find max version in index or recent updates, using new clock 1538017826853355520
[junit4] 2> 608958 INFO (coreLoadExecutor-1518-thread-1-processing-n:127.0.0.1:39026_) [n:127.0.0.1:39026_ c:control_collection s:shard1 r:core_node1 x:collection1] o.a.s.u.UpdateLog Took 1.0ms to seed version buckets with highest version 1538017826853355520
[junit4] 2> 608958 INFO (coreLoadExecutor-1518-thread-1-processing-n:127.0.0.1:39026_) [n:127.0.0.1:39026_ c:control_collection s:shard1 r:core_node1 x:collection1] o.a.s.c.ZkController watch zkdir /configs/conf1
[junit4] 2> 608958 INFO (coreLoadExecutor-1518-thread-1-processing-n:127.0.0.1:39026_) [n:127.0.0.1:39026_ c:control_collection s:shard1 r:core_node1 x:collection1] o.a.s.c.CoreContainer registering core: collection1
[junit4] 2> 608960 INFO (coreZkRegister-1512-thread-1-processing-n:127.0.0.1:39026_ x:collection1 s:shard1 c:control_collection r:core_node1) [n:127.0.0.1:39026_ c:control_collection s:shard1 r:core_node1 x:collection1] o.a.s.c.ZkController Register replica - core:collection1 address:https://127.0.0.1:39026 collection:control_collection shard:shard1
[junit4] 2> 608960 INFO (coreZkRegister-1512-thread-1-processing-n:127.0.0.1:39026_ x:collection1 s:shard1 c:control_collection r:core_node1) [n:127.0.0.1:39026_ c:control_collection s:shard1 r:core_node1 x:collection1] o.a.s.c.c.SolrZkClient makePath: /collections/control_collection/leader_elect/shard1/election
[junit4] 2> 608963 INFO (coreZkRegister-1512-thread-1-processing-n:127.0.0.1:39026_ x:collection1 s:shard1 c:control_collection r:core_node1) [n:127.0.0.1:39026_ c:control_collection s:shard1 r:core_node1 x:collection1] o.a.s.c.LeaderElector Joined leadership election with path: /collections/control_collection/leader_elect/shard1/election/96126114081210373-core_node1-n_0000000000
[junit4] 2> 608963 INFO (coreZkRegister-1512-thread-1-processing-n:127.0.0.1:39026_ x:collection1 s:shard1 c:control_collection r:core_node1) [n:127.0.0.1:39026_ c:control_collection s:shard1 r:core_node1 x:collection1] o.a.s.c.ShardLeaderElectionContext Running the leader process for shard=shard1 and weAreReplacement=false and leaderVoteWait=10000
[junit4] 2> 608965 INFO (coreZkRegister-1512-thread-1-processing-n:127.0.0.1:39026_ x:collection1 s:shard1 c:control_collection r:core_node1) [n:127.0.0.1:39026_ c:control_collection s:shard1 r:core_node1 x:collection1] o.a.s.c.ShardLeaderElectionContext Enough replicas found to continue.
[junit4] 2> 608965 INFO (coreZkRegister-1512-thread-1-processing-n:127.0.0.1:39026_ x:collection1 s:shard1 c:control_collection r:core_node1) [n:127.0.0.1:39026_ c:control_collection s:shard1 r:core_node1 x:collection1] o.a.s.c.ShardLeaderElectionContext I may be the new leader - try and sync
[junit4] 2> 608965 INFO (coreZkRegister-1512-thread-1-processing-n:127.0.0.1:39026_ x:collection1 s:shard1 c:control_collection r:core_node1) [n:127.0.0.1:39026_ c:control_collection s:shard1 r:core_node1 x:collection1] o.a.s.c.SyncStrategy Sync replicas to https://127.0.0.1:39026/collection1/
[junit4] 2> 608965 INFO (OverseerStateUpdate-96126114081210373-127.0.0.1:39026_-n_0000000000) [n:127.0.0.1:39026_ ] o.a.s.c.Overseer processMessage: queueSize: 1, message = {
[junit4] 2> "operation":"leader",
[junit4] 2> "shard":"shard1",
[junit4] 2> "collection":"control_collection"} current state version: 1
[junit4] 2> 608965 INFO (coreZkRegister-1512-thread-1-processing-n:127.0.0.1:39026_ x:collection1 s:shard1 c:control_collection r:core_node1) [n:127.0.0.1:39026_ c:control_collection s:shard1 r:core_node1 x:collection1] o.a.s.c.SyncStrategy Sync Success - now sync replicas to me
[junit4] 2> 608965 INFO (coreZkRegister-1512-thread-1-processing-n:127.0.0.1:39026_ x:collection1 s:shard1 c:control_collection r:core_node1) [n:127.0.0.1:39026_ c:control_collection s:shard1 r:core_node1 x:collection1] o.a.s.c.SyncStrategy https://127.0.0.1:39026/collection1/ has no replicas
[junit4] 2> 608966 INFO (coreZkRegister-1512-thread-1-processing-n:127.0.0.1:39026_ x:collection1 s:shard1 c:control_collection r:core_node1) [n:127.0.0.1:39026_ c:control_collection s:shard1 r:core_node1 x:collection1] o.a.s.c.c.SolrZkClient makePath: /collections/control_collection/leaders/shard1
[junit4] 2> 608967 INFO (coreZkRegister-1512-thread-1-processing-n:127.0.0.1:39026_ x:collection1 s:shard1 c:control_collection r:core_node1) [n:127.0.0.1:39026_ c:control_collection s:shard1 r:core_node1 x:collection1] o.a.s.c.ShardLeaderElectionContextBase Creating leader registration node /collections/control_collection/leaders/shard1/leader after winning as /collections/control_collection/leader_elect/shard1/election/96126114081210373-core_node1-n_0000000000
[junit4] 2> 608968 INFO (coreZkRegister-1512-thread-1-processing-n:127.0.0.1:39026_ x:collection1 s:shard1 c:control_collection r:core_node1) [n:127.0.0.1:39026_ c:control_collection s:shard1 r:core_node1 x:collection1] o.a.s.c.ShardLeaderElectionContext I am the new leader: https://127.0.0.1:39026/collection1/ shard1
[junit4] 2> 608972 INFO (OverseerStateUpdate-96126114081210373-127.0.0.1:39026_-n_0000000000) [n:127.0.0.1:39026_ ] o.a.s.c.Overseer processMessage: queueSize: 1, message = {
[junit4] 2> "operation":"leader",
[junit4] 2> "shard":"shard1",
[junit4] 2> "collection":"control_collection",
[junit4] 2> "base_url":"https://127.0.0.1:39026",
[junit4] 2> "core":"collection1",
[junit4] 2> "state":"active"} current state version: 1
[junit4] 2> 609073 INFO (zkCallback-495-thread-4-processing-n:127.0.0.1:39026_) [n:127.0.0.1:39026_ ] o.a.s.c.c.ZkStateReader A cluster state change: [WatchedEvent state:SyncConnected type:NodeDataChanged path:/clusterstate.json], has occurred - updating... (live nodes size: [1])
[junit4] 2> 609120 INFO (coreZkRegister-1512-thread-1-processing-n:127.0.0.1:39026_ x:collection1 s:shard1 c:control_collection r:core_node1) [n:127.0.0.1:39026_ c:control_collection s:shard1 r:core_node1 x:collection1] o.a.s.c.ZkController We are https://127.0.0.1:39026/collection1/ and leader is https://127.0.0.1:39026/collection1/
[junit4] 2> 609120 INFO (coreZkRegister-1512-thread-1-processing-n:127.0.0.1:39026_ x:collection1 s:shard1 c:control_collection r:core_node1) [n:127.0.0.1:39026_ c:control_collection s:shard1 r:core_node1 x:collection1] o.a.s.c.ZkController No LogReplay needed for core=collection1 baseURL=https://127.0.0.1:39026
[junit4] 2> 609120 INFO (coreZkRegister-1512-thread-1-processing-n:127.0.0.1:39026_ x:collection1 s:shard1 c:control_collection r:core_node1) [n:127.0.0.1:39026_ c:control_collection s:shard1 r:core_node1 x:collection1] o.a.s.c.ZkController I am the leader, no recovery necessary
[junit4] 2> 609120 INFO (coreZkRegister-1512-thread-1-processing-n:127.0.0.1:39026_ x:collection1 s:shard1 c:control_collection r:core_node1) [n:127.0.0.1:39026_ c:control_collection s:shard1 r:core_node1 x:collection1] o.a.s.c.ZkController publishing state=active
[junit4] 2> 609120 INFO (coreZkRegister-1512-thread-1-processing-n:127.0.0.1:39026_ x:collection1 s:shard1 c:control_collection r:core_node1) [n:127.0.0.1:39026_ c:control_collection s:shard1 r:core_node1 x:collection1] o.a.s.c.ZkController numShards not found on descriptor - reading it from system property
[junit4] 2> 609121 INFO (OverseerStateUpdate-96126114081210373-127.0.0.1:39026_-n_0000000000) [n:127.0.0.1:39026_ ] o.a.s.c.Overseer processMessage: queueSize: 1, message = {
[junit4] 2> "core":"collection1",
[junit4] 2> "core_node_name":"core_node1",
[junit4] 2> "roles":null,
[junit4] 2> "base_url":"https://127.0.0.1:39026",
[junit4] 2> "node_name":"127.0.0.1:39026_",
[junit4] 2> "numShards":"1",
[junit4] 2> "state":"active",
[junit4] 2> "shard":"shard1",
[junit4] 2> "collection":"control_collection",
[junit4] 2> "operation":"state"} current state version: 2
[junit4] 2> 609121 INFO (OverseerStateUpdate-96126114081210373-127.0.0.1:39026_-n_0000000000) [n:127.0.0.1:39026_ ] o.a.s.c.o.ReplicaMutator Update state numShards=1 message={
[junit4] 2> "core":"collection1",
[junit4] 2> "core_node_name":"core_node1",
[junit4] 2> "roles":null,
[junit4] 2> "base_url":"https://127.0.0.1:39026",
[junit4] 2> "node_name":"127.0.0.1:39026_",
[junit4] 2> "numShards":"1",
[junit4] 2> "state":"active",
[junit4] 2> "shard":"shard1",
[junit4] 2> "collection":"control_collection",
[junit4] 2> "operation":"state"}
[junit4] 2> 609224 INFO (zkCallback-495-thread-3-processing-n:127.0.0.1:39026_) [n:127.0.0.1:39026_ ] o.a.s.c.c.ZkStateReader A cluster state change: [WatchedEvent state:SyncConnected type:NodeDataChanged path:/clusterstate.json], has occurred - updating... (live nodes size: [1])
[junit4] 2> 609327 INFO (TEST-TestReqParamsAPI.test-seed#[63F3FC14C09E69F1]) [ ] o.a.s.c.c.SolrZkClient Using default ZkCredentialsProvider
[junit4] 2> 609327 INFO (TEST-TestReqParamsAPI.test-seed#[63F3FC14C09E69F1]) [ ] o.a.s.c.c.ConnectionManager Waiting for client to connect to ZooKeeper
[junit4] 2> 609334 INFO (zkCallback-499-thread-1) [ ] o.a.s.c.c.ConnectionManager Watcher org.apache.solr.common.cloud.ConnectionManager@491252d5 name:ZooKeeperConnection Watcher:127.0.0.1:41810/solr got event WatchedEvent state:SyncConnected type:None path:null path:null type:None
[junit4] 2> 609335 INFO (TEST-TestReqParamsAPI.test-seed#[63F3FC14C09E69F1]) [ ] o.a.s.c.c.ConnectionManager Client is connected to ZooKeeper
[junit4] 2> 609335 INFO (TEST-TestReqParamsAPI.test-seed#[63F3FC14C09E69F1]) [ ] o.a.s.c.c.SolrZkClient Using default ZkACLProvider
[junit4] 2> 609335 INFO (TEST-TestReqParamsAPI.test-seed#[63F3FC14C09E69F1]) [ ] o.a.s.c.c.ZkStateReader Updating cluster state from ZooKeeper...
[junit4] 2> 609335 INFO (TEST-TestReqParamsAPI.test-seed#[63F3FC14C09E69F1]) [ ] o.a.s.c.c.ZkStateReader Loaded cluster properties: {urlScheme=https}
[junit4] 2> 609336 INFO (TEST-TestReqParamsAPI.test-seed#[63F3FC14C09E69F1]) [ ] o.a.s.c.c.ZkStateReader Updated live nodes from ZooKeeper... (0) -> (1)
[junit4] 2> 609336 INFO (TEST-TestReqParamsAPI.test-seed#[63F3FC14C09E69F1]) [ ] o.a.s.c.ChaosMonkey monkey: init - expire sessions:false cause connection loss:false
[junit4] 2> 609458 INFO (TEST-TestReqParamsAPI.test-seed#[63F3FC14C09E69F1]) [ ] o.a.s.SolrTestCaseJ4 Writing core.properties file to /x1/jenkins/jenkins-slave/workspace/Lucene-Solr-Tests-6.x/solr/build/solr-core/test/J1/temp/solr.handler.TestReqParamsAPI_63F3FC14C09E69F1-001/shard-1-001/cores/collection1
[junit4] 2> 609458 INFO (TEST-TestReqParamsAPI.test-seed#[63F3FC14C09E69F1]) [ ] o.a.s.c.AbstractFullDistribZkTestBase create jetty 1 in directory /x1/jenkins/jenkins-slave/workspace/Lucene-Solr-Tests-6.x/solr/build/solr-core/test/J1/temp/solr.handler.TestReqParamsAPI_63F3FC14C09E69F1-001/shard-1-001
[junit4] 2> 609465 INFO (TEST-TestReqParamsAPI.test-seed#[63F3FC14C09E69F1]) [ ] o.e.j.s.Server jetty-9.3.8.v20160314
[junit4] 2> 609474 INFO (TEST-TestReqParamsAPI.test-seed#[63F3FC14C09E69F1]) [ ] o.e.j.s.h.ContextHandler Started o.e.j.s.ServletContextHandler@196324ec{/,null,AVAILABLE}
[junit4] 2> 609477 INFO (TEST-TestReqParamsAPI.test-seed#[63F3FC14C09E69F1]) [ ] o.e.j.s.ServerConnector Started ServerConnector@7ba4aea5{SSL,[ssl, http/1.1]}{127.0.0.1:59972}
[junit4] 2> 609477 INFO (TEST-TestReqParamsAPI.test-seed#[63F3FC14C09E69F1]) [ ] o.e.j.s.Server Started @613634ms
[junit4] 2> 609477 INFO (TEST-TestReqParamsAPI.test-seed#[63F3FC14C09E69F1]) [ ] o.a.s.c.s.e.JettySolrRunner Jetty properties: {solr.data.dir=/x1/jenkins/jenkins-slave/workspace/Lucene-Solr-Tests-6.x/solr/build/solr-core/test/J1/temp/solr.handler.TestReqParamsAPI_63F3FC14C09E69F1-001/tempDir-001/jetty1, solrconfig=solrconfig.xml, hostContext=/, hostPort=59972, coreRootDirectory=/x1/jenkins/jenkins-slave/workspace/Lucene-Solr-Tests-6.x/solr/build/solr-core/test/J1/../../../../../../../../../../x1/jenkins/jenkins-slave/workspace/Lucene-Solr-Tests-6.x/solr/build/solr-core/test/J1/temp/solr.handler.TestReqParamsAPI_63F3FC14C09E69F1-001/shard-1-001/cores}
[junit4] 2> 609477 INFO (TEST-TestReqParamsAPI.test-seed#[63F3FC14C09E69F1]) [ ] o.a.s.s.SolrDispatchFilter SolrDispatchFilter.init(): sun.misc.Launcher$AppClassLoader@73d16e93
[junit4] 2> 609477 INFO (TEST-TestReqParamsAPI.test-seed#[63F3FC14C09E69F1]) [ ] o.a.s.c.SolrResourceLoader new SolrResourceLoader for directory: '/x1/jenkins/jenkins-slave/workspace/Lucene-Solr-Tests-6.x/solr/build/solr-core/test/J1/temp/solr.handler.TestReqParamsAPI_63F3FC14C09E69F1-001/shard-1-001'
[junit4] 2> 609477 INFO (TEST-TestReqParamsAPI.test-seed#[63F3FC14C09E69F1]) [ ] o.a.s.c.SolrResourceLoader JNDI not configured for solr (NoInitialContextEx)
[junit4] 2> 609477 INFO (TEST-TestReqParamsAPI.test-seed#[63F3FC14C09E69F1]) [ ] o.a.s.c.SolrResourceLoader solr home defaulted to 'solr/' (could not find system property or JNDI)
[junit4] 2> 609478 INFO (TEST-TestReqParamsAPI.test-seed#[63F3FC14C09E69F1]) [ ] o.a.s.c.c.SolrZkClient Using default ZkCredentialsProvider
[junit4] 2> 609478 INFO (TEST-TestReqParamsAPI.test-seed#[63F3FC14C09E69F1]) [ ] o.a.s.c.c.ConnectionManager Waiting for client to connect to ZooKeeper
[junit4] 2> 609493 INFO (zkCallback-500-thread-1) [ ] o.a.s.c.c.ConnectionManager Watcher org.apache.solr.common.cloud.ConnectionManager@6fc085c9 name:ZooKeeperConnection Watcher:127.0.0.1:41810/solr got event WatchedEvent state:SyncConnected type:None path:null path:null type:None
[junit4] 2> 609493 INFO (TEST-TestReqParamsAPI.test-seed#[63F3FC14C09E69F1]) [ ] o.a.s.c.c.ConnectionManager Client is connected to ZooKeeper
[junit4] 2> 609493 INFO (TEST-TestReqParamsAPI.test-seed#[63F3FC14C09E69F1]) [ ] o.a.s.c.c.SolrZkClient Using default ZkACLProvider
[junit4] 2> 609494 INFO (TEST-TestReqParamsAPI.test-seed#[63F3FC14C09E69F1]) [ ] o.a.s.s.SolrDispatchFilter Loading solr.xml from SolrHome (not found in ZooKeeper)
[junit4] 2> 609494 INFO (TEST-TestReqParamsAPI.test-seed#[63F3FC14C09E69F1]) [ ] o.a.s.c.SolrXmlConfig Loading container configuration from /x1/jenkins/jenkins-slave/workspace/Lucene-Solr-Tests-6.x/solr/build/solr-core/test/J1/temp/solr.handler.TestReqParamsAPI_63F3FC14C09E69F1-001/shard-1-001/solr.xml
[junit4] 2> 609499 INFO (TEST-TestReqParamsAPI.test-seed#[63F3FC14C09E69F1]) [ ] o.a.s.c.CorePropertiesLocator Config-defined core root directory: /x1/jenkins/jenkins-slave/workspace/Lucene-Solr-Tests-6.x/solr/build/solr-core/test/J1/../../../../../../../../../../x1/jenkins/jenkins-slave/workspace/Lucene-Solr-Tests-6.x/solr/build/solr-core/test/J1/temp/solr.handler.TestReqParamsAPI_63F3FC14C09E69F1-001/shard-1-001/cores
[junit4] 2> 609500 INFO (TEST-TestReqParamsAPI.test-seed#[63F3FC14C09E69F1]) [ ] o.a.s.c.CoreContainer New CoreContainer 1605790785
[junit4] 2> 609500 INFO (TEST-TestReqParamsAPI.test-seed#[63F3FC14C09E69F1]) [ ] o.a.s.c.CoreContainer Loading cores into CoreContainer [instanceDir=/x1/jenkins/jenkins-slave/workspace/Lucene-Solr-Tests-6.x/solr/build/solr-core/test/J1/temp/solr.handler.TestReqParamsAPI_63F3FC14C09E69F1-001/shard-1-001]
[junit4] 2> 609500 WARN (TEST-TestReqParamsAPI.test-seed#[63F3FC14C09E69F1]) [ ] o.a.s.c.CoreContainer Couldn't add files from /x1/jenkins/jenkins-slave/workspace/Lucene-Solr-Tests-6.x/solr/build/solr-core/test/J1/temp/solr.handler.TestReqParamsAPI_63F3FC14C09E69F1-001/shard-1-001/lib to classpath: /x1/jenkins/jenkins-slave/workspace/Lucene-Solr-Tests-6.x/solr/build/solr-core/test/J1/temp/solr.handler.TestReqParamsAPI_63F3FC14C09E69F1-001/shard-1-001/lib
[junit4] 2> 609500 INFO (TEST-TestReqParamsAPI.test-seed#[63F3FC14C09E69F1]) [ ] o.a.s.h.c.HttpShardHandlerFactory created with socketTimeout : 90000,urlScheme : ,connTimeout : 15000,maxConnectionsPerHost : 20,maxConnections : 10000,corePoolSize : 0,maximumPoolSize : 2147483647,maxThreadIdleTime : 5,sizeOfQueue : -1,fairnessPolicy : false,useRetries : false,
[junit4] 2> 609501 INFO (TEST-TestReqParamsAPI.test-seed#[63F3FC14C09E69F1]) [ ] o.a.s.u.UpdateShardHandler Creating UpdateShardHandler HTTP client with params: socketTimeout=340000&connTimeout=45000&retry=true
[junit4] 2> 609502 INFO (TEST-TestReqParamsAPI.test-seed#[63F3FC14C09E69F1]) [ ] o.a.s.l.LogWatcher SLF4J impl is org.slf4j.impl.Log4jLoggerFactory
[junit4] 2> 609502 INFO (TEST-TestReqParamsAPI.test-seed#[63F3FC14C09E69F1]) [ ] o.a.s.l.LogWatcher Registering Log Listener [Log4j (org.slf4j.impl.Log4jLoggerFactory)]
[junit4] 2> 609502 INFO (TEST-TestReqParamsAPI.test-seed#[63F3FC14C09E69F1]) [ ] o.a.s.c.ZkContainer Zookeeper client=127.0.0.1:41810/solr
[junit4] 2> 609502 INFO (TEST-TestReqParamsAPI.test-seed#[63F3FC14C09E69F1]) [ ] o.a.s.c.ZkController zkHost includes chroot
[junit4] 2> 609502 INFO (TEST-TestReqParamsAPI.test-seed#[63F3FC14C09E69F1]) [ ] o.a.s.c.c.SolrZkClient Using default ZkCredentialsProvider
[junit4] 2> 609508 INFO (TEST-TestReqParamsAPI.test-seed#[63F3FC14C09E69F1]) [ ] o.a.s.c.c.ConnectionManager Waiting for client to connect to ZooKeeper
[junit4] 2> 609509 INFO (zkCallback-503-thread-1) [ ] o.a.s.c.c.ConnectionManager Watcher org.apache.solr.common.cloud.ConnectionManager@7596d9d5 name:ZooKeeperConnection Watcher:127.0.0.1:41810 got event WatchedEvent state:SyncConnected type:None path:null path:null type:None
[junit4] 2> 609509 INFO (TEST-TestReqParamsAPI.test-seed#[63F3FC14C09E69F1]) [ ] o.a.s.c.c.ConnectionManager Client is connected to ZooKeeper
[junit4] 2> 609510 INFO (TEST-TestReqParamsAPI.test-seed#[63F3FC14C09E69F1]) [ ] o.a.s.c.c.SolrZkClient Using default ZkACLProvider
[junit4] 2> 609510 INFO (TEST-TestReqParamsAPI.test-seed#[63F3FC14C09E69F1]) [n:127.0.0.1:59972_ ] o.a.s.c.ZkController Added new OnReconnect listener org.apache.solr.cloud.ZkController$$Lambda$69/259333065@490cf290
[junit4] 2> 609512 INFO (TEST-TestReqParamsAPI.test-seed#[63F3FC14C09E69F1]) [n:127.0.0.1:59972_ ] o.a.s.c.c.ConnectionManager Waiting for client to connect to ZooKeeper
[junit4] 2> 609512 INFO (zkCallback-504-thread-1-processing-n:127.0.0.1:59972_) [n:127.0.0.1:59972_ ] o.a.s.c.c.ConnectionManager Watcher org.apache.solr.common.cloud.ConnectionManager@78b58ddf name:ZooKeeperConnection Watcher:127.0.0.1:41810/solr got event WatchedEvent state:SyncConnected type:None path:null path:null type:None
[junit4] 2> 609512 INFO (TEST-TestReqParamsAPI.test-seed#[63F3FC14C09E69F1]) [n:127.0.0.1:59972_ ] o.a.s.c.c.ConnectionManager Client is connected to ZooKeeper
[junit4] 2> 609516 INFO (TEST-TestReqParamsAPI.test-seed#[63F3FC14C09E69F1]) [n:127.0.0.1:59972_ ] o.a.s.c.c.ZkStateReader Updating cluster state from ZooKeeper...
[junit4] 2> 609516 INFO (TEST-TestReqParamsAPI.test-seed#[63F3FC14C09E69F1]) [n:127.0.0.1:59972_ ] o.a.s.c.c.ZkStateReader Loaded cluster properties: {urlScheme=https}
[junit4] 2> 609517 INFO (TEST-TestReqParamsAPI.test-seed#[63F3FC14C09E69F1]) [n:127.0.0.1:59972_ ] o.a.s.c.c.ZkStateReader Updated live nodes from ZooKeeper... (0) -> (1)
[junit4] 2> 609518 INFO (TEST-TestReqParamsAPI.test-seed#[63F3FC14C09E69F1]) [n:127.0.0.1:59972_ ] o.a.s.c.Overseer Overseer (id=null) closing
[junit4] 2> 609518 INFO (TEST-TestReqParamsAPI.test-seed#[63F3FC14C09E69F1]) [n:127.0.0.1:59972_ ] o.a.s.c.LeaderElector Joined leadership election with path: /overseer_elect/election/96126114081210377-127.0.0.1:59972_-n_0000000001
[junit4] 2> 609519 INFO (TEST-TestReqParamsAPI.test-seed#[63F3FC14C09E69F1]) [n:127.0.0.1:59972_ ] o.a.s.c.LeaderElector Watching path /overseer_elect/election/96126114081210373-127.0.0.1:39026_-n_0000000000 to know if I could be the leader
[junit4] 2> 609519 INFO (TEST-TestReqParamsAPI.test-seed#[63F3FC14C09E69F1]) [n:127.0.0.1:59972_ ] o.a.s.c.ZkController Publish node=127.0.0.1:59972_ as DOWN
[junit4] 2> 609520 INFO (OverseerStateUpdate-96126114081210373-127.0.0.1:39026_-n_0000000000) [n:127.0.0.1:39026_ ] o.a.s.c.Overseer processMessage: queueSize: 1, message = {
[junit4] 2> "operation":"downnode",
[junit4] 2> "node_name":"127.0.0.1:59972_"} current state version: 3
[junit4] 2> 609520 INFO (OverseerStateUpdate-96126114081210373-127.0.0.1:39026_-n_0000000000) [n:127.0.0.1:39026_ ] o.a.s.c.o.NodeMutator DownNode state invoked for node: 127.0.0.1:59972_
[junit4] 2> 609621 INFO (zkCallback-495-thread-4-processing-n:127.0.0.1:39026_) [n:127.0.0.1:39026_ ] o.a.s.c.c.ZkStateReader A cluster state change: [WatchedEvent state:SyncConnected type:NodeDataChanged path:/clusterstate.json], has occurred - updating... (live nodes size: [1])
[junit4] 2> 609621 INFO (zkCallback-504-thread-1-processing-n:127.0.0.1:59972_) [n:127.0.0.1:59972_ ] o.a.s.c.c.ZkStateReader A cluster state change: [WatchedEvent state:SyncConnected type:NodeDataChanged path:/clusterstate.json], has occurred - updating... (live nodes size: [1])
[junit4] 2> 609621 INFO (zkCallback-499-thread-1) [ ] o.a.s.c.c.ZkStateReader A cluster state change: [WatchedEvent state:SyncConnected type:NodeDataChanged path:/clusterstate.json], has occurred - updating... (live nodes size: [1])
[junit4] 2> 610524 INFO (TEST-TestReqParamsAPI.test-seed#[63F3FC14C09E69F1]) [n:127.0.0.1:59972_ ] o.a.s.c.ZkController Register node as live in ZooKeeper:/live_nodes/127.0.0.1:59972_
[junit4] 2> 610528 INFO (TEST-TestReqParamsAPI.test-seed#[63F3FC14C09E69F1]) [n:127.0.0.1:59972_ ] o.a.s.c.c.SolrZkClient makePath: /live_nodes/127.0.0.1:59972_
[junit4] 2> 610528 INFO (zkCallback-495-thread-4-processing-n:127.0.0.1:39026_) [n:127.0.0.1:39026_ ] o.a.s.c.c.ZkStateReader A live node change: [WatchedEvent state:SyncConnected type:NodeChildrenChanged path:/live_nodes], has occurred - updating... (live nodes size: [1])
[junit4] 2> 610528 INFO (zkCallback-499-thread-1) [ ] o.a.s.c.c.ZkStateReader A live node change: [WatchedEvent state:SyncConnected type:NodeChildrenChanged path:/live_nodes], has occurred - updating... (live nodes size: [1])
[junit4] 2> 610529 INFO (zkCallback-499-thread-1) [ ] o.a.s.c.c.ZkStateReader Updated live nodes from ZooKeeper... (1) -> (2)
[junit4] 2> 610529 INFO (zkCallback-495-thread-4-processing-n:127.0.0.1:39026_) [n:127.0.0.1:39026_ ] o.a.s.c.c.ZkStateReader Updated live nodes from ZooKeeper... (1) -> (2)
[junit4] 2> 610529 INFO (zkCallback-504-thread-1-processing-n:127.0.0.1:59972_) [n:127.0.0.1:59972_ ] o.a.s.c.c.ZkStateReader A live node change: [WatchedEvent state:SyncConnected type:NodeChildrenChanged path:/live_nodes], has occurred - updating... (live nodes size: [1])
[junit4] 2> 610529 INFO (zkCallback-504-thread-1-processing-n:127.0.0.1:59972_) [n:127.0.0.1:59972_ ] o.a.s.c.c.ZkStateReader Updated live nodes from ZooKeeper... (1) -> (2)
[junit4] 2> 610565 INFO (TEST-TestReqParamsAPI.test-seed#[63F3FC14C09E69F1]) [n:127.0.0.1:59972_ ] o.a.s.c.CoreContainer Security conf doesn't exist. Skipping setup for authorization module.
[junit4] 2> 610565 INFO (TEST-TestReqParamsAPI.test-seed#[63F3FC14C09E69F1]) [n:127.0.0.1:59972_ ] o.a.s.c.CoreContainer No authentication plugin used.
[junit4] 2> 610565 INFO (TEST-TestReqParamsAPI.test-seed#[63F3FC14C09E69F1]) [n:127.0.0.1:59972_ ] o.a.s.c.CorePropertiesLocator Looking for core definitions underneath /x1/jenkins/jenkins-slave/workspace/Lucene-Solr-Tests-6.x/solr/build/solr-core/test/J1/../../../../../../../../../../x1/jenkins/jenkins-slave/workspace/Lucene-Solr-Tests-6.x/solr/build/solr-core/test/J1/temp/solr.handler.TestReqParamsAPI_63F3FC14C09E69F1-001/shard-1-001/cores
[junit4] 2> 610566 INFO (TEST-TestReqParamsAPI.test-seed#[63F3FC14C09E69F1]) [n:127.0.0.1:59972_ ] o.a.s.c.CoreDescriptor Created CoreDescriptor: {name=collection1, config=solrconfig.xml, transient=false, schema=schema.xml, loadOnStartup=true, configSetProperties=configsetprops.json, collection=collection1, coreNodeName=, dataDir=data/, shard=}
[junit4] 2> 610566 INFO (TEST-TestReqParamsAPI.test-seed#[63F3FC14C09E69F1]) [n:127.0.0.1:59972_ ] o.a.s.c.CorePropertiesLocator Found core collection1 in /x1/jenkins/jenkins-slave/workspace/Lucene-Solr-Tests-6.x/solr/build/solr-core/test/J1/../../../../../../../../../../x1/jenkins/jenkins-slave/workspace/Lucene-Solr-Tests-6.x/solr/build/solr-core/test/J1/temp/solr.handler.TestReqParamsAPI_63F3FC14C09E69F1-001/shard-1-001/cores/collection1
[junit4] 2> 610566 INFO (TEST-TestReqParamsAPI.test-seed#[63F3FC14C09E69F1]) [n:127.0.0.1:59972_ ] o.a.s.c.CorePropertiesLocator Found 1 core definitions
[junit4] 2> 610569 INFO (coreLoadExecutor-1529-thread-1-processing-n:127.0.0.1:59972_) [n:127.0.0.1:59972_ c:collection1 x:collection1] o.a.s.c.ZkController publishing state=down
[junit4] 2> 610569 INFO (coreLoadExecutor-1529-thread-1-processing-n:127.0.0.1:59972_) [n:127.0.0.1:59972_ c:collection1 x:collection1] o.a.s.c.ZkController numShards not found on descriptor - reading it from system property
[junit4] 2> 610570 INFO (OverseerStateUpdate-96126114081210373-127.0.0.1:39026_-n_0000000000) [n:127.0.0.1:39026_ ] o.a.s.c.Overseer processMessage: queueSize: 1, message = {
[junit4] 2> "core":"collection1",
[junit4] 2> "roles":null,
[junit4] 2> "base_url":"https://127.0.0.1:59972",
[junit4] 2> "node_name":"127.0.0.1:59972_",
[junit4] 2> "numShards":"2",
[junit4] 2> "state":"down",
[junit4] 2> "shard":null,
[junit4] 2> "collection":"collection1",
[junit4] 2> "operation":"state"} current state version: 4
[junit4] 2> 610570 INFO (OverseerStateUpdate-96126114081210373-127.0.0.1:39026_-n_0000000000) [n:127.0.0.1:39026_ ] o.a.s.c.o.ReplicaMutator Update state numShards=2 message={
[junit4] 2> "core":"collection1",
[junit4] 2> "roles":null,
[junit4] 2> "base_url":"https://127.0.0.1:59972",
[junit4] 2> "node_name":"127.0.0.1:59972_",
[junit4] 2> "numShards":"2",
[junit4] 2> "state":"down",
[junit4] 2> "shard":null,
[junit4] 2> "collection":"collection1",
[junit4] 2> "operation":"state"}
[junit4] 2> 610571 INFO (OverseerStateUpdate-96126114081210373-127.0.0.1:39026_-n_0000000000) [n:127.0.0.1:39026_ ] o.a.s.c.o.ClusterStateMutator building a new cName: collection1
[junit4] 2> 610571 INFO (OverseerStateUpdate-96126114081210373-127.0.0.1:39026_-n_0000000000) [n:127.0.0.1:39026_ ] o.a.s.c.o.ReplicaMutator Assigning new node to shard shard=shard2
[junit4] 2> 610572 INFO (coreLoadExecutor-1529-thread-1-processing-n:127.0.0.1:59972_) [n:127.0.0.1:59972_ c:collection1 x:collection1] o.a.s.c.ZkController Collection collection1 not visible yet, but flagging it so a watch is registered when it becomes visible
[junit4] 2> 610572 INFO (coreLoadExecutor-1529-thread-1-processing-n:127.0.0.1:59972_) [n:127.0.0.1:59972_ c:collection1 x:collection1] o.a.s.c.c.ZkStateReader Deleting data for [collection1]
[junit4] 2> 610576 INFO (TEST-TestReqParamsAPI.test-seed#[63F3FC14C09E69F1]) [n:127.0.0.1:59972_ ] o.a.s.s.SolrDispatchFilter user.dir=/x1/jenkins/jenkins-slave/workspace/Lucene-Solr-Tests-6.x/solr/build/solr-core/test/J1
[junit4] 2> 610576 INFO (TEST-TestReqParamsAPI.test-seed#[63F3FC14C09E69F1]) [n:127.0.0.1:59972_ ] o.a.s.s.SolrDispatchFilter SolrDispatchFilter.init() done
[junit4] 2> 610576 INFO (coreLoadExecutor-1529-thread-1-processing-n:127.0.0.1:59972_) [n:127.0.0.1:59972_ c:collection1 x:collection1] o.a.s.c.ZkController look for our core node name
[junit4] 2> 610672 INFO (zkCallback-499-thread-1) [ ] o.a.s.c.c.ZkStateReader A cluster state change: [WatchedEvent state:SyncConnected type:NodeDataChanged path:/clusterstate.json], has occurred - updating... (live nodes size: [2])
[junit4] 2> 610672 INFO (zkCallback-495-thread-4-processing-n:127.0.0.1:39026_) [n:127.0.0.1:39026_ ] o.a.s.c.c.ZkStateReader A cluster state change: [WatchedEvent state:SyncConnected type:NodeDataChanged path:/clusterstate.json], has occurred - updating... (live nodes size: [2])
[junit4] 2> 610672 INFO (zkCallback-504-thread-1-processing-n:127.0.0.1:59972_) [n:127.0.0.1:59972_ ] o.a.s.c.c.ZkStateReader A cluster state change: [WatchedEvent state:SyncConnected type:NodeDataChanged path:/clusterstate.json], has occurred - updating... (live nodes size: [2])
[junit4] 2> 611577 INFO (coreLoadExecutor-1529-thread-1-processing-n:127.0.0.1:59972_) [n:127.0.0.1:59972_ c:collection1 x:collection1] o.a.s.c.ZkController waiting to find shard id in clusterstate for collection1
[junit4] 2> 611577 INFO (coreLoadExecutor-1529-thread-1-processing-n:127.0.0.1:59972_) [n:127.0.0.1:59972_ c:collection1 x:collection1] o.a.s.c.ZkController Check for collection zkNode:collection1
[junit4] 2> 611577 INFO (coreLoadExecutor-1529-thread-1-processing-n:127.0.0.1:59972_) [n:127.0.0.1:59972_ c:collection1 x:collection1] o.a.s.c.ZkController Collection zkNode exists
[junit4] 2> 611577 INFO (coreLoadExecutor-1529-thread-1-processing-n:127.0.0.1:59972_) [n:127.0.0.1:59972_ c:collection1 x:collection1] o.a.s.c.c.ZkStateReader Load collection config from: [/collections/collection1]
[junit4] 2> 611577 INFO (coreLoadExecutor-1529-thread-1-processing-n:127.0.0.1:59972_) [n:127.0.0.1:59972_ c:collection1 x:collection1] o.a.s.c.c.ZkStateReader path=[/collections/collection1] [configName]=[conf1] specified config exists in ZooKeeper
[junit4] 2> 611577 INFO (coreLoadExecutor-1529-thread-1-processing-n:127.0.0.1:59972_) [n:127.0.0.1:59972_ c:collection1 x:collection1] o.a.s.c.SolrResourceLoader new SolrResourceLoader for directory: '/x1/jenkins/jenkins-slave/workspace/Lucene-Solr-Tests-6.x/solr/build/solr-core/test/J1/temp/solr.handler.TestReqParamsAPI_63F3FC14C09E69F1-001/shard-1-001/cores/collection1'
[junit4] 2> 611577 INFO (coreLoadExecutor-1529-thread-1-processing-n:127.0.0.1:59972_) [n:127.0.0.1:59972_ c:collection1 x:collection1] o.a.s.c.SolrResourceLoader JNDI not configured for solr (NoInitialContextEx)
[junit4] 2> 611578 INFO (coreLoadExecutor-1529-thread-1-processing-n:127.0.0.1:59972_) [n:127.0.0.1:59972_ c:collection1 x:collection1] o.a.s.c.SolrResourceLoader solr home defaulted to 'solr/' (could not find system property or JNDI)
[junit4] 2> 611578 INFO (coreLoadExecutor-1529-thread-1-processing-n:127.0.0.1:59972_) [n:127.0.0.1:59972_ c:collection1 x:collection1] o.a.s.c.Config loaded config solrconfig.xml with version 0
[junit4] 2> 611582 INFO (coreLoadExecutor-1529-thread-1-processing-n:127.0.0.1:59972_) [n:127.0.0.1:59972_ c:collection1 x:collection1] o.a.s.c.SolrConfig current version of requestparams : -1
[junit4] 2> 611584 WARN (coreLoadExecutor-1529-thread-1-processing-n:127.0.0.1:59972_) [n:127.0.0.1:59972_ c:collection1 x:collection1] o.a.s.c.Config Beginning with Solr 5.5, <mergePolicy> is deprecated, use <mergePolicyFactory> instead.
[junit4] 2> 611584 INFO (coreLoadExecutor-1529-thread-1-processing-n:127.0.0.1:59972_) [n:127.0.0.1:59972_ c:collection1 x:collection1] o.a.s.c.SolrConfig Using Lucene MatchVersion: 6.2.0
[junit4] 2> 611607 INFO (coreLoadExecutor-1529-thread-1-processing-n:127.0.0.1:59972_) [n:127.0.0.1:59972_ c:collection1 x:collection1] o.a.s.c.SolrConfig Loaded SolrConfig: solrconfig.xml
[junit4] 2> 611611 INFO (coreLoadExecutor-1529-thread-1-processing-n:127.0.0.1:59972_) [n:127.0.0.1:59972_ c:collection1 x:collection1] o.a.s.s.IndexSchema [collection1] Schema name=test
[junit4] 2> 611670 INFO (coreLoadExecutor-1529-thread-1-processing-n:127.0.0.1:59972_) [n:127.0.0.1:59972_ c:collection1 x:collection1] o.a.s.s.OpenExchangeRatesOrgProvider Initialized with rates=open-exchange-rates.json, refreshInterval=1440.
[junit4] 2> 611674 INFO (coreLoadExecutor-1529-thread-1-processing-n:127.0.0.1:59972_) [n:127.0.0.1:59972_ c:collection1 x:collection1] o.a.s.s.IndexSchema default search field in schema is text
[junit4] 2> 611675 INFO (coreLoadExecutor-1529-thread-1-processing-n:127.0.0.1:59972_) [n:127.0.0.1:59972_ c:collection1 x:collection1] o.a.s.s.IndexSchema unique key field: id
[junit4] 2> 611685 INFO (coreLoadExecutor-1529-thread-1-processing-n:127.0.0.1:59972_) [n:127.0.0.1:59972_ c:collection1 x:collection1] o.a.s.s.FileExchangeRateProvider Reloading exchange rates from file currency.xml
[junit4] 2> 611687 INFO (coreLoadExecutor-1529-thread-1-processing-n:127.0.0.1:59972_) [n:127.0.0.1:59972_ c:collection1 x:collection1] o.a.s.s.FileExchangeRateProvider Reloading exchange rates from file currency.xml
[junit4] 2> 611688 INFO (coreLoadExecutor-1529-thread-1-processing-n:127.0.0.1:59972_) [n:127.0.0.1:59972_ c:collection1 x:collection1] o.a.s.s.OpenExchangeRatesOrgProvider Reloading exchange rates from open-exchange-rates.json
[junit4] 2> 611689 INFO (coreLoadExecutor-1529-thread-1-processing-n:127.0.0.1:59972_) [n:127.0.0.1:59972_ c:collection1 x:collection1] o.a.s.s.OpenExchangeRatesOrgProvider Reloading exchange rates from open-exchange-rates.json
[junit4] 2> 611690 INFO (coreLoadExecutor-1529-thread-1-processing-n:127.0.0.1:59972_) [n:127.0.0.1:59972_ c:collection1 x:collection1] o.a.s.c.ConfigSetProperties Did not find ConfigSet properties, assuming default properties: Can't find resource 'configsetprops.json' in classpath or '/configs/conf1', cwd=/x1/jenkins/jenkins-slave/workspace/Lucene-Solr-Tests-6.x/solr/build/solr-core/test/J1
[junit4] 2> 611690 INFO (coreLoadExecutor-1529-thread-1-processing-n:127.0.0.1:59972_) [n:127.0.0.1:59972_ c:collection1 x:collection1] o.a.s.c.CoreContainer Creating SolrCore 'collection1' using configuration from collection collection1
[junit4] 2> 611690 INFO (coreLoadExecutor-1529-thread-1-processing-n:127.0.0.1:59972_) [n:127.0.0.1:59972_ c:collection1 s:shard2 r:core_node1 x:collection1] o.a.s.c.SolrCore org.apache.solr.core.MockDirectoryFactory
[junit4] 2> 611691 INFO (coreLoadExecutor-1529-thread-1-processing-n:127.0.0.1:59972_) [n:127.0.0.1:59972_ c:collection1 s:shard2 r:core_node1 x:collection1] o.a.s.c.SolrCore [[collection1] ] Opening new SolrCore at [/x1/jenkins/jenkins-slave/workspace/Lucene-Solr-Tests-6.x/solr/build/solr-core/test/J1/temp/solr.handler.TestReqParamsAPI_63F3FC14C09E69F1-001/shard-1-001/cores/collection1], dataDir=[/x1/jenkins/jenkins-slave/workspace/Lucene-Solr-Tests-6.x/solr/build/solr-core/test/J1/../../../../../../../../../../x1/jenkins/jenkins-slave/workspace/Lucene-Solr-Tests-6.x/solr/build/solr-core/test/J1/temp/solr.handler.TestReqParamsAPI_63F3FC14C09E69F1-001/shard-1-001/cores/collection1/data/]
[junit4] 2> 611691 INFO (coreLoadExecutor-1529-thread-1-processing-n:127.0.0.1:59972_) [n:127.0.0.1:59972_ c:collection1 s:shard2 r:core_node1 x:collection1] o.a.s.c.JmxMonitoredMap JMX monitoring is enabled. Adding Solr mbeans to JMX Server: com.sun.jmx.mbeanserver.JmxMBeanServer@2249d19e
[ju
[...truncated too long message...]
ode4 x:collection1] o.a.s.c.ElectionContext Canceling election /collections/collection1/leader_elect/shard1/election/96126114081210386-core_node4-n_0000000001
[junit4] 2> 640334 WARN (zkCallback-523-thread-1-processing-n:127.0.0.1:48699_) [n:127.0.0.1:48699_ c:collection1 s:shard1 r:core_node4 x:collection1] o.a.s.c.LeaderElector
[junit4] 2> org.apache.zookeeper.KeeperException$SessionExpiredException: KeeperErrorCode = Session expired for /collections/collection1/leader_elect/shard1/election/96126114081210386-core_node4-n_0000000001
[junit4] 2> at org.apache.zookeeper.KeeperException.create(KeeperException.java:127)
[junit4] 2> at org.apache.zookeeper.KeeperException.create(KeeperException.java:51)
[junit4] 2> at org.apache.zookeeper.ZooKeeper.delete(ZooKeeper.java:873)
[junit4] 2> at org.apache.solr.common.cloud.SolrZkClient$2.execute(SolrZkClient.java:243)
[junit4] 2> at org.apache.solr.common.cloud.SolrZkClient$2.execute(SolrZkClient.java:240)
[junit4] 2> at org.apache.solr.common.cloud.ZkCmdExecutor.retryOperation(ZkCmdExecutor.java:60)
[junit4] 2> at org.apache.solr.common.cloud.SolrZkClient.delete(SolrZkClient.java:240)
[junit4] 2> at org.apache.solr.cloud.ElectionContext.cancelElection(ElectionContext.java:85)
[junit4] 2> at org.apache.solr.cloud.ShardLeaderElectionContextBase.cancelElection(ElectionContext.java:142)
[junit4] 2> at org.apache.solr.cloud.ShardLeaderElectionContext.cancelElection(ElectionContext.java:274)
[junit4] 2> at org.apache.solr.cloud.ShardLeaderElectionContext.runLeaderProcess(ElectionContext.java:450)
[junit4] 2> at org.apache.solr.cloud.LeaderElector.runIamLeaderProcess(LeaderElector.java:170)
[junit4] 2> at org.apache.solr.cloud.LeaderElector.checkIfIamLeader(LeaderElector.java:135)
[junit4] 2> at org.apache.solr.cloud.LeaderElector.access$200(LeaderElector.java:56)
[junit4] 2> at org.apache.solr.cloud.LeaderElector$ElectionWatcher.process(LeaderElector.java:348)
[junit4] 2> at org.apache.solr.common.cloud.SolrZkClient$3.lambda$process$0(SolrZkClient.java:265)
[junit4] 2> at java.util.concurrent.Executors$RunnableAdapter.call(Executors.java:511)
[junit4] 2> at java.util.concurrent.FutureTask.run(FutureTask.java:266)
[junit4] 2> at org.apache.solr.common.util.ExecutorUtil$MDCAwareThreadPoolExecutor.lambda$execute$0(ExecutorUtil.java:229)
[junit4] 2> at java.util.concurrent.ThreadPoolExecutor.runWorker(ThreadPoolExecutor.java:1142)
[junit4] 2> at java.util.concurrent.ThreadPoolExecutor$Worker.run(ThreadPoolExecutor.java:617)
[junit4] 2> at java.lang.Thread.run(Thread.java:745)
[junit4] 2> 641829 WARN (zkCallback-523-thread-2-processing-n:127.0.0.1:48699_) [n:127.0.0.1:48699_ ] o.a.s.c.c.ZkStateReader ZooKeeper watch triggered, but Solr cannot talk to ZK: [KeeperErrorCode = Session expired for /live_nodes]
[junit4] 2> 641830 INFO (TEST-TestReqParamsAPI.test-seed#[63F3FC14C09E69F1]) [ ] o.e.j.s.ServerConnector Stopped ServerConnector@148bda76{SSL,[ssl, http/1.1]}{127.0.0.1:0}
[junit4] 2> 641830 INFO (TEST-TestReqParamsAPI.test-seed#[63F3FC14C09E69F1]) [ ] o.e.j.s.h.ContextHandler Stopped o.e.j.s.ServletContextHandler@6f7c201f{/,null,UNAVAILABLE}
[junit4] 2> 641833 INFO (TEST-TestReqParamsAPI.test-seed#[63F3FC14C09E69F1]) [ ] o.a.s.c.ZkTestServer connecting to 127.0.0.1:41810 41810
[junit4] 2> 641999 INFO (Thread-1182) [ ] o.a.s.c.ZkTestServer connecting to 127.0.0.1:41810 41810
[junit4] 2> 641999 WARN (Thread-1182) [ ] o.a.s.c.ZkTestServer Watch limit violations:
[junit4] 2> Maximum concurrent create/delete watches above limit:
[junit4] 2>
[junit4] 2> 30 /solr/configs/conf1
[junit4] 2> 6 /solr/aliases.json
[junit4] 2> 5 /solr/security.json
[junit4] 2> 4 /solr/collections/collection1/state.json
[junit4] 2>
[junit4] 2> Maximum concurrent data watches above limit:
[junit4] 2>
[junit4] 2> 6 /solr/clusterstate.json
[junit4] 2> 6 /solr/clusterprops.json
[junit4] 2>
[junit4] 2> Maximum concurrent children watches above limit:
[junit4] 2>
[junit4] 2> 33 /solr/overseer/collection-queue-work
[junit4] 2> 29 /solr/overseer/queue
[junit4] 2> 6 /solr/live_nodes
[junit4] 2> 6 /solr/collections
[junit4] 2> 4 /solr/overseer/queue-work
[junit4] 2>
[junit4] 2> NOTE: reproduce with: ant test -Dtestcase=TestReqParamsAPI -Dtests.method=test -Dtests.seed=63F3FC14C09E69F1 -Dtests.multiplier=2 -Dtests.slow=true -Dtests.locale=zh-SG -Dtests.timezone=America/Cordoba -Dtests.asserts=true -Dtests.file.encoding=ISO-8859-1
[junit4] FAILURE 34.5s J1 | TestReqParamsAPI.test <<<
[junit4] > Throwable #1: java.lang.AssertionError: Could not get expected value 'CY val modified' for path 'response/params/y/c' full output: {
[junit4] > "responseHeader":{
[junit4] > "status":0,
[junit4] > "QTime":0},
[junit4] > "response":{
[junit4] > "znodeVersion":1,
[junit4] > "params":{
[junit4] > "x":{
[junit4] > "a":"A val",
[junit4] > "b":"B val",
[junit4] > "":{"v":0}},
[junit4] > "y":{
[junit4] > "c":"CY val",
[junit4] > "b":"BY val",
[junit4] > "i":20,
[junit4] > "d":[
[junit4] > "val 1",
[junit4] > "val 2"],
[junit4] > "":{"v":0}}}}}, from server: https://127.0.0.1:59972/collection1
[junit4] > at __randomizedtesting.SeedInfo.seed([63F3FC14C09E69F1:EBA7C3CE6E620409]:0)
[junit4] > at org.apache.solr.core.TestSolrConfigHandler.testForResponseElement(TestSolrConfigHandler.java:481)
[junit4] > at org.apache.solr.handler.TestReqParamsAPI.testReqParams(TestReqParamsAPI.java:194)
[junit4] > at org.apache.solr.handler.TestReqParamsAPI.test(TestReqParamsAPI.java:61)
[junit4] > at org.apache.solr.BaseDistributedSearchTestCase$ShardsRepeatRule$ShardsFixedStatement.callStatement(BaseDistributedSearchTestCase.java:992)
[junit4] > at org.apache.solr.BaseDistributedSearchTestCase$ShardsRepeatRule$ShardsStatement.evaluate(BaseDistributedSearchTestCase.java:967)
[junit4] > at java.lang.Thread.run(Thread.java:745)
[junit4] 2> 642002 INFO (SUITE-TestReqParamsAPI-seed#[63F3FC14C09E69F1]-worker) [ ] o.a.s.SolrTestCaseJ4 ###deleteCore
[junit4] 2> NOTE: leaving temporary files on disk at: /x1/jenkins/jenkins-slave/workspace/Lucene-Solr-Tests-6.x/solr/build/solr-core/test/J1/temp/solr.handler.TestReqParamsAPI_63F3FC14C09E69F1-001
[junit4] 2> Jun 24, 2016 11:35:32 AM com.carrotsearch.randomizedtesting.ThreadLeakControl checkThreadLeaks
[junit4] 2> WARNING: Will linger awaiting termination of 1 leaked thread(s).
[junit4] 2> NOTE: test params are: codec=DummyCompressingStoredFields(storedFieldsFormat=CompressingStoredFieldsFormat(compressionMode=DUMMY, chunkSize=7, maxDocsPerChunk=10, blockSize=817), termVectorsFormat=CompressingTermVectorsFormat(compressionMode=DUMMY, chunkSize=7, blockSize=817)), sim=ClassicSimilarity, locale=zh-SG, timezone=America/Cordoba
[junit4] 2> NOTE: Linux 3.13.0-85-generic amd64/Oracle Corporation 1.8.0_74 (64-bit)/cpus=4,threads=1,free=236848160,total=527958016
[junit4] 2> NOTE: All tests run in this JVM: [TestFieldResource, IndexBasedSpellCheckerTest, DirectSolrSpellCheckerTest, HdfsThreadLeakTest, SolrCmdDistributorTest, TestOnReconnectListenerSupport, SpellPossibilityIteratorTest, TestQueryUtils, HttpPartitionTest, TestQuerySenderNoQuery, FacetPivotSmallTest, TestUpdate, TestSolrDeletionPolicy2, SolrIndexSplitterTest, CollectionsAPIAsyncDistributedZkTest, TimeZoneUtilsTest, SpellCheckCollatorTest, TestQuerySenderListener, TestDistributedGrouping, TestNonDefinedSimilarityFactory, TermsComponentTest, TriLevelCompositeIdRoutingTest, SpellingQueryConverterTest, SimpleMLTQParserTest, TestLMJelinekMercerSimilarityFactory, TestRawResponseWriter, CustomCollectionTest, FileUtilsTest, TestSolrCoreProperties, CollectionReloadTest, ExitableDirectoryReaderTest, ZkControllerTest, ZkSolrClientTest, TestLFUCache, TestBlendedInfixSuggestions, SchemaVersionSpecificBehaviorTest, BigEndianAscendingWordDeserializerTest, TestSSLRandomization, TestTrie, TestDocTermOrds, SuggesterFSTTest, TestDFRSimilarityFactory, TestMiniSolrCloudClusterBase, SecurityConfHandlerTest, EnumFieldTest, UUIDUpdateProcessorFallbackTest, DistributedExpandComponentTest, BufferStoreTest, TestReqParamsAPI]
[junit4] Completed [171/615 (1!)] on J1 in 35.05s, 1 test, 1 failure <<< FAILURES!
[...truncated 1454 lines...]
BUILD FAILED
/x1/jenkins/jenkins-slave/workspace/Lucene-Solr-Tests-6.x/build.xml:740: The following error occurred while executing this line:
/x1/jenkins/jenkins-slave/workspace/Lucene-Solr-Tests-6.x/build.xml:684: The following error occurred while executing this line:
/x1/jenkins/jenkins-slave/workspace/Lucene-Solr-Tests-6.x/build.xml:59: The following error occurred while executing this line:
/x1/jenkins/jenkins-slave/workspace/Lucene-Solr-Tests-6.x/solr/build.xml:233: The following error occurred while executing this line:
/x1/jenkins/jenkins-slave/workspace/Lucene-Solr-Tests-6.x/solr/common-build.xml:530: The following error occurred while executing this line:
/x1/jenkins/jenkins-slave/workspace/Lucene-Solr-Tests-6.x/lucene/common-build.xml:1427: The following error occurred while executing this line:
/x1/jenkins/jenkins-slave/workspace/Lucene-Solr-Tests-6.x/lucene/common-build.xml:984: There were test failures: 615 suites (10 ignored), 2591 tests, 1 failure, 87 ignored (72 assumptions) [seed: 63F3FC14C09E69F1]
Total time: 64 minutes 31 seconds
Build step 'Invoke Ant' marked build as failure
Archiving artifacts
Recording test results
Email was triggered for: Failure - Any
Sending email for trigger: Failure - Any