You are viewing a plain text version of this content. The canonical link for it is here.
Posted to distributedlog-dev@bookkeeper.apache.org by Apache Jenkins Server <je...@builds.apache.org> on 2016/10/13 07:18:43 UTC
Jenkins build became unstable: distributedlog-nightly-build #85
See <https://builds.apache.org/job/distributedlog-nightly-build/85/>
Build failed in Jenkins: distributedlog-nightly-build #86
Posted by Apache Jenkins Server <je...@builds.apache.org>.
See <https://builds.apache.org/job/distributedlog-nightly-build/86/changes>
Changes:
[sijieg] [BLOG] A technical review of kafka and distributedlog
[sijieg] Improve distributedlog benchmark
[sijieg] DL-32: Fix Findbug warnings
------------------------------------------
[...truncated 2011 lines...]
[INFO] Downloading: https://repo.maven.apache.org/maven2/org/apache/maven/surefire/surefire-junit4/2.9/surefire-junit4-2.9.jar
[INFO] Downloaded: https://repo.maven.apache.org/maven2/org/apache/maven/surefire/surefire-junit4/2.9/surefire-junit4-2.9.jar (33 KB at 2962.8 KB/sec)
-------------------------------------------------------
T E S T S
-------------------------------------------------------
-------------------------------------------------------
T E S T S
-------------------------------------------------------
Running com.twitter.distributedlog.tools.TestDistributedLogTool
Tests run: 12, Failures: 0, Errors: 1, Skipped: 0, Time elapsed: 65.279 sec <<< FAILURE!
Running com.twitter.distributedlog.config.TestConfigurationSubscription
Tests run: 4, Failures: 0, Errors: 0, Skipped: 0, Time elapsed: 0.541 sec
Running com.twitter.distributedlog.config.TestDynamicDistributedLogConfiguration
Tests run: 7, Failures: 0, Errors: 0, Skipped: 0, Time elapsed: 0.286 sec
Running com.twitter.distributedlog.config.TestDynamicConfigurationFactory
Tests run: 3, Failures: 0, Errors: 0, Skipped: 0, Time elapsed: 1.773 sec
Running com.twitter.distributedlog.config.TestConcurrentBaseConfiguration
Tests run: 1, Failures: 0, Errors: 0, Skipped: 0, Time elapsed: 0.299 sec
Running com.twitter.distributedlog.namespace.TestDistributedLogNamespaceBuilder
Tests run: 10, Failures: 0, Errors: 0, Skipped: 0, Time elapsed: 2.354 sec
Running com.twitter.distributedlog.TestEnvelopedEntry
Tests run: 2, Failures: 0, Errors: 0, Skipped: 0, Time elapsed: 0.241 sec
Running com.twitter.distributedlog.TestInterleavedReaders
Tests run: 8, Failures: 0, Errors: 5, Skipped: 0, Time elapsed: 305.641 sec <<< FAILURE!
Running com.twitter.distributedlog.TestBKDistributedLogManager
Tests run: 30, Failures: 0, Errors: 13, Skipped: 0, Time elapsed: 790.049 sec <<< FAILURE!
Running com.twitter.distributedlog.acl.TestZKAccessControlManager
Tests run: 1, Failures: 0, Errors: 0, Skipped: 0, Time elapsed: 3.463 sec
Running com.twitter.distributedlog.acl.TestZKAccessControl
Tests run: 5, Failures: 0, Errors: 0, Skipped: 0, Time elapsed: 1.023 sec
Running com.twitter.distributedlog.TestBKSyncLogReader
Tests run: 6, Failures: 0, Errors: 4, Skipped: 0, Time elapsed: 245.44 sec <<< FAILURE!
Running com.twitter.distributedlog.TestBKLogReadHandler
Tests run: 21, Failures: 0, Errors: 0, Skipped: 0, Time elapsed: 13.344 sec
Running com.twitter.distributedlog.TestAsyncBulkWrite
Tests run: 6, Failures: 0, Errors: 0, Skipped: 0, Time elapsed: 4.307 sec
Running com.twitter.distributedlog.TestNonBlockingReads
Tests run: 1, Failures: 0, Errors: 0, Skipped: 1, Time elapsed: 0.037 sec
Running com.twitter.distributedlog.admin.TestDLCK
Tests run: 1, Failures: 0, Errors: 0, Skipped: 0, Time elapsed: 5.36 sec
Running com.twitter.distributedlog.admin.TestDistributedLogAdmin
Tests run: 1, Failures: 0, Errors: 0, Skipped: 1, Time elapsed: 2.138 sec
Running com.twitter.distributedlog.TestBKLogWriteHandler
Tests run: 1, Failures: 0, Errors: 0, Skipped: 0, Time elapsed: 2.536 sec
Running com.twitter.distributedlog.metadata.TestLogSegmentMetadataStoreUpdater
Tests run: 3, Failures: 0, Errors: 0, Skipped: 0, Time elapsed: 1.254 sec
Running com.twitter.distributedlog.metadata.TestDLMetadata
Tests run: 7, Failures: 0, Errors: 0, Skipped: 0, Time elapsed: 1.096 sec
Running com.twitter.distributedlog.metadata.TestZkMetadataResolver
Tests run: 5, Failures: 0, Errors: 0, Skipped: 0, Time elapsed: 1.24 sec
Running com.twitter.distributedlog.TestDLMTestUtil
Tests run: 1, Failures: 0, Errors: 0, Skipped: 0, Time elapsed: 0.58 sec
Running com.twitter.distributedlog.TestAppendOnlyStreamReader
Tests run: 5, Failures: 0, Errors: 5, Skipped: 0, Time elapsed: 302.342 sec <<< FAILURE!
Running com.twitter.distributedlog.TestFailureAndRecovery
Tests run: 5, Failures: 0, Errors: 0, Skipped: 0, Time elapsed: 8.461 sec
Running com.twitter.distributedlog.TestLogSegmentsZK
Tests run: 4, Failures: 0, Errors: 0, Skipped: 0, Time elapsed: 4.173 sec
Running com.twitter.distributedlog.TestLedgerHandleCache
Tests run: 10, Failures: 0, Errors: 0, Skipped: 0, Time elapsed: 2.617 sec
Running com.twitter.distributedlog.TestReadAhead
Tests run: 2, Failures: 0, Errors: 0, Skipped: 0, Time elapsed: 13.81 sec
Running com.twitter.distributedlog.TestAsyncReaderWriter
Tests run: 43, Failures: 0, Errors: 1, Skipped: 2, Time elapsed: 132.973 sec <<< FAILURE!
Running com.twitter.distributedlog.selector.TestLogRecordSelectors
Tests run: 4, Failures: 0, Errors: 0, Skipped: 0, Time elapsed: 0.245 sec
Running com.twitter.distributedlog.TestReadUtils
Tests run: 17, Failures: 0, Errors: 0, Skipped: 0, Time elapsed: 12.446 sec
Running com.twitter.distributedlog.TestLogSegmentMetadata
Tests run: 6, Failures: 0, Errors: 0, Skipped: 0, Time elapsed: 1.034 sec
Running com.twitter.distributedlog.logsegment.TestRollingPolicy
Tests run: 2, Failures: 0, Errors: 0, Skipped: 0, Time elapsed: 0.204 sec
Running com.twitter.distributedlog.logsegment.TestLogSegmentCache
Tests run: 6, Failures: 0, Errors: 0, Skipped: 0, Time elapsed: 0.315 sec
Running com.twitter.distributedlog.TestNonBlockingReadsMultiReader
Tests run: 1, Failures: 0, Errors: 1, Skipped: 0, Time elapsed: 62.266 sec <<< FAILURE!
Running com.twitter.distributedlog.TestRollLogSegments
Tests run: 5, Failures: 0, Errors: 2, Skipped: 0, Time elapsed: 64.036 sec <<< FAILURE!
Running com.twitter.distributedlog.TestLogSegmentCreation
Tests run: 1, Failures: 0, Errors: 0, Skipped: 0, Time elapsed: 3.265 sec
Running com.twitter.distributedlog.TestZooKeeperClient
Tests run: 12, Failures: 0, Errors: 0, Skipped: 2, Time elapsed: 7.162 sec
Running com.twitter.distributedlog.TestWriteLimiter
Tests run: 10, Failures: 0, Errors: 0, Skipped: 0, Time elapsed: 0.205 sec
Running com.twitter.distributedlog.TestBKLogSegmentWriter
Tests run: 10, Failures: 0, Errors: 0, Skipped: 0, Time elapsed: 7.054 sec
Running com.twitter.distributedlog.TestDistributedLogConfiguration
Tests run: 5, Failures: 0, Errors: 0, Skipped: 0, Time elapsed: 0.339 sec
Running com.twitter.distributedlog.limiter.TestRequestLimiter
Tests run: 1, Failures: 0, Errors: 0, Skipped: 0, Time elapsed: 0.107 sec
Running com.twitter.distributedlog.net.TestDNSResolver
Tests run: 3, Failures: 0, Errors: 0, Skipped: 0, Time elapsed: 0.2 sec
Running com.twitter.distributedlog.net.TestNetUtils
Tests run: 3, Failures: 0, Errors: 0, Skipped: 0, Time elapsed: 0.202 sec
Running com.twitter.distributedlog.TestBKDistributedLogNamespace
Tests run: 9, Failures: 0, Errors: 0, Skipped: 0, Time elapsed: 4.822 sec
Running com.twitter.distributedlog.lock.TestZKSessionLock
Tests run: 29, Failures: 0, Errors: 0, Skipped: 0, Time elapsed: 21.614 sec
Running com.twitter.distributedlog.lock.TestDistributedLock
Tests run: 14, Failures: 0, Errors: 0, Skipped: 0, Time elapsed: 30.607 sec
Running com.twitter.distributedlog.bk.TestLedgerAllocatorPool
Tests run: 6, Failures: 0, Errors: 0, Skipped: 0, Time elapsed: 3.577 sec
Running com.twitter.distributedlog.bk.TestLedgerAllocator
Tests run: 9, Failures: 0, Errors: 0, Skipped: 2, Time elapsed: 9.176 sec
Running com.twitter.distributedlog.TestTruncate
Running com.twitter.distributedlog.impl.TestZKLogSegmentFilters
Tests run: 1, Failures: 0, Errors: 0, Skipped: 0, Time elapsed: 0.236 sec
Running com.twitter.distributedlog.impl.federated.TestFederatedZKLogMetadataStore
Tests run: 11, Failures: 0, Errors: 0, Skipped: 0, Time elapsed: 34.938 sec
Running com.twitter.distributedlog.impl.TestZKNamespaceWatcher
Tests run: 2, Failures: 0, Errors: 0, Skipped: 0, Time elapsed: 33.944 sec
Running com.twitter.distributedlog.impl.metadata.TestZKLogMetadataForWriter
Tests run: 13, Failures: 0, Errors: 1, Skipped: 0, Time elapsed: 1.61 sec <<< FAILURE!
Running com.twitter.distributedlog.impl.metadata.TestZKLogMetadataForWriterUtilFunctions
Tests run: 9, Failures: 0, Errors: 0, Skipped: 0, Time elapsed: 0.278 sec
Running com.twitter.distributedlog.impl.metadata.TestZKLogMetadata
Tests run: 1, Failures: 0, Errors: 0, Skipped: 0, Time elapsed: 0.253 sec
Running com.twitter.distributedlog.impl.TestZKLogSegmentMetadataStore
Tests run: 19, Failures: 0, Errors: 0, Skipped: 0, Time elapsed: 5.332 sec
Running com.twitter.distributedlog.impl.TestZKLogMetadataStore
Tests run: 3, Failures: 0, Errors: 0, Skipped: 0, Time elapsed: 2.218 sec
Running com.twitter.distributedlog.rate.TestMovingAverageRate
Tests run: 2, Failures: 0, Errors: 0, Skipped: 0, Time elapsed: 0.51 sec
Running com.twitter.distributedlog.TestEntry
Tests run: 4, Failures: 0, Errors: 0, Skipped: 0, Time elapsed: 0.627 sec
Running com.twitter.distributedlog.TestSequenceID
Tests run: 5, Failures: 0, Errors: 0, Skipped: 0, Time elapsed: 8.897 sec
Running com.twitter.distributedlog.zk.TestZKTransaction
Tests run: 2, Failures: 0, Errors: 0, Skipped: 0, Time elapsed: 0.615 sec
Running com.twitter.distributedlog.zk.TestZKVersionedSetOp
Tests run: 2, Failures: 0, Errors: 0, Skipped: 0, Time elapsed: 0.294 sec
Running com.twitter.distributedlog.zk.TestZKWatcherManager
Tests run: 1, Failures: 0, Errors: 0, Skipped: 0, Time elapsed: 0.196 sec
Running com.twitter.distributedlog.feature.TestDynamicConfigurationFeatureProvider
Tests run: 3, Failures: 0, Errors: 0, Skipped: 1, Time elapsed: 0.392 sec
Running com.twitter.distributedlog.feature.TestConfigurationFeatureProvider
Tests run: 1, Failures: 0, Errors: 0, Skipped: 0, Time elapsed: 0.218 sec
Running com.twitter.distributedlog.util.TestUtils
Tests run: 2, Failures: 0, Errors: 0, Skipped: 0, Time elapsed: 1.03 sec
Running com.twitter.distributedlog.util.TestSafeQueueingFuturePool
Tests run: 5, Failures: 0, Errors: 0, Skipped: 0, Time elapsed: 0.566 sec
Running com.twitter.distributedlog.util.TestPermitManager
Tests run: 2, Failures: 0, Errors: 0, Skipped: 0, Time elapsed: 0.217 sec
Running com.twitter.distributedlog.util.TestTimeSequencer
Tests run: 1, Failures: 0, Errors: 0, Skipped: 0, Time elapsed: 0.076 sec
Running com.twitter.distributedlog.util.TestFutureUtils
Tests run: 1, Failures: 0, Errors: 0, Skipped: 0, Time elapsed: 0.516 sec
Running com.twitter.distributedlog.util.TestDLUtils
Tests run: 13, Failures: 0, Errors: 0, Skipped: 0, Time elapsed: 0.271 sec
Running com.twitter.distributedlog.util.TestConfUtils
Tests run: 1, Failures: 0, Errors: 0, Skipped: 0, Time elapsed: 0.289 sec
Running com.twitter.distributedlog.TestAppendOnlyStreamWriter
Tests run: 8, Failures: 0, Errors: 5, Skipped: 0, Time elapsed: 319.147 sec <<< FAILURE!
Running com.twitter.distributedlog.TestAsyncReaderLock
Tests run: 11, Failures: 0, Errors: 0, Skipped: 0, Time elapsed: 21.467 sec
Results :
Tests in error:
testToolTruncateStream(com.twitter.distributedlog.tools.TestDistributedLogTool): test timed out after 60000 milliseconds
testInterleavedReaders(com.twitter.distributedlog.TestInterleavedReaders): test timed out after 60000 milliseconds
testInterleavedReadersWithRollingEdge(com.twitter.distributedlog.TestInterleavedReaders): test timed out after 60000 milliseconds
testInterleavedReadersWithRolling(com.twitter.distributedlog.TestInterleavedReaders): test timed out after 60000 milliseconds
testInterleavedReadersWithCleanup(com.twitter.distributedlog.TestInterleavedReaders): test timed out after 60000 milliseconds
testInterleavedReadersWithRollingEdgeUnPartitioned(com.twitter.distributedlog.TestInterleavedReaders): test timed out after 60000 milliseconds
testContinuousReaders(com.twitter.distributedlog.TestBKDistributedLogManager): test timed out after 60000 milliseconds
testMarkEndOfStream(com.twitter.distributedlog.TestBKDistributedLogManager): test timed out after 60000 milliseconds
testMarkEndOfStreamOnEmptyStream(com.twitter.distributedlog.TestBKDistributedLogManager): test timed out after 60000 milliseconds
testMarkEndOfStreamOnClosedStream(com.twitter.distributedlog.TestBKDistributedLogManager): test timed out after 60000 milliseconds
deleteDuringRead(com.twitter.distributedlog.TestBKDistributedLogManager): test timed out after 60000 milliseconds
testImmediateFlush(com.twitter.distributedlog.TestBKDistributedLogManager): test timed out after 60000 milliseconds
testTruncationValidation(com.twitter.distributedlog.TestBKDistributedLogManager): test timed out after 60000 milliseconds
testNumberOfTransactions(com.twitter.distributedlog.TestBKDistributedLogManager): test timed out after 60000 milliseconds
testSimpleRead(com.twitter.distributedlog.TestBKDistributedLogManager): test timed out after 60000 milliseconds
testNumberOfTransactionsWithInprogressAtEnd(com.twitter.distributedlog.TestBKDistributedLogManager): test timed out after 60000 milliseconds
testContinuousReaderBulk(com.twitter.distributedlog.TestBKDistributedLogManager): test timed out after 60000 milliseconds
testContinuousReadersWithEmptyLedgers(com.twitter.distributedlog.TestBKDistributedLogManager): test timed out after 60000 milliseconds
testNonPartitionedWrites(com.twitter.distributedlog.TestBKDistributedLogManager): test timed out after 60000 milliseconds
testReadingFromEmptyLog(com.twitter.distributedlog.TestBKSyncLogReader): test timed out after 60000 milliseconds
testReadRecordsWhenReadAheadCatchingUp(com.twitter.distributedlog.TestBKSyncLogReader): test timed out after 60000 milliseconds
testReadRecordsWhenReadAheadCatchingUp2(com.twitter.distributedlog.TestBKSyncLogReader): test timed out after 60000 milliseconds
testDeletingLogWhileReading(com.twitter.distributedlog.TestBKSyncLogReader): test timed out after 60000 milliseconds
testSkipToSkipsBytesWithLargerLogRecords(com.twitter.distributedlog.TestAppendOnlyStreamReader): test timed out after 60000 milliseconds
testSkipToSkipsBytesWithImmediateFlush(com.twitter.distributedlog.TestAppendOnlyStreamReader): test timed out after 60000 milliseconds
testSkipToreturnsFalseIfPositionDoesNotExistYetForUnSealedStream(com.twitter.distributedlog.TestAppendOnlyStreamReader): test timed out after 60000 milliseconds
testSkipToForNoPositionChange(com.twitter.distributedlog.TestAppendOnlyStreamReader): test timed out after 60000 milliseconds
testSkipToSkipsBytesUntilEndOfStream(com.twitter.distributedlog.TestAppendOnlyStreamReader): test timed out after 60000 milliseconds
testWriteControlRecord(com.twitter.distributedlog.TestAsyncReaderWriter): test timed out after 60000 milliseconds
testMultiReaders(com.twitter.distributedlog.TestNonBlockingReadsMultiReader): test timed out after 60000 milliseconds
testUnableToRollLogSegments(com.twitter.distributedlog.TestRollLogSegments): test timed out after 60000 milliseconds
testCaughtUpReaderOnLogSegmentRolling(com.twitter.distributedlog.TestRollLogSegments): Induced Exception at:FP_StartLogSegmentBeforeLedgerCreate
testCreateLogMetadata(com.twitter.distributedlog.impl.metadata.TestZKLogMetadataForWriter): Failed to create log /messaging/distributedlog/testCreateLogMetadata/<default> : NONODE
testPositionUpdatesOnlyAfterWriteCompletion(com.twitter.distributedlog.TestAppendOnlyStreamWriter): test timed out after 60000 milliseconds
testOffsetGapAfterSegmentWriterFailure(com.twitter.distributedlog.TestAppendOnlyStreamWriter): test timed out after 60000 milliseconds
testBasicReadAndWriteBehavior(com.twitter.distributedlog.TestAppendOnlyStreamWriter): test timed out after 60000 milliseconds
testWriteFutureDoesNotCompleteUntilWritePersisted(com.twitter.distributedlog.TestAppendOnlyStreamWriter): test timed out after 60000 milliseconds
testNoOffsetGapAfterSegmentWriterFailure(com.twitter.distributedlog.TestAppendOnlyStreamWriter): test timed out after 60000 milliseconds
Tests run: 481, Failures: 0, Errors: 38, Skipped: 9
[JENKINS] Recording test results
[INFO] ------------------------------------------------------------------------
[INFO] Reactor Summary:
[INFO]
[INFO] Apache DistributedLog :: Parent .................... SUCCESS [ 8.640 s]
[INFO] Apache DistributedLog :: Protocol .................. SUCCESS [ 49.400 s]
[INFO] Apache DistributedLog :: Core Library .............. FAILURE [ 01:13 h]
[INFO] Apache DistributedLog :: Proxy Client .............. SKIPPED
[INFO] Apache DistributedLog :: Proxy Service ............. SKIPPED
[INFO] Apache DistributedLog :: Benchmark ................. SKIPPED
[INFO] Apache DistributedLog :: Tutorials :: Basics ....... SKIPPED
[INFO] Apache DistributedLog :: Tutorials :: Messaging Tutorial SKIPPED
[INFO] Apache DistributedLog :: Tutorials :: Kafka Tutorial SKIPPED
[INFO] Apache DistributedLog :: Tutorials :: MapReduce Tutorial SKIPPED
[INFO] Apache DistributedLog :: Tutorials ................. SKIPPED
[INFO] ------------------------------------------------------------------------
[INFO] BUILD FAILURE
[INFO] ------------------------------------------------------------------------
[INFO] Total time: 01:14 h
[INFO] Finished at: 2016-10-14T08:30:12+00:00
[INFO] Final Memory: 49M/749M
[INFO] ------------------------------------------------------------------------
Waiting for Jenkins to finish collecting data
[ERROR] Failed to execute goal org.apache.maven.plugins:maven-surefire-plugin:2.9:test (default-test) on project distributedlog-core: Failure or timeout -> [Help 1]
[ERROR]
[ERROR] To see the full stack trace of the errors, re-run Maven with the -e switch.
[ERROR] Re-run Maven using the -X switch to enable full debug logging.
[ERROR]
[ERROR] For more information about the errors and possible solutions, please read the following articles:
[ERROR] [Help 1] http://cwiki.apache.org/confluence/display/MAVEN/MojoExecutionException
[ERROR]
[ERROR] After correcting the problems, you can resume the build with the command
[ERROR] mvn <goals> -rf :distributedlog-core
[JENKINS] Archiving <https://builds.apache.org/job/distributedlog-nightly-build/ws/distributedlog-core/pom.xml> to com.twitter/distributedlog-core/0.4.0-incubating-SNAPSHOT/distributedlog-core-0.4.0-incubating-SNAPSHOT.pom
[JENKINS] Archiving <https://builds.apache.org/job/distributedlog-nightly-build/ws/distributedlog-tutorials/distributedlog-mapreduce/pom.xml> to com.twitter/distributedlog-mapreduce/0.4.0-incubating-SNAPSHOT/distributedlog-mapreduce-0.4.0-incubating-SNAPSHOT.pom
[JENKINS] Archiving <https://builds.apache.org/job/distributedlog-nightly-build/ws/distributedlog-client/pom.xml> to com.twitter/distributedlog-client/0.4.0-incubating-SNAPSHOT/distributedlog-client-0.4.0-incubating-SNAPSHOT.pom
[JENKINS] Archiving <https://builds.apache.org/job/distributedlog-nightly-build/ws/distributedlog-benchmark/pom.xml> to com.twitter/distributedlog-benchmark/0.4.0-incubating-SNAPSHOT/distributedlog-benchmark-0.4.0-incubating-SNAPSHOT.pom
[JENKINS] Archiving <https://builds.apache.org/job/distributedlog-nightly-build/ws/distributedlog-tutorials/distributedlog-messaging/pom.xml> to com.twitter/distributedlog-messaging/0.4.0-incubating-SNAPSHOT/distributedlog-messaging-0.4.0-incubating-SNAPSHOT.pom
[JENKINS] Archiving <https://builds.apache.org/job/distributedlog-nightly-build/ws/distributedlog-tutorials/distributedlog-kafka/pom.xml> to com.twitter/distributedlog-kafka/0.4.0-incubating-SNAPSHOT/distributedlog-kafka-0.4.0-incubating-SNAPSHOT.pom
[JENKINS] Archiving <https://builds.apache.org/job/distributedlog-nightly-build/ws/pom.xml> to com.twitter/distributedlog/0.4.0-incubating-SNAPSHOT/distributedlog-0.4.0-incubating-SNAPSHOT.pom
[JENKINS] Archiving <https://builds.apache.org/job/distributedlog-nightly-build/ws/distributedlog-service/pom.xml> to com.twitter/distributedlog-service/0.4.0-incubating-SNAPSHOT/distributedlog-service-0.4.0-incubating-SNAPSHOT.pom
[JENKINS] Archiving <https://builds.apache.org/job/distributedlog-nightly-build/ws/distributedlog-tutorials/distributedlog-basic/pom.xml> to com.twitter/distributedlog-basic/0.4.0-incubating-SNAPSHOT/distributedlog-basic-0.4.0-incubating-SNAPSHOT.pom
[JENKINS] Archiving <https://builds.apache.org/job/distributedlog-nightly-build/ws/distributedlog-protocol/pom.xml> to com.twitter/distributedlog-protocol/0.4.0-incubating-SNAPSHOT/distributedlog-protocol-0.4.0-incubating-SNAPSHOT.pom
[JENKINS] Archiving <https://builds.apache.org/job/distributedlog-nightly-build/ws/distributedlog-protocol/target/distributedlog-protocol-0.4.0-incubating-SNAPSHOT.jar> to com.twitter/distributedlog-protocol/0.4.0-incubating-SNAPSHOT/distributedlog-protocol-0.4.0-incubating-SNAPSHOT.jar
[JENKINS] Archiving <https://builds.apache.org/job/distributedlog-nightly-build/ws/distributedlog-tutorials/pom.xml> to com.twitter/distributedlog-tutorials/0.4.0-incubating-SNAPSHOT/distributedlog-tutorials-0.4.0-incubating-SNAPSHOT.pom
channel stopped
Updating DL-32