You are viewing a plain text version of this content. The canonical link for it is here.
Posted to dev@lucene.apache.org by Policeman Jenkins Server <je...@thetaphi.de> on 2019/01/21 15:36:58 UTC
[JENKINS] Lucene-Solr-master-Windows (32bit/jdk1.8.0_172) - Build #
7705 - Unstable!
Build: https://jenkins.thetaphi.de/job/Lucene-Solr-master-Windows/7705/
Java: 32bit/jdk1.8.0_172 -client -XX:+UseSerialGC
1 tests failed.
FAILED: org.apache.solr.client.solrj.io.stream.StreamDecoratorTest.testClassifyStream
Error Message:
expected:<0.0> but was:<0.9998245650830389>
Stack Trace:
java.lang.AssertionError: expected:<0.0> but was:<0.9998245650830389>
at __randomizedtesting.SeedInfo.seed([EAB51E24E990EA7A:4FFD841CD0C8F3EE]:0)
at org.junit.Assert.fail(Assert.java:88)
at org.junit.Assert.failNotEquals(Assert.java:834)
at org.junit.Assert.assertEquals(Assert.java:553)
at org.junit.Assert.assertEquals(Assert.java:683)
at org.apache.solr.client.solrj.io.stream.StreamDecoratorTest.testClassifyStream(StreamDecoratorTest.java:3406)
at sun.reflect.NativeMethodAccessorImpl.invoke0(Native Method)
at sun.reflect.NativeMethodAccessorImpl.invoke(NativeMethodAccessorImpl.java:62)
at sun.reflect.DelegatingMethodAccessorImpl.invoke(DelegatingMethodAccessorImpl.java:43)
at java.lang.reflect.Method.invoke(Method.java:498)
at com.carrotsearch.randomizedtesting.RandomizedRunner.invoke(RandomizedRunner.java:1750)
at com.carrotsearch.randomizedtesting.RandomizedRunner$8.evaluate(RandomizedRunner.java:938)
at com.carrotsearch.randomizedtesting.RandomizedRunner$9.evaluate(RandomizedRunner.java:974)
at com.carrotsearch.randomizedtesting.RandomizedRunner$10.evaluate(RandomizedRunner.java:988)
at com.carrotsearch.randomizedtesting.rules.SystemPropertiesRestoreRule$1.evaluate(SystemPropertiesRestoreRule.java:57)
at org.apache.lucene.util.TestRuleSetupTeardownChained$1.evaluate(TestRuleSetupTeardownChained.java:49)
at org.apache.lucene.util.AbstractBeforeAfterRule$1.evaluate(AbstractBeforeAfterRule.java:45)
at org.apache.lucene.util.TestRuleThreadAndTestName$1.evaluate(TestRuleThreadAndTestName.java:48)
at org.apache.lucene.util.TestRuleIgnoreAfterMaxFailures$1.evaluate(TestRuleIgnoreAfterMaxFailures.java:64)
at org.apache.lucene.util.TestRuleMarkFailure$1.evaluate(TestRuleMarkFailure.java:47)
at com.carrotsearch.randomizedtesting.rules.StatementAdapter.evaluate(StatementAdapter.java:36)
at com.carrotsearch.randomizedtesting.ThreadLeakControl$StatementRunner.run(ThreadLeakControl.java:368)
at com.carrotsearch.randomizedtesting.ThreadLeakControl.forkTimeoutingTask(ThreadLeakControl.java:817)
at com.carrotsearch.randomizedtesting.ThreadLeakControl$3.evaluate(ThreadLeakControl.java:468)
at com.carrotsearch.randomizedtesting.RandomizedRunner.runSingleTest(RandomizedRunner.java:947)
at com.carrotsearch.randomizedtesting.RandomizedRunner$5.evaluate(RandomizedRunner.java:832)
at com.carrotsearch.randomizedtesting.RandomizedRunner$6.evaluate(RandomizedRunner.java:883)
at com.carrotsearch.randomizedtesting.RandomizedRunner$7.evaluate(RandomizedRunner.java:894)
at com.carrotsearch.randomizedtesting.rules.StatementAdapter.evaluate(StatementAdapter.java:36)
at com.carrotsearch.randomizedtesting.rules.SystemPropertiesRestoreRule$1.evaluate(SystemPropertiesRestoreRule.java:57)
at org.apache.lucene.util.AbstractBeforeAfterRule$1.evaluate(AbstractBeforeAfterRule.java:45)
at com.carrotsearch.randomizedtesting.rules.StatementAdapter.evaluate(StatementAdapter.java:36)
at org.apache.lucene.util.TestRuleStoreClassName$1.evaluate(TestRuleStoreClassName.java:41)
at com.carrotsearch.randomizedtesting.rules.NoShadowingOrOverridesOnMethodsRule$1.evaluate(NoShadowingOrOverridesOnMethodsRule.java:40)
at com.carrotsearch.randomizedtesting.rules.NoShadowingOrOverridesOnMethodsRule$1.evaluate(NoShadowingOrOverridesOnMethodsRule.java:40)
at com.carrotsearch.randomizedtesting.rules.StatementAdapter.evaluate(StatementAdapter.java:36)
at com.carrotsearch.randomizedtesting.rules.StatementAdapter.evaluate(StatementAdapter.java:36)
at com.carrotsearch.randomizedtesting.rules.StatementAdapter.evaluate(StatementAdapter.java:36)
at org.apache.lucene.util.TestRuleAssertionsRequired$1.evaluate(TestRuleAssertionsRequired.java:53)
at org.apache.lucene.util.TestRuleMarkFailure$1.evaluate(TestRuleMarkFailure.java:47)
at org.apache.lucene.util.TestRuleIgnoreAfterMaxFailures$1.evaluate(TestRuleIgnoreAfterMaxFailures.java:64)
at org.apache.lucene.util.TestRuleIgnoreTestSuites$1.evaluate(TestRuleIgnoreTestSuites.java:54)
at com.carrotsearch.randomizedtesting.rules.StatementAdapter.evaluate(StatementAdapter.java:36)
at com.carrotsearch.randomizedtesting.ThreadLeakControl$StatementRunner.run(ThreadLeakControl.java:368)
at java.lang.Thread.run(Thread.java:748)
Build Log:
[...truncated 16541 lines...]
[junit4] Suite: org.apache.solr.client.solrj.io.stream.StreamDecoratorTest
[junit4] 2> Creating dataDir: C:\Users\jenkins\workspace\Lucene-Solr-master-Windows\solr\build\solr-solrj\test\J0\temp\solr.client.solrj.io.stream.StreamDecoratorTest_EAB51E24E990EA7A-001\init-core-data-001
[junit4] 2> 372820 WARN (SUITE-StreamDecoratorTest-seed#[EAB51E24E990EA7A]-worker) [ ] o.a.s.SolrTestCaseJ4 startTrackingSearchers: numOpens=2 numCloses=2
[junit4] 2> 372820 INFO (SUITE-StreamDecoratorTest-seed#[EAB51E24E990EA7A]-worker) [ ] o.a.s.SolrTestCaseJ4 Using PointFields (NUMERIC_POINTS_SYSPROP=true) w/NUMERIC_DOCVALUES_SYSPROP=false
[junit4] 2> 372839 INFO (SUITE-StreamDecoratorTest-seed#[EAB51E24E990EA7A]-worker) [ ] o.a.s.SolrTestCaseJ4 Randomized ssl (false) and clientAuth (false) via: @org.apache.solr.SolrTestCaseJ4$SuppressSSL(bugUrl=None)
[junit4] 2> 372839 INFO (SUITE-StreamDecoratorTest-seed#[EAB51E24E990EA7A]-worker) [ ] o.a.s.SolrTestCaseJ4 SecureRandom sanity checks: test.solr.allowed.securerandom=null & java.security.egd=file:/dev/./urandom
[junit4] 2> 372841 INFO (SUITE-StreamDecoratorTest-seed#[EAB51E24E990EA7A]-worker) [ ] o.a.s.c.MiniSolrCloudCluster Starting cluster of 4 servers in C:\Users\jenkins\workspace\Lucene-Solr-master-Windows\solr\build\solr-solrj\test\J0\temp\solr.client.solrj.io.stream.StreamDecoratorTest_EAB51E24E990EA7A-001\tempDir-001
[junit4] 2> 372841 INFO (SUITE-StreamDecoratorTest-seed#[EAB51E24E990EA7A]-worker) [ ] o.a.s.c.ZkTestServer STARTING ZK TEST SERVER
[junit4] 2> 372842 INFO (ZkTestServer Run Thread) [ ] o.a.s.c.ZkTestServer client port:0.0.0.0/0.0.0.0:0
[junit4] 2> 372842 INFO (ZkTestServer Run Thread) [ ] o.a.s.c.ZkTestServer Starting server
[junit4] 2> 373037 INFO (SUITE-StreamDecoratorTest-seed#[EAB51E24E990EA7A]-worker) [ ] o.a.s.c.ZkTestServer start zk server on port:57001
[junit4] 2> 373038 INFO (SUITE-StreamDecoratorTest-seed#[EAB51E24E990EA7A]-worker) [ ] o.a.s.c.ZkTestServer parse host and port list: 127.0.0.1:57001
[junit4] 2> 373038 INFO (SUITE-StreamDecoratorTest-seed#[EAB51E24E990EA7A]-worker) [ ] o.a.s.c.ZkTestServer connecting to 127.0.0.1 57001
[junit4] 2> 373380 INFO (zkConnectionManagerCallback-2723-thread-1) [ ] o.a.s.c.c.ConnectionManager zkClient has connected
[junit4] 2> 374364 INFO (zkConnectionManagerCallback-2725-thread-1) [ ] o.a.s.c.c.ConnectionManager zkClient has connected
[junit4] 2> 374572 INFO (zkConnectionManagerCallback-2727-thread-1) [ ] o.a.s.c.c.ConnectionManager zkClient has connected
[junit4] 2> 374580 WARN (jetty-launcher-2728-thread-1) [ ] o.e.j.s.AbstractConnector Ignoring deprecated socket close linger time
[junit4] 2> 374580 INFO (jetty-launcher-2728-thread-1) [ ] o.a.s.c.s.e.JettySolrRunner Start Jetty (original configured port=0)
[junit4] 2> 374580 INFO (jetty-launcher-2728-thread-1) [ ] o.a.s.c.s.e.JettySolrRunner Trying to start Jetty on port 0 try number 1 ...
[junit4] 2> 374580 INFO (jetty-launcher-2728-thread-1) [ ] o.e.j.s.Server jetty-9.4.14.v20181114; built: 2018-11-14T21:20:31.478Z; git: c4550056e785fb5665914545889f21dc136ad9e6; jvm 1.8.0_172-b11
[junit4] 2> 374580 INFO (jetty-launcher-2728-thread-1) [ ] o.e.j.s.session DefaultSessionIdManager workerName=node0
[junit4] 2> 374580 INFO (jetty-launcher-2728-thread-1) [ ] o.e.j.s.session No SessionScavenger set, using defaults
[junit4] 2> 374580 INFO (jetty-launcher-2728-thread-1) [ ] o.e.j.s.session node0 Scavenging every 600000ms
[junit4] 2> 374580 INFO (jetty-launcher-2728-thread-1) [ ] o.e.j.s.h.ContextHandler Started o.e.j.s.ServletContextHandler@fed7ca{/solr,null,AVAILABLE}
[junit4] 2> 374583 WARN (jetty-launcher-2728-thread-2) [ ] o.e.j.s.AbstractConnector Ignoring deprecated socket close linger time
[junit4] 2> 374584 INFO (jetty-launcher-2728-thread-2) [ ] o.a.s.c.s.e.JettySolrRunner Start Jetty (original configured port=0)
[junit4] 2> 374584 INFO (jetty-launcher-2728-thread-2) [ ] o.a.s.c.s.e.JettySolrRunner Trying to start Jetty on port 0 try number 1 ...
[junit4] 2> 374584 INFO (jetty-launcher-2728-thread-2) [ ] o.e.j.s.Server jetty-9.4.14.v20181114; built: 2018-11-14T21:20:31.478Z; git: c4550056e785fb5665914545889f21dc136ad9e6; jvm 1.8.0_172-b11
[junit4] 2> 374584 INFO (jetty-launcher-2728-thread-2) [ ] o.e.j.s.session DefaultSessionIdManager workerName=node0
[junit4] 2> 374584 INFO (jetty-launcher-2728-thread-2) [ ] o.e.j.s.session No SessionScavenger set, using defaults
[junit4] 2> 374584 INFO (jetty-launcher-2728-thread-2) [ ] o.e.j.s.session node0 Scavenging every 600000ms
[junit4] 2> 374585 INFO (jetty-launcher-2728-thread-2) [ ] o.e.j.s.h.ContextHandler Started o.e.j.s.ServletContextHandler@6b6214{/solr,null,AVAILABLE}
[junit4] 2> 374589 WARN (jetty-launcher-2728-thread-3) [ ] o.e.j.s.AbstractConnector Ignoring deprecated socket close linger time
[junit4] 2> 374590 INFO (jetty-launcher-2728-thread-3) [ ] o.a.s.c.s.e.JettySolrRunner Start Jetty (original configured port=0)
[junit4] 2> 374590 INFO (jetty-launcher-2728-thread-3) [ ] o.a.s.c.s.e.JettySolrRunner Trying to start Jetty on port 0 try number 1 ...
[junit4] 2> 374590 INFO (jetty-launcher-2728-thread-3) [ ] o.e.j.s.Server jetty-9.4.14.v20181114; built: 2018-11-14T21:20:31.478Z; git: c4550056e785fb5665914545889f21dc136ad9e6; jvm 1.8.0_172-b11
[junit4] 2> 374590 INFO (jetty-launcher-2728-thread-3) [ ] o.e.j.s.session DefaultSessionIdManager workerName=node0
[junit4] 2> 374590 INFO (jetty-launcher-2728-thread-3) [ ] o.e.j.s.session No SessionScavenger set, using defaults
[junit4] 2> 374590 INFO (jetty-launcher-2728-thread-3) [ ] o.e.j.s.session node0 Scavenging every 600000ms
[junit4] 2> 374590 INFO (jetty-launcher-2728-thread-3) [ ] o.e.j.s.h.ContextHandler Started o.e.j.s.ServletContextHandler@589461{/solr,null,AVAILABLE}
[junit4] 2> 374593 WARN (jetty-launcher-2728-thread-4) [ ] o.e.j.s.AbstractConnector Ignoring deprecated socket close linger time
[junit4] 2> 374593 INFO (jetty-launcher-2728-thread-4) [ ] o.a.s.c.s.e.JettySolrRunner Start Jetty (original configured port=0)
[junit4] 2> 374593 INFO (jetty-launcher-2728-thread-4) [ ] o.a.s.c.s.e.JettySolrRunner Trying to start Jetty on port 0 try number 1 ...
[junit4] 2> 374594 INFO (jetty-launcher-2728-thread-4) [ ] o.e.j.s.Server jetty-9.4.14.v20181114; built: 2018-11-14T21:20:31.478Z; git: c4550056e785fb5665914545889f21dc136ad9e6; jvm 1.8.0_172-b11
[junit4] 2> 374594 INFO (jetty-launcher-2728-thread-4) [ ] o.e.j.s.session DefaultSessionIdManager workerName=node0
[junit4] 2> 374594 INFO (jetty-launcher-2728-thread-4) [ ] o.e.j.s.session No SessionScavenger set, using defaults
[junit4] 2> 374594 INFO (jetty-launcher-2728-thread-4) [ ] o.e.j.s.session node0 Scavenging every 600000ms
[junit4] 2> 374594 INFO (jetty-launcher-2728-thread-4) [ ] o.e.j.s.h.ContextHandler Started o.e.j.s.ServletContextHandler@123ed54{/solr,null,AVAILABLE}
[junit4] 2> 374596 INFO (jetty-launcher-2728-thread-1) [ ] o.e.j.s.AbstractConnector Started ServerConnector@f00915{HTTP/1.1,[http/1.1, h2c]}{127.0.0.1:57027}
[junit4] 2> 374596 INFO (jetty-launcher-2728-thread-1) [ ] o.e.j.s.Server Started @372339ms
[junit4] 2> 374596 INFO (jetty-launcher-2728-thread-1) [ ] o.a.s.c.s.e.JettySolrRunner Jetty properties: {hostContext=/solr, hostPort=57027}
[junit4] 2> 374596 ERROR (jetty-launcher-2728-thread-1) [ ] o.a.s.u.StartupLoggingUtils Missing Java Option solr.log.dir. Logging may be missing or incomplete.
[junit4] 2> 374596 INFO (jetty-launcher-2728-thread-1) [ ] o.a.s.s.SolrDispatchFilter Using logger factory org.apache.logging.slf4j.Log4jLoggerFactory
[junit4] 2> 374597 INFO (jetty-launcher-2728-thread-1) [ ] o.a.s.s.SolrDispatchFilter ___ _ Welcome to Apache Solr™ version 9.0.0
[junit4] 2> 374597 INFO (jetty-launcher-2728-thread-1) [ ] o.a.s.s.SolrDispatchFilter / __| ___| |_ _ Starting in cloud mode on port null
[junit4] 2> 374597 INFO (jetty-launcher-2728-thread-1) [ ] o.a.s.s.SolrDispatchFilter \__ \/ _ \ | '_| Install dir: null
[junit4] 2> 374597 INFO (jetty-launcher-2728-thread-1) [ ] o.a.s.s.SolrDispatchFilter |___/\___/_|_| Start time: 2019-01-21T15:09:02.814Z
[junit4] 2> 374605 INFO (jetty-launcher-2728-thread-2) [ ] o.e.j.s.AbstractConnector Started ServerConnector@534927{HTTP/1.1,[http/1.1, h2c]}{127.0.0.1:57030}
[junit4] 2> 374605 INFO (jetty-launcher-2728-thread-2) [ ] o.e.j.s.Server Started @372348ms
[junit4] 2> 374605 INFO (jetty-launcher-2728-thread-2) [ ] o.a.s.c.s.e.JettySolrRunner Jetty properties: {hostContext=/solr, hostPort=57030}
[junit4] 2> 374605 ERROR (jetty-launcher-2728-thread-2) [ ] o.a.s.u.StartupLoggingUtils Missing Java Option solr.log.dir. Logging may be missing or incomplete.
[junit4] 2> 374605 INFO (jetty-launcher-2728-thread-2) [ ] o.a.s.s.SolrDispatchFilter Using logger factory org.apache.logging.slf4j.Log4jLoggerFactory
[junit4] 2> 374605 INFO (jetty-launcher-2728-thread-2) [ ] o.a.s.s.SolrDispatchFilter ___ _ Welcome to Apache Solr™ version 9.0.0
[junit4] 2> 374605 INFO (jetty-launcher-2728-thread-2) [ ] o.a.s.s.SolrDispatchFilter / __| ___| |_ _ Starting in cloud mode on port null
[junit4] 2> 374605 INFO (jetty-launcher-2728-thread-2) [ ] o.a.s.s.SolrDispatchFilter \__ \/ _ \ | '_| Install dir: null
[junit4] 2> 374605 INFO (jetty-launcher-2728-thread-2) [ ] o.a.s.s.SolrDispatchFilter |___/\___/_|_| Start time: 2019-01-21T15:09:02.822Z
[junit4] 2> 374608 INFO (jetty-launcher-2728-thread-3) [ ] o.e.j.s.AbstractConnector Started ServerConnector@181b58{HTTP/1.1,[http/1.1, h2c]}{127.0.0.1:57035}
[junit4] 2> 374608 INFO (jetty-launcher-2728-thread-3) [ ] o.e.j.s.Server Started @372354ms
[junit4] 2> 374608 INFO (jetty-launcher-2728-thread-3) [ ] o.a.s.c.s.e.JettySolrRunner Jetty properties: {hostContext=/solr, hostPort=57035}
[junit4] 2> 374612 ERROR (jetty-launcher-2728-thread-3) [ ] o.a.s.u.StartupLoggingUtils Missing Java Option solr.log.dir. Logging may be missing or incomplete.
[junit4] 2> 374612 INFO (jetty-launcher-2728-thread-3) [ ] o.a.s.s.SolrDispatchFilter Using logger factory org.apache.logging.slf4j.Log4jLoggerFactory
[junit4] 2> 374612 INFO (jetty-launcher-2728-thread-3) [ ] o.a.s.s.SolrDispatchFilter ___ _ Welcome to Apache Solr™ version 9.0.0
[junit4] 2> 374612 INFO (jetty-launcher-2728-thread-3) [ ] o.a.s.s.SolrDispatchFilter / __| ___| |_ _ Starting in cloud mode on port null
[junit4] 2> 374612 INFO (jetty-launcher-2728-thread-3) [ ] o.a.s.s.SolrDispatchFilter \__ \/ _ \ | '_| Install dir: null
[junit4] 2> 374612 INFO (jetty-launcher-2728-thread-3) [ ] o.a.s.s.SolrDispatchFilter |___/\___/_|_| Start time: 2019-01-21T15:09:02.829Z
[junit4] 2> 374614 INFO (jetty-launcher-2728-thread-4) [ ] o.e.j.s.AbstractConnector Started ServerConnector@9be49f{HTTP/1.1,[http/1.1, h2c]}{127.0.0.1:57038}
[junit4] 2> 374614 INFO (jetty-launcher-2728-thread-4) [ ] o.e.j.s.Server Started @372357ms
[junit4] 2> 374614 INFO (jetty-launcher-2728-thread-4) [ ] o.a.s.c.s.e.JettySolrRunner Jetty properties: {hostContext=/solr, hostPort=57038}
[junit4] 2> 374614 ERROR (jetty-launcher-2728-thread-4) [ ] o.a.s.u.StartupLoggingUtils Missing Java Option solr.log.dir. Logging may be missing or incomplete.
[junit4] 2> 374614 INFO (jetty-launcher-2728-thread-4) [ ] o.a.s.s.SolrDispatchFilter Using logger factory org.apache.logging.slf4j.Log4jLoggerFactory
[junit4] 2> 374614 INFO (jetty-launcher-2728-thread-4) [ ] o.a.s.s.SolrDispatchFilter ___ _ Welcome to Apache Solr™ version 9.0.0
[junit4] 2> 374614 INFO (jetty-launcher-2728-thread-4) [ ] o.a.s.s.SolrDispatchFilter / __| ___| |_ _ Starting in cloud mode on port null
[junit4] 2> 374614 INFO (jetty-launcher-2728-thread-4) [ ] o.a.s.s.SolrDispatchFilter \__ \/ _ \ | '_| Install dir: null
[junit4] 2> 374614 INFO (jetty-launcher-2728-thread-4) [ ] o.a.s.s.SolrDispatchFilter |___/\___/_|_| Start time: 2019-01-21T15:09:02.831Z
[junit4] 2> 374633 INFO (zkConnectionManagerCallback-2730-thread-1) [ ] o.a.s.c.c.ConnectionManager zkClient has connected
[junit4] 2> 374638 INFO (jetty-launcher-2728-thread-1) [ ] o.a.s.s.SolrDispatchFilter solr.xml found in ZooKeeper. Loading...
[junit4] 2> 374671 INFO (zkConnectionManagerCallback-2732-thread-1) [ ] o.a.s.c.c.ConnectionManager zkClient has connected
[junit4] 2> 374671 INFO (zkConnectionManagerCallback-2736-thread-1) [ ] o.a.s.c.c.ConnectionManager zkClient has connected
[junit4] 2> 374672 INFO (zkConnectionManagerCallback-2734-thread-1) [ ] o.a.s.c.c.ConnectionManager zkClient has connected
[junit4] 2> 374673 INFO (jetty-launcher-2728-thread-4) [ ] o.a.s.s.SolrDispatchFilter solr.xml found in ZooKeeper. Loading...
[junit4] 2> 374677 INFO (jetty-launcher-2728-thread-3) [ ] o.a.s.s.SolrDispatchFilter solr.xml found in ZooKeeper. Loading...
[junit4] 2> 374673 INFO (jetty-launcher-2728-thread-2) [ ] o.a.s.s.SolrDispatchFilter solr.xml found in ZooKeeper. Loading...
[junit4] 2> 375226 INFO (jetty-launcher-2728-thread-1) [ ] o.a.s.h.c.HttpShardHandlerFactory Host whitelist initialized: WhitelistHostChecker [whitelistHosts=null, whitelistHostCheckingEnabled=true]
[junit4] 2> 375385 WARN (jetty-launcher-2728-thread-1) [ ] o.e.j.u.s.S.config No Client EndPointIdentificationAlgorithm configured for SslContextFactory@70a107[provider=null,keyStore=null,trustStore=null]
[junit4] 2> 375462 INFO (jetty-launcher-2728-thread-4) [ ] o.a.s.h.c.HttpShardHandlerFactory Host whitelist initialized: WhitelistHostChecker [whitelistHosts=null, whitelistHostCheckingEnabled=true]
[junit4] 2> 375466 WARN (jetty-launcher-2728-thread-1) [ ] o.e.j.u.s.S.config No Client EndPointIdentificationAlgorithm configured for SslContextFactory@1f980c9[provider=null,keyStore=null,trustStore=null]
[junit4] 2> 375467 INFO (jetty-launcher-2728-thread-1) [ ] o.a.s.c.ZkContainer Zookeeper client=127.0.0.1:57001/solr
[junit4] 2> 375470 WARN (jetty-launcher-2728-thread-4) [ ] o.e.j.u.s.S.config No Client EndPointIdentificationAlgorithm configured for SslContextFactory@132898f[provider=null,keyStore=null,trustStore=null]
[junit4] 2> 375502 INFO (jetty-launcher-2728-thread-2) [ ] o.a.s.h.c.HttpShardHandlerFactory Host whitelist initialized: WhitelistHostChecker [whitelistHosts=null, whitelistHostCheckingEnabled=true]
[junit4] 2> 375512 WARN (jetty-launcher-2728-thread-4) [ ] o.e.j.u.s.S.config No Client EndPointIdentificationAlgorithm configured for SslContextFactory@1c1e757[provider=null,keyStore=null,trustStore=null]
[junit4] 2> 375514 INFO (jetty-launcher-2728-thread-4) [ ] o.a.s.c.ZkContainer Zookeeper client=127.0.0.1:57001/solr
[junit4] 2> 375517 WARN (jetty-launcher-2728-thread-2) [ ] o.e.j.u.s.S.config No Client EndPointIdentificationAlgorithm configured for SslContextFactory@113a774[provider=null,keyStore=null,trustStore=null]
[junit4] 2> 375538 INFO (zkConnectionManagerCallback-2743-thread-1) [ ] o.a.s.c.c.ConnectionManager zkClient has connected
[junit4] 2> 375549 WARN (jetty-launcher-2728-thread-2) [ ] o.e.j.u.s.S.config No Client EndPointIdentificationAlgorithm configured for SslContextFactory@e9e71a[provider=null,keyStore=null,trustStore=null]
[junit4] 2> 375550 INFO (jetty-launcher-2728-thread-2) [ ] o.a.s.c.ZkContainer Zookeeper client=127.0.0.1:57001/solr
[junit4] 2> 375570 INFO (zkConnectionManagerCallback-2749-thread-1) [ ] o.a.s.c.c.ConnectionManager zkClient has connected
[junit4] 2> 375592 INFO (zkConnectionManagerCallback-2753-thread-1) [ ] o.a.s.c.c.ConnectionManager zkClient has connected
[junit4] 2> 375593 INFO (zkConnectionManagerCallback-2756-thread-1) [ ] o.a.s.c.c.ConnectionManager zkClient has connected
[junit4] 2> 375598 INFO (zkConnectionManagerCallback-2758-thread-1) [ ] o.a.s.c.c.ConnectionManager zkClient has connected
[junit4] 2> 375629 WARN (jetty-launcher-2728-thread-4) [n:127.0.0.1:57038_solr ] o.a.s.c.ZkController The _default configset could not be uploaded. Please provide 'solr.default.confdir' parameter that points to a configset intended to be the default. Current 'solr.default.confdir' value: null
[junit4] 2> 375631 WARN (jetty-launcher-2728-thread-1) [n:127.0.0.1:57027_solr ] o.a.s.c.ZkController The _default configset could not be uploaded. Please provide 'solr.default.confdir' parameter that points to a configset intended to be the default. Current 'solr.default.confdir' value: null
[junit4] 2> 375667 INFO (jetty-launcher-2728-thread-3) [ ] o.a.s.h.c.HttpShardHandlerFactory Host whitelist initialized: WhitelistHostChecker [whitelistHosts=null, whitelistHostCheckingEnabled=true]
[junit4] 2> 375684 INFO (zkConnectionManagerCallback-2760-thread-1) [ ] o.a.s.c.c.ConnectionManager zkClient has connected
[junit4] 2> 375684 INFO (jetty-launcher-2728-thread-1) [n:127.0.0.1:57027_solr ] o.a.s.c.OverseerElectionContext I am going to be the leader 127.0.0.1:57027_solr
[junit4] 2> 375685 INFO (jetty-launcher-2728-thread-1) [n:127.0.0.1:57027_solr ] o.a.s.c.Overseer Overseer (id=72122740698906633-127.0.0.1:57027_solr-n_0000000000) starting
[junit4] 2> 375685 INFO (jetty-launcher-2728-thread-4) [n:127.0.0.1:57038_solr ] o.a.s.c.ZkController Register node as live in ZooKeeper:/live_nodes/127.0.0.1:57038_solr
[junit4] 2> 375685 WARN (jetty-launcher-2728-thread-3) [ ] o.e.j.u.s.S.config No Client EndPointIdentificationAlgorithm configured for SslContextFactory@1d8dced[provider=null,keyStore=null,trustStore=null]
[junit4] 2> 375727 WARN (jetty-launcher-2728-thread-2) [n:127.0.0.1:57030_solr ] o.a.s.c.ZkController The _default configset could not be uploaded. Please provide 'solr.default.confdir' parameter that points to a configset intended to be the default. Current 'solr.default.confdir' value: null
[junit4] 2> 375729 INFO (jetty-launcher-2728-thread-2) [n:127.0.0.1:57030_solr ] o.a.s.c.c.ZkStateReader Updated live nodes from ZooKeeper... (0) -> (1)
[junit4] 2> 375737 INFO (jetty-launcher-2728-thread-2) [n:127.0.0.1:57030_solr ] o.a.s.c.ZkController Publish node=127.0.0.1:57030_solr as DOWN
[junit4] 2> 375737 INFO (jetty-launcher-2728-thread-2) [n:127.0.0.1:57030_solr ] o.a.s.c.TransientSolrCoreCacheDefault Allocating transient cache for 2147483647 transient cores
[junit4] 2> 375737 INFO (jetty-launcher-2728-thread-2) [n:127.0.0.1:57030_solr ] o.a.s.c.ZkController Register node as live in ZooKeeper:/live_nodes/127.0.0.1:57030_solr
[junit4] 2> 375768 INFO (zkCallback-2759-thread-1) [ ] o.a.s.c.c.ZkStateReader Updated live nodes from ZooKeeper... (1) -> (2)
[junit4] 2> 375774 WARN (jetty-launcher-2728-thread-3) [ ] o.e.j.u.s.S.config No Client EndPointIdentificationAlgorithm configured for SslContextFactory@1f61c84[provider=null,keyStore=null,trustStore=null]
[junit4] 2> 375780 INFO (jetty-launcher-2728-thread-3) [ ] o.a.s.c.ZkContainer Zookeeper client=127.0.0.1:57001/solr
[junit4] 2> 375782 INFO (zkCallback-2757-thread-1) [ ] o.a.s.c.c.ZkStateReader Updated live nodes from ZooKeeper... (0) -> (2)
[junit4] 2> 375782 INFO (zkCallback-2752-thread-1) [ ] o.a.s.c.c.ZkStateReader Updated live nodes from ZooKeeper... (0) -> (2)
[junit4] 2> 375792 INFO (zkConnectionManagerCallback-2774-thread-1) [ ] o.a.s.c.c.ConnectionManager zkClient has connected
[junit4] 2> 375802 INFO (jetty-launcher-2728-thread-1) [n:127.0.0.1:57027_solr ] o.a.s.c.c.ZkStateReader Updated live nodes from ZooKeeper... (0) -> (2)
[junit4] 2> 375806 INFO (jetty-launcher-2728-thread-1) [n:127.0.0.1:57027_solr ] o.a.s.c.s.i.ZkClientClusterStateProvider Cluster at 127.0.0.1:57001/solr ready
[junit4] 2> 375806 INFO (jetty-launcher-2728-thread-1) [n:127.0.0.1:57027_solr ] o.a.s.c.ZkController Publish node=127.0.0.1:57027_solr as DOWN
[junit4] 2> 375815 INFO (jetty-launcher-2728-thread-1) [n:127.0.0.1:57027_solr ] o.a.s.c.TransientSolrCoreCacheDefault Allocating transient cache for 2147483647 transient cores
[junit4] 2> 375815 INFO (jetty-launcher-2728-thread-1) [n:127.0.0.1:57027_solr ] o.a.s.c.ZkController Register node as live in ZooKeeper:/live_nodes/127.0.0.1:57027_solr
[junit4] 2> 375817 INFO (zkCallback-2752-thread-1) [ ] o.a.s.c.c.ZkStateReader Updated live nodes from ZooKeeper... (2) -> (3)
[junit4] 2> 375817 INFO (zkCallback-2757-thread-1) [ ] o.a.s.c.c.ZkStateReader Updated live nodes from ZooKeeper... (2) -> (3)
[junit4] 2> 375817 INFO (zkCallback-2759-thread-1) [ ] o.a.s.c.c.ZkStateReader Updated live nodes from ZooKeeper... (2) -> (3)
[junit4] 2> 375856 INFO (jetty-launcher-2728-thread-1) [n:127.0.0.1:57027_solr ] o.a.s.h.a.MetricsHistoryHandler No .system collection, keeping metrics history in memory.
[junit4] 2> 375913 INFO (OverseerStateUpdate-72122740698906633-127.0.0.1:57027_solr-n_0000000000) [n:127.0.0.1:57027_solr ] o.a.s.c.Overseer Starting to work on the main queue : 127.0.0.1:57027_solr
[junit4] 2> 375918 INFO (zkCallback-2773-thread-1) [ ] o.a.s.c.c.ZkStateReader Updated live nodes from ZooKeeper... (2) -> (3)
[junit4] 2> 375919 INFO (zkConnectionManagerCallback-2777-thread-1) [ ] o.a.s.c.c.ConnectionManager zkClient has connected
[junit4] 2> 375927 INFO (zkConnectionManagerCallback-2782-thread-1) [ ] o.a.s.c.c.ConnectionManager zkClient has connected
[junit4] 2> 375933 INFO (jetty-launcher-2728-thread-4) [n:127.0.0.1:57038_solr ] o.a.s.c.c.ZkStateReader Updated live nodes from ZooKeeper... (0) -> (3)
[junit4] 2> 375938 INFO (jetty-launcher-2728-thread-4) [n:127.0.0.1:57038_solr ] o.a.s.c.s.i.ZkClientClusterStateProvider Cluster at 127.0.0.1:57001/solr ready
[junit4] 2> 375938 INFO (jetty-launcher-2728-thread-4) [n:127.0.0.1:57038_solr ] o.a.s.h.a.MetricsHistoryHandler No .system collection, keeping metrics history in memory.
[junit4] 2> 375942 INFO (zkConnectionManagerCallback-2787-thread-1) [ ] o.a.s.c.c.ConnectionManager zkClient has connected
[junit4] 2> 375943 INFO (jetty-launcher-2728-thread-1) [n:127.0.0.1:57027_solr ] o.a.s.m.r.SolrJmxReporter JMX monitoring for 'solr_57027.solr.node' (registry 'solr.node') enabled at server: com.sun.jmx.mbeanserver.JmxMBeanServer@125f3a6
[junit4] 2> 375943 INFO (jetty-launcher-2728-thread-2) [n:127.0.0.1:57030_solr ] o.a.s.c.c.ZkStateReader Updated live nodes from ZooKeeper... (0) -> (3)
[junit4] 2> 375947 INFO (jetty-launcher-2728-thread-2) [n:127.0.0.1:57030_solr ] o.a.s.c.s.i.ZkClientClusterStateProvider Cluster at 127.0.0.1:57001/solr ready
[junit4] 2> 375948 INFO (jetty-launcher-2728-thread-2) [n:127.0.0.1:57030_solr ] o.a.s.h.a.MetricsHistoryHandler No .system collection, keeping metrics history in memory.
[junit4] 2> 375952 INFO (zkConnectionManagerCallback-2790-thread-1) [ ] o.a.s.c.c.ConnectionManager zkClient has connected
[junit4] 2> 375959 INFO (jetty-launcher-2728-thread-1) [n:127.0.0.1:57027_solr ] o.a.s.m.r.SolrJmxReporter JMX monitoring for 'solr_57027.solr.jvm' (registry 'solr.jvm') enabled at server: com.sun.jmx.mbeanserver.JmxMBeanServer@125f3a6
[junit4] 2> 375959 INFO (jetty-launcher-2728-thread-1) [n:127.0.0.1:57027_solr ] o.a.s.m.r.SolrJmxReporter JMX monitoring for 'solr_57027.solr.jetty' (registry 'solr.jetty') enabled at server: com.sun.jmx.mbeanserver.JmxMBeanServer@125f3a6
[junit4] 2> 375962 INFO (jetty-launcher-2728-thread-1) [n:127.0.0.1:57027_solr ] o.a.s.c.CorePropertiesLocator Found 0 core definitions underneath C:\Users\jenkins\workspace\Lucene-Solr-master-Windows\solr\build\solr-solrj\test\J0\temp\solr.client.solrj.io.stream.StreamDecoratorTest_EAB51E24E990EA7A-001\tempDir-001\node1\.
[junit4] 2> 375972 INFO (jetty-launcher-2728-thread-4) [n:127.0.0.1:57038_solr ] o.a.s.m.r.SolrJmxReporter JMX monitoring for 'solr_57038.solr.node' (registry 'solr.node') enabled at server: com.sun.jmx.mbeanserver.JmxMBeanServer@125f3a6
[junit4] 2> 375978 INFO (jetty-launcher-2728-thread-2) [n:127.0.0.1:57030_solr ] o.a.s.m.r.SolrJmxReporter JMX monitoring for 'solr_57030.solr.node' (registry 'solr.node') enabled at server: com.sun.jmx.mbeanserver.JmxMBeanServer@125f3a6
[junit4] 2> 375984 INFO (jetty-launcher-2728-thread-4) [n:127.0.0.1:57038_solr ] o.a.s.m.r.SolrJmxReporter JMX monitoring for 'solr_57038.solr.jvm' (registry 'solr.jvm') enabled at server: com.sun.jmx.mbeanserver.JmxMBeanServer@125f3a6
[junit4] 2> 375985 INFO (jetty-launcher-2728-thread-4) [n:127.0.0.1:57038_solr ] o.a.s.m.r.SolrJmxReporter JMX monitoring for 'solr_57038.solr.jetty' (registry 'solr.jetty') enabled at server: com.sun.jmx.mbeanserver.JmxMBeanServer@125f3a6
[junit4] 2> 375987 INFO (jetty-launcher-2728-thread-4) [n:127.0.0.1:57038_solr ] o.a.s.c.CorePropertiesLocator Found 0 core definitions underneath C:\Users\jenkins\workspace\Lucene-Solr-master-Windows\solr\build\solr-solrj\test\J0\temp\solr.client.solrj.io.stream.StreamDecoratorTest_EAB51E24E990EA7A-001\tempDir-001\node4\.
[junit4] 2> 375992 INFO (jetty-launcher-2728-thread-2) [n:127.0.0.1:57030_solr ] o.a.s.m.r.SolrJmxReporter JMX monitoring for 'solr_57030.solr.jvm' (registry 'solr.jvm') enabled at server: com.sun.jmx.mbeanserver.JmxMBeanServer@125f3a6
[junit4] 2> 375992 INFO (jetty-launcher-2728-thread-2) [n:127.0.0.1:57030_solr ] o.a.s.m.r.SolrJmxReporter JMX monitoring for 'solr_57030.solr.jetty' (registry 'solr.jetty') enabled at server: com.sun.jmx.mbeanserver.JmxMBeanServer@125f3a6
[junit4] 2> 375994 WARN (jetty-launcher-2728-thread-3) [n:127.0.0.1:57035_solr ] o.a.s.c.ZkController The _default configset could not be uploaded. Please provide 'solr.default.confdir' parameter that points to a configset intended to be the default. Current 'solr.default.confdir' value: null
[junit4] 2> 375995 INFO (jetty-launcher-2728-thread-2) [n:127.0.0.1:57030_solr ] o.a.s.c.CorePropertiesLocator Found 0 core definitions underneath C:\Users\jenkins\workspace\Lucene-Solr-master-Windows\solr\build\solr-solrj\test\J0\temp\solr.client.solrj.io.stream.StreamDecoratorTest_EAB51E24E990EA7A-001\tempDir-001\node2\.
[junit4] 2> 376001 INFO (jetty-launcher-2728-thread-3) [n:127.0.0.1:57035_solr ] o.a.s.c.c.ZkStateReader Updated live nodes from ZooKeeper... (0) -> (3)
[junit4] 2> 376006 INFO (jetty-launcher-2728-thread-3) [n:127.0.0.1:57035_solr ] o.a.s.c.ZkController Publish node=127.0.0.1:57035_solr as DOWN
[junit4] 2> 376009 INFO (jetty-launcher-2728-thread-3) [n:127.0.0.1:57035_solr ] o.a.s.c.TransientSolrCoreCacheDefault Allocating transient cache for 2147483647 transient cores
[junit4] 2> 376009 INFO (jetty-launcher-2728-thread-3) [n:127.0.0.1:57035_solr ] o.a.s.c.ZkController Register node as live in ZooKeeper:/live_nodes/127.0.0.1:57035_solr
[junit4] 2> 376016 INFO (zkCallback-2757-thread-1) [ ] o.a.s.c.c.ZkStateReader Updated live nodes from ZooKeeper... (3) -> (4)
[junit4] 2> 376016 INFO (zkCallback-2759-thread-1) [ ] o.a.s.c.c.ZkStateReader Updated live nodes from ZooKeeper... (3) -> (4)
[junit4] 2> 376016 INFO (zkCallback-2752-thread-1) [ ] o.a.s.c.c.ZkStateReader Updated live nodes from ZooKeeper... (3) -> (4)
[junit4] 2> 376016 INFO (zkCallback-2773-thread-1) [ ] o.a.s.c.c.ZkStateReader Updated live nodes from ZooKeeper... (3) -> (4)
[junit4] 2> 376093 INFO (zkCallback-2786-thread-1) [ ] o.a.s.c.c.ZkStateReader Updated live nodes from ZooKeeper... (3) -> (4)
[junit4] 2> 376095 INFO (zkCallback-2781-thread-1) [ ] o.a.s.c.c.ZkStateReader Updated live nodes from ZooKeeper... (3) -> (4)
[junit4] 2> 376095 INFO (zkCallback-2789-thread-1) [ ] o.a.s.c.c.ZkStateReader Updated live nodes from ZooKeeper... (3) -> (4)
[junit4] 2> 376119 INFO (zkConnectionManagerCallback-2799-thread-1) [ ] o.a.s.c.c.ConnectionManager zkClient has connected
[junit4] 2> 376122 INFO (jetty-launcher-2728-thread-3) [n:127.0.0.1:57035_solr ] o.a.s.c.c.ZkStateReader Updated live nodes from ZooKeeper... (0) -> (4)
[junit4] 2> 376122 INFO (jetty-launcher-2728-thread-3) [n:127.0.0.1:57035_solr ] o.a.s.c.s.i.ZkClientClusterStateProvider Cluster at 127.0.0.1:57001/solr ready
[junit4] 2> 376122 INFO (jetty-launcher-2728-thread-3) [n:127.0.0.1:57035_solr ] o.a.s.h.a.MetricsHistoryHandler No .system collection, keeping metrics history in memory.
[junit4] 2> 376155 INFO (jetty-launcher-2728-thread-3) [n:127.0.0.1:57035_solr ] o.a.s.m.r.SolrJmxReporter JMX monitoring for 'solr_57035.solr.node' (registry 'solr.node') enabled at server: com.sun.jmx.mbeanserver.JmxMBeanServer@125f3a6
[junit4] 2> 376175 INFO (jetty-launcher-2728-thread-3) [n:127.0.0.1:57035_solr ] o.a.s.m.r.SolrJmxReporter JMX monitoring for 'solr_57035.solr.jvm' (registry 'solr.jvm') enabled at server: com.sun.jmx.mbeanserver.JmxMBeanServer@125f3a6
[junit4] 2> 376175 INFO (jetty-launcher-2728-thread-3) [n:127.0.0.1:57035_solr ] o.a.s.m.r.SolrJmxReporter JMX monitoring for 'solr_57035.solr.jetty' (registry 'solr.jetty') enabled at server: com.sun.jmx.mbeanserver.JmxMBeanServer@125f3a6
[junit4] 2> 376177 INFO (jetty-launcher-2728-thread-3) [n:127.0.0.1:57035_solr ] o.a.s.c.CorePropertiesLocator Found 0 core definitions underneath C:\Users\jenkins\workspace\Lucene-Solr-master-Windows\solr\build\solr-solrj\test\J0\temp\solr.client.solrj.io.stream.StreamDecoratorTest_EAB51E24E990EA7A-001\tempDir-001\node3\.
[junit4] 2> 376243 INFO (zkConnectionManagerCallback-2805-thread-1) [ ] o.a.s.c.c.ConnectionManager zkClient has connected
[junit4] 2> 376246 INFO (SUITE-StreamDecoratorTest-seed#[EAB51E24E990EA7A]-worker) [ ] o.a.s.c.c.ZkStateReader Updated live nodes from ZooKeeper... (0) -> (4)
[junit4] 2> 376248 INFO (SUITE-StreamDecoratorTest-seed#[EAB51E24E990EA7A]-worker) [ ] o.a.s.c.s.i.ZkClientClusterStateProvider Cluster at 127.0.0.1:57001/solr ready
[junit4] 2> 376260 INFO (qtp14105191-7382) [n:127.0.0.1:57027_solr ] o.a.s.h.a.CollectionsHandler Invoked Collection Action :create with params collection.configName=conf&name=collection1&nrtReplicas=1&action=CREATE&numShards=2&wt=javabin&version=2 and sendToOCPQueue=true
[junit4] 2> 376262 INFO (OverseerThreadFactory-2078-thread-1-processing-n:127.0.0.1:57027_solr) [n:127.0.0.1:57027_solr ] o.a.s.c.a.c.CreateCollectionCmd Create collection collection1
[junit4] 2> 376374 INFO (qtp14105191-7384) [n:127.0.0.1:57027_solr ] o.a.s.s.HttpSolrCall [admin] webapp=null path=/admin/metrics params={prefix=CONTAINER.fs.usableSpace,CONTAINER.fs.totalSpace,CORE.coreName&wt=javabin&version=2&group=solr.node,solr.core} status=0 QTime=3
[junit4] 2> 376378 INFO (qtp14105191-7385) [n:127.0.0.1:57027_solr ] o.a.s.s.HttpSolrCall [admin] webapp=null path=/admin/metrics params={prefix=CONTAINER.fs.usableSpace,CONTAINER.fs.totalSpace,CORE.coreName&wt=javabin&version=2&group=solr.node,solr.core} status=0 QTime=3
[junit4] 2> 376382 INFO (qtp14105191-7386) [n:127.0.0.1:57027_solr ] o.a.s.s.HttpSolrCall [admin] webapp=null path=/admin/metrics params={prefix=CONTAINER.fs.usableSpace,CONTAINER.fs.totalSpace,CORE.coreName&wt=javabin&version=2&group=solr.node,solr.core} status=0 QTime=2
[junit4] 2> 376385 INFO (qtp14105191-7415) [n:127.0.0.1:57027_solr ] o.a.s.s.HttpSolrCall [admin] webapp=null path=/admin/metrics params={prefix=CONTAINER.fs.usableSpace,CONTAINER.fs.totalSpace,CORE.coreName&wt=javabin&version=2&group=solr.node,solr.core} status=0 QTime=2
[junit4] 2> 376390 INFO (qtp14105191-7418) [n:127.0.0.1:57027_solr ] o.a.s.s.HttpSolrCall [admin] webapp=null path=/admin/metrics params={prefix=CONTAINER.fs.usableSpace,CONTAINER.fs.totalSpace,CORE.coreName&wt=javabin&version=2&group=solr.node,solr.core} status=0 QTime=2
[junit4] 2> 376394 INFO (qtp3948973-7400) [n:127.0.0.1:57035_solr ] o.a.s.s.HttpSolrCall [admin] webapp=null path=/admin/metrics params={prefix=CONTAINER.fs.usableSpace,CONTAINER.fs.totalSpace,CORE.coreName&wt=javabin&version=2&group=solr.node,solr.core} status=0 QTime=2
[junit4] 2> 376398 INFO (qtp3948973-7401) [n:127.0.0.1:57035_solr ] o.a.s.s.HttpSolrCall [admin] webapp=null path=/admin/metrics params={prefix=CONTAINER.fs.usableSpace,CONTAINER.fs.totalSpace,CORE.coreName&wt=javabin&version=2&group=solr.node,solr.core} status=0 QTime=3
[junit4] 2> 376404 INFO (qtp3948973-7402) [n:127.0.0.1:57035_solr ] o.a.s.s.HttpSolrCall [admin] webapp=null path=/admin/metrics params={prefix=CONTAINER.fs.usableSpace,CONTAINER.fs.totalSpace,CORE.coreName&wt=javabin&version=2&group=solr.node,solr.core} status=0 QTime=2
[junit4] 2> 376407 INFO (qtp3948973-7403) [n:127.0.0.1:57035_solr ] o.a.s.s.HttpSolrCall [admin] webapp=null path=/admin/metrics params={prefix=CONTAINER.fs.usableSpace,CONTAINER.fs.totalSpace,CORE.coreName&wt=javabin&version=2&group=solr.node,solr.core} status=0 QTime=2
[junit4] 2> 376411 INFO (qtp3948973-7403) [n:127.0.0.1:57035_solr ] o.a.s.s.HttpSolrCall [admin] webapp=null path=/admin/metrics params={prefix=CONTAINER.fs.usableSpace,CONTAINER.fs.totalSpace,CORE.coreName&wt=javabin&version=2&group=solr.node,solr.core} status=0 QTime=2
[junit4] 2> 376416 INFO (qtp21086313-7391) [n:127.0.0.1:57030_solr ] o.a.s.s.HttpSolrCall [admin] webapp=null path=/admin/metrics params={prefix=CONTAINER.fs.usableSpace,CONTAINER.fs.totalSpace,CORE.coreName&wt=javabin&version=2&group=solr.node,solr.core} status=0 QTime=2
[junit4] 2> 376420 INFO (qtp21086313-7392) [n:127.0.0.1:57030_solr ] o.a.s.s.HttpSolrCall [admin] webapp=null path=/admin/metrics params={prefix=CONTAINER.fs.usableSpace,CONTAINER.fs.totalSpace,CORE.coreName&wt=javabin&version=2&group=solr.node,solr.core} status=0 QTime=2
[junit4] 2> 376423 INFO (qtp21086313-7393) [n:127.0.0.1:57030_solr ] o.a.s.s.HttpSolrCall [admin] webapp=null path=/admin/metrics params={prefix=CONTAINER.fs.usableSpace,CONTAINER.fs.totalSpace,CORE.coreName&wt=javabin&version=2&group=solr.node,solr.core} status=0 QTime=2
[junit4] 2> 376427 INFO (qtp21086313-7394) [n:127.0.0.1:57030_solr ] o.a.s.s.HttpSolrCall [admin] webapp=null path=/admin/metrics params={prefix=CONTAINER.fs.usableSpace,CONTAINER.fs.totalSpace,CORE.coreName&wt=javabin&version=2&group=solr.node,solr.core} status=0 QTime=2
[junit4] 2> 376429 INFO (qtp21086313-7395) [n:127.0.0.1:57030_solr ] o.a.s.s.HttpSolrCall [admin] webapp=null path=/admin/metrics params={prefix=CONTAINER.fs.usableSpace,CONTAINER.fs.totalSpace,CORE.coreName&wt=javabin&version=2&group=solr.node,solr.core} status=0 QTime=2
[junit4] 2> 376436 INFO (qtp27950463-7409) [n:127.0.0.1:57038_solr ] o.a.s.s.HttpSolrCall [admin] webapp=null path=/admin/metrics params={prefix=CONTAINER.fs.usableSpace,CONTAINER.fs.totalSpace,CORE.coreName&wt=javabin&version=2&group=solr.node,solr.core} status=0 QTime=2
[junit4] 2> 376439 INFO (qtp27950463-7410) [n:127.0.0.1:57038_solr ] o.a.s.s.HttpSolrCall [admin] webapp=null path=/admin/metrics params={prefix=CONTAINER.fs.usableSpace,CONTAINER.fs.totalSpace,CORE.coreName&wt=javabin&version=2&group=solr.node,solr.core} status=0 QTime=2
[junit4] 2> 376443 INFO (qtp27950463-7411) [n:127.0.0.1:57038_solr ] o.a.s.s.HttpSolrCall [admin] webapp=null path=/admin/metrics params={prefix=CONTAINER.fs.usableSpace,CONTAINER.fs.totalSpace,CORE.coreName&wt=javabin&version=2&group=solr.node,solr.core} status=0 QTime=2
[junit4] 2> 376447 INFO (qtp27950463-7412) [n:127.0.0.1:57038_solr ] o.a.s.s.HttpSolrCall [admin] webapp=null path=/admin/metrics params={prefix=CONTAINER.fs.usableSpace,CONTAINER.fs.totalSpace,CORE.coreName&wt=javabin&version=2&group=solr.node,solr.core} status=0 QTime=2
[junit4] 2> 376451 INFO (qtp27950463-7413) [n:127.0.0.1:57038_solr ] o.a.s.s.HttpSolrCall [admin] webapp=null path=/admin/metrics params={prefix=CONTAINER.fs.usableSpace,CONTAINER.fs.totalSpace,CORE.coreName&wt=javabin&version=2&group=solr.node,solr.core} status=0 QTime=2
[junit4] 2> 376458 INFO (OverseerStateUpdate-72122740698906633-127.0.0.1:57027_solr-n_0000000000) [n:127.0.0.1:57027_solr ] o.a.s.c.o.SliceMutator createReplica() {
[junit4] 2> "operation":"ADDREPLICA",
[junit4] 2> "collection":"collection1",
[junit4] 2> "shard":"shard1",
[junit4] 2> "core":"collection1_shard1_replica_n1",
[junit4] 2> "state":"down",
[junit4] 2> "base_url":"http://127.0.0.1:57038/solr",
[junit4] 2> "type":"NRT",
[junit4] 2> "waitForFinalState":"false"}
[junit4] 2> 376461 INFO (OverseerStateUpdate-72122740698906633-127.0.0.1:57027_solr-n_0000000000) [n:127.0.0.1:57027_solr ] o.a.s.c.o.SliceMutator createReplica() {
[junit4] 2> "operation":"ADDREPLICA",
[junit4] 2> "collection":"collection1",
[junit4] 2> "shard":"shard2",
[junit4] 2> "core":"collection1_shard2_replica_n2",
[junit4] 2> "state":"down",
[junit4] 2> "base_url":"http://127.0.0.1:57030/solr",
[junit4] 2> "type":"NRT",
[junit4] 2> "waitForFinalState":"false"}
[junit4] 2> 376661 INFO (qtp27950463-7427) [n:127.0.0.1:57038_solr x:collection1_shard1_replica_n1] o.a.s.h.a.CoreAdminOperation core create command qt=/admin/cores&coreNodeName=core_node3&collection.configName=conf&newCollection=true&name=collection1_shard1_replica_n1&action=CREATE&numShards=2&collection=collection1&shard=shard1&wt=javabin&version=2&replicaType=NRT
[junit4] 2> 376661 INFO (qtp21086313-7419) [n:127.0.0.1:57030_solr x:collection1_shard2_replica_n2] o.a.s.h.a.CoreAdminOperation core create command qt=/admin/cores&coreNodeName=core_node4&collection.configName=conf&newCollection=true&name=collection1_shard2_replica_n2&action=CREATE&numShards=2&collection=collection1&shard=shard2&wt=javabin&version=2&replicaType=NRT
[junit4] 2> 376663 INFO (qtp27950463-7427) [n:127.0.0.1:57038_solr x:collection1_shard1_replica_n1] o.a.s.c.TransientSolrCoreCacheDefault Allocating transient cache for 2147483647 transient cores
[junit4] 2> 377679 INFO (qtp27950463-7427) [n:127.0.0.1:57038_solr c:collection1 s:shard1 r:core_node3 x:collection1_shard1_replica_n1] o.a.s.c.SolrConfig Using Lucene MatchVersion: 9.0.0
[junit4] 2> 377679 INFO (qtp21086313-7419) [n:127.0.0.1:57030_solr c:collection1 s:shard2 r:core_node4 x:collection1_shard2_replica_n2] o.a.s.c.SolrConfig Using Lucene MatchVersion: 9.0.0
[junit4] 2> 377701 INFO (qtp27950463-7427) [n:127.0.0.1:57038_solr c:collection1 s:shard1 r:core_node3 x:collection1_shard1_replica_n1] o.a.s.s.IndexSchema [collection1_shard1_replica_n1] Schema name=test
[junit4] 2> 377701 INFO (qtp21086313-7419) [n:127.0.0.1:57030_solr c:collection1 s:shard2 r:core_node4 x:collection1_shard2_replica_n2] o.a.s.s.IndexSchema [collection1_shard2_replica_n2] Schema name=test
[junit4] 2> 377777 WARN (qtp27950463-7427) [n:127.0.0.1:57038_solr c:collection1 s:shard1 r:core_node3 x:collection1_shard1_replica_n1] o.a.s.s.IndexSchema Field lowerfilt1and2 is not multivalued and destination for multiple copyFields (2)
[junit4] 2> 377780 WARN (qtp27950463-7427) [n:127.0.0.1:57038_solr c:collection1 s:shard1 r:core_node3 x:collection1_shard1_replica_n1] o.a.s.s.IndexSchema Field text is not multivalued and destination for multiple copyFields (3)
[junit4] 2> 377780 INFO (qtp27950463-7427) [n:127.0.0.1:57038_solr c:collection1 s:shard1 r:core_node3 x:collection1_shard1_replica_n1] o.a.s.s.IndexSchema Loaded schema test/1.6 with uniqueid field id
[junit4] 2> 377780 INFO (qtp27950463-7427) [n:127.0.0.1:57038_solr c:collection1 s:shard1 r:core_node3 x:collection1_shard1_replica_n1] o.a.s.c.CoreContainer Creating SolrCore 'collection1_shard1_replica_n1' using configuration from collection collection1, trusted=true
[junit4] 2> 377785 INFO (qtp27950463-7427) [n:127.0.0.1:57038_solr c:collection1 s:shard1 r:core_node3 x:collection1_shard1_replica_n1] o.a.s.m.r.SolrJmxReporter JMX monitoring for 'solr_57038.solr.core.collection1.shard1.replica_n1' (registry 'solr.core.collection1.shard1.replica_n1') enabled at server: com.sun.jmx.mbeanserver.JmxMBeanServer@125f3a6
[junit4] 2> 377786 INFO (qtp27950463-7427) [n:127.0.0.1:57038_solr c:collection1 s:shard1 r:core_node3 x:collection1_shard1_replica_n1] o.a.s.c.SolrCore [[collection1_shard1_replica_n1] ] Opening new SolrCore at [C:\Users\jenkins\workspace\Lucene-Solr-master-Windows\solr\build\solr-solrj\test\J0\temp\solr.client.solrj.io.stream.StreamDecoratorTest_EAB51E24E990EA7A-001\tempDir-001\node4\collection1_shard1_replica_n1], dataDir=[C:\Users\jenkins\workspace\Lucene-Solr-master-Windows\solr\build\solr-solrj\test\J0\temp\solr.client.solrj.io.stream.StreamDecoratorTest_EAB51E24E990EA7A-001\tempDir-001\node4\.\collection1_shard1_replica_n1\data\]
[junit4] 2> 377782 WARN (qtp21086313-7419) [n:127.0.0.1:57030_solr c:collection1 s:shard2 r:core_node4 x:collection1_shard2_replica_n2] o.a.s.s.IndexSchema Field lowerfilt1and2 is not multivalued and destination for multiple copyFields (2)
[junit4] 2> 377788 WARN (qtp21086313-7419) [n:127.0.0.1:57030_solr c:collection1 s:shard2 r:core_node4 x:collection1_shard2_replica_n2] o.a.s.s.IndexSchema Field text is not multivalued and destination for multiple copyFields (3)
[junit4] 2> 377792 INFO (qtp21086313-7419) [n:127.0.0.1:57030_solr c:collection1 s:shard2 r:core_node4 x:collection1_shard2_replica_n2] o.a.s.s.IndexSchema Loaded schema test/1.6 with uniqueid field id
[junit4] 2> 377793 INFO (qtp21086313-7419) [n:127.0.0.1:57030_solr c:collection1 s:shard2 r:core_node4 x:collection1_shard2_replica_n2] o.a.s.c.CoreContainer Creating SolrCore 'collection1_shard2_replica_n2' using configuration from collection collection1, trusted=true
[junit4] 2> 377794 INFO (qtp21086313-7419) [n:127.0.0.1:57030_solr c:collection1 s:shard2 r:core_node4 x:collection1_shard2_replica_n2] o.a.s.m.r.SolrJmxReporter JMX monitoring for 'solr_57030.solr.core.collection1.shard2.replica_n2' (registry 'solr.core.collection1.shard2.replica_n2') enabled at server: com.sun.jmx.mbeanserver.JmxMBeanServer@125f3a6
[junit4] 2> 377795 INFO (qtp21086313-7419) [n:127.0.0.1:57030_solr c:collection1 s:shard2 r:core_node4 x:collection1_shard2_replica_n2] o.a.s.c.SolrCore [[collection1_shard2_replica_n2] ] Opening new SolrCore at [C:\Users\jenkins\workspace\Lucene-Solr-master-Windows\solr\build\solr-solrj\test\J0\temp\solr.client.solrj.io.stream.StreamDecoratorTest_EAB51E24E990EA7A-001\tempDir-001\node2\collection1_shard2_replica_n2], dataDir=[C:\Users\jenkins\workspace\Lucene-Solr-master-Windows\solr\build\solr-solrj\test\J0\temp\solr.client.solrj.io.stream.StreamDecoratorTest_EAB51E24E990EA7A-001\tempDir-001\node2\.\collection1_shard2_replica_n2\data\]
[junit4] 2> 377985 INFO (qtp21086313-7419) [n:127.0.0.1:57030_solr c:collection1 s:shard2 r:core_node4 x:collection1_shard2_replica_n2] o.a.s.u.UpdateHandler Using UpdateLog implementation: org.apache.solr.update.UpdateLog
[junit4] 2> 377985 INFO (qtp21086313-7419) [n:127.0.0.1:57030_solr c:collection1 s:shard2 r:core_node4 x:collection1_shard2_replica_n2] o.a.s.u.UpdateLog Initializing UpdateLog: dataDir= defaultSyncLevel=FLUSH numRecordsToKeep=100 maxNumLogsToKeep=10 numVersionBuckets=65536
[junit4] 2> 377988 INFO (qtp21086313-7419) [n:127.0.0.1:57030_solr c:collection1 s:shard2 r:core_node4 x:collection1_shard2_replica_n2] o.a.s.u.CommitTracker Hard AutoCommit: disabled
[junit4] 2> 377988 INFO (qtp21086313-7419) [n:127.0.0.1:57030_solr c:collection1 s:shard2 r:core_node4 x:collection1_shard2_replica_n2] o.a.s.u.CommitTracker Soft AutoCommit: disabled
[junit4] 2> 377990 INFO (qtp21086313-7419) [n:127.0.0.1:57030_solr c:collection1 s:shard2 r:core_node4 x:collection1_shard2_replica_n2] o.a.s.s.SolrIndexSearcher Opening [Searcher@166c9b5[collection1_shard2_replica_n2] main]
[junit4] 2> 377992 INFO (qtp21086313-7419) [n:127.0.0.1:57030_solr c:collection1 s:shard2 r:core_node4 x:collection1_shard2_replica_n2] o.a.s.r.ManagedResourceStorage Configured ZooKeeperStorageIO with znodeBase: /configs/conf
[junit4] 2> 377993 INFO (qtp21086313-7419) [n:127.0.0.1:57030_solr c:collection1 s:shard2 r:core_node4 x:collection1_shard2_replica_n2] o.a.s.r.ManagedResourceStorage Loaded null at path _rest_managed.json using ZooKeeperStorageIO:path=/configs/conf
[junit4] 2> 377993 INFO (qtp21086313-7419) [n:127.0.0.1:57030_solr c:collection1 s:shard2 r:core_node4 x:collection1_shard2_replica_n2] o.a.s.h.ReplicationHandler Commits will be reserved for 10000ms.
[junit4] 2> 377993 INFO (qtp21086313-7419) [n:127.0.0.1:57030_solr c:collection1 s:shard2 r:core_node4 x:collection1_shard2_replica_n2] o.a.s.u.UpdateLog Could not find max version in index or recent updates, using new clock 1623283042835496960
[junit4] 2> 378024 INFO (searcherExecutor-2091-thread-1-processing-n:127.0.0.1:57030_solr x:collection1_shard2_replica_n2 c:collection1 s:shard2 r:core_node4) [n:127.0.0.1:57030_solr c:collection1 s:shard2 r:core_node4 x:collection1_shard2_replica_n2] o.a.s.c.SolrCore [collection1_shard2_replica_n2] Registered new searcher Searcher@166c9b5[collection1_shard2_replica_n2] main{ExitableDirectoryReader(UninvertingDirectoryReader())}
[junit4] 2> 378025 INFO (qtp27950463-7427) [n:127.0.0.1:57038_solr c:collection1 s:shard1 r:core_node3 x:collection1_shard1_replica_n1] o.a.s.u.UpdateHandler Using UpdateLog implementation: org.apache.solr.update.UpdateLog
[junit4] 2> 378025 INFO (qtp27950463-7427) [n:127.0.0.1:57038_solr c:collection1 s:shard1 r:core_node3 x:collection1_shard1_replica_n1] o.a.s.u.UpdateLog Initializing UpdateLog: dataDir= defaultSyncLevel=FLUSH numRecordsToKeep=100 maxNumLogsToKeep=10 numVersionBuckets=65536
[junit4] 2> 378029 INFO (qtp27950463-7427) [n:127.0.0.1:57038_solr c:collection1 s:shard1 r:core_node3 x:collection1_shard1_replica_n1] o.a.s.u.CommitTracker Hard AutoCommit: disabled
[junit4] 2> 378029 INFO (qtp27950463-7427) [n:127.0.0.1:57038_solr c:collection1 s:shard1 r:core_node3 x:collection1_shard1_replica_n1] o.a.s.u.CommitTracker Soft AutoCommit: disabled
[junit4] 2> 378035 INFO (qtp21086313-7419) [n:127.0.0.1:57030_solr c:collection1 s:shard2 r:core_node4 x:collection1_shard2_replica_n2] o.a.s.c.ZkShardTerms Successful update of terms at /collections/collection1/terms/shard2 to Terms{values={core_node4=0}, version=0}
[junit4] 2> 378036 INFO (qtp21086313-7419) [n:127.0.0.1:57030_solr c:collection1 s:shard2 r:core_node4 x:collection1_shard2_replica_n2] o.a.s.c.ShardLeaderElectionContextBase make sure parent is created /collections/collection1/leaders/shard2
[junit4] 2> 378039 INFO (qtp21086313-7419) [n:127.0.0.1:57030_solr c:collection1 s:shard2 r:core_node4 x:collection1_shard2_replica_n2] o.a.s.c.ShardLeaderElectionContext Enough replicas found to continue.
[junit4] 2> 378039 INFO (qtp21086313-7419) [n:127.0.0.1:57030_solr c:collection1 s:shard2 r:core_node4 x:collection1_shard2_replica_n2] o.a.s.c.ShardLeaderElectionContext I may be the new leader - try and sync
[junit4] 2> 378039 INFO (qtp21086313-7419) [n:127.0.0.1:57030_solr c:collection1 s:shard2 r:core_node4 x:collection1_shard2_replica_n2] o.a.s.c.SyncStrategy Sync replicas to http://127.0.0.1:57030/solr/collection1_shard2_replica_n2/
[junit4] 2> 378039 INFO (qtp21086313-7419) [n:127.0.0.1:57030_solr c:collection1 s:shard2 r:core_node4 x:collection1_shard2_replica_n2] o.a.s.c.SyncStrategy Sync Success - now sync replicas to me
[junit4] 2> 378039 INFO (qtp21086313-7419) [n:127.0.0.1:57030_solr c:collection1 s:shard2 r:core_node4 x:collection1_shard2_replica_n2] o.a.s.c.SyncStrategy http://127.0.0.1:57030/solr/collection1_shard2_replica_n2/ has no replicas
[junit4] 2> 378039 INFO (qtp21086313-7419) [n:127.0.0.1:57030_solr c:collection1 s:shard2 r:core_node4 x:collection1_shard2_replica_n2] o.a.s.c.ShardLeaderElectionContextBase Creating leader registration node /collections/collection1/leaders/shard2/leader after winning as /collections/collection1/leader_elect/shard2/election/72122740698906636-core_node4-n_0000000000
[junit4] 2> 378043 INFO (qtp21086313-7419) [n:127.0.0.1:57030_solr c:collection1 s:shard2 r:core_node4 x:collection1_shard2_replica_n2] o.a.s.c.ShardLeaderElectionContext I am the new leader: http://127.0.0.1:57030/solr/collection1_shard2_replica_n2/ shard2
[junit4] 2> 378043 INFO (qtp27950463-7427) [n:127.0.0.1:57038_solr c:collection1 s:shard1 r:core_node3 x:collection1_shard1_replica_n1] o.a.s.s.SolrIndexSearcher Opening [Searcher@e72864[collection1_shard1_replica_n1] main]
[junit4] 2> 378043 INFO (qtp27950463-7427) [n:127.0.0.1:57038_solr c:collection1 s:shard1 r:core_node3 x:collection1_shard1_replica_n1] o.a.s.r.ManagedResourceStorage Configured ZooKeeperStorageIO with znodeBase: /configs/conf
[junit4] 2> 378043 INFO (qtp27950463-7427) [n:127.0.0.1:57038_solr c:collection1 s:shard1 r:core_node3 x:collection1_shard1_replica_n1] o.a.s.r.ManagedResourceStorage Loaded null at path _rest_managed.json using ZooKeeperStorageIO:path=/configs/conf
[junit4] 2> 378046 INFO (qtp27950463-7427) [n:127.0.0.1:57038_solr c:collection1 s:shard1 r:core_node3 x:collection1_shard1_replica_n1] o.a.s.h.ReplicationHandler Commits will be reserved for 10000ms.
[junit4] 2> 378047 INFO (qtp27950463-7427) [n:127.0.0.1:57038_solr c:collection1 s:shard1 r:core_node3 x:collection1_shard1_replica_n1] o.a.s.u.UpdateLog Could not find max version in index or recent updates, using new clock 1623283042892120064
[junit4] 2> 378052 INFO (qtp27950463-7427) [n:127.0.0.1:57038_solr c:collection1 s:shard1 r:core_node3 x:collection1_shard1_replica_n1] o.a.s.c.ZkShardTerms Successful update of terms at /collections/collection1/terms/shard1 to Terms{values={core_node3=0}, version=0}
[junit4] 2> 378052 INFO (qtp27950463-7427) [n:127.0.0.1:57038_solr c:collection1 s:shard1 r:core_node3 x:collection1_shard1_replica_n1] o.a.s.c.ShardLeaderElectionContextBase make sure parent is created /collections/collection1/leaders/shard1
[junit4] 2> 378056 INFO (searcherExecutor-2090-thread-1-processing-n:127.0.0.1:57038_solr x:collection1_shard1_replica_n1 c:collection1 s:shard1 r:core_node3) [n:127.0.0.1:57038_solr c:collection1 s:shard1 r:core_node3 x:collection1_shard1_replica_n1] o.a.s.c.SolrCore [collection1_shard1_replica_n1] Registered new searcher Searcher@e72864[collection1_shard1_replica_n1] main{ExitableDirectoryReader(UninvertingDirectoryReader())}
[junit4] 2> 378057 INFO (qtp27950463-7427) [n:127.0.0.1:57038_solr c:collection1 s:shard1 r:core_node3 x:collection1_shard1_replica_n1] o.a.s.c.ShardLeaderElectionContext Enough replicas found to continue.
[junit4] 2> 378057 INFO (qtp27950463-7427) [n:127.0.0.1:57038_solr c:collection1 s:shard1 r:core_node3 x:collection1_shard1_replica_n1] o.a.s.c.ShardLeaderElectionContext I may be the new leader - try and sync
[junit4] 2> 378057 INFO (qtp27950463-7427) [n:127.0.0.1:57038_solr c:collection1 s:shard1 r:core_node3 x:collection1_shard1_replica_n1] o.a.s.c.SyncStrategy Sync replicas to http://127.0.0.1:57038/solr/collection1_shard1_replica_n1/
[junit4] 2> 378057 INFO (qtp27950463-7427) [n:127.0.0.1:57038_solr c:collection1 s:shard1 r:core_node3 x:collection1_shard1_replica_n1] o.a.s.c.SyncStrategy Sync Success - now sync replicas to me
[junit4] 2> 378057 INFO (qtp27950463-7427) [n:127.0.0.1:57038_solr c:collection1 s:shard1 r:core_node3 x:collection1_shard1_replica_n1] o.a.s.c.SyncStrategy http://127.0.0.1:57038/solr/collection1_shard1_replica_n1/ has no replicas
[junit4] 2> 378057 INFO (qtp27950463-7427) [n:127.0.0.1:57038_solr c:collection1 s:shard1 r:core_node3 x:collection1_shard1_replica_n1] o.a.s.c.ShardLeaderElectionContextBase Creating leader registration node /collections/collection1/leaders/shard1/leader after winning as /collections/collection1/leader_elect/shard1/election/72122740698906635-core_node3-n_0000000000
[junit4] 2> 378057 INFO (qtp27950463-7427) [n:127.0.0.1:57038_solr c:collection1 s:shard1 r:core_node3 x:collection1_shard1_replica_n1] o.a.s.c.ShardLeaderElectionContext I am the new leader: http://127.0.0.1:57038/solr/collection1_shard1_replica_n1/ shard1
[junit4] 2> 378161 INFO (zkCallback-2757-thread-1) [ ] o.a.s.c.c.ZkStateReader A cluster state change: [WatchedEvent state:SyncConnected type:NodeDataChanged path:/collections/collection1/state.json] for collection [collection1] has occurred - updating... (live nodes size: [4])
[junit4] 2> 378161 INFO (zkCallback-2759-thread-1) [ ] o.a.s.c.c.ZkStateReader A cluster state change: [WatchedEvent state:SyncConnected type:NodeDataChanged path:/collections/collection1/state.json] for collection [collection1] has occurred - updating... (live nodes size: [4])
[junit4] 2> 378161 INFO (qtp21086313-7419) [n:127.0.0.1:57030_solr c:collection1 s:shard2 r:core_node4 x:collection1_shard2_replica_n2] o.a.s.c.ZkController I am the leader, no recovery necessary
[junit4] 2> 378161 INFO (qtp27950463-7427) [n:127.0.0.1:57038_solr c:collection1 s:shard1 r:core_node3 x:collection1_shard1_replica_n1] o.a.s.c.ZkController I am the leader, no recovery necessary
[junit4] 2> 378165 INFO (qtp27950463-7427) [n:127.0.0.1:57038_solr c:collection1 s:shard1 r:core_node3 x:collection1_shard1_replica_n1] o.a.s.s.HttpSolrCall [admin] webapp=null path=/admin/cores params={qt=/admin/cores&coreNodeName=core_node3&collection.configName=conf&newCollection=true&name=collection1_shard1_replica_n1&action=CREATE&numShards=2&collection=collection1&shard=shard1&wt=javabin&version=2&replicaType=NRT} status=0 QTime=1534
[junit4] 2> 378165 INFO (qtp21086313-7419) [n:127.0.0.1:57030_solr c:collection1 s:shard2 r:core_node4 x:collection1_shard2_replica_n2] o.a.s.s.HttpSolrCall [admin] webapp=null path=/admin/cores params={qt=/admin/cores&coreNodeName=core_node4&collection.configName=conf&newCollection=true&name=collection1_shard2_replica_n2&action=CREATE&numShards=2&collection=collection1&shard=shard2&wt=javabin&version=2&replicaType=NRT} status=0 QTime=1535
[junit4] 2> 378170 INFO (qtp14105191-7382) [n:127.0.0.1:57027_solr ] o.a.s.h.a.CollectionsHandler Wait for new collection to be active for at most 45 seconds. Check all shard replicas
[junit4] 2> 378228 INFO (OverseerCollectionConfigSetProcessor-72122740698906633-127.0.0.1:57027_solr-n_0000000000) [n:127.0.0.1:57027_solr ] o.a.s.c.OverseerTaskQueue Response ZK path: /overseer/collection-queue-work/qnr-0000000000 doesn't exist. Requestor may have disconnected from ZooKeeper
[junit4] 2> 378266 INFO (zkCallback-2759-thread-1) [ ] o.a.s.c.c.ZkStateReader A cluster state change: [WatchedEvent state:SyncConnected type:NodeDataChanged path:/collections/collection1/state.json] for collection [collection1] has occurred - updating... (live nodes size: [4])
[junit4] 2> 378266 INFO (zkCallback-2759-thread-2) [ ] o.a.s.c.c.ZkStateReader A cluster state change: [WatchedEvent state:SyncConnected type:NodeDataChanged path:/collections/collection1/state.json] for collection [collection1] has occurred - updating... (live nodes size: [4])
[junit4] 2> 378267 INFO (zkCallback-2752-thread-1) [ ] o.a.s.c.c.ZkStateReader A cluster state change: [WatchedEvent state:SyncConnected type:NodeDataChanged path:/collections/collection1/state.json] for collection [collection1] has occurred - updating... (live nodes size: [4])
[junit4] 2> 378267 INFO (zkCallback-2757-thread-2) [ ] o.a.s.c.c.ZkStateReader A cluster state change: [WatchedEvent state:SyncConnected type:NodeDataChanged path:/collections/collection1/state.json] for collection [collection1] has occurred - updating... (live nodes size: [4])
[junit4] 2> 378267 INFO (zkCallback-2757-thread-1) [ ] o.a.s.c.c.ZkStateReader A cluster state change: [WatchedEvent state:SyncConnected type:NodeDataChanged path:/collections/collection1/state.json] for collection [collection1] has occurred - updating... (live nodes size: [4])
[junit4] 2> 378268 INFO (qtp14105191-7382) [n:127.0.0.1:57027_solr ] o.a.s.s.HttpSolrCall [admin] webapp=null path=/admin/collections params={collection.configName=conf&name=collection1&nrtReplicas=1&action=CREATE&numShards=2&wt=javabin&version=2} status=0 QTime=2049
[junit4] 2> 378270 INFO (SUITE-StreamDecoratorTest-seed#[EAB51E24E990EA7A]-worker) [ ] o.a.s.c.AbstractDistribZkTestBase Wait for recoveries to finish - collection: collection1 failOnTimeout:true timeout (sec):45
[junit4] 2> 378271 INFO (SUITE-StreamDecoratorTest-seed#[EAB51E24E990EA7A]-worker) [ ] o.a.s.c.AbstractDistribZkTestBase Recoveries finished - collection: collection1
[junit4] 2> 378308 INFO (TEST-StreamDecoratorTest.testParallelRollupStream-seed#[EAB51E24E990EA7A]) [ ] o.a.s.SolrTestCaseJ4 ###Starting testParallelRollupStream
[junit4] 2> 378323 INFO (qtp27950463-7409) [n:127.0.0.1:57038_solr c:collection1 s:shard1 r:core_node3 x:collection1_shard1_replica_n1] o.a.s.c.ZkShardTerms Successful update of terms at /collections/collection1/terms/shard1 to Terms{values={core_node3=1}, version=1}
[junit4] 2> 378323 INFO (qtp27950463-7409) [n:127.0.0.1:57038_solr c:collection1 s:shard1 r:core_node3 x:collection1_shard1_replica_n1] o.a.s.u.p.LogUpdateProcessorFactory [collection1_shard1_replica_n1] webapp=/solr path=/update params={update.distrib=TOLEADER&distrib.from=http://127.0.0.1:57030/solr/collection1_shard2_replica_n2/&wt=javabin&version=2}{deleteByQuery=*:* (-1623283043178381312)} 0 4
[junit4] 2> 378327 INFO (qtp27950463-7410) [n:127.0.0.1:57038_solr c:collection1 s:shard1 r:core_node3 x:collection1_shard1_replica_n1] o.a.s.u.DirectUpdateHandler2 start commit{_version_=1623283043185721344,optimize=false,openSearcher=true,waitSearcher=true,expungeDeletes=false,softCommit=false,prepareCommit=false}
[junit4] 2> 378327 INFO (qtp27950463-7410) [n:127.0.0.1:57038_solr c:collection1 s:shard1 r:core_node3 x:collection1_shard1_replica_n1] o.a.s.u.DirectUpdateHandler2 No uncommitted changes. Skipping IW.commit.
[junit4] 2> 378328 INFO (qtp27950463-7410) [n:127.0.0.1:57038_solr c:collection1 s:shard1 r:core_node3 x:collection1_shard1_replica_n1] o.a.s.u.DirectUpdateHandler2 end_commit_flush
[junit4] 2> 378328 INFO (qtp27950463-7410) [n:127.0.0.1:57038_solr c:collection1 s:shard1 r:core_node3 x:collection1_shard1_replica_n1] o.a.s.u.p.LogUpdateProcessorFactory [collection1_shard1_replica_n1] webapp=/solr path=/update params={update.distrib=TOLEADER&waitSearcher=true&openSearcher=true&commit=true&softCommit=false&distrib.from=http://127.0.0.1:57030/solr/collection1_shard2_replica_n2/&commit_end_point=leaders&wt=javabin&version=2&expungeDeletes=false}{commit=} 0 1
[junit4] 2> 378329 INFO (qtp21086313-7390) [n:127.0.0.1:57030_solr c:collection1 s:shard2 r:core_node4 x:collection1_shard2_replica_n2] o.a.s.u.DirectUpdateHandler2 start commit{_version_=1623283043187818496,optimize=false,openSearcher=true,waitSearcher=true,expungeDeletes=false,softCommit=false,prepareCommit=false}
[junit4] 2> 378329 INFO (qtp21086313-7390) [n:127.0.0.1:57030_solr c:collection1 s:shard2 r:core_node4 x:collection1_shard2_replica_n2] o.a.s.u.DirectUpdateHandler2 No uncommitted changes. Skipping IW.commit.
[junit4] 2> 378330 INFO (qtp21086313-7390) [n:127.0.0.1:57030_solr c:collection1 s:shard2 r:core_node4 x:collection1_shard2_replica_n2] o.a.s.u.DirectUpdateHandler2 end_commit_flush
[junit4] 2> 378330 INFO (qtp21086313-7390) [n:127.0.0.1:57030_solr c:collection1 s:shard2 r:core_node4 x:collection1_shard2_replica_n2] o.a.s.c.ZkShardTerms Successful update of terms at /collections/collection1/terms/shard2 to Terms{values={core_node4=1}, version=1}
[junit4] 2> 378330 INFO (qtp21086313-7390) [n:127.0.0.1:57030_solr c:collection1 s:shard2 r:core_node4 x:collection1_shard2_replica_n2] o.a.s.u.p.LogUpdateProcessorFactory [collection1_shard2_replica_n2] webapp=/solr path=/update params={_stateVer_=collection1:4&commit=true&wt=javabin&version=2}{deleteByQuery=*:* (-1623283043169992704),commit=} 0 19
[junit4] 2> 378340 INFO (qtp21086313-7391) [n:127.0.0.1:57030_solr c:collection1 s:shard2 r:core_node4 x:collection1_shard2_replica_n2] o.a.s.u.p.LogUpdateProcessorFactory [collection1_shard2_replica_n2] webapp=/solr path=/update params={_stateVer_=collection1:4&wt=javabin&version=2}{add=[2 (1623283043192012800), 3 (1623283043197255680), 5 (1623283043197255681), 6 (1623283043198304256), 7 (1623283043199352832), 9 (1623283043199352833)]} 0 8
[junit4] 2> 378347 INFO (qtp27950463-7411) [n:127.0.0.1:57038_solr c:collection1 s:shard1 r:core_node3 x:collection1_shard1_replica_n1] o.a.s.u.p.LogUpdateProcessorFactory [collection1_shard1_replica_n1] webapp=/solr path=/update params={_stateVer_=collection1:4&wt=javabin&version=2}{add=[0 (1623283043193061376), 4 (1623283043205644288), 1 (1623283043205644289), 8 (1623283043205644290)]} 0 14
[junit4] 2> 378353 INFO (qtp27950463-7413) [n:127.0.0.1:57038_solr c:collection1 s:shard1 r:core_node3 x:collection1_shard1_replica_n1] o.a.s.u.DirectUpdateHandler2 start commit{_version_=1623283043212984320,optimize=false,openSearcher=true,waitSearcher=true,expungeDeletes=false,softCommit=false,prepareCommit=false}
[junit4] 2> 378353 INFO (qtp27950463-7413) [n:127.0.0.1:57038_solr c:collection1 s:shard1 r:core_node3 x:collection1_shard1_replica_n1] o.a.s.u.SolrIndexWriter Calling setCommitData with IW:org.apache.solr.update.SolrIndexWriter@cc7f90 commitCommandVersion:1623283043212984320
[junit4] 2> 378411 INFO (qtp27950463-7413) [n:127.0.0.1:57038_solr c:collection1 s:shard1 r:core_node3 x:collection1_shard1_replica_n1] o.a.s.s.SolrIndexSearcher Opening [Searcher@1e4adfd[collection1_shard1_replica_n1] main]
[junit4] 2> 378411 INFO (qtp27950463-7413) [n:127.0.0.1:57038_solr c:collection1 s:shard1 r:core_node3 x:collection1_shard1_replica_n1] o.a.s.u.DirectUpdateHandler2 end_commit_flush
[junit4] 2> 378413 INFO (searcherExecutor-2090-thread-1-processing-n:127.0.0.1:57038_solr x:collection1_shard1_replica_n1 c:collection1 s:shard1 r:core_node3) [n:127.0.0.1:57038_solr c:collection1 s:shard1 r:core_node3 x:collection1_shard1_replica_n1] o.a.s.c.SolrCore [collection1_shard1_replica_n1] Registered new searcher Searcher@1e4adfd[collection1_shard1_replica_n1] main{ExitableDirectoryReader(UninvertingDirectoryReader(_0(9.0.0):C4:[diagnostics={os=Windows 10, java.vendor=Oracle Corporation, java.version=1.8.0_172, java.vm.version=25.172-b11, lucene.version=9.0.0, os.arch=x86, java.runtime.version=1.8.0_172-b11, source=flush, os.version=10.0, timestamp=1548083346601}]:[attributes={Lucene50StoredFieldsFormat.mode=BEST_SPEED}]))}
[junit4] 2> 378414 INFO (qtp27950463-7413) [n:127.0.0.1:57038_solr c:collection1 s:shard1 r:core_node3 x:collection1_shard1_replica_n1] o.a.s.u.p.LogUpdateProcessorFactory [collection1_shard1_replica_n1] webapp=/solr path=/update params={update.distrib=TOLEADER&waitSearcher=true&openSearcher=true&commit=true&softCommit=false&distrib.from=http://127.0.0.1:57030/solr/collection1_shard2_replica_n2/&commit_end_point=leaders&wt=javabin&version=2&expungeDeletes=false}{commit=} 0 63
[junit4] 2> 378415 INFO (qtp21086313-7392) [n:127.0.0.1:57030_solr c:collection1 s:shard2 r:core_node4 x:collection1_shard2_replica_n2] o.a.s.u.DirectUpdateHandler2 start commit{_version_=1623283043277996032,optimize=false,openSearcher=true,waitSearcher=true,expungeDeletes=false,softCommit=false,prepareCommit=false}
[junit4] 2> 378415 INFO (qtp21086313-7392) [n:127.0.0.1:57030_solr c:collection1 s:shard2 r:core_node4 x:collection1_shard2_replica_n2] o.a.s.u.SolrIndexWriter Calling setCommitData with IW:org.apache.solr.update.SolrIndexWriter@8967fd commitCommandVersion:1623283043277996032
[junit4] 2> 378421 INFO (qtp21086313-7392) [n:127.0.0.1:57030_solr c:collection1 s:shard2 r:core_node4 x:collection1_shard2_replica_n2] o.a.s.s.SolrIndexSearcher Opening [Searcher@8b9679[collection1_shard2_replica_n2] main]
[junit4] 2> 378421 INFO (qtp21086313-7392) [n:127.0.0.1:57030_solr c:collection1 s:shard2 r:core_node4 x:collection1_shard2_replica_n2] o.a.s.u.DirectUpdateHandler2 end_commit_flush
[junit4] 2> 378423 INFO (searcherExecutor-2091-thread-1-processing-n:127.0.0.1:57030_solr x:collection1_shard2_replica_n2 c:collection1 s:shard2 r:core_node4) [n:127.0.0.1:57030_solr c:collection1 s:shard2 r:core_node4 x:collection1_shard2_replica_n2] o.a.s.c.SolrCore [collection1_shard2_replica_n2] Registered new searcher Searcher@8b9679[collection1_shard2_replica_n2] main{ExitableDirectoryReader(UninvertingDirectoryReader(_0(9.0.0):C6:[diagnostics={os=Windows 10, java.vendor=Oracle Corporation, java.version=1.8.0_172, java.vm.version=25.172-b11, lucene.version=9.0.0, os.arch=x86, java.runtime.version=1.8.0_172-b11, source=flush, os.version=10.0, timestamp=1548083346634}]:[attributes={Lucene50StoredFieldsFormat.mode=BEST_SPEED}]))}
[junit4] 2> 378424 INFO (qtp21086313-7392) [n:127.0.0.1:57030_solr c:collection1 s:shard2 r:core_node4 x:collection1_shard2_replica_n2] o.a.s.u.p.LogUpdateProcessorFactory [collection1_shard2_replica_n2] webapp=/solr path=/update params={_stateVer_=collection1:4&commit=true&wt=javabin&version=2}{commit=} 0 76
[junit4] 2> 378438 INFO (zkConnectionManagerCallback-2812-thread-1) [ ] o.a.s.c.c.ConnectionManager zkClient has connected
[junit4] 2> 378441 INFO (TEST-StreamDecoratorTest.testParallelRollupStream-seed#[EAB51E24E990EA7A]) [ ] o.a.s.c.c.ZkStateReader Updated live nodes from ZooKeeper... (0) -> (4)
[junit4] 2> 378442 INFO (TEST-StreamDecoratorTest.testParallelRollupStream-seed#[EAB51E24E990EA7A]) [ ] o.a.s.c.s.i.ZkClientClusterStateProvider Cluster at 127.0.0.1:57001/solr ready
[junit4] 2> 378456 INFO (qtp21086313-7394) [n:127.0.0.1:57030_solr c:collection1 s:shard2 r:core_node4 x:collection1_shard2_replica_n2] o.a.s.c.S.Request [collection1_shard2_replica_n2] webapp=/solr path=/stream params={distrib=false&workerID=0&indent=off&numWorkers=2&expr=rollup(search(collection1,q%3D"*:*",fl%3D"a_s,a_i,a_f",sort%3D"a_s+asc",partitionKeys%3Da_s,qt%3D"/export",zkHost%3D"127.0.0.1:57001/solr"),over%3Da_s,sum(a_i),sum(a_f),min(a_i),min(a_f),max(a_i),max(a_f),avg(a_i,false),avg(a_f,false),count(*))&wt=json&version=2.2} status=0 QTime=6
[junit4] 2> 378456 INFO (qtp27950463-7428) [n:127.0.0.1:57038_solr c:collection1 s:shard1 r:core_node3 x:collection1_shard1_replica_n1] o.a.s.c.S.Request [collection1_shard1_replica_n1] webapp=/solr path=/stream params={distrib=false&workerID=1&indent=off&numWorkers=2&expr=rollup(search(collection1,q%3D"*:*",fl%3D"a_s,a_i,a_f",sort%3D"a_s+asc",partitionKeys%3Da_s,qt%3D"/export",zkHost%3D"127.0.0.1:57001/solr"),over%3Da_s,sum(a_i),sum(a_f),min(a_i),min(a_f),max(a_i),max(a_f),avg(a_i,false),avg(a_f,false),count(*))&wt=json&version=2.2} status=0 QTime=4
[junit4] 2> 378461 INFO (zkConnectionManagerCallback-2818-thread-1) [ ] o.a.s.c.c.ConnectionManager zkClient has connected
[junit4] 2> 378462 INFO (qtp27950463-7428) [n:127.0.0.1:57038_solr c:collection1 s:shard1 r:core_node3 x:collection1_shard1_replica_n1] o.a.s.c.c.ZkStateReader Updated live nodes from ZooKeeper... (0) -> (4)
[junit4] 2> 378462 INFO (qtp27950463-7428) [n:127.0.0.1:57038_solr c:collection1 s:shard1 r:core_node3 x:collection1_shard1_replica_n1] o.a.s.c.s.i.ZkClientClusterStateProvider Cluster at 127.0.0.1:57001/solr ready
[junit4] 2> 378491 INFO (qtp27950463-7408) [n:127.0.0.1:57038_solr c:collection1 s:shard1 r:core_node3 x:collection1_shard1_replica_n1] o.a.s.c.S.Request [collection1_shard1_replica_n1] webapp=/solr path=/export params={q=*:*&distrib=false&indent=off&fl=a_s,a_i,a_f&sort=a_s+asc&partitionKeys=a_s&fq={!hash+workers%3D2+worker%3D0}&wt=json&version=2.2} hits=3 status=0 QTime=21
[junit4] 2> 378491 INFO (qtp21086313-7390) [n:127.0.0.1:57030_solr c:collection1 s:shard2 r:core_node4 x:collection1_shard2_replica_n2] o.a.s.c.S.Request [collection1_shard2_replica_n2] webapp=/solr path=/export params={q=*:*&distrib=false&indent=off&fl=a_s,a_i,a_f&sort=a_s+asc&partitionKeys=a_s&fq={!hash+workers%3D2+worker%3D1}&wt=json&version=2.2} hits=3 status=0 QTime=16
[junit4] 2> 378491 INFO (qtp27950463-7409) [n:127.0.0.1:57038_solr c:collection1 s:shard1 r:core_node3 x:collection1_shard1_replica_n1] o.a.s.c.S.Request [collection1_shard1_replica_n1] webapp=/solr path=/export params={q=*:*&distrib=false&indent=off&fl=a_s,a_i,a_f&sort=a_s+asc&partitionKeys=a_s&fq={!hash+workers%3D2+worker%3D1}&wt=json&version=2.2} hits=1 status=0 QTime=21
[junit4] 2> 378493 INFO (qtp21086313-7422) [n:127.0.0.1:57030_solr c:collection1 s:shard2 r:core_node4 x:collection1_shard2_replica_n2] o.a.s.c.S.Request [collection1_shard2_replica_n2] webapp=/solr path=/export params={q=*:*&distrib=false&indent=off&fl=a_s,a_i,a_f&sort=a_s+asc&partitionKeys=a_s&fq={!hash+workers%3D2+worker%3D0}&wt=json&version=2.2} hits=3 status=0 QTime=22
[junit4] 2> 378509 WARN (NIOServerCxn.Factory:0.0.0.0/0.0.0.0:0) [ ] o.a.z.s.NIOServerCnxn Unable to read additional data from client sessionid 0x1003b4023960014, likely client has closed socket
[junit4] 2> 378509 INFO (TEST-StreamDecoratorTest.testParallelRollupStream-seed#[EAB51E24E990EA7A]) [ ] o.a.s.SolrTestCaseJ4 ###Ending testParallelRollupStream
[junit4] 2> 378570 INFO (TEST-StreamDecoratorTest.testParallelRankStream-seed#[EAB51E24E990EA7A]) [ ] o.a.s.SolrTestCaseJ4 ###Starting testParallelRankStream
[junit4] 2> 378579 INFO (qtp27950463-7408) [n:127.0.0.1:57038_solr c:collection1 s:shard1 r:core_node3 x:collection1_shard1_replica_n1] o.a.s.s.SolrIndexSearcher Opening [Searcher@407c0e[collection1_shard1_replica_n1] realtime]
[junit4] 2> 378579 INFO (qtp21086313-7422) [n:127.0.0.1:57030_solr c:collection1 s:shard2 r:core_node4 x:collection1_shard2_replica_n2] o.a.s.s.SolrIndexSearcher Opening [Searcher@5e001c[collection1_shard2_replica_n2] realtime]
[junit4] 2> 378580 INFO (qtp27950463-7408) [n:127.0.0.1:57038_solr c:collection1 s:shard1 r:core_node3 x:collection1_shard1_replica_n1] o.a.s.u.p.LogUpdateProcessorFactory [collection1_shard1_replica_n1] webapp=/solr path=/update params={update.distrib=TOLEADER&distrib.from=http://127.0.0.1:57030/solr/collection1_shard2_replica_n2/&wt=javabin&version=2}{deleteByQuery=*:* (-1623283043442622464)} 0 7
[junit4] 2> 378583 INFO (qtp27950463-7411) [n:127.0.0.1:57038_solr c:collection1 s:shard1 r:core_node3 x:collection1_shard1_replica_n1] o.a.s.u.DirectUpdateHandler2 start commit{_version_=1623283043454156800,optimize=false,openSearcher=true,waitSearcher=true,expungeDeletes=false,softCommit=false,prepareCommit=false}
[junit4] 2> 378583 INFO (qtp27950463-7411) [n:127.0.0.1:57038_solr c:collection1 s:shard1 r:core_node3 x:collection1_shard1_replica_n1] o.a.s.u.SolrIndexWriter Calling setCommitData with IW:org.apache.solr.update.SolrIndexWriter@cc7f90 commitCommandVersion:1623283043454156800
[junit4] 2> 378584 INFO (qtp27950463-7411) [n:127.0.0.1:57038_solr c:collection1 s:shard1 r:core_node3 x:collection1_shard1_replica_n1] o.a.s.s.SolrIndexSearcher Opening [Searcher@15cf615[collection1_shard1_replica_n1] main]
[junit4] 2> 378584 INFO (qtp27950463-7411) [n:127.0.0.1:57038_solr c:collection1 s:shard1 r:core_node3 x:collection1_shard1_replica_n1] o.a.s.u.DirectUpdateHandler2 end_commit_flush
[junit4] 2> 378586 INFO (searcherExecutor-2090-thread-1-processing-n:127.0.0.1:57038_solr x:collection1_shard1_replica_n1 c:collection1 s:shard1 r:core_node3) [n:127.0.0.1:57038_solr c:collection1 s:shard1 r:core_node3 x:collection1_shard1_replica_n1] o.a.s.c.SolrCore [collection1_shard1_replica_n1] Registered new searcher Searcher@15cf615[collection1_shard1_replica_n1] main{ExitableDirectoryReader(UninvertingDirectoryReader())}
[junit4] 2> 378587 INFO (qtp27950463-7411) [n:127.0.0.1:57038_solr c:collection1 s:shard1 r:core_node3 x:collection1_shard1_replica_n1] o.a.s.u.p.LogUpdateProcessorFactory [collection1_shard1_replica_n1] webapp=/solr path=/update params={update.distrib=TOLEADER&waitSearcher=true&openSearcher=true&commit=true&softCommit=false&distrib.from=http://127.0.0.1:57030/solr/collection1_shard2_replica_n2/&commit_end_point=leaders&wt=javabin&version=2&expungeDeletes=false}{commit=} 0 4
[junit4] 2> 378588 INFO (qtp21086313-7422) [n:127.0.0.1:57030_solr c:collection1 s:shard2 r:core_node4 x:collection1_shard2_replica_n2] o.a.s.u.DirectUpdateHandler2 start commit{_version_=1623283043459399680,optimize=false,openSearcher=true,waitSearcher=true,expungeDeletes=false,softCommit=false,prepareCommit=false}
[junit4] 2> 378588 INFO (qtp21086313-7422) [n:127.0.0.1:57030_solr c:collection1 s:shard2 r:core_node4 x:collection1_shard2_replica_n2] o.a.s.u.SolrIndexWriter Calling setCommitData with IW:org.apache.solr.update.SolrIndexWriter@8967fd commitCommandVersion:1623283043459399680
[junit4] 2> 378589 INFO (qtp21086313-7422) [n:127.0.0.1:57030_solr c:collection1 s:shard2 r:core_node4 x:collection1_shard2_replica_n2] o.a.s.s.SolrIndexSearcher Opening [Searcher@b82285[collection1_shard2_replica_n2] main]
[junit4] 2> 378589 INFO (qtp21086313-7422) [n:127.0.0.1:57030_solr c:collection1 s:shard2 r:core_node4 x:collection1_shard2_replica_n2] o.a.s.u.DirectUpdateHandler2 end_commit_flush
[junit4] 2> 378591 INFO (searcherExecutor-2091-thread-1-processing-n:127.0.0.1:57030_solr x:collection1_shard2_replica_n2 c:collection1 s:shard2 r:core_node4) [n:127.0.0.1:57030_solr c:collection1 s:shard2 r:core_node4 x:collection1_shard2_replica_n2] o.a.s.c.SolrCore [collection1_shard2_replica_n2] Registered new searcher Searcher@b82285[collection1_shard2_replica_n2] main{ExitableDirectoryReader(UninvertingDirectoryReader())}
[junit4] 2> 378591 INFO (qtp21086313-7422) [n:127.0.0.1:57030_solr c:collection1 s:shard2 r:core_node4 x:collection1_shard2_replica_n2] o.a.s.u.p.LogUpdateProcessorFactory [collection1_shard2_replica_n2] webapp=/solr path=/update params={_stateVer_=collection1:4&commit=true&wt=javabin&version=2}{deleteByQuery=*:* (-1623283043442622464),commit=} 0 20
[junit4] 2> 378598 INFO (qtp27950463-7428) [n:127.0.0.1:57038_solr c:collection1 s:shard1 r:core_node3 x:collection1_shard1_replica_n1] o.a.s.u.p.LogUpdateProcessorFactory [collection1_shard1_replica_n1] webapp=/solr path=/update params={_stateVer_=collection1:4&wt=javabin&version=2}{add=[0 (1623283043463593984), 4 (1623283043468836864), 8 (1623283043468836865), 10 (1623283043468836866)]} 0 4
[junit4] 2> 378601 INFO (qtp21086313-7391) [n:127.0.0.1:57030_solr c:collection1 s:shard2 r:core_node4 x:collection1_shard2_replica_n2] o.a.s.u.p.LogUpdateProcessorFactory [collection1_shard2_replica_n2] webapp=/solr path=/update params={_stateVer_=collection1:4&wt=javabin&version=2}{add=[2 (1623283043463593984), 3 (1623283043471982592), 5 (1623283043471982593), 6 (1623283043471982594), 7 (1623283043473031168), 9 (1623283043473031169)]} 0 8
[junit4] 2> 378612 INFO (qtp21086313-7393) [n:127.0.0.1:57030_solr c:collection1 s:shard2 r:core_node4 x:collection1_shard2_replica_n2] o.a.s.u.DirectUpdateHandler2 start commit{_version_=1623283043484565504,optimize=false,openSearcher=true,waitSearcher=true,expungeDeletes=false,softCommit=false,prepareCommit=false}
[junit4] 2> 378612 INFO (qtp21086313-7393) [n:127.0.0.1:57030_solr c:collection1 s:shard2 r:core_node4 x:collection1_shard2_replica_n2] o.a.s.u.SolrIndexWriter Calling setCommitData with IW:org.apache.solr.update.SolrIndexWriter@8967fd commitCommandVersion:1623283043484565504
[junit4] 2> 378620 INFO (qtp21086313-7393) [n:127.0.0.1:57030_solr c:collection1 s:shard2 r:core_node4 x:collection1_shard2_replica_n2] o.a.s.s.SolrIndexSearcher Opening [Searcher@8a65c8[collection1_shard2_replica_n2] main]
[junit4] 2> 378621 INFO (qtp21086313-7393) [n:127.0.0.1:57030_solr c:collection1 s:shard2 r:core_node4 x:collection1_shard2_replica_n2] o.a.s.u.DirectUpdateHandler2 end_commit_flush
[junit4] 2> 378622 INFO (searcherExecutor-2091-thread-1-processing-n:127.0.0.1:57030_solr x:collection1_shard2_replica_n2 c:collection1 s:shard2 r:core_node4) [n:127.0.0.1:57030_solr c:collection1 s:shard2 r:core_node4 x:collection1_shard2_replica_n2] o.a.s.c.SolrCore [collection1_shard2_replica_n2] Registered new searcher Searcher@8a65c8[collection1_shard2_replica_n2] main{ExitableDirectoryReader(UninvertingDirectoryReader(_1(9.0.0):C6:[diagnostics={os=Windows 10, java.vendor=Oracle Corporation, java.version=1.8.0_172, java.vm.version=25.172-b11, lucene.version=9.0.0, os.arch=x86, java.runtime.version=1.8.0_172-b11, source=flush, os.version=10.0, timestamp=1548083346834}]:[attributes={Lucene50StoredFieldsFormat.mode=BEST_SPEED}]))}
[junit4] 2> 378622 INFO (qtp21086313-7393) [n:127.0.0.1:57030_solr c:collection1 s:shard2 r:core_node4 x:collection1_shard2_replica_n2] o.a.s.u.p.LogUpdateProcessorFactory [collection1_shard2_replica_n2] webapp=/solr path=/update params={update.distrib=TOLEADER&waitSearcher=true&openSearcher=true&commit=true&softCommit=false&distrib.from=http://127.0.0.1:57038/solr/collection1_shard1_replica_n1/&commit_end_point=leaders&wt=javabin&version=2&expungeDeletes=false}{commit=} 0 11
[junit4] 2> 378625 INFO (qtp27950463-7413) [n:127.0.0.1:57038_solr c:collection1 s:shard1 r:core_node3 x:collection1_shard1_replica_n1] o.a.s.u.DirectUpdateHandler2 start commit{_version_=1623283043498196992,optimize=false,openSearcher=true,waitSearcher=true,expungeDeletes=false,softCommit=false,prepareCommit=false}
[junit4] 2> 378625 INFO (qtp27950463-7413) [n:127.0.0.1:57038_solr c:collection1 s:shard1 r:core_node3 x:collection1_shard1_replica_n1] o.a.s.u.SolrIndexWriter Calling setCommitData with IW:org.apache.solr.update.SolrIndexWriter@cc7f90 commitCommandVersion:1623283043498196992
[junit4] 2> 378626 INFO (qtp27950463-7413) [n:127.0.0.1:57038_solr c:collection1 s:shard1 r:core_node3 x:collection1_shard1_replica_n1] o.a.s.s.SolrIndexSearcher Opening [Searcher@1fd0260[collection1_shard1_replica_n1] main]
[junit4] 2> 378630 INFO (qtp27950463-7413) [n:127.0.0.1:57038_solr c:collection1 s:shard1 r:core_node3 x:collection1_shard1_replica_n1] o.a.s.u.DirectUpdateHandler2 end_commit_flush
[junit4] 2> 378632 INFO (searcherExecutor-2090-thread-1-processing-n:127.0.0.1:57038_solr x:collection1_shard1_replica_n1 c:collection1 s:shard1 r:core_node3) [n:127.0.0.1:57038_solr c:collection1 s:shard1 r:core_node3 x:collection1_shard1_replica_n1] o.a.s.c.SolrCore [collection1_shard1_replica_n1] Registered new searcher Searcher@1fd0260[collection1_shard1_replica_n1] main{ExitableDirectoryReader(UninvertingDirectoryReader(_1(9.0.0):C4:[diagnostics={os=Windows 10, java.vendor=Oracle Corporation, java.version=1.8.0_172, java.vm.version=25.172-b11, lucene.version=9.0.0, os.arch=x86, java.runtime.version=1.8.0_172-b11, source=flush, os.version=10.0, timestamp=1548083346843}]:[attributes={Lucene50StoredFieldsFormat.mode=BEST_SPEED}]))}
[junit4] 2> 378632 INFO (qtp27950463-7413) [n:127.0.0.1:57038_solr c:collection1 s:shard1 r:core_node3 x:collection1_shard1_replica_n1] o.a.s.u.p.LogUpdateProcessorFactory [collection1_shard1_replica_n1] webapp=/solr path=/update params={_stateVer_=collection1:4&commit=true&wt=javabin&version=2}{commit=} 0 30
[junit4] 2> 378642 INFO (zkConnectionManagerCallback-2825-thread-1) [ ] o.a.s.c.c.ConnectionManager zkClient has connected
[junit4] 2> 378644 INFO (TEST-StreamDecoratorTest.testParallelRankStream-seed#[EAB51E24E990EA7A]) [ ] o.a.s.c.c.ZkStateReader Updated live nodes from ZooKeeper... (0) -> (4)
[junit4] 2> 378645 INFO (TEST-StreamDecoratorTest.testParallelRankStream-seed#[EAB51E24E990EA7A]) [ ] o.a.s.c.s.i.ZkClientClusterStateProvider Cluster at 127.0.0.1:57001/solr ready
[junit4] 2> 378651 INFO (qtp27950463-7427) [n:127.0.0.1:57038_solr c:collection1 s:shard1 r:core_node3 x:collection1_shard1_replica_n1] o.a.s.c.S.Request [collection1_shard1_replica_n1] webapp=/solr path=/stream params={distrib=false&workerID=1&indent=off&numWorkers=2&expr=top(n%3D11,search(collection1,q%3D"*:*",fl%3D"id,a_s,a_i",sort%3D"a_i+asc",partitionKeys%3Da_i,qt%3D"/export",zkHost%3D"127.0.0.1:57001/solr"),sort%3D"a_i+desc")&wt=json&version=2.2} status=0 QTime=0
[junit4] 2> 378654 INFO (qtp21086313-7395) [n:127.0.0.1:57030_solr c:collection1 s:shard2 r:core_node4 x:collection1_shard2_replica_n2] o.a.s.c.S.Request [collection1_shard2_replica_n2] webapp=/solr path=/stream params={distrib=false&workerID=0&indent=off&numWorkers=2&expr=top(n%3D11,search(collection1,q%3D"*:*",fl%3D"id,a_s,a_i",sort%3D"a_i+asc",partitionKeys%3Da_i,qt%3D"/export",zkHost%3D"127.0.0.1:57001/solr"),sort%3D"a_i+desc")&wt=json&version=2.2} status=0 QTime=0
[junit4] 2> 378663 INFO (qtp21086313-7422) [n:127.0.0.1:57030_solr c:collection1 s:shard2 r:core_node4 x:collection1_shard2_replica_n2] o.a.s.c.S.Request [collection1_shard2_replica_n2] webapp=/solr path=/export params={q=*:*&distrib=false&indent=off&fl=id,a_s,a_i&sort=a_i+asc&partitionKeys=a_i&fq={!hash+workers%3D2+worker%3D1}&wt=json&version=2.2} hits=4 status=0 QTime=6
[junit4] 2> 378664 INFO (qtp27950463-7409) [n:127.0.0.1:57038_solr c:collection1 s:shard1 r:core_node3 x:collection1_shard1_replica_n1] o.a.s.c.S.Request [collection1_shard1_replica_n1] webapp=/solr path=/export params={q=*:*&distrib=false&indent=off&fl=id,a_s,a_i&sort=a_i+asc&partitionKeys=a_i&fq={!hash+workers%3D2+worker%3D1}&wt=json&version=2.2} hits=0 status=0 QTime=7
[junit4] 2> 378664 INFO (qtp21086313-7392) [n:127.0.0.1:57030_solr c:collection1 s:shard2 r:core_node4 x:collection1_shard2_replica_n2] o.a.s.c.S.Request [collection1_shard2_replica_n2] webapp=/solr path=/export params={q=*:*&distrib=false&indent=off&fl=id,a_s,a_i&sort=a_i+asc&partitionKeys=a_i&fq={!hash+workers%3D2+worker%3D0}&wt=json&version=2.2} hits=2 status=0 QTime=4
[junit4] 2> 378666 INFO (qtp27950463-7408) [n:127.0.0.1:57038_solr c:collection1 s:shard1 r:core_node3 x:collection1_shard1_replica_n1] o.a.s.c.S.Request [collection1_shard1_replica_n1] webapp=/solr path=/export params={q=*:*&distrib=false&indent=off&fl=id,a_s,a_i&sort=a_i+asc&partitionKeys=a_i&fq={!hash+workers%3D2+worker%3D0}&wt=json&version=2.2} hits=4 status=0 QTime=1
[junit4] 2> 378672 WARN (NIOServerCxn.Factory:0.0.0.0/0.0.0.0:0) [ ] o.a.z.s.NIOServerCnxn Unable to read additional data from client sessionid 0x1003b4023960016, likely client has closed socket
[junit4] 2> 378672 INFO (TEST-StreamDecoratorTest.testParallelRankStream-seed#[EAB51E24E990EA7A]) [ ] o.a.s.SolrTestCaseJ4 ###Ending testParallelRankStream
[junit4] 2> 378725 INFO (TEST-StreamDecoratorTest.testParallelComplementStream-seed#[EAB51E24E990EA7A]) [ ] o.a.s.SolrTestCaseJ4 ###Starting testParallelComplementStream
[junit4] 2> 378732 INFO (qtp27950463-7409) [n:127.0.0.1:57038_solr c:collection1 s:shard1 r:core_node3 x:collection1_shard1_replica_n1] o.a.s.s.SolrIndexSearcher Opening [Searcher@193291c[collection1_shard1_replica_n1] realtime]
[junit4] 2> 378735 INFO (qtp21086313-7422) [n:127.0.0.1:57030_solr c:collection1 s:shard2 r:core_node4 x:collection1_shard2_replica_n2] o.a.s.s.SolrIndexSearcher Opening [Searcher@a2dbfa[collection1_shard2_replica_n2] realtime]
[junit4] 2> 378738 INFO (qtp27950463-7409) [n:127.0.0.1:57038_solr c:collection1 s:shard1 r:core_node3 x:collection1_shard1_replica_n1] o.a.s.u.p.LogUpdateProcessorFactory [collection1_shard1_replica_n1] webapp=/solr path=/update params={update.distrib=TOLEADER&distrib.from=http://127.0.0.1:57030/solr/collection1_shard2_replica_n2/&wt=javabin&version=2}{deleteByQuery=*:* (-1623283043605151744)} 0 9
[junit4] 2> 378742 INFO (qtp27950463-7428) [n:127.0.0.1:57038_solr c:collec
[...truncated too long message...]
855-thread-4) [ ] o.a.s.m.SolrMetricManager Closing metric reporters for registry=solr.cluster, tag=null
[junit4] 1> Done close org.apache.solr.common.util.ExecutorUtil$MDCAwareThreadPoolExecutor@d6bbbd[Terminated, pool size = 0, active threads = 0, queued tasks = 0, completed tasks = 1]
[junit4] 2> 441588 INFO (zkCallback-2798-thread-1) [ ] o.a.s.c.c.ZkStateReader Updated live nodes from ZooKeeper... (1) -> (0)
[junit4] 1> Done close org.apache.solr.common.util.ExecutorUtil$MDCAwareThreadPoolExecutor@2b64bf[Terminated, pool size = 0, active threads = 0, queued tasks = 0, completed tasks = 4]
[junit4] 2> 441592 WARN (NIOServerCxn.Factory:0.0.0.0/0.0.0.0:0) [ ] o.a.z.s.NIOServerCnxn Unable to read additional data from client sessionid 0x1003b4023960012, likely client has closed socket
[junit4] 2> 441593 INFO (jetty-closer-3855-thread-4) [ ] o.e.j.s.AbstractConnector Stopped ServerConnector@181b58{HTTP/1.1,[http/1.1, h2c]}{127.0.0.1:0}
[junit4] 2> 441593 INFO (jetty-closer-3855-thread-4) [ ] o.e.j.s.h.ContextHandler Stopped o.e.j.s.ServletContextHandler@589461{/solr,null,UNAVAILABLE}
[junit4] 2> 441593 INFO (jetty-closer-3855-thread-4) [ ] o.e.j.s.session node0 Stopped scavenging
[junit4] 2> 441594 INFO (SUITE-StreamDecoratorTest-seed#[EAB51E24E990EA7A]-worker) [ ] o.a.s.c.ZkTestServer Shutting down ZkTestServer.
[junit4] 2> 441597 WARN (ZkTestServer Run Thread) [ ] o.a.s.c.ZkTestServer Watch limit violations:
[junit4] 2> Maximum concurrent create/delete watches above limit:
[junit4] 2>
[junit4] 2> 66 /solr/aliases.json
[junit4] 2> 66 /solr/clusterprops.json
[junit4] 2> 10 /solr/configs/conf
[junit4] 2> 10 /solr/collections/parallelDestinationCollection1/terms/shard2
[junit4] 2> 10 /solr/collections/parallelDestinationCollection1/terms/shard1
[junit4] 2> 7 /solr/collections/destinationCollection/terms/shard2
[junit4] 2> 7 /solr/collections/destinationCollection/terms/shard1
[junit4] 2> 4 /solr/collections/parallelDestinationCollection/state.json
[junit4] 2> 4 /solr/configs/ml
[junit4] 2> 4 /solr/collections/destination/terms/shard1
[junit4] 2> 4 /solr/collections/mainCorpus/terms/shard2
[junit4] 2> 4 /solr/security.json
[junit4] 2> 4 /solr/collections/mainCorpus/terms/shard1
[junit4] 2> 4 /solr/collections/parallelDestinationCollection/terms/shard1
[junit4] 2> 4 /solr/collections/parallelDestinationCollection/terms/shard2
[junit4] 2> 4 /solr/collections/destinationCollection/state.json
[junit4] 2> 4 /solr/collections/workQueue/terms/shard2
[junit4] 2> 4 /solr/collections/workQueue/terms/shard1
[junit4] 2> 3 /solr/collections/mainCorpus/state.json
[junit4] 2> 3 /solr/collections/modelCollection/terms/shard2
[junit4] 2> 3 /solr/collections/modelCollection/terms/shard1
[junit4] 2> 3 /solr/collections/destination/state.json
[junit4] 2> 3 /solr/collections/destination/terms/shard2
[junit4] 2> 3 /solr/collections/checkpointCollection/terms/shard1
[junit4] 2> 3 /solr/collections/parallelDestinationCollection1/state.json
[junit4] 2> 3 /solr/collections/collection1/terms/shard1
[junit4] 2> 3 /solr/collections/collection1/terms/shard2
[junit4] 2> 3 /solr/collections/uknownCollection/terms/shard2
[junit4] 2> 3 /solr/collections/uknownCollection/terms/shard1
[junit4] 2> 2 /solr/collections/checkpointCollection/terms/shard2
[junit4] 2>
[junit4] 2> Maximum concurrent data watches above limit:
[junit4] 2>
[junit4] 2> 66 /solr/clusterstate.json
[junit4] 2> 47 /solr/collections/parallelDestinationCollection1/state.json
[junit4] 2> 26 /solr/collections/destinationCollection/state.json
[junit4] 2> 17 /solr/collections/uknownCollection/state.json
[junit4] 2> 17 /solr/collections/modelCollection/state.json
[junit4] 2> 17 /solr/collections/checkpointCollection/state.json
[junit4] 2> 16 /solr/collections/workQueue/state.json
[junit4] 2> 15 /solr/collections/parallelDestinationCollection/state.json
[junit4] 2> 14 /solr/collections/mainCorpus/state.json
[junit4] 2> 13 /solr/collections/destination/state.json
[junit4] 2> 12 /solr/collections/collection1/state.json
[junit4] 2> 2 /solr/overseer_elect/election/72122740698906635-127.0.0.1:57038_solr-n_0000000001
[junit4] 2> 2 /solr/overseer_elect/election/72122740698906633-127.0.0.1:57027_solr-n_0000000000
[junit4] 2>
[junit4] 2> Maximum concurrent children watches above limit:
[junit4] 2>
[junit4] 2> 66 /solr/live_nodes
[junit4] 2> 66 /solr/collections
[junit4] 2>
[junit4] 2> 441604 INFO (SUITE-StreamDecoratorTest-seed#[EAB51E24E990EA7A]-worker) [ ] o.a.s.c.ZkTestServer parse host and port list: 127.0.0.1:57001
[junit4] 2> 441604 INFO (SUITE-StreamDecoratorTest-seed#[EAB51E24E990EA7A]-worker) [ ] o.a.s.c.ZkTestServer connecting to 127.0.0.1 57001
[junit4] 2> NOTE: leaving temporary files on disk at: C:\Users\jenkins\workspace\Lucene-Solr-master-Windows\solr\build\solr-solrj\test\J0\temp\solr.client.solrj.io.stream.StreamDecoratorTest_EAB51E24E990EA7A-001
[junit4] 2> NOTE: test params are: codec=Asserting(Lucene80): {expr_s=BlockTreeOrds(blocksize=128), name_s=PostingsFormat(name=LuceneFixedGap), terms_ss=FSTOrd50, join2_s=FSTOrd50, field_s=FST50, multiDefault=FSTOrd50, subject=FSTOrd50, a1_s=FSTOrd50, a2_s=PostingsFormat(name=LuceneFixedGap), body_t=PostingsFormat(name=LuceneFixedGap), s_multi=PostingsFormat(name=LuceneFixedGap), a_ss=FST50, a_s=PostingsFormat(name=LuceneFixedGap), tv_text=FST50, text_s=BlockTreeOrds(blocksize=128), id=BlockTreeOrds(blocksize=128), text=PostingsFormat(name=LuceneFixedGap), bbid_s=PostingsFormat(name=LuceneFixedGap), type_s=FST50, checkpoint_ss=PostingsFormat(name=LuceneFixedGap), test_t=PostingsFormat(name=LuceneFixedGap), ident_s=FSTOrd50, extra_s=FSTOrd50, ykey_s=FST50, side_s=PostingsFormat(name=LuceneFixedGap)}, docValues:{expr_s=DocValuesFormat(name=Lucene80), name_s=DocValuesFormat(name=Direct), iteration_i=DocValuesFormat(name=Lucene80), terms_ss=DocValuesFormat(name=Lucene80), join2_s=DocValuesFormat(name=Lucene80), field_s=DocValuesFormat(name=Asserting), multiDefault=DocValuesFormat(name=Lucene80), a1_s=DocValuesFormat(name=Lucene80), a_f=DocValuesFormat(name=Lucene80), intDefault=DocValuesFormat(name=Asserting), join1_i=DocValuesFormat(name=Lucene80), a2_s=DocValuesFormat(name=Direct), falseNegative_i=DocValuesFormat(name=Asserting), a_i=DocValuesFormat(name=Lucene80), join3_i=DocValuesFormat(name=Direct), test_i=DocValuesFormat(name=Lucene80), falsePositive_i=DocValuesFormat(name=Asserting), field_i=DocValuesFormat(name=Lucene80), s_multi=DocValuesFormat(name=Direct), a_ss=DocValuesFormat(name=Asserting), a_s=DocValuesFormat(name=Direct), text_s=DocValuesFormat(name=Lucene80), id=DocValuesFormat(name=Lucene80), bbid_s=DocValuesFormat(name=Direct), timestamp=DocValuesFormat(name=Asserting), type_s=DocValuesFormat(name=Asserting), i_multi=DocValuesFormat(name=Lucene80), trueNegative_i=DocValuesFormat(name=Direct), b_ls=DocValuesFormat(name=Lucene80), out_i=DocValuesFormat(name=Lucene80), checkpoint_ss=DocValuesFormat(name=Direct), ident_s=DocValuesFormat(name=Lucene80), _version_=DocValuesFormat(name=Asserting), extra_s=DocValuesFormat(name=Lucene80), ykey_s=DocValuesFormat(name=Asserting), side_s=DocValuesFormat(name=Direct), truePositive_i=DocValuesFormat(name=Lucene80)}, maxPointsInLeafNode=1059, maxMBSortInHeap=5.832766149021529, sim=Asserting(org.apache.lucene.search.similarities.AssertingSimilarity@4c12d7), locale=mk, timezone=IST
[junit4] 2> NOTE: Windows 10 10.0 x86/Oracle Corporation 1.8.0_172 (32-bit)/cpus=3,threads=1,free=81820800,total=389701632
[junit4] 2> NOTE: All tests run in this JVM: [CloudSolrClientBuilderTest, CloudSolrClientTest, TestPolicy, MultiplyEvaluatorTest, TestLBHttp2SolrClient, MergeIndexesEmbeddedTest, GreaterThanEvaluatorTest, SolrExampleStreamingTest, GraphTest, SolrExampleJettyTest, CommonAdminParamsTest, FacetFieldTest, CumulativeProbabilityEvaluatorTest, TestFastInputStream, SineEvaluatorTest, AddEvaluatorTest, ConcurrentUpdateHttp2SolrClientMultiCollectionTest, NotEvaluatorTest, HttpSolrClientBuilderTest, TestCollectionAdminRequest, ZkConfigFilesTest, LBHttpSolrClientBuilderTest, TestSuggesterResponse, FloorEvaluatorTest, RecursiveEvaluatorTest, JettyWebappTest, ArcSineEvaluatorTest, ReverseEvaluatorTest, SolrExceptionTest, SolrSchemalessExampleTest, TestSolrJErrorHandling, Http2SolrClientCompatibilityTest, TestCoreAdmin, ModifiableSolrParamsTest, TestCollectionStateWatchers, SolrExampleStreamingBinaryTest, HyperbolicSineEvaluatorTest, DirectJsonQueryRequestFacetingIntegrationTest, StreamDecoratorTest]
[junit4] Completed [145/184 (1!)] on J0 in 70.01s, 47 tests, 1 failure, 2 skipped <<< FAILURES!
[...truncated 44108 lines...]
[repro] Jenkins log URL: https://jenkins.thetaphi.de/job/Lucene-Solr-master-Windows/7705/consoleText
[repro] Revision: 60aef389cfbe708701c50fc3a68a4082b69ec4d0
[repro] Ant options: "-Dargs=-client -XX:+UseSerialGC"
[repro] ant clean
[...truncated 6 lines...]
[repro] Test suites by module:
[repro] solr\solrj
[repro] StreamDecoratorTest
[repro] ant compile-test
[...truncated 2724 lines...]
[repro] ant test-nocompile -Dtests.dups=5 -Dtests.maxfailures=5 -Dtests.class="*.StreamDecoratorTest" -Dtests.showOutput=onerror "-Dargs=-client -XX:+UseSerialGC" -Dtests.seed=EAB51E24E990EA7A -Dtests.slow=true -Dtests.locale=mk -Dtests.timezone=IST -Dtests.asserts=true -Dtests.file.encoding=Cp1252
[...truncated 298 lines...]
[repro] Failures:
[repro] 0/5 failed: org.apache.solr.client.solrj.io.stream.StreamDecoratorTest
[repro] Exiting with code 0
[...truncated 75 lines...]
[JENKINS-EA] Lucene-Solr-master-Windows (64bit/jdk-12-ea+23) -
Build # 7706 - Still Unstable!
Posted by Policeman Jenkins Server <je...@thetaphi.de>.
Build: https://jenkins.thetaphi.de/job/Lucene-Solr-master-Windows/7706/
Java: 64bit/jdk-12-ea+23 -XX:-UseCompressedOops -XX:+UseConcMarkSweepGC
1 tests failed.
FAILED: junit.framework.TestSuite.org.apache.solr.cloud.ChaosMonkeySafeLeaderWithPullReplicasTest
Error Message:
ObjectTracker found 6 object(s) that were not released!!! [SolrCore, MMapDirectory, MMapDirectory, MMapDirectory, InternalHttpClient, MMapDirectory] org.apache.solr.common.util.ObjectReleaseTracker$ObjectTrackerException: org.apache.solr.core.SolrCore at org.apache.solr.common.util.ObjectReleaseTracker.track(ObjectReleaseTracker.java:42) at org.apache.solr.core.SolrCore.<init>(SolrCore.java:1056) at org.apache.solr.core.SolrCore.<init>(SolrCore.java:876) at org.apache.solr.core.CoreContainer.createFromDescriptor(CoreContainer.java:1189) at org.apache.solr.core.CoreContainer.lambda$load$13(CoreContainer.java:695) at com.codahale.metrics.InstrumentedExecutorService$InstrumentedCallable.call(InstrumentedExecutorService.java:197) at java.base/java.util.concurrent.FutureTask.run(FutureTask.java:264) at org.apache.solr.common.util.ExecutorUtil$MDCAwareThreadPoolExecutor.lambda$execute$0(ExecutorUtil.java:209) at java.base/java.util.concurrent.ThreadPoolExecutor.runWorker(ThreadPoolExecutor.java:1128) at java.base/java.util.concurrent.ThreadPoolExecutor$Worker.run(ThreadPoolExecutor.java:628) at java.base/java.lang.Thread.run(Thread.java:835) org.apache.solr.common.util.ObjectReleaseTracker$ObjectTrackerException: org.apache.lucene.store.MMapDirectory at org.apache.solr.common.util.ObjectReleaseTracker.track(ObjectReleaseTracker.java:42) at org.apache.solr.core.CachingDirectoryFactory.get(CachingDirectoryFactory.java:348) at org.apache.solr.update.SolrIndexWriter.create(SolrIndexWriter.java:95) at org.apache.solr.update.DefaultSolrCoreState.createMainIndexWriter(DefaultSolrCoreState.java:257) at org.apache.solr.update.DefaultSolrCoreState.getIndexWriter(DefaultSolrCoreState.java:131) at org.apache.solr.core.SolrCore.openNewSearcher(SolrCore.java:2106) at org.apache.solr.core.SolrCore.getSearcher(SolrCore.java:2265) at org.apache.solr.core.SolrCore.initSearcher(SolrCore.java:1108) at org.apache.solr.core.SolrCore.<init>(SolrCore.java:995) at org.apache.solr.core.SolrCore.<init>(SolrCore.java:876) at org.apache.solr.core.CoreContainer.createFromDescriptor(CoreContainer.java:1189) at org.apache.solr.core.CoreContainer.lambda$load$13(CoreContainer.java:695) at com.codahale.metrics.InstrumentedExecutorService$InstrumentedCallable.call(InstrumentedExecutorService.java:197) at java.base/java.util.concurrent.FutureTask.run(FutureTask.java:264) at org.apache.solr.common.util.ExecutorUtil$MDCAwareThreadPoolExecutor.lambda$execute$0(ExecutorUtil.java:209) at java.base/java.util.concurrent.ThreadPoolExecutor.runWorker(ThreadPoolExecutor.java:1128) at java.base/java.util.concurrent.ThreadPoolExecutor$Worker.run(ThreadPoolExecutor.java:628) at java.base/java.lang.Thread.run(Thread.java:835) org.apache.solr.common.util.ObjectReleaseTracker$ObjectTrackerException: org.apache.lucene.store.MMapDirectory at org.apache.solr.common.util.ObjectReleaseTracker.track(ObjectReleaseTracker.java:42) at org.apache.solr.core.CachingDirectoryFactory.get(CachingDirectoryFactory.java:348) at org.apache.solr.handler.IndexFetcher.fetchLatestIndex(IndexFetcher.java:503) at org.apache.solr.handler.IndexFetcher.fetchLatestIndex(IndexFetcher.java:346) at org.apache.solr.handler.ReplicationHandler.doFetch(ReplicationHandler.java:422) at org.apache.solr.handler.ReplicationHandler.lambda$setupPolling$13(ReplicationHandler.java:1182) at java.base/java.util.concurrent.Executors$RunnableAdapter.call(Executors.java:515) at java.base/java.util.concurrent.FutureTask.runAndReset(FutureTask.java:305) at java.base/java.util.concurrent.ScheduledThreadPoolExecutor$ScheduledFutureTask.run(ScheduledThreadPoolExecutor.java:305) at java.base/java.util.concurrent.ThreadPoolExecutor.runWorker(ThreadPoolExecutor.java:1128) at java.base/java.util.concurrent.ThreadPoolExecutor$Worker.run(ThreadPoolExecutor.java:628) at java.base/java.lang.Thread.run(Thread.java:835) org.apache.solr.common.util.ObjectReleaseTracker$ObjectTrackerException: org.apache.lucene.store.MMapDirectory at org.apache.solr.common.util.ObjectReleaseTracker.track(ObjectReleaseTracker.java:42) at org.apache.solr.core.CachingDirectoryFactory.get(CachingDirectoryFactory.java:348) at org.apache.solr.core.SolrCore.getNewIndexDir(SolrCore.java:361) at org.apache.solr.core.SolrCore.initIndex(SolrCore.java:740) at org.apache.solr.core.SolrCore.<init>(SolrCore.java:969) at org.apache.solr.core.SolrCore.<init>(SolrCore.java:876) at org.apache.solr.core.CoreContainer.createFromDescriptor(CoreContainer.java:1189) at org.apache.solr.core.CoreContainer.lambda$load$13(CoreContainer.java:695) at com.codahale.metrics.InstrumentedExecutorService$InstrumentedCallable.call(InstrumentedExecutorService.java:197) at java.base/java.util.concurrent.FutureTask.run(FutureTask.java:264) at org.apache.solr.common.util.ExecutorUtil$MDCAwareThreadPoolExecutor.lambda$execute$0(ExecutorUtil.java:209) at java.base/java.util.concurrent.ThreadPoolExecutor.runWorker(ThreadPoolExecutor.java:1128) at java.base/java.util.concurrent.ThreadPoolExecutor$Worker.run(ThreadPoolExecutor.java:628) at java.base/java.lang.Thread.run(Thread.java:835) org.apache.solr.common.util.ObjectReleaseTracker$ObjectTrackerException: org.apache.http.impl.client.InternalHttpClient at org.apache.solr.common.util.ObjectReleaseTracker.track(ObjectReleaseTracker.java:42) at org.apache.solr.client.solrj.impl.HttpClientUtil.createClient(HttpClientUtil.java:321) at org.apache.solr.client.solrj.impl.HttpClientUtil.createClient(HttpClientUtil.java:330) at org.apache.solr.handler.IndexFetcher.createHttpClient(IndexFetcher.java:225) at org.apache.solr.handler.IndexFetcher.<init>(IndexFetcher.java:267) at org.apache.solr.handler.ReplicationHandler.doFetch(ReplicationHandler.java:418) at org.apache.solr.cloud.RecoveryStrategy.replicate(RecoveryStrategy.java:237) at org.apache.solr.cloud.RecoveryStrategy.doReplicateOnlyRecovery(RecoveryStrategy.java:382) at org.apache.solr.cloud.RecoveryStrategy.doRecovery(RecoveryStrategy.java:328) at org.apache.solr.cloud.RecoveryStrategy.run(RecoveryStrategy.java:307) at com.codahale.metrics.InstrumentedExecutorService$InstrumentedRunnable.run(InstrumentedExecutorService.java:176) at java.base/java.util.concurrent.Executors$RunnableAdapter.call(Executors.java:515) at java.base/java.util.concurrent.FutureTask.run(FutureTask.java:264) at org.apache.solr.common.util.ExecutorUtil$MDCAwareThreadPoolExecutor.lambda$execute$0(ExecutorUtil.java:209) at java.base/java.util.concurrent.ThreadPoolExecutor.runWorker(ThreadPoolExecutor.java:1128) at java.base/java.util.concurrent.ThreadPoolExecutor$Worker.run(ThreadPoolExecutor.java:628) at java.base/java.lang.Thread.run(Thread.java:835) org.apache.solr.common.util.ObjectReleaseTracker$ObjectTrackerException: org.apache.lucene.store.MMapDirectory at org.apache.solr.common.util.ObjectReleaseTracker.track(ObjectReleaseTracker.java:42) at org.apache.solr.core.CachingDirectoryFactory.get(CachingDirectoryFactory.java:348) at org.apache.solr.core.SolrCore.initSnapshotMetaDataManager(SolrCore.java:510) at org.apache.solr.core.SolrCore.<init>(SolrCore.java:961) at org.apache.solr.core.SolrCore.<init>(SolrCore.java:876) at org.apache.solr.core.CoreContainer.createFromDescriptor(CoreContainer.java:1189) at org.apache.solr.core.CoreContainer.lambda$load$13(CoreContainer.java:695) at com.codahale.metrics.InstrumentedExecutorService$InstrumentedCallable.call(InstrumentedExecutorService.java:197) at java.base/java.util.concurrent.FutureTask.run(FutureTask.java:264) at org.apache.solr.common.util.ExecutorUtil$MDCAwareThreadPoolExecutor.lambda$execute$0(ExecutorUtil.java:209) at java.base/java.util.concurrent.ThreadPoolExecutor.runWorker(ThreadPoolExecutor.java:1128) at java.base/java.util.concurrent.ThreadPoolExecutor$Worker.run(ThreadPoolExecutor.java:628) at java.base/java.lang.Thread.run(Thread.java:835) expected null, but was:<ObjectTracker found 6 object(s) that were not released!!! [SolrCore, MMapDirectory, MMapDirectory, MMapDirectory, InternalHttpClient, MMapDirectory] org.apache.solr.common.util.ObjectReleaseTracker$ObjectTrackerException: org.apache.solr.core.SolrCore at org.apache.solr.common.util.ObjectReleaseTracker.track(ObjectReleaseTracker.java:42) at org.apache.solr.core.SolrCore.<init>(SolrCore.java:1056) at org.apache.solr.core.SolrCore.<init>(SolrCore.java:876) at org.apache.solr.core.CoreContainer.createFromDescriptor(CoreContainer.java:1189) at org.apache.solr.core.CoreContainer.lambda$load$13(CoreContainer.java:695) at com.codahale.metrics.InstrumentedExecutorService$InstrumentedCallable.call(InstrumentedExecutorService.java:197) at java.base/java.util.concurrent.FutureTask.run(FutureTask.java:264) at org.apache.solr.common.util.ExecutorUtil$MDCAwareThreadPoolExecutor.lambda$execute$0(ExecutorUtil.java:209) at java.base/java.util.concurrent.ThreadPoolExecutor.runWorker(ThreadPoolExecutor.java:1128) at java.base/java.util.concurrent.ThreadPoolExecutor$Worker.run(ThreadPoolExecutor.java:628) at java.base/java.lang.Thread.run(Thread.java:835) org.apache.solr.common.util.ObjectReleaseTracker$ObjectTrackerException: org.apache.lucene.store.MMapDirectory at org.apache.solr.common.util.ObjectReleaseTracker.track(ObjectReleaseTracker.java:42) at org.apache.solr.core.CachingDirectoryFactory.get(CachingDirectoryFactory.java:348) at org.apache.solr.update.SolrIndexWriter.create(SolrIndexWriter.java:95) at org.apache.solr.update.DefaultSolrCoreState.createMainIndexWriter(DefaultSolrCoreState.java:257) at org.apache.solr.update.DefaultSolrCoreState.getIndexWriter(DefaultSolrCoreState.java:131) at org.apache.solr.core.SolrCore.openNewSearcher(SolrCore.java:2106) at org.apache.solr.core.SolrCore.getSearcher(SolrCore.java:2265) at org.apache.solr.core.SolrCore.initSearcher(SolrCore.java:1108) at org.apache.solr.core.SolrCore.<init>(SolrCore.java:995) at org.apache.solr.core.SolrCore.<init>(SolrCore.java:876) at org.apache.solr.core.CoreContainer.createFromDescriptor(CoreContainer.java:1189) at org.apache.solr.core.CoreContainer.lambda$load$13(CoreContainer.java:695) at com.codahale.metrics.InstrumentedExecutorService$InstrumentedCallable.call(InstrumentedExecutorService.java:197) at java.base/java.util.concurrent.FutureTask.run(FutureTask.java:264) at org.apache.solr.common.util.ExecutorUtil$MDCAwareThreadPoolExecutor.lambda$execute$0(ExecutorUtil.java:209) at java.base/java.util.concurrent.ThreadPoolExecutor.runWorker(ThreadPoolExecutor.java:1128) at java.base/java.util.concurrent.ThreadPoolExecutor$Worker.run(ThreadPoolExecutor.java:628) at java.base/java.lang.Thread.run(Thread.java:835) org.apache.solr.common.util.ObjectReleaseTracker$ObjectTrackerException: org.apache.lucene.store.MMapDirectory at org.apache.solr.common.util.ObjectReleaseTracker.track(ObjectReleaseTracker.java:42) at org.apache.solr.core.CachingDirectoryFactory.get(CachingDirectoryFactory.java:348) at org.apache.solr.handler.IndexFetcher.fetchLatestIndex(IndexFetcher.java:503) at org.apache.solr.handler.IndexFetcher.fetchLatestIndex(IndexFetcher.java:346) at org.apache.solr.handler.ReplicationHandler.doFetch(ReplicationHandler.java:422) at org.apache.solr.handler.ReplicationHandler.lambda$setupPolling$13(ReplicationHandler.java:1182) at java.base/java.util.concurrent.Executors$RunnableAdapter.call(Executors.java:515) at java.base/java.util.concurrent.FutureTask.runAndReset(FutureTask.java:305) at java.base/java.util.concurrent.ScheduledThreadPoolExecutor$ScheduledFutureTask.run(ScheduledThreadPoolExecutor.java:305) at java.base/java.util.concurrent.ThreadPoolExecutor.runWorker(ThreadPoolExecutor.java:1128) at java.base/java.util.concurrent.ThreadPoolExecutor$Worker.run(ThreadPoolExecutor.java:628) at java.base/java.lang.Thread.run(Thread.java:835) org.apache.solr.common.util.ObjectReleaseTracker$ObjectTrackerException: org.apache.lucene.store.MMapDirectory at org.apache.solr.common.util.ObjectReleaseTracker.track(ObjectReleaseTracker.java:42) at org.apache.solr.core.CachingDirectoryFactory.get(CachingDirectoryFactory.java:348) at org.apache.solr.core.SolrCore.getNewIndexDir(SolrCore.java:361) at org.apache.solr.core.SolrCore.initIndex(SolrCore.java:740) at org.apache.solr.core.SolrCore.<init>(SolrCore.java:969) at org.apache.solr.core.SolrCore.<init>(SolrCore.java:876) at org.apache.solr.core.CoreContainer.createFromDescriptor(CoreContainer.java:1189) at org.apache.solr.core.CoreContainer.lambda$load$13(CoreContainer.java:695) at com.codahale.metrics.InstrumentedExecutorService$InstrumentedCallable.call(InstrumentedExecutorService.java:197) at java.base/java.util.concurrent.FutureTask.run(FutureTask.java:264) at org.apache.solr.common.util.ExecutorUtil$MDCAwareThreadPoolExecutor.lambda$execute$0(ExecutorUtil.java:209) at java.base/java.util.concurrent.ThreadPoolExecutor.runWorker(ThreadPoolExecutor.java:1128) at java.base/java.util.concurrent.ThreadPoolExecutor$Worker.run(ThreadPoolExecutor.java:628) at java.base/java.lang.Thread.run(Thread.java:835) org.apache.solr.common.util.ObjectReleaseTracker$ObjectTrackerException: org.apache.http.impl.client.InternalHttpClient at org.apache.solr.common.util.ObjectReleaseTracker.track(ObjectReleaseTracker.java:42) at org.apache.solr.client.solrj.impl.HttpClientUtil.createClient(HttpClientUtil.java:321) at org.apache.solr.client.solrj.impl.HttpClientUtil.createClient(HttpClientUtil.java:330) at org.apache.solr.handler.IndexFetcher.createHttpClient(IndexFetcher.java:225) at org.apache.solr.handler.IndexFetcher.<init>(IndexFetcher.java:267) at org.apache.solr.handler.ReplicationHandler.doFetch(ReplicationHandler.java:418) at org.apache.solr.cloud.RecoveryStrategy.replicate(RecoveryStrategy.java:237) at org.apache.solr.cloud.RecoveryStrategy.doReplicateOnlyRecovery(RecoveryStrategy.java:382) at org.apache.solr.cloud.RecoveryStrategy.doRecovery(RecoveryStrategy.java:328) at org.apache.solr.cloud.RecoveryStrategy.run(RecoveryStrategy.java:307) at com.codahale.metrics.InstrumentedExecutorService$InstrumentedRunnable.run(InstrumentedExecutorService.java:176) at java.base/java.util.concurrent.Executors$RunnableAdapter.call(Executors.java:515) at java.base/java.util.concurrent.FutureTask.run(FutureTask.java:264) at org.apache.solr.common.util.ExecutorUtil$MDCAwareThreadPoolExecutor.lambda$execute$0(ExecutorUtil.java:209) at java.base/java.util.concurrent.ThreadPoolExecutor.runWorker(ThreadPoolExecutor.java:1128) at java.base/java.util.concurrent.ThreadPoolExecutor$Worker.run(ThreadPoolExecutor.java:628) at java.base/java.lang.Thread.run(Thread.java:835) org.apache.solr.common.util.ObjectReleaseTracker$ObjectTrackerException: org.apache.lucene.store.MMapDirectory at org.apache.solr.common.util.ObjectReleaseTracker.track(ObjectReleaseTracker.java:42) at org.apache.solr.core.CachingDirectoryFactory.get(CachingDirectoryFactory.java:348) at org.apache.solr.core.SolrCore.initSnapshotMetaDataManager(SolrCore.java:510) at org.apache.solr.core.SolrCore.<init>(SolrCore.java:961) at org.apache.solr.core.SolrCore.<init>(SolrCore.java:876) at org.apache.solr.core.CoreContainer.createFromDescriptor(CoreContainer.java:1189) at org.apache.solr.core.CoreContainer.lambda$load$13(CoreContainer.java:695) at com.codahale.metrics.InstrumentedExecutorService$InstrumentedCallable.call(InstrumentedExecutorService.java:197) at java.base/java.util.concurrent.FutureTask.run(FutureTask.java:264) at org.apache.solr.common.util.ExecutorUtil$MDCAwareThreadPoolExecutor.lambda$execute$0(ExecutorUtil.java:209) at java.base/java.util.concurrent.ThreadPoolExecutor.runWorker(ThreadPoolExecutor.java:1128) at java.base/java.util.concurrent.ThreadPoolExecutor$Worker.run(ThreadPoolExecutor.java:628) at java.base/java.lang.Thread.run(Thread.java:835) >
Stack Trace:
java.lang.AssertionError: ObjectTracker found 6 object(s) that were not released!!! [SolrCore, MMapDirectory, MMapDirectory, MMapDirectory, InternalHttpClient, MMapDirectory]
org.apache.solr.common.util.ObjectReleaseTracker$ObjectTrackerException: org.apache.solr.core.SolrCore
at org.apache.solr.common.util.ObjectReleaseTracker.track(ObjectReleaseTracker.java:42)
at org.apache.solr.core.SolrCore.<init>(SolrCore.java:1056)
at org.apache.solr.core.SolrCore.<init>(SolrCore.java:876)
at org.apache.solr.core.CoreContainer.createFromDescriptor(CoreContainer.java:1189)
at org.apache.solr.core.CoreContainer.lambda$load$13(CoreContainer.java:695)
at com.codahale.metrics.InstrumentedExecutorService$InstrumentedCallable.call(InstrumentedExecutorService.java:197)
at java.base/java.util.concurrent.FutureTask.run(FutureTask.java:264)
at org.apache.solr.common.util.ExecutorUtil$MDCAwareThreadPoolExecutor.lambda$execute$0(ExecutorUtil.java:209)
at java.base/java.util.concurrent.ThreadPoolExecutor.runWorker(ThreadPoolExecutor.java:1128)
at java.base/java.util.concurrent.ThreadPoolExecutor$Worker.run(ThreadPoolExecutor.java:628)
at java.base/java.lang.Thread.run(Thread.java:835)
org.apache.solr.common.util.ObjectReleaseTracker$ObjectTrackerException: org.apache.lucene.store.MMapDirectory
at org.apache.solr.common.util.ObjectReleaseTracker.track(ObjectReleaseTracker.java:42)
at org.apache.solr.core.CachingDirectoryFactory.get(CachingDirectoryFactory.java:348)
at org.apache.solr.update.SolrIndexWriter.create(SolrIndexWriter.java:95)
at org.apache.solr.update.DefaultSolrCoreState.createMainIndexWriter(DefaultSolrCoreState.java:257)
at org.apache.solr.update.DefaultSolrCoreState.getIndexWriter(DefaultSolrCoreState.java:131)
at org.apache.solr.core.SolrCore.openNewSearcher(SolrCore.java:2106)
at org.apache.solr.core.SolrCore.getSearcher(SolrCore.java:2265)
at org.apache.solr.core.SolrCore.initSearcher(SolrCore.java:1108)
at org.apache.solr.core.SolrCore.<init>(SolrCore.java:995)
at org.apache.solr.core.SolrCore.<init>(SolrCore.java:876)
at org.apache.solr.core.CoreContainer.createFromDescriptor(CoreContainer.java:1189)
at org.apache.solr.core.CoreContainer.lambda$load$13(CoreContainer.java:695)
at com.codahale.metrics.InstrumentedExecutorService$InstrumentedCallable.call(InstrumentedExecutorService.java:197)
at java.base/java.util.concurrent.FutureTask.run(FutureTask.java:264)
at org.apache.solr.common.util.ExecutorUtil$MDCAwareThreadPoolExecutor.lambda$execute$0(ExecutorUtil.java:209)
at java.base/java.util.concurrent.ThreadPoolExecutor.runWorker(ThreadPoolExecutor.java:1128)
at java.base/java.util.concurrent.ThreadPoolExecutor$Worker.run(ThreadPoolExecutor.java:628)
at java.base/java.lang.Thread.run(Thread.java:835)
org.apache.solr.common.util.ObjectReleaseTracker$ObjectTrackerException: org.apache.lucene.store.MMapDirectory
at org.apache.solr.common.util.ObjectReleaseTracker.track(ObjectReleaseTracker.java:42)
at org.apache.solr.core.CachingDirectoryFactory.get(CachingDirectoryFactory.java:348)
at org.apache.solr.handler.IndexFetcher.fetchLatestIndex(IndexFetcher.java:503)
at org.apache.solr.handler.IndexFetcher.fetchLatestIndex(IndexFetcher.java:346)
at org.apache.solr.handler.ReplicationHandler.doFetch(ReplicationHandler.java:422)
at org.apache.solr.handler.ReplicationHandler.lambda$setupPolling$13(ReplicationHandler.java:1182)
at java.base/java.util.concurrent.Executors$RunnableAdapter.call(Executors.java:515)
at java.base/java.util.concurrent.FutureTask.runAndReset(FutureTask.java:305)
at java.base/java.util.concurrent.ScheduledThreadPoolExecutor$ScheduledFutureTask.run(ScheduledThreadPoolExecutor.java:305)
at java.base/java.util.concurrent.ThreadPoolExecutor.runWorker(ThreadPoolExecutor.java:1128)
at java.base/java.util.concurrent.ThreadPoolExecutor$Worker.run(ThreadPoolExecutor.java:628)
at java.base/java.lang.Thread.run(Thread.java:835)
org.apache.solr.common.util.ObjectReleaseTracker$ObjectTrackerException: org.apache.lucene.store.MMapDirectory
at org.apache.solr.common.util.ObjectReleaseTracker.track(ObjectReleaseTracker.java:42)
at org.apache.solr.core.CachingDirectoryFactory.get(CachingDirectoryFactory.java:348)
at org.apache.solr.core.SolrCore.getNewIndexDir(SolrCore.java:361)
at org.apache.solr.core.SolrCore.initIndex(SolrCore.java:740)
at org.apache.solr.core.SolrCore.<init>(SolrCore.java:969)
at org.apache.solr.core.SolrCore.<init>(SolrCore.java:876)
at org.apache.solr.core.CoreContainer.createFromDescriptor(CoreContainer.java:1189)
at org.apache.solr.core.CoreContainer.lambda$load$13(CoreContainer.java:695)
at com.codahale.metrics.InstrumentedExecutorService$InstrumentedCallable.call(InstrumentedExecutorService.java:197)
at java.base/java.util.concurrent.FutureTask.run(FutureTask.java:264)
at org.apache.solr.common.util.ExecutorUtil$MDCAwareThreadPoolExecutor.lambda$execute$0(ExecutorUtil.java:209)
at java.base/java.util.concurrent.ThreadPoolExecutor.runWorker(ThreadPoolExecutor.java:1128)
at java.base/java.util.concurrent.ThreadPoolExecutor$Worker.run(ThreadPoolExecutor.java:628)
at java.base/java.lang.Thread.run(Thread.java:835)
org.apache.solr.common.util.ObjectReleaseTracker$ObjectTrackerException: org.apache.http.impl.client.InternalHttpClient
at org.apache.solr.common.util.ObjectReleaseTracker.track(ObjectReleaseTracker.java:42)
at org.apache.solr.client.solrj.impl.HttpClientUtil.createClient(HttpClientUtil.java:321)
at org.apache.solr.client.solrj.impl.HttpClientUtil.createClient(HttpClientUtil.java:330)
at org.apache.solr.handler.IndexFetcher.createHttpClient(IndexFetcher.java:225)
at org.apache.solr.handler.IndexFetcher.<init>(IndexFetcher.java:267)
at org.apache.solr.handler.ReplicationHandler.doFetch(ReplicationHandler.java:418)
at org.apache.solr.cloud.RecoveryStrategy.replicate(RecoveryStrategy.java:237)
at org.apache.solr.cloud.RecoveryStrategy.doReplicateOnlyRecovery(RecoveryStrategy.java:382)
at org.apache.solr.cloud.RecoveryStrategy.doRecovery(RecoveryStrategy.java:328)
at org.apache.solr.cloud.RecoveryStrategy.run(RecoveryStrategy.java:307)
at com.codahale.metrics.InstrumentedExecutorService$InstrumentedRunnable.run(InstrumentedExecutorService.java:176)
at java.base/java.util.concurrent.Executors$RunnableAdapter.call(Executors.java:515)
at java.base/java.util.concurrent.FutureTask.run(FutureTask.java:264)
at org.apache.solr.common.util.ExecutorUtil$MDCAwareThreadPoolExecutor.lambda$execute$0(ExecutorUtil.java:209)
at java.base/java.util.concurrent.ThreadPoolExecutor.runWorker(ThreadPoolExecutor.java:1128)
at java.base/java.util.concurrent.ThreadPoolExecutor$Worker.run(ThreadPoolExecutor.java:628)
at java.base/java.lang.Thread.run(Thread.java:835)
org.apache.solr.common.util.ObjectReleaseTracker$ObjectTrackerException: org.apache.lucene.store.MMapDirectory
at org.apache.solr.common.util.ObjectReleaseTracker.track(ObjectReleaseTracker.java:42)
at org.apache.solr.core.CachingDirectoryFactory.get(CachingDirectoryFactory.java:348)
at org.apache.solr.core.SolrCore.initSnapshotMetaDataManager(SolrCore.java:510)
at org.apache.solr.core.SolrCore.<init>(SolrCore.java:961)
at org.apache.solr.core.SolrCore.<init>(SolrCore.java:876)
at org.apache.solr.core.CoreContainer.createFromDescriptor(CoreContainer.java:1189)
at org.apache.solr.core.CoreContainer.lambda$load$13(CoreContainer.java:695)
at com.codahale.metrics.InstrumentedExecutorService$InstrumentedCallable.call(InstrumentedExecutorService.java:197)
at java.base/java.util.concurrent.FutureTask.run(FutureTask.java:264)
at org.apache.solr.common.util.ExecutorUtil$MDCAwareThreadPoolExecutor.lambda$execute$0(ExecutorUtil.java:209)
at java.base/java.util.concurrent.ThreadPoolExecutor.runWorker(ThreadPoolExecutor.java:1128)
at java.base/java.util.concurrent.ThreadPoolExecutor$Worker.run(ThreadPoolExecutor.java:628)
at java.base/java.lang.Thread.run(Thread.java:835)
expected null, but was:<ObjectTracker found 6 object(s) that were not released!!! [SolrCore, MMapDirectory, MMapDirectory, MMapDirectory, InternalHttpClient, MMapDirectory]
org.apache.solr.common.util.ObjectReleaseTracker$ObjectTrackerException: org.apache.solr.core.SolrCore
at org.apache.solr.common.util.ObjectReleaseTracker.track(ObjectReleaseTracker.java:42)
at org.apache.solr.core.SolrCore.<init>(SolrCore.java:1056)
at org.apache.solr.core.SolrCore.<init>(SolrCore.java:876)
at org.apache.solr.core.CoreContainer.createFromDescriptor(CoreContainer.java:1189)
at org.apache.solr.core.CoreContainer.lambda$load$13(CoreContainer.java:695)
at com.codahale.metrics.InstrumentedExecutorService$InstrumentedCallable.call(InstrumentedExecutorService.java:197)
at java.base/java.util.concurrent.FutureTask.run(FutureTask.java:264)
at org.apache.solr.common.util.ExecutorUtil$MDCAwareThreadPoolExecutor.lambda$execute$0(ExecutorUtil.java:209)
at java.base/java.util.concurrent.ThreadPoolExecutor.runWorker(ThreadPoolExecutor.java:1128)
at java.base/java.util.concurrent.ThreadPoolExecutor$Worker.run(ThreadPoolExecutor.java:628)
at java.base/java.lang.Thread.run(Thread.java:835)
org.apache.solr.common.util.ObjectReleaseTracker$ObjectTrackerException: org.apache.lucene.store.MMapDirectory
at org.apache.solr.common.util.ObjectReleaseTracker.track(ObjectReleaseTracker.java:42)
at org.apache.solr.core.CachingDirectoryFactory.get(CachingDirectoryFactory.java:348)
at org.apache.solr.update.SolrIndexWriter.create(SolrIndexWriter.java:95)
at org.apache.solr.update.DefaultSolrCoreState.createMainIndexWriter(DefaultSolrCoreState.java:257)
at org.apache.solr.update.DefaultSolrCoreState.getIndexWriter(DefaultSolrCoreState.java:131)
at org.apache.solr.core.SolrCore.openNewSearcher(SolrCore.java:2106)
at org.apache.solr.core.SolrCore.getSearcher(SolrCore.java:2265)
at org.apache.solr.core.SolrCore.initSearcher(SolrCore.java:1108)
at org.apache.solr.core.SolrCore.<init>(SolrCore.java:995)
at org.apache.solr.core.SolrCore.<init>(SolrCore.java:876)
at org.apache.solr.core.CoreContainer.createFromDescriptor(CoreContainer.java:1189)
at org.apache.solr.core.CoreContainer.lambda$load$13(CoreContainer.java:695)
at com.codahale.metrics.InstrumentedExecutorService$InstrumentedCallable.call(InstrumentedExecutorService.java:197)
at java.base/java.util.concurrent.FutureTask.run(FutureTask.java:264)
at org.apache.solr.common.util.ExecutorUtil$MDCAwareThreadPoolExecutor.lambda$execute$0(ExecutorUtil.java:209)
at java.base/java.util.concurrent.ThreadPoolExecutor.runWorker(ThreadPoolExecutor.java:1128)
at java.base/java.util.concurrent.ThreadPoolExecutor$Worker.run(ThreadPoolExecutor.java:628)
at java.base/java.lang.Thread.run(Thread.java:835)
org.apache.solr.common.util.ObjectReleaseTracker$ObjectTrackerException: org.apache.lucene.store.MMapDirectory
at org.apache.solr.common.util.ObjectReleaseTracker.track(ObjectReleaseTracker.java:42)
at org.apache.solr.core.CachingDirectoryFactory.get(CachingDirectoryFactory.java:348)
at org.apache.solr.handler.IndexFetcher.fetchLatestIndex(IndexFetcher.java:503)
at org.apache.solr.handler.IndexFetcher.fetchLatestIndex(IndexFetcher.java:346)
at org.apache.solr.handler.ReplicationHandler.doFetch(ReplicationHandler.java:422)
at org.apache.solr.handler.ReplicationHandler.lambda$setupPolling$13(ReplicationHandler.java:1182)
at java.base/java.util.concurrent.Executors$RunnableAdapter.call(Executors.java:515)
at java.base/java.util.concurrent.FutureTask.runAndReset(FutureTask.java:305)
at java.base/java.util.concurrent.ScheduledThreadPoolExecutor$ScheduledFutureTask.run(ScheduledThreadPoolExecutor.java:305)
at java.base/java.util.concurrent.ThreadPoolExecutor.runWorker(ThreadPoolExecutor.java:1128)
at java.base/java.util.concurrent.ThreadPoolExecutor$Worker.run(ThreadPoolExecutor.java:628)
at java.base/java.lang.Thread.run(Thread.java:835)
org.apache.solr.common.util.ObjectReleaseTracker$ObjectTrackerException: org.apache.lucene.store.MMapDirectory
at org.apache.solr.common.util.ObjectReleaseTracker.track(ObjectReleaseTracker.java:42)
at org.apache.solr.core.CachingDirectoryFactory.get(CachingDirectoryFactory.java:348)
at org.apache.solr.core.SolrCore.getNewIndexDir(SolrCore.java:361)
at org.apache.solr.core.SolrCore.initIndex(SolrCore.java:740)
at org.apache.solr.core.SolrCore.<init>(SolrCore.java:969)
at org.apache.solr.core.SolrCore.<init>(SolrCore.java:876)
at org.apache.solr.core.CoreContainer.createFromDescriptor(CoreContainer.java:1189)
at org.apache.solr.core.CoreContainer.lambda$load$13(CoreContainer.java:695)
at com.codahale.metrics.InstrumentedExecutorService$InstrumentedCallable.call(InstrumentedExecutorService.java:197)
at java.base/java.util.concurrent.FutureTask.run(FutureTask.java:264)
at org.apache.solr.common.util.ExecutorUtil$MDCAwareThreadPoolExecutor.lambda$execute$0(ExecutorUtil.java:209)
at java.base/java.util.concurrent.ThreadPoolExecutor.runWorker(ThreadPoolExecutor.java:1128)
at java.base/java.util.concurrent.ThreadPoolExecutor$Worker.run(ThreadPoolExecutor.java:628)
at java.base/java.lang.Thread.run(Thread.java:835)
org.apache.solr.common.util.ObjectReleaseTracker$ObjectTrackerException: org.apache.http.impl.client.InternalHttpClient
at org.apache.solr.common.util.ObjectReleaseTracker.track(ObjectReleaseTracker.java:42)
at org.apache.solr.client.solrj.impl.HttpClientUtil.createClient(HttpClientUtil.java:321)
at org.apache.solr.client.solrj.impl.HttpClientUtil.createClient(HttpClientUtil.java:330)
at org.apache.solr.handler.IndexFetcher.createHttpClient(IndexFetcher.java:225)
at org.apache.solr.handler.IndexFetcher.<init>(IndexFetcher.java:267)
at org.apache.solr.handler.ReplicationHandler.doFetch(ReplicationHandler.java:418)
at org.apache.solr.cloud.RecoveryStrategy.replicate(RecoveryStrategy.java:237)
at org.apache.solr.cloud.RecoveryStrategy.doReplicateOnlyRecovery(RecoveryStrategy.java:382)
at org.apache.solr.cloud.RecoveryStrategy.doRecovery(RecoveryStrategy.java:328)
at org.apache.solr.cloud.RecoveryStrategy.run(RecoveryStrategy.java:307)
at com.codahale.metrics.InstrumentedExecutorService$InstrumentedRunnable.run(InstrumentedExecutorService.java:176)
at java.base/java.util.concurrent.Executors$RunnableAdapter.call(Executors.java:515)
at java.base/java.util.concurrent.FutureTask.run(FutureTask.java:264)
at org.apache.solr.common.util.ExecutorUtil$MDCAwareThreadPoolExecutor.lambda$execute$0(ExecutorUtil.java:209)
at java.base/java.util.concurrent.ThreadPoolExecutor.runWorker(ThreadPoolExecutor.java:1128)
at java.base/java.util.concurrent.ThreadPoolExecutor$Worker.run(ThreadPoolExecutor.java:628)
at java.base/java.lang.Thread.run(Thread.java:835)
org.apache.solr.common.util.ObjectReleaseTracker$ObjectTrackerException: org.apache.lucene.store.MMapDirectory
at org.apache.solr.common.util.ObjectReleaseTracker.track(ObjectReleaseTracker.java:42)
at org.apache.solr.core.CachingDirectoryFactory.get(CachingDirectoryFactory.java:348)
at org.apache.solr.core.SolrCore.initSnapshotMetaDataManager(SolrCore.java:510)
at org.apache.solr.core.SolrCore.<init>(SolrCore.java:961)
at org.apache.solr.core.SolrCore.<init>(SolrCore.java:876)
at org.apache.solr.core.CoreContainer.createFromDescriptor(CoreContainer.java:1189)
at org.apache.solr.core.CoreContainer.lambda$load$13(CoreContainer.java:695)
at com.codahale.metrics.InstrumentedExecutorService$InstrumentedCallable.call(InstrumentedExecutorService.java:197)
at java.base/java.util.concurrent.FutureTask.run(FutureTask.java:264)
at org.apache.solr.common.util.ExecutorUtil$MDCAwareThreadPoolExecutor.lambda$execute$0(ExecutorUtil.java:209)
at java.base/java.util.concurrent.ThreadPoolExecutor.runWorker(ThreadPoolExecutor.java:1128)
at java.base/java.util.concurrent.ThreadPoolExecutor$Worker.run(ThreadPoolExecutor.java:628)
at java.base/java.lang.Thread.run(Thread.java:835)
>
at __randomizedtesting.SeedInfo.seed([5BBB19AABF618A34]:0)
at org.junit.Assert.fail(Assert.java:88)
at org.junit.Assert.failNotNull(Assert.java:755)
at org.junit.Assert.assertNull(Assert.java:737)
at org.apache.solr.SolrTestCaseJ4.teardownTestCases(SolrTestCaseJ4.java:322)
at jdk.internal.reflect.GeneratedMethodAccessor35.invoke(Unknown Source)
at java.base/jdk.internal.reflect.DelegatingMethodAccessorImpl.invoke(DelegatingMethodAccessorImpl.java:43)
at java.base/java.lang.reflect.Method.invoke(Method.java:567)
at com.carrotsearch.randomizedtesting.RandomizedRunner.invoke(RandomizedRunner.java:1750)
at com.carrotsearch.randomizedtesting.RandomizedRunner$7.evaluate(RandomizedRunner.java:901)
at com.carrotsearch.randomizedtesting.rules.StatementAdapter.evaluate(StatementAdapter.java:36)
at com.carrotsearch.randomizedtesting.rules.SystemPropertiesRestoreRule$1.evaluate(SystemPropertiesRestoreRule.java:57)
at org.apache.lucene.util.AbstractBeforeAfterRule$1.evaluate(AbstractBeforeAfterRule.java:45)
at com.carrotsearch.randomizedtesting.rules.StatementAdapter.evaluate(StatementAdapter.java:36)
at org.apache.lucene.util.TestRuleStoreClassName$1.evaluate(TestRuleStoreClassName.java:41)
at com.carrotsearch.randomizedtesting.rules.NoShadowingOrOverridesOnMethodsRule$1.evaluate(NoShadowingOrOverridesOnMethodsRule.java:40)
at com.carrotsearch.randomizedtesting.rules.NoShadowingOrOverridesOnMethodsRule$1.evaluate(NoShadowingOrOverridesOnMethodsRule.java:40)
at com.carrotsearch.randomizedtesting.rules.StatementAdapter.evaluate(StatementAdapter.java:36)
at com.carrotsearch.randomizedtesting.rules.StatementAdapter.evaluate(StatementAdapter.java:36)
at org.apache.lucene.util.TestRuleAssertionsRequired$1.evaluate(TestRuleAssertionsRequired.java:53)
at org.apache.lucene.util.TestRuleMarkFailure$1.evaluate(TestRuleMarkFailure.java:47)
at org.apache.lucene.util.TestRuleIgnoreAfterMaxFailures$1.evaluate(TestRuleIgnoreAfterMaxFailures.java:64)
at org.apache.lucene.util.TestRuleIgnoreTestSuites$1.evaluate(TestRuleIgnoreTestSuites.java:54)
at com.carrotsearch.randomizedtesting.rules.StatementAdapter.evaluate(StatementAdapter.java:36)
at com.carrotsearch.randomizedtesting.ThreadLeakControl$StatementRunner.run(ThreadLeakControl.java:368)
at java.base/java.lang.Thread.run(Thread.java:835)
Build Log:
[...truncated 2059 lines...]
[junit4] JVM J0: stderr was not empty, see: C:\Users\jenkins\workspace\Lucene-Solr-master-Windows\lucene\build\core\test\temp\junit4-J0-20190122_051054_07711521821475837927759.syserr
[junit4] >>> JVM J0 emitted unexpected output (verbatim) ----
[junit4] OpenJDK 64-Bit Server VM warning: Option UseConcMarkSweepGC was deprecated in version 9.0 and will likely be removed in a future release.
[junit4] <<< JVM J0: EOF ----
[...truncated 5 lines...]
[junit4] JVM J1: stderr was not empty, see: C:\Users\jenkins\workspace\Lucene-Solr-master-Windows\lucene\build\core\test\temp\junit4-J1-20190122_051054_0777567449987414171318.syserr
[junit4] >>> JVM J1 emitted unexpected output (verbatim) ----
[junit4] OpenJDK 64-Bit Server VM warning: Option UseConcMarkSweepGC was deprecated in version 9.0 and will likely be removed in a future release.
[junit4] <<< JVM J1: EOF ----
[...truncated 319 lines...]
[junit4] JVM J1: stderr was not empty, see: C:\Users\jenkins\workspace\Lucene-Solr-master-Windows\lucene\build\test-framework\test\temp\junit4-J1-20190122_051938_65110597442119307625224.syserr
[junit4] >>> JVM J1 emitted unexpected output (verbatim) ----
[junit4] OpenJDK 64-Bit Server VM warning: Option UseConcMarkSweepGC was deprecated in version 9.0 and will likely be removed in a future release.
[junit4] <<< JVM J1: EOF ----
[...truncated 3 lines...]
[junit4] JVM J0: stderr was not empty, see: C:\Users\jenkins\workspace\Lucene-Solr-master-Windows\lucene\build\test-framework\test\temp\junit4-J0-20190122_051938_65112499385650377982687.syserr
[junit4] >>> JVM J0 emitted unexpected output (verbatim) ----
[junit4] OpenJDK 64-Bit Server VM warning: Option UseConcMarkSweepGC was deprecated in version 9.0 and will likely be removed in a future release.
[junit4] <<< JVM J0: EOF ----
[...truncated 1081 lines...]
[junit4] JVM J0: stderr was not empty, see: C:\Users\jenkins\workspace\Lucene-Solr-master-Windows\lucene\build\analysis\common\test\temp\junit4-J0-20190122_052122_8137584969169520402317.syserr
[junit4] >>> JVM J0 emitted unexpected output (verbatim) ----
[junit4] OpenJDK 64-Bit Server VM warning: Option UseConcMarkSweepGC was deprecated in version 9.0 and will likely be removed in a future release.
[junit4] <<< JVM J0: EOF ----
[...truncated 3 lines...]
[junit4] JVM J1: stderr was not empty, see: C:\Users\jenkins\workspace\Lucene-Solr-master-Windows\lucene\build\analysis\common\test\temp\junit4-J1-20190122_052122_81316864872891158465922.syserr
[junit4] >>> JVM J1 emitted unexpected output (verbatim) ----
[junit4] OpenJDK 64-Bit Server VM warning: Option UseConcMarkSweepGC was deprecated in version 9.0 and will likely be removed in a future release.
[junit4] <<< JVM J1: EOF ----
[...truncated 260 lines...]
[junit4] JVM J0: stderr was not empty, see: C:\Users\jenkins\workspace\Lucene-Solr-master-Windows\lucene\build\analysis\icu\test\temp\junit4-J0-20190122_052407_1031579965683153920717.syserr
[junit4] >>> JVM J0 emitted unexpected output (verbatim) ----
[junit4] OpenJDK 64-Bit Server VM warning: Option UseConcMarkSweepGC was deprecated in version 9.0 and will likely be removed in a future release.
[junit4] <<< JVM J0: EOF ----
[junit4] JVM J1: stderr was not empty, see: C:\Users\jenkins\workspace\Lucene-Solr-master-Windows\lucene\build\analysis\icu\test\temp\junit4-J1-20190122_052407_1034526258264127699885.syserr
[junit4] >>> JVM J1 emitted unexpected output (verbatim) ----
[junit4] OpenJDK 64-Bit Server VM warning: Option UseConcMarkSweepGC was deprecated in version 9.0 and will likely be removed in a future release.
[junit4] <<< JVM J1: EOF ----
[...truncated 242 lines...]
[junit4] JVM J1: stderr was not empty, see: C:\Users\jenkins\workspace\Lucene-Solr-master-Windows\lucene\build\analysis\kuromoji\test\temp\junit4-J1-20190122_052423_7753366035748847908227.syserr
[junit4] >>> JVM J1 emitted unexpected output (verbatim) ----
[junit4] OpenJDK 64-Bit Server VM warning: Option UseConcMarkSweepGC was deprecated in version 9.0 and will likely be removed in a future release.
[junit4] <<< JVM J1: EOF ----
[...truncated 15 lines...]
[junit4] JVM J0: stderr was not empty, see: C:\Users\jenkins\workspace\Lucene-Solr-master-Windows\lucene\build\analysis\kuromoji\test\temp\junit4-J0-20190122_052423_77516839333540943991004.syserr
[junit4] >>> JVM J0 emitted unexpected output (verbatim) ----
[junit4] OpenJDK 64-Bit Server VM warning: Option UseConcMarkSweepGC was deprecated in version 9.0 and will likely be removed in a future release.
[junit4] <<< JVM J0: EOF ----
[...truncated 166 lines...]
[junit4] JVM J0: stderr was not empty, see: C:\Users\jenkins\workspace\Lucene-Solr-master-Windows\lucene\build\analysis\morfologik\test\temp\junit4-J0-20190122_052458_0114748610820640036442.syserr
[junit4] >>> JVM J0 emitted unexpected output (verbatim) ----
[junit4] OpenJDK 64-Bit Server VM warning: Option UseConcMarkSweepGC was deprecated in version 9.0 and will likely be removed in a future release.
[junit4] <<< JVM J0: EOF ----
[junit4] JVM J1: stderr was not empty, see: C:\Users\jenkins\workspace\Lucene-Solr-master-Windows\lucene\build\analysis\morfologik\test\temp\junit4-J1-20190122_052458_0117319758344638914886.syserr
[junit4] >>> JVM J1 emitted unexpected output (verbatim) ----
[junit4] OpenJDK 64-Bit Server VM warning: Option UseConcMarkSweepGC was deprecated in version 9.0 and will likely be removed in a future release.
[junit4] <<< JVM J1: EOF ----
[...truncated 208 lines...]
[junit4] JVM J1: stderr was not empty, see: C:\Users\jenkins\workspace\Lucene-Solr-master-Windows\lucene\build\analysis\nori\test\temp\junit4-J1-20190122_052505_93012162344394883080073.syserr
[junit4] >>> JVM J1 emitted unexpected output (verbatim) ----
[junit4] OpenJDK 64-Bit Server VM warning: Option UseConcMarkSweepGC was deprecated in version 9.0 and will likely be removed in a future release.
[junit4] <<< JVM J1: EOF ----
[...truncated 3 lines...]
[junit4] JVM J0: stderr was not empty, see: C:\Users\jenkins\workspace\Lucene-Solr-master-Windows\lucene\build\analysis\nori\test\temp\junit4-J0-20190122_052505_93014498016801733635043.syserr
[junit4] >>> JVM J0 emitted unexpected output (verbatim) ----
[junit4] OpenJDK 64-Bit Server VM warning: Option UseConcMarkSweepGC was deprecated in version 9.0 and will likely be removed in a future release.
[junit4] <<< JVM J0: EOF ----
[...truncated 169 lines...]
[junit4] JVM J0: stderr was not empty, see: C:\Users\jenkins\workspace\Lucene-Solr-master-Windows\lucene\build\analysis\opennlp\test\temp\junit4-J0-20190122_052520_09118036536880914272394.syserr
[junit4] >>> JVM J0 emitted unexpected output (verbatim) ----
[junit4] OpenJDK 64-Bit Server VM warning: Option UseConcMarkSweepGC was deprecated in version 9.0 and will likely be removed in a future release.
[junit4] <<< JVM J0: EOF ----
[...truncated 3 lines...]
[junit4] JVM J1: stderr was not empty, see: C:\Users\jenkins\workspace\Lucene-Solr-master-Windows\lucene\build\analysis\opennlp\test\temp\junit4-J1-20190122_052520_0949922968166786965397.syserr
[junit4] >>> JVM J1 emitted unexpected output (verbatim) ----
[junit4] OpenJDK 64-Bit Server VM warning: Option UseConcMarkSweepGC was deprecated in version 9.0 and will likely be removed in a future release.
[junit4] <<< JVM J1: EOF ----
[...truncated 177 lines...]
[junit4] JVM J1: stderr was not empty, see: C:\Users\jenkins\workspace\Lucene-Solr-master-Windows\lucene\build\analysis\phonetic\test\temp\junit4-J1-20190122_052527_8587375093890664268485.syserr
[junit4] >>> JVM J1 emitted unexpected output (verbatim) ----
[junit4] OpenJDK 64-Bit Server VM warning: Option UseConcMarkSweepGC was deprecated in version 9.0 and will likely be removed in a future release.
[junit4] <<< JVM J1: EOF ----
[...truncated 3 lines...]
[junit4] JVM J0: stderr was not empty, see: C:\Users\jenkins\workspace\Lucene-Solr-master-Windows\lucene\build\analysis\phonetic\test\temp\junit4-J0-20190122_052527_85814563034968715907032.syserr
[junit4] >>> JVM J0 emitted unexpected output (verbatim) ----
[junit4] OpenJDK 64-Bit Server VM warning: Option UseConcMarkSweepGC was deprecated in version 9.0 and will likely be removed in a future release.
[junit4] <<< JVM J0: EOF ----
[...truncated 160 lines...]
[junit4] JVM J0: stderr was not empty, see: C:\Users\jenkins\workspace\Lucene-Solr-master-Windows\lucene\build\analysis\smartcn\test\temp\junit4-J0-20190122_052544_11614490338975069075730.syserr
[junit4] >>> JVM J0 emitted unexpected output (verbatim) ----
[junit4] OpenJDK 64-Bit Server VM warning: Option UseConcMarkSweepGC was deprecated in version 9.0 and will likely be removed in a future release.
[junit4] <<< JVM J0: EOF ----
[...truncated 3 lines...]
[junit4] JVM J1: stderr was not empty, see: C:\Users\jenkins\workspace\Lucene-Solr-master-Windows\lucene\build\analysis\smartcn\test\temp\junit4-J1-20190122_052544_11615111794110951769983.syserr
[junit4] >>> JVM J1 emitted unexpected output (verbatim) ----
[junit4] OpenJDK 64-Bit Server VM warning: Option UseConcMarkSweepGC was deprecated in version 9.0 and will likely be removed in a future release.
[junit4] <<< JVM J1: EOF ----
[...truncated 168 lines...]
[junit4] JVM J1: stderr was not empty, see: C:\Users\jenkins\workspace\Lucene-Solr-master-Windows\lucene\build\analysis\stempel\test\temp\junit4-J1-20190122_052555_5214153055272794451058.syserr
[junit4] >>> JVM J1 emitted unexpected output (verbatim) ----
[junit4] OpenJDK 64-Bit Server VM warning: Option UseConcMarkSweepGC was deprecated in version 9.0 and will likely be removed in a future release.
[junit4] <<< JVM J1: EOF ----
[junit4] JVM J0: stderr was not empty, see: C:\Users\jenkins\workspace\Lucene-Solr-master-Windows\lucene\build\analysis\stempel\test\temp\junit4-J0-20190122_052555_52117078361719022573470.syserr
[junit4] >>> JVM J0 emitted unexpected output (verbatim) ----
[junit4] OpenJDK 64-Bit Server VM warning: Option UseConcMarkSweepGC was deprecated in version 9.0 and will likely be removed in a future release.
[junit4] <<< JVM J0: EOF ----
[...truncated 204 lines...]
[junit4] JVM J0: stderr was not empty, see: C:\Users\jenkins\workspace\Lucene-Solr-master-Windows\lucene\build\backward-codecs\test\temp\junit4-J0-20190122_052602_9914062238707067959962.syserr
[junit4] >>> JVM J0 emitted unexpected output (verbatim) ----
[junit4] OpenJDK 64-Bit Server VM warning: Option UseConcMarkSweepGC was deprecated in version 9.0 and will likely be removed in a future release.
[junit4] <<< JVM J0: EOF ----
[...truncated 9 lines...]
[junit4] JVM J1: stderr was not empty, see: C:\Users\jenkins\workspace\Lucene-Solr-master-Windows\lucene\build\backward-codecs\test\temp\junit4-J1-20190122_052602_9917599237476004722993.syserr
[junit4] >>> JVM J1 emitted unexpected output (verbatim) ----
[junit4] OpenJDK 64-Bit Server VM warning: Option UseConcMarkSweepGC was deprecated in version 9.0 and will likely be removed in a future release.
[junit4] <<< JVM J1: EOF ----
[...truncated 1551 lines...]
[junit4] JVM J0: stderr was not empty, see: C:\Users\jenkins\workspace\Lucene-Solr-master-Windows\lucene\build\benchmark\test\temp\junit4-J0-20190122_052718_65218271018655284310798.syserr
[junit4] >>> JVM J0 emitted unexpected output (verbatim) ----
[junit4] OpenJDK 64-Bit Server VM warning: Option UseConcMarkSweepGC was deprecated in version 9.0 and will likely be removed in a future release.
[junit4] <<< JVM J0: EOF ----
[...truncated 3 lines...]
[junit4] JVM J1: stderr was not empty, see: C:\Users\jenkins\workspace\Lucene-Solr-master-Windows\lucene\build\benchmark\test\temp\junit4-J1-20190122_052718_6527357238634417846017.syserr
[junit4] >>> JVM J1 emitted unexpected output (verbatim) ----
[junit4] OpenJDK 64-Bit Server VM warning: Option UseConcMarkSweepGC was deprecated in version 9.0 and will likely be removed in a future release.
[junit4] <<< JVM J1: EOF ----
[...truncated 252 lines...]
[junit4] JVM J0: stderr was not empty, see: C:\Users\jenkins\workspace\Lucene-Solr-master-Windows\lucene\build\classification\test\temp\junit4-J0-20190122_052734_42114291893058609703969.syserr
[junit4] >>> JVM J0 emitted unexpected output (verbatim) ----
[junit4] OpenJDK 64-Bit Server VM warning: Option UseConcMarkSweepGC was deprecated in version 9.0 and will likely be removed in a future release.
[junit4] <<< JVM J0: EOF ----
[...truncated 3 lines...]
[junit4] JVM J1: stderr was not empty, see: C:\Users\jenkins\workspace\Lucene-Solr-master-Windows\lucene\build\classification\test\temp\junit4-J1-20190122_052734_4212715693537888793156.syserr
[junit4] >>> JVM J1 emitted unexpected output (verbatim) ----
[junit4] OpenJDK 64-Bit Server VM warning: Option UseConcMarkSweepGC was deprecated in version 9.0 and will likely be removed in a future release.
[junit4] <<< JVM J1: EOF ----
[...truncated 262 lines...]
[junit4] JVM J1: stderr was not empty, see: C:\Users\jenkins\workspace\Lucene-Solr-master-Windows\lucene\build\codecs\test\temp\junit4-J1-20190122_052756_8659888958976590366353.syserr
[junit4] >>> JVM J1 emitted unexpected output (verbatim) ----
[junit4] OpenJDK 64-Bit Server VM warning: Option UseConcMarkSweepGC was deprecated in version 9.0 and will likely be removed in a future release.
[junit4] <<< JVM J1: EOF ----
[...truncated 3 lines...]
[junit4] JVM J0: stderr was not empty, see: C:\Users\jenkins\workspace\Lucene-Solr-master-Windows\lucene\build\codecs\test\temp\junit4-J0-20190122_052756_86516624108322599752009.syserr
[junit4] >>> JVM J0 emitted unexpected output (verbatim) ----
[junit4] OpenJDK 64-Bit Server VM warning: Option UseConcMarkSweepGC was deprecated in version 9.0 and will likely be removed in a future release.
[junit4] <<< JVM J0: EOF ----
[...truncated 235 lines...]
[junit4] JVM J0: stderr was not empty, see: C:\Users\jenkins\workspace\Lucene-Solr-master-Windows\lucene\build\demo\test\temp\junit4-J0-20190122_053018_1685406155049464374816.syserr
[junit4] >>> JVM J0 emitted unexpected output (verbatim) ----
[junit4] OpenJDK 64-Bit Server VM warning: Option UseConcMarkSweepGC was deprecated in version 9.0 and will likely be removed in a future release.
[junit4] <<< JVM J0: EOF ----
[junit4] JVM J1: stderr was not empty, see: C:\Users\jenkins\workspace\Lucene-Solr-master-Windows\lucene\build\demo\test\temp\junit4-J1-20190122_053018_1681273550968215143909.syserr
[junit4] >>> JVM J1 emitted unexpected output (verbatim) ----
[junit4] OpenJDK 64-Bit Server VM warning: Option UseConcMarkSweepGC was deprecated in version 9.0 and will likely be removed in a future release.
[junit4] <<< JVM J1: EOF ----
[...truncated 174 lines...]
[junit4] JVM J1: stderr was not empty, see: C:\Users\jenkins\workspace\Lucene-Solr-master-Windows\lucene\build\expressions\test\temp\junit4-J1-20190122_053023_62111336962673006578257.syserr
[junit4] >>> JVM J1 emitted unexpected output (verbatim) ----
[junit4] OpenJDK 64-Bit Server VM warning: Option UseConcMarkSweepGC was deprecated in version 9.0 and will likely be removed in a future release.
[junit4] <<< JVM J1: EOF ----
[...truncated 3 lines...]
[junit4] JVM J0: stderr was not empty, see: C:\Users\jenkins\workspace\Lucene-Solr-master-Windows\lucene\build\expressions\test\temp\junit4-J0-20190122_053023_62113932776698418795856.syserr
[junit4] >>> JVM J0 emitted unexpected output (verbatim) ----
[junit4] OpenJDK 64-Bit Server VM warning: Option UseConcMarkSweepGC was deprecated in version 9.0 and will likely be removed in a future release.
[junit4] <<< JVM J0: EOF ----
[...truncated 235 lines...]
[junit4] JVM J0: stderr was not empty, see: C:\Users\jenkins\workspace\Lucene-Solr-master-Windows\lucene\build\facet\test\temp\junit4-J0-20190122_053031_66813512633074932477640.syserr
[junit4] >>> JVM J0 emitted unexpected output (verbatim) ----
[junit4] OpenJDK 64-Bit Server VM warning: Option UseConcMarkSweepGC was deprecated in version 9.0 and will likely be removed in a future release.
[junit4] <<< JVM J0: EOF ----
[...truncated 3 lines...]
[junit4] JVM J1: stderr was not empty, see: C:\Users\jenkins\workspace\Lucene-Solr-master-Windows\lucene\build\facet\test\temp\junit4-J1-20190122_053031_66814302279277180701286.syserr
[junit4] >>> JVM J1 emitted unexpected output (verbatim) ----
[junit4] OpenJDK 64-Bit Server VM warning: Option UseConcMarkSweepGC was deprecated in version 9.0 and will likely be removed in a future release.
[junit4] <<< JVM J1: EOF ----
[...truncated 183 lines...]
[junit4] JVM J0: stderr was not empty, see: C:\Users\jenkins\workspace\Lucene-Solr-master-Windows\lucene\build\grouping\test\temp\junit4-J0-20190122_053107_3806487330185415351159.syserr
[junit4] >>> JVM J0 emitted unexpected output (verbatim) ----
[junit4] OpenJDK 64-Bit Server VM warning: Option UseConcMarkSweepGC was deprecated in version 9.0 and will likely be removed in a future release.
[junit4] <<< JVM J0: EOF ----
[...truncated 3 lines...]
[junit4] JVM J1: stderr was not empty, see: C:\Users\jenkins\workspace\Lucene-Solr-master-Windows\lucene\build\grouping\test\temp\junit4-J1-20190122_053107_3803745426309962484236.syserr
[junit4] >>> JVM J1 emitted unexpected output (verbatim) ----
[junit4] OpenJDK 64-Bit Server VM warning: Option UseConcMarkSweepGC was deprecated in version 9.0 and will likely be removed in a future release.
[junit4] <<< JVM J1: EOF ----
[...truncated 259 lines...]
[junit4] JVM J1: stderr was not empty, see: C:\Users\jenkins\workspace\Lucene-Solr-master-Windows\lucene\build\highlighter\test\temp\junit4-J1-20190122_053116_7905860272679001701254.syserr
[junit4] >>> JVM J1 emitted unexpected output (verbatim) ----
[junit4] OpenJDK 64-Bit Server VM warning: Option UseConcMarkSweepGC was deprecated in version 9.0 and will likely be removed in a future release.
[junit4] <<< JVM J1: EOF ----
[junit4] JVM J0: stderr was not empty, see: C:\Users\jenkins\workspace\Lucene-Solr-master-Windows\lucene\build\highlighter\test\temp\junit4-J0-20190122_053116_790286041196661391498.syserr
[junit4] >>> JVM J0 emitted unexpected output (verbatim) ----
[junit4] OpenJDK 64-Bit Server VM warning: Option UseConcMarkSweepGC was deprecated in version 9.0 and will likely be removed in a future release.
[junit4] <<< JVM J0: EOF ----
[...truncated 167 lines...]
[junit4] JVM J0: stderr was not empty, see: C:\Users\jenkins\workspace\Lucene-Solr-master-Windows\lucene\build\join\test\temp\junit4-J0-20190122_053140_09216981924883144490677.syserr
[junit4] >>> JVM J0 emitted unexpected output (verbatim) ----
[junit4] OpenJDK 64-Bit Server VM warning: Option UseConcMarkSweepGC was deprecated in version 9.0 and will likely be removed in a future release.
[junit4] <<< JVM J0: EOF ----
[...truncated 3 lines...]
[junit4] JVM J1: stderr was not empty, see: C:\Users\jenkins\workspace\Lucene-Solr-master-Windows\lucene\build\join\test\temp\junit4-J1-20190122_053140_0951597483117312317359.syserr
[junit4] >>> JVM J1 emitted unexpected output (verbatim) ----
[junit4] OpenJDK 64-Bit Server VM warning: Option UseConcMarkSweepGC was deprecated in version 9.0 and will likely be removed in a future release.
[junit4] <<< JVM J1: EOF ----
[...truncated 156 lines...]
[junit4] JVM J0: stderr was not empty, see: C:\Users\jenkins\workspace\Lucene-Solr-master-Windows\lucene\build\memory\test\temp\junit4-J0-20190122_053151_1938393696077680137856.syserr
[junit4] >>> JVM J0 emitted unexpected output (verbatim) ----
[junit4] OpenJDK 64-Bit Server VM warning: Option UseConcMarkSweepGC was deprecated in version 9.0 and will likely be removed in a future release.
[junit4] <<< JVM J0: EOF ----
[...truncated 3 lines...]
[junit4] JVM J1: stderr was not empty, see: C:\Users\jenkins\workspace\Lucene-Solr-master-Windows\lucene\build\memory\test\temp\junit4-J1-20190122_053151_1939553627841955248451.syserr
[junit4] >>> JVM J1 emitted unexpected output (verbatim) ----
[junit4] OpenJDK 64-Bit Server VM warning: Option UseConcMarkSweepGC was deprecated in version 9.0 and will likely be removed in a future release.
[junit4] <<< JVM J1: EOF ----
[...truncated 199 lines...]
[junit4] JVM J1: stderr was not empty, see: C:\Users\jenkins\workspace\Lucene-Solr-master-Windows\lucene\build\misc\test\temp\junit4-J1-20190122_053159_692389105115627835951.syserr
[junit4] >>> JVM J1 emitted unexpected output (verbatim) ----
[junit4] OpenJDK 64-Bit Server VM warning: Option UseConcMarkSweepGC was deprecated in version 9.0 and will likely be removed in a future release.
[junit4] <<< JVM J1: EOF ----
[...truncated 3 lines...]
[junit4] JVM J0: stderr was not empty, see: C:\Users\jenkins\workspace\Lucene-Solr-master-Windows\lucene\build\misc\test\temp\junit4-J0-20190122_053159_6922928938649467154291.syserr
[junit4] >>> JVM J0 emitted unexpected output (verbatim) ----
[junit4] OpenJDK 64-Bit Server VM warning: Option UseConcMarkSweepGC was deprecated in version 9.0 and will likely be removed in a future release.
[junit4] <<< JVM J0: EOF ----
[...truncated 307 lines...]
[junit4] JVM J0: stderr was not empty, see: C:\Users\jenkins\workspace\Lucene-Solr-master-Windows\lucene\build\queries\test\temp\junit4-J0-20190122_053219_68714119037629037840397.syserr
[junit4] >>> JVM J0 emitted unexpected output (verbatim) ----
[junit4] OpenJDK 64-Bit Server VM warning: Option UseConcMarkSweepGC was deprecated in version 9.0 and will likely be removed in a future release.
[junit4] <<< JVM J0: EOF ----
[...truncated 3 lines...]
[junit4] JVM J1: stderr was not empty, see: C:\Users\jenkins\workspace\Lucene-Solr-master-Windows\lucene\build\queries\test\temp\junit4-J1-20190122_053219_68712046771576485274793.syserr
[junit4] >>> JVM J1 emitted unexpected output (verbatim) ----
[junit4] OpenJDK 64-Bit Server VM warning: Option UseConcMarkSweepGC was deprecated in version 9.0 and will likely be removed in a future release.
[junit4] <<< JVM J1: EOF ----
[...truncated 232 lines...]
[junit4] JVM J1: stderr was not empty, see: C:\Users\jenkins\workspace\Lucene-Solr-master-Windows\lucene\build\queryparser\test\temp\junit4-J1-20190122_053231_8431525770358919386651.syserr
[junit4] >>> JVM J1 emitted unexpected output (verbatim) ----
[junit4] Suite: org.apache.lucene.queryparser.xml.TestCorePlusQueriesParser
[junit4] Completed [26/26] on J0 in 1.52s, 20 tests
[junit4]
[junit4] OpenJDK 64-Bit Server VM warning: Option UseConcMarkSweepGC was deprecated in version 9.0 and will likely be removed in a future release.
[junit4] <<< JVM J1: EOF ----
[junit4] JVM J0: stderr was not empty, see: C:\Users\jenkins\workspace\Lucene-Solr-master-Windows\lucene\build\queryparser\test\temp\junit4-J0-20190122_053231_84313285794878067183000.syserr
[junit4] >>> JVM J0 emitted unexpected output (verbatim) ----
[junit4] OpenJDK 64-Bit Server VM warning: Option UseConcMarkSweepGC was deprecated in version 9.0 and will likely be removed in a future release.
[junit4] <<< JVM J0: EOF ----
[...truncated 213 lines...]
[junit4] JVM J0: stderr was not empty, see: C:\Users\jenkins\workspace\Lucene-Solr-master-Windows\lucene\build\replicator\test\temp\junit4-J0-20190122_053247_0281071753078409682391.syserr
[junit4] >>> JVM J0 emitted unexpected output (verbatim) ----
[junit4] OpenJDK 64-Bit Server VM warning: Option UseConcMarkSweepGC was deprecated in version 9.0 and will likely be removed in a future release.
[junit4] <<< JVM J0: EOF ----
[...truncated 3 lines...]
[junit4] JVM J1: stderr was not empty, see: C:\Users\jenkins\workspace\Lucene-Solr-master-Windows\lucene\build\replicator\test\temp\junit4-J1-20190122_053247_0289592416630486006217.syserr
[junit4] >>> JVM J1 emitted unexpected output (verbatim) ----
[junit4] OpenJDK 64-Bit Server VM warning: Option UseConcMarkSweepGC was deprecated in version 9.0 and will likely be removed in a future release.
[junit4] <<< JVM J1: EOF ----
[...truncated 239 lines...]
[junit4] JVM J1: stderr was not empty, see: C:\Users\jenkins\workspace\Lucene-Solr-master-Windows\lucene\build\sandbox\test\temp\junit4-J1-20190122_053305_61017854251695684919015.syserr
[junit4] >>> JVM J1 emitted unexpected output (verbatim) ----
[junit4] OpenJDK 64-Bit Server VM warning: Option UseConcMarkSweepGC was deprecated in version 9.0 and will likely be removed in a future release.
[junit4] <<< JVM J1: EOF ----
[junit4] JVM J0: stderr was not empty, see: C:\Users\jenkins\workspace\Lucene-Solr-master-Windows\lucene\build\sandbox\test\temp\junit4-J0-20190122_053305_6095802116476593293701.syserr
[junit4] >>> JVM J0 emitted unexpected output (verbatim) ----
[junit4] OpenJDK 64-Bit Server VM warning: Option UseConcMarkSweepGC was deprecated in version 9.0 and will likely be removed in a future release.
[junit4] <<< JVM J0: EOF ----
[...truncated 300 lines...]
[junit4] JVM J0: stderr was not empty, see: C:\Users\jenkins\workspace\Lucene-Solr-master-Windows\lucene\build\spatial-extras\test\temp\junit4-J0-20190122_053338_00210227949450987160568.syserr
[junit4] >>> JVM J0 emitted unexpected output (verbatim) ----
[junit4] OpenJDK 64-Bit Server VM warning: Option UseConcMarkSweepGC was deprecated in version 9.0 and will likely be removed in a future release.
[junit4] <<< JVM J0: EOF ----
[...truncated 3 lines...]
[junit4] JVM J1: stderr was not empty, see: C:\Users\jenkins\workspace\Lucene-Solr-master-Windows\lucene\build\spatial-extras\test\temp\junit4-J1-20190122_053338_0027217320995109198094.syserr
[junit4] >>> JVM J1 emitted unexpected output (verbatim) ----
[junit4] OpenJDK 64-Bit Server VM warning: Option UseConcMarkSweepGC was deprecated in version 9.0 and will likely be removed in a future release.
[junit4] <<< JVM J1: EOF ----
[...truncated 193 lines...]
[junit4] JVM J1: stderr was not empty, see: C:\Users\jenkins\workspace\Lucene-Solr-master-Windows\lucene\build\spatial3d\test\temp\junit4-J1-20190122_053417_0535315541584838891490.syserr
[junit4] >>> JVM J1 emitted unexpected output (verbatim) ----
[junit4] OpenJDK 64-Bit Server VM warning: Option UseConcMarkSweepGC was deprecated in version 9.0 and will likely be removed in a future release.
[junit4] <<< JVM J1: EOF ----
[...truncated 5 lines...]
[junit4] JVM J0: stderr was not empty, see: C:\Users\jenkins\workspace\Lucene-Solr-master-Windows\lucene\build\spatial3d\test\temp\junit4-J0-20190122_053417_05316033964081805383027.syserr
[junit4] >>> JVM J0 emitted unexpected output (verbatim) ----
[junit4] OpenJDK 64-Bit Server VM warning: Option UseConcMarkSweepGC was deprecated in version 9.0 and will likely be removed in a future release.
[junit4] <<< JVM J0: EOF ----
[...truncated 152 lines...]
[junit4] JVM J0: stderr was not empty, see: C:\Users\jenkins\workspace\Lucene-Solr-master-Windows\lucene\build\spatial\test\temp\junit4-J0-20190122_053437_98811585007313173988503.syserr
[junit4] >>> JVM J0 emitted unexpected output (verbatim) ----
[junit4] OpenJDK 64-Bit Server VM warning: Option UseConcMarkSweepGC was deprecated in version 9.0 and will likely be removed in a future release.
[junit4] <<< JVM J0: EOF ----
[...truncated 256 lines...]
[junit4] JVM J1: stderr was not empty, see: C:\Users\jenkins\workspace\Lucene-Solr-master-Windows\lucene\build\suggest\test\temp\junit4-J1-20190122_053442_49616165841684120457889.syserr
[junit4] >>> JVM J1 emitted unexpected output (verbatim) ----
[junit4] OpenJDK 64-Bit Server VM warning: Option UseConcMarkSweepGC was deprecated in version 9.0 and will likely be removed in a future release.
[junit4] <<< JVM J1: EOF ----
[...truncated 3 lines...]
[junit4] JVM J0: stderr was not empty, see: C:\Users\jenkins\workspace\Lucene-Solr-master-Windows\lucene\build\suggest\test\temp\junit4-J0-20190122_053442_49614853618205849995191.syserr
[junit4] >>> JVM J0 emitted unexpected output (verbatim) ----
[junit4] OpenJDK 64-Bit Server VM warning: Option UseConcMarkSweepGC was deprecated in version 9.0 and will likely be removed in a future release.
[junit4] <<< JVM J0: EOF ----
[...truncated 3356 lines...]
[junit4] Suite: org.apache.solr.cloud.ChaosMonkeySafeLeaderWithPullReplicasTest
[junit4] 2> 1903724 INFO (SUITE-ChaosMonkeySafeLeaderWithPullReplicasTest-seed#[5BBB19AABF618A34]-worker) [ ] o.a.s.SolrTestCaseJ4 SecureRandom sanity checks: test.solr.allowed.securerandom=null & java.security.egd=file:/dev/./urandom
[junit4] 2> Creating dataDir: C:\Users\jenkins\workspace\Lucene-Solr-master-Windows\solr\build\solr-core\test\J1\temp\solr.cloud.ChaosMonkeySafeLeaderWithPullReplicasTest_5BBB19AABF618A34-001\init-core-data-001
[junit4] 2> 1903725 WARN (SUITE-ChaosMonkeySafeLeaderWithPullReplicasTest-seed#[5BBB19AABF618A34]-worker) [ ] o.a.s.SolrTestCaseJ4 startTrackingSearchers: numOpens=9 numCloses=9
[junit4] 2> 1903726 INFO (SUITE-ChaosMonkeySafeLeaderWithPullReplicasTest-seed#[5BBB19AABF618A34]-worker) [ ] o.a.s.SolrTestCaseJ4 Using TrieFields (NUMERIC_POINTS_SYSPROP=false) w/NUMERIC_DOCVALUES_SYSPROP=false
[junit4] 2> 1903727 INFO (SUITE-ChaosMonkeySafeLeaderWithPullReplicasTest-seed#[5BBB19AABF618A34]-worker) [ ] o.a.s.SolrTestCaseJ4 Randomized ssl (false) and clientAuth (true) via: @org.apache.solr.util.RandomizeSSL(reason="", value=0.0/0.0, ssl=0.0/0.0, clientAuth=0.0/0.0)
[junit4] 2> 1903727 INFO (SUITE-ChaosMonkeySafeLeaderWithPullReplicasTest-seed#[5BBB19AABF618A34]-worker) [ ] o.a.s.BaseDistributedSearchTestCase Setting hostContext system property: /wj_x/x
[junit4] 2> 1903727 INFO (TEST-ChaosMonkeySafeLeaderWithPullReplicasTest.test-seed#[5BBB19AABF618A34]) [ ] o.a.s.c.ChaosMonkeySafeLeaderWithPullReplicasTest Starting ChaosMonkey test with 2 shards and 4 nodes
[junit4] 2> 1903730 INFO (TEST-ChaosMonkeySafeLeaderWithPullReplicasTest.test-seed#[5BBB19AABF618A34]) [ ] o.a.s.c.ZkTestServer STARTING ZK TEST SERVER
[junit4] 2> 1903731 INFO (ZkTestServer Run Thread) [ ] o.a.s.c.ZkTestServer client port:0.0.0.0/0.0.0.0:0
[junit4] 2> 1903731 INFO (ZkTestServer Run Thread) [ ] o.a.s.c.ZkTestServer Starting server
[junit4] 2> 1903829 INFO (TEST-ChaosMonkeySafeLeaderWithPullReplicasTest.test-seed#[5BBB19AABF618A34]) [ ] o.a.s.c.ZkTestServer start zk server on port:61597
[junit4] 2> 1903829 INFO (TEST-ChaosMonkeySafeLeaderWithPullReplicasTest.test-seed#[5BBB19AABF618A34]) [ ] o.a.s.c.ZkTestServer parse host and port list: 127.0.0.1:61597
[junit4] 2> 1903829 INFO (TEST-ChaosMonkeySafeLeaderWithPullReplicasTest.test-seed#[5BBB19AABF618A34]) [ ] o.a.s.c.ZkTestServer connecting to 127.0.0.1 61597
[junit4] 2> 1903835 INFO (zkConnectionManagerCallback-12971-thread-1) [ ] o.a.s.c.c.ConnectionManager zkClient has connected
[junit4] 2> 1903839 INFO (zkConnectionManagerCallback-12973-thread-1) [ ] o.a.s.c.c.ConnectionManager zkClient has connected
[junit4] 2> 1903840 INFO (TEST-ChaosMonkeySafeLeaderWithPullReplicasTest.test-seed#[5BBB19AABF618A34]) [ ] o.a.s.c.ZkTestServer put C:\Users\jenkins\workspace\Lucene-Solr-master-Windows\solr\core\src\test-files\solr\collection1\conf\solrconfig-tlog.xml to /configs/conf1/solrconfig.xml
[junit4] 2> 1903841 INFO (TEST-ChaosMonkeySafeLeaderWithPullReplicasTest.test-seed#[5BBB19AABF618A34]) [ ] o.a.s.c.ZkTestServer put C:\Users\jenkins\workspace\Lucene-Solr-master-Windows\solr\core\src\test-files\solr\collection1\conf\schema15.xml to /configs/conf1/schema.xml
[junit4] 2> 1903843 INFO (TEST-ChaosMonkeySafeLeaderWithPullReplicasTest.test-seed#[5BBB19AABF618A34]) [ ] o.a.s.c.ZkTestServer put C:\Users\jenkins\workspace\Lucene-Solr-master-Windows\solr\core\src\test-files\solr\collection1\conf\solrconfig.snippet.randomindexconfig.xml to /configs/conf1/solrconfig.snippet.randomindexconfig.xml
[junit4] 2> 1903845 INFO (TEST-ChaosMonkeySafeLeaderWithPullReplicasTest.test-seed#[5BBB19AABF618A34]) [ ] o.a.s.c.ZkTestServer put C:\Users\jenkins\workspace\Lucene-Solr-master-Windows\solr\core\src\test-files\solr\collection1\conf\stopwords.txt to /configs/conf1/stopwords.txt
[junit4] 2> 1903846 INFO (TEST-ChaosMonkeySafeLeaderWithPullReplicasTest.test-seed#[5BBB19AABF618A34]) [ ] o.a.s.c.ZkTestServer put C:\Users\jenkins\workspace\Lucene-Solr-master-Windows\solr\core\src\test-files\solr\collection1\conf\protwords.txt to /configs/conf1/protwords.txt
[junit4] 2> 1903847 INFO (TEST-ChaosMonkeySafeLeaderWithPullReplicasTest.test-seed#[5BBB19AABF618A34]) [ ] o.a.s.c.ZkTestServer put C:\Users\jenkins\workspace\Lucene-Solr-master-Windows\solr\core\src\test-files\solr\collection1\conf\currency.xml to /configs/conf1/currency.xml
[junit4] 2> 1903848 INFO (TEST-ChaosMonkeySafeLeaderWithPullReplicasTest.test-seed#[5BBB19AABF618A34]) [ ] o.a.s.c.ZkTestServer put C:\Users\jenkins\workspace\Lucene-Solr-master-Windows\solr\core\src\test-files\solr\collection1\conf\enumsConfig.xml to /configs/conf1/enumsConfig.xml
[junit4] 2> 1903850 INFO (TEST-ChaosMonkeySafeLeaderWithPullReplicasTest.test-seed#[5BBB19AABF618A34]) [ ] o.a.s.c.ZkTestServer put C:\Users\jenkins\workspace\Lucene-Solr-master-Windows\solr\core\src\test-files\solr\collection1\conf\open-exchange-rates.json to /configs/conf1/open-exchange-rates.json
[junit4] 2> 1903851 INFO (TEST-ChaosMonkeySafeLeaderWithPullReplicasTest.test-seed#[5BBB19AABF618A34]) [ ] o.a.s.c.ZkTestServer put C:\Users\jenkins\workspace\Lucene-Solr-master-Windows\solr\core\src\test-files\solr\collection1\conf\mapping-ISOLatin1Accent.txt to /configs/conf1/mapping-ISOLatin1Accent.txt
[junit4] 2> 1903852 INFO (TEST-ChaosMonkeySafeLeaderWithPullReplicasTest.test-seed#[5BBB19AABF618A34]) [ ] o.a.s.c.ZkTestServer put C:\Users\jenkins\workspace\Lucene-Solr-master-Windows\solr\core\src\test-files\solr\collection1\conf\old_synonyms.txt to /configs/conf1/old_synonyms.txt
[junit4] 2> 1903853 INFO (TEST-ChaosMonkeySafeLeaderWithPullReplicasTest.test-seed#[5BBB19AABF618A34]) [ ] o.a.s.c.ZkTestServer put C:\Users\jenkins\workspace\Lucene-Solr-master-Windows\solr\core\src\test-files\solr\collection1\conf\synonyms.txt to /configs/conf1/synonyms.txt
[junit4] 2> 1903854 INFO (TEST-ChaosMonkeySafeLeaderWithPullReplicasTest.test-seed#[5BBB19AABF618A34]) [ ] o.a.s.c.AbstractFullDistribZkTestBase Will use NRT replicas unless explicitly asked otherwise
[junit4] 2> 1904263 WARN (TEST-ChaosMonkeySafeLeaderWithPullReplicasTest.test-seed#[5BBB19AABF618A34]) [ ] o.e.j.s.AbstractConnector Ignoring deprecated socket close linger time
[junit4] 2> 1904264 INFO (TEST-ChaosMonkeySafeLeaderWithPullReplicasTest.test-seed#[5BBB19AABF618A34]) [ ] o.a.s.c.s.e.JettySolrRunner Start Jetty (original configured port=0)
[junit4] 2> 1904264 INFO (TEST-ChaosMonkeySafeLeaderWithPullReplicasTest.test-seed#[5BBB19AABF618A34]) [ ] o.a.s.c.s.e.JettySolrRunner Trying to start Jetty on port 0 try number 1 ...
[junit4] 2> 1904264 INFO (TEST-ChaosMonkeySafeLeaderWithPullReplicasTest.test-seed#[5BBB19AABF618A34]) [ ] o.e.j.s.Server jetty-9.4.14.v20181114; built: 2018-11-14T21:20:31.478Z; git: c4550056e785fb5665914545889f21dc136ad9e6; jvm 12-ea+23
[junit4] 2> 1904264 INFO (TEST-ChaosMonkeySafeLeaderWithPullReplicasTest.test-seed#[5BBB19AABF618A34]) [ ] o.e.j.s.session DefaultSessionIdManager workerName=node0
[junit4] 2> 1904264 INFO (TEST-ChaosMonkeySafeLeaderWithPullReplicasTest.test-seed#[5BBB19AABF618A34]) [ ] o.e.j.s.session No SessionScavenger set, using defaults
[junit4] 2> 1904264 INFO (TEST-ChaosMonkeySafeLeaderWithPullReplicasTest.test-seed#[5BBB19AABF618A34]) [ ] o.e.j.s.session node0 Scavenging every 660000ms
[junit4] 2> 1904266 INFO (TEST-ChaosMonkeySafeLeaderWithPullReplicasTest.test-seed#[5BBB19AABF618A34]) [ ] o.e.j.s.h.ContextHandler Started o.e.j.s.ServletContextHandler@312a344{/wj_x/x,null,AVAILABLE}
[junit4] 2> 1904267 INFO (TEST-ChaosMonkeySafeLeaderWithPullReplicasTest.test-seed#[5BBB19AABF618A34]) [ ] o.e.j.s.AbstractConnector Started ServerConnector@76b9ce81{HTTP/1.1,[http/1.1, h2c]}{127.0.0.1:61605}
[junit4] 2> 1904267 INFO (TEST-ChaosMonkeySafeLeaderWithPullReplicasTest.test-seed#[5BBB19AABF618A34]) [ ] o.e.j.s.Server Started @1884524ms
[junit4] 2> 1904267 INFO (TEST-ChaosMonkeySafeLeaderWithPullReplicasTest.test-seed#[5BBB19AABF618A34]) [ ] o.a.s.c.s.e.JettySolrRunner Jetty properties: {hostContext=/wj_x/x, solr.data.dir=C:\Users\jenkins\workspace\Lucene-Solr-master-Windows\solr\build\solr-core\test\J1\temp\solr.cloud.ChaosMonkeySafeLeaderWithPullReplicasTest_5BBB19AABF618A34-001\tempDir-001/control/data, hostPort=61605, coreRootDirectory=C:\Users\jenkins\workspace\Lucene-Solr-master-Windows\solr\build\solr-core\test\J1\temp\solr.cloud.ChaosMonkeySafeLeaderWithPullReplicasTest_5BBB19AABF618A34-001\control-001\cores, replicaType=NRT}
[junit4] 2> 1904267 ERROR (TEST-ChaosMonkeySafeLeaderWithPullReplicasTest.test-seed#[5BBB19AABF618A34]) [ ] o.a.s.u.StartupLoggingUtils Missing Java Option solr.log.dir. Logging may be missing or incomplete.
[junit4] 2> 1904267 INFO (TEST-ChaosMonkeySafeLeaderWithPullReplicasTest.test-seed#[5BBB19AABF618A34]) [ ] o.a.s.s.SolrDispatchFilter Using logger factory org.apache.logging.slf4j.Log4jLoggerFactory
[junit4] 2> 1904268 INFO (TEST-ChaosMonkeySafeLeaderWithPullReplicasTest.test-seed#[5BBB19AABF618A34]) [ ] o.a.s.s.SolrDispatchFilter ___ _ Welcome to Apache Solr™ version 9.0.0
[junit4] 2> 1904268 INFO (TEST-ChaosMonkeySafeLeaderWithPullReplicasTest.test-seed#[5BBB19AABF618A34]) [ ] o.a.s.s.SolrDispatchFilter / __| ___| |_ _ Starting in cloud mode on port null
[junit4] 2> 1904268 INFO (TEST-ChaosMonkeySafeLeaderWithPullReplicasTest.test-seed#[5BBB19AABF618A34]) [ ] o.a.s.s.SolrDispatchFilter \__ \/ _ \ | '_| Install dir: null
[junit4] 2> 1904268 INFO (TEST-ChaosMonkeySafeLeaderWithPullReplicasTest.test-seed#[5BBB19AABF618A34]) [ ] o.a.s.s.SolrDispatchFilter |___/\___/_|_| Start time: 2019-01-22T06:07:59.714388800Z
[junit4] 2> 1904271 INFO (zkConnectionManagerCallback-12975-thread-1) [ ] o.a.s.c.c.ConnectionManager zkClient has connected
[junit4] 2> 1904272 INFO (TEST-ChaosMonkeySafeLeaderWithPullReplicasTest.test-seed#[5BBB19AABF618A34]) [ ] o.a.s.s.SolrDispatchFilter Loading solr.xml from SolrHome (not found in ZooKeeper)
[junit4] 2> 1904272 INFO (TEST-ChaosMonkeySafeLeaderWithPullReplicasTest.test-seed#[5BBB19AABF618A34]) [ ] o.a.s.c.SolrXmlConfig Loading container configuration from C:\Users\jenkins\workspace\Lucene-Solr-master-Windows\solr\build\solr-core\test\J1\temp\solr.cloud.ChaosMonkeySafeLeaderWithPullReplicasTest_5BBB19AABF618A34-001\control-001\solr.xml
[junit4] 2> 1904275 INFO (TEST-ChaosMonkeySafeLeaderWithPullReplicasTest.test-seed#[5BBB19AABF618A34]) [ ] o.a.s.c.SolrXmlConfig Configuration parameter autoReplicaFailoverWorkLoopDelay is ignored
[junit4] 2> 1904275 INFO (TEST-ChaosMonkeySafeLeaderWithPullReplicasTest.test-seed#[5BBB19AABF618A34]) [ ] o.a.s.c.SolrXmlConfig Configuration parameter autoReplicaFailoverBadNodeExpiration is ignored
[junit4] 2> 1904276 INFO (TEST-ChaosMonkeySafeLeaderWithPullReplicasTest.test-seed#[5BBB19AABF618A34]) [ ] o.a.s.c.SolrXmlConfig MBean server found: com.sun.jmx.mbeanserver.JmxMBeanServer@24cf2eaf, but no JMX reporters were configured - adding default JMX reporter.
[junit4] 2> 1904402 INFO (TEST-ChaosMonkeySafeLeaderWithPullReplicasTest.test-seed#[5BBB19AABF618A34]) [ ] o.a.s.h.c.HttpShardHandlerFactory Host whitelist initialized: WhitelistHostChecker [whitelistHosts=null, whitelistHostCheckingEnabled=false]
[junit4] 2> 1904406 WARN (TEST-ChaosMonkeySafeLeaderWithPullReplicasTest.test-seed#[5BBB19AABF618A34]) [ ] o.e.j.u.s.S.config No Client EndPointIdentificationAlgorithm configured for SslContextFactory@40dab021[provider=null,keyStore=null,trustStore=null]
[junit4] 2> 1904410 WARN (TEST-ChaosMonkeySafeLeaderWithPullReplicasTest.test-seed#[5BBB19AABF618A34]) [ ] o.e.j.u.s.S.config No Client EndPointIdentificationAlgorithm configured for SslContextFactory@798cc935[provider=null,keyStore=null,trustStore=null]
[junit4] 2> 1904411 INFO (TEST-ChaosMonkeySafeLeaderWithPullReplicasTest.test-seed#[5BBB19AABF618A34]) [ ] o.a.s.c.ZkContainer Zookeeper client=127.0.0.1:61597/solr
[junit4] 2> 1904414 INFO (zkConnectionManagerCallback-12981-thread-1) [ ] o.a.s.c.c.ConnectionManager zkClient has connected
[junit4] 2> 1904415 WARN (NIOServerCxn.Factory:0.0.0.0/0.0.0.0:0) [ ] o.a.z.s.NIOServerCnxn Unable to read additional data from client sessionid 0x1003e6ed13f0003, likely client has closed socket
[junit4] 2> 1904419 INFO (zkConnectionManagerCallback-12983-thread-1) [ ] o.a.s.c.c.ConnectionManager zkClient has connected
[junit4] 2> 1904495 INFO (TEST-ChaosMonkeySafeLeaderWithPullReplicasTest.test-seed#[5BBB19AABF618A34]) [n:127.0.0.1:61605_wj_x%2Fx ] o.a.s.c.OverseerElectionContext I am going to be the leader 127.0.0.1:61605_wj_x%2Fx
[junit4] 2> 1904496 INFO (TEST-ChaosMonkeySafeLeaderWithPullReplicasTest.test-seed#[5BBB19AABF618A34]) [n:127.0.0.1:61605_wj_x%2Fx ] o.a.s.c.Overseer Overseer (id=72126239715819524-127.0.0.1:61605_wj_x%2Fx-n_0000000000) starting
[junit4] 2> 1904502 INFO (zkConnectionManagerCallback-12990-thread-1) [ ] o.a.s.c.c.ConnectionManager zkClient has connected
[junit4] 2> 1904504 INFO (TEST-ChaosMonkeySafeLeaderWithPullReplicasTest.test-seed#[5BBB19AABF618A34]) [n:127.0.0.1:61605_wj_x%2Fx ] o.a.s.c.s.i.ZkClientClusterStateProvider Cluster at 127.0.0.1:61597/solr ready
[junit4] 2> 1904505 INFO (OverseerStateUpdate-72126239715819524-127.0.0.1:61605_wj_x%2Fx-n_0000000000) [n:127.0.0.1:61605_wj_x%2Fx ] o.a.s.c.Overseer Starting to work on the main queue : 127.0.0.1:61605_wj_x%2Fx
[junit4] 2> 1904506 INFO (TEST-ChaosMonkeySafeLeaderWithPullReplicasTest.test-seed#[5BBB19AABF618A34]) [n:127.0.0.1:61605_wj_x%2Fx ] o.a.s.c.ZkController Register node as live in ZooKeeper:/live_nodes/127.0.0.1:61605_wj_x%2Fx
[junit4] 2> 1904514 INFO (zkCallback-12989-thread-1) [ ] o.a.s.c.c.ZkStateReader Updated live nodes from ZooKeeper... (0) -> (1)
[junit4] 2> 1904514 INFO (zkCallback-12982-thread-1) [ ] o.a.s.c.c.ZkStateReader Updated live nodes from ZooKeeper... (0) -> (1)
[junit4] 2> 1904539 INFO (TEST-ChaosMonkeySafeLeaderWithPullReplicasTest.test-seed#[5BBB19AABF618A34]) [n:127.0.0.1:61605_wj_x%2Fx ] o.a.s.h.a.MetricsHistoryHandler No .system collection, keeping metrics history in memory.
[junit4] 2> 1904573 INFO (TEST-ChaosMonkeySafeLeaderWithPullReplicasTest.test-seed#[5BBB19AABF618A34]) [n:127.0.0.1:61605_wj_x%2Fx ] o.a.s.m.r.SolrJmxReporter JMX monitoring for 'solr.node' (registry 'solr.node') enabled at server: com.sun.jmx.mbeanserver.JmxMBeanServer@24cf2eaf
[junit4] 2> 1904589 INFO (TEST-ChaosMonkeySafeLeaderWithPullReplicasTest.test-seed#[5BBB19AABF618A34]) [n:127.0.0.1:61605_wj_x%2Fx ] o.a.s.m.r.SolrJmxReporter JMX monitoring for 'solr.jvm' (registry 'solr.jvm') enabled at server: com.sun.jmx.mbeanserver.JmxMBeanServer@24cf2eaf
[junit4] 2> 1904589 INFO (TEST-ChaosMonkeySafeLeaderWithPullReplicasTest.test-seed#[5BBB19AABF618A34]) [n:127.0.0.1:61605_wj_x%2Fx ] o.a.s.m.r.SolrJmxReporter JMX monitoring for 'solr.jetty' (registry 'solr.jetty') enabled at server: com.sun.jmx.mbeanserver.JmxMBeanServer@24cf2eaf
[junit4] 2> 1904592 INFO (TEST-ChaosMonkeySafeLeaderWithPullReplicasTest.test-seed#[5BBB19AABF618A34]) [n:127.0.0.1:61605_wj_x%2Fx ] o.a.s.c.CorePropertiesLocator Found 0 core definitions underneath C:\Users\jenkins\workspace\Lucene-Solr-master-Windows\solr\build\solr-core\test\J1\temp\solr.cloud.ChaosMonkeySafeLeaderWithPullReplicasTest_5BBB19AABF618A34-001\control-001\cores
[junit4] 2> 1904623 INFO (zkConnectionManagerCallback-12996-thread-1) [ ] o.a.s.c.c.ConnectionManager zkClient has connected
[junit4] 2> 1904625 INFO (TEST-ChaosMonkeySafeLeaderWithPullReplicasTest.test-seed#[5BBB19AABF618A34]) [ ] o.a.s.c.c.ZkStateReader Updated live nodes from ZooKeeper... (0) -> (1)
[junit4] 2> 1904625 INFO (TEST-ChaosMonkeySafeLeaderWithPullReplicasTest.test-seed#[5BBB19AABF618A34]) [ ] o.a.s.c.s.i.ZkClientClusterStateProvider Cluster at 127.0.0.1:61597/solr ready
[junit4] 2> 1904626 INFO (qtp2001109944-36732) [n:127.0.0.1:61605_wj_x%2Fx ] o.a.s.h.a.CollectionsHandler Invoked Collection Action :create with params collection.configName=conf1&name=control_collection&nrtReplicas=1&action=CREATE&numShards=1&createNodeSet=127.0.0.1:61605_wj_x%252Fx&wt=javabin&version=2 and sendToOCPQueue=true
[junit4] 2> 1904630 INFO (OverseerThreadFactory-11753-thread-1-processing-n:127.0.0.1:61605_wj_x%2Fx) [n:127.0.0.1:61605_wj_x%2Fx ] o.a.s.c.a.c.CreateCollectionCmd Create collection control_collection
[junit4] 2> 1904737 INFO (qtp2001109944-36734) [n:127.0.0.1:61605_wj_x%2Fx ] o.a.s.s.HttpSolrCall [admin] webapp=null path=/admin/metrics params={prefix=CONTAINER.fs.usableSpace,CONTAINER.fs.totalSpace,CORE.coreName&wt=javabin&version=2&group=solr.node,solr.core} status=0 QTime=3
[junit4] 2> 1904742 INFO (qtp2001109944-36735) [n:127.0.0.1:61605_wj_x%2Fx ] o.a.s.s.HttpSolrCall [admin] webapp=null path=/admin/metrics params={prefix=CONTAINER.fs.usableSpace,CONTAINER.fs.totalSpace,CORE.coreName&wt=javabin&version=2&group=solr.node,solr.core} status=0 QTime=4
[junit4] 2> 1904744 INFO (qtp2001109944-36736) [n:127.0.0.1:61605_wj_x%2Fx ] o.a.s.s.HttpSolrCall [admin] webapp=null path=/admin/metrics params={prefix=CONTAINER.fs.usableSpace,CONTAINER.fs.totalSpace,CORE.coreName&wt=javabin&version=2&group=solr.node,solr.core} status=0 QTime=2
[junit4] 2> 1904747 INFO (qtp2001109944-36731) [n:127.0.0.1:61605_wj_x%2Fx ] o.a.s.s.HttpSolrCall [admin] webapp=null path=/admin/metrics params={prefix=CONTAINER.fs.usableSpace,CONTAINER.fs.totalSpace,CORE.coreName&wt=javabin&version=2&group=solr.node,solr.core} status=0 QTime=2
[junit4] 2> 1904749 INFO (qtp2001109944-36733) [n:127.0.0.1:61605_wj_x%2Fx ] o.a.s.s.HttpSolrCall [admin] webapp=null path=/admin/metrics params={prefix=CONTAINER.fs.usableSpace,CONTAINER.fs.totalSpace,CORE.coreName&wt=javabin&version=2&group=solr.node,solr.core} status=0 QTime=2
[junit4] 2> 1904752 INFO (qtp2001109944-36734) [n:127.0.0.1:61605_wj_x%2Fx x:control_collection_shard1_replica_n1] o.a.s.h.a.CoreAdminOperation core create command qt=/admin/cores&collection.configName=conf1&newCollection=true&name=control_collection_shard1_replica_n1&action=CREATE&numShards=1&collection=control_collection&shard=shard1&wt=javabin&version=2&replicaType=NRT
[junit4] 2> 1904753 INFO (qtp2001109944-36734) [n:127.0.0.1:61605_wj_x%2Fx x:control_collection_shard1_replica_n1] o.a.s.c.TransientSolrCoreCacheDefault Allocating transient cache for 4 transient cores
[junit4] 2> 1905767 INFO (qtp2001109944-36734) [n:127.0.0.1:61605_wj_x%2Fx c:control_collection s:shard1 x:control_collection_shard1_replica_n1] o.a.s.c.SolrConfig Using Lucene MatchVersion: 9.0.0
[junit4] 2> 1905781 INFO (qtp2001109944-36734) [n:127.0.0.1:61605_wj_x%2Fx c:control_collection s:shard1 x:control_collection_shard1_replica_n1] o.a.s.s.IndexSchema [control_collection_shard1_replica_n1] Schema name=test
[junit4] 2> 1905824 INFO (qtp2001109944-36734) [n:127.0.0.1:61605_wj_x%2Fx c:control_collection s:shard1 x:control_collection_shard1_replica_n1] o.a.s.s.IndexSchema Loaded schema test/1.6 with uniqueid field id
[junit4] 2> 1905840 INFO (qtp2001109944-36734) [n:127.0.0.1:61605_wj_x%2Fx c:control_collection s:shard1 x:control_collection_shard1_replica_n1] o.a.s.c.CoreContainer Creating SolrCore 'control_collection_shard1_replica_n1' using configuration from collection control_collection, trusted=true
[junit4] 2> 1905841 INFO (qtp2001109944-36734) [n:127.0.0.1:61605_wj_x%2Fx c:control_collection s:shard1 x:control_collection_shard1_replica_n1] o.a.s.m.r.SolrJmxReporter JMX monitoring for 'solr.core.control_collection.shard1.replica_n1' (registry 'solr.core.control_collection.shard1.replica_n1') enabled at server: com.sun.jmx.mbeanserver.JmxMBeanServer@24cf2eaf
[junit4] 2> 1905841 INFO (qtp2001109944-36734) [n:127.0.0.1:61605_wj_x%2Fx c:control_collection s:shard1 x:control_collection_shard1_replica_n1] o.a.s.c.SolrCore [[control_collection_shard1_replica_n1] ] Opening new SolrCore at [C:\Users\jenkins\workspace\Lucene-Solr-master-Windows\solr\build\solr-core\test\J1\temp\solr.cloud.ChaosMonkeySafeLeaderWithPullReplicasTest_5BBB19AABF618A34-001\control-001\cores\control_collection_shard1_replica_n1], dataDir=[C:\Users\jenkins\workspace\Lucene-Solr-master-Windows\solr\build\solr-core\test\J1\temp\solr.cloud.ChaosMonkeySafeLeaderWithPullReplicasTest_5BBB19AABF618A34-001\control-001\cores\control_collection_shard1_replica_n1\data\]
[junit4] 2> 1905847 INFO (qtp2001109944-36734) [n:127.0.0.1:61605_wj_x%2Fx c:control_collection s:shard1 x:control_collection_shard1_replica_n1] o.a.s.u.RandomMergePolicy RandomMergePolicy wrapping class org.apache.lucene.index.TieredMergePolicy: [TieredMergePolicy: maxMergeAtOnce=14, maxMergeAtOnceExplicit=40, maxMergedSegmentMB=14.9736328125, floorSegmentMB=0.3642578125, forceMergeDeletesPctAllowed=11.21921855162109, segmentsPerTier=19.0, maxCFSSegmentSizeMB=8.796093022207999E12, noCFSRatio=1.0, deletesPctAllowed=21.84833107760627
[junit4] 2> 1905852 WARN (qtp2001109944-36734) [n:127.0.0.1:61605_wj_x%2Fx c:control_collection s:shard1 x:control_collection_shard1_replica_n1] o.a.s.c.RequestHandlers INVALID paramSet a in requestHandler {type = requestHandler,name = /dump,class = DumpRequestHandler,attributes = {initParams=a, name=/dump, class=DumpRequestHandler},args = {defaults={a=A,b=B}}}
[junit4] 2> 1905929 INFO (qtp2001109944-36734) [n:127.0.0.1:61605_wj_x%2Fx c:control_collection s:shard1 x:control_collection_shard1_replica_n1] o.a.s.u.UpdateHandler Using UpdateLog implementation: org.apache.solr.update.UpdateLog
[junit4] 2> 1905929 INFO (qtp2001109944-36734) [n:127.0.0.1:61605_wj_x%2Fx c:control_collection s:shard1 x:control_collection_shard1_replica_n1] o.a.s.u.UpdateLog Initializing UpdateLog: dataDir= defaultSyncLevel=FLUSH numRecordsToKeep=100 maxNumLogsToKeep=10 numVersionBuckets=65536
[junit4] 2> 1905931 INFO (qtp2001109944-36734) [n:127.0.0.1:61605_wj_x%2Fx c:control_collection s:shard1 x:control_collection_shard1_replica_n1] o.a.s.u.CommitTracker Hard AutoCommit: if uncommitted for 15000ms;
[junit4] 2> 1905931 INFO (qtp2001109944-36734) [n:127.0.0.1:61605_wj_x%2Fx c:control_collection s:shard1 x:control_collection_shard1_replica_n1] o.a.s.u.CommitTracker Soft AutoCommit: disabled
[junit4] 2> 1905934 INFO (qtp2001109944-36734) [n:127.0.0.1:61605_wj_x%2Fx c:control_collection s:shard1 x:control_collection_shard1_replica_n1] o.a.s.u.RandomMergePolicy RandomMergePolicy wrapping class org.apache.lucene.index.TieredMergePolicy: [TieredMergePolicy: maxMergeAtOnce=22, maxMergeAtOnceExplicit=33, maxMergedSegmentMB=68.99609375, floorSegmentMB=2.056640625, forceMergeDeletesPctAllowed=23.199813130344207, segmentsPerTier=30.0, maxCFSSegmentSizeMB=8.796093022207999E12, noCFSRatio=0.0, deletesPctAllowed=31.02176550783763
[junit4] 2> 1905935 INFO (qtp2001109944-36734) [n:127.0.0.1:61605_wj_x%2Fx c:control_collection s:shard1 x:control_collection_shard1_replica_n1] o.a.s.s.SolrIndexSearcher Opening [Searcher@1440da1f[control_collection_shard1_replica_n1] main]
[junit4] 2> 1905936 INFO (qtp2001109944-36734) [n:127.0.0.1:61605_wj_x%2Fx c:control_collection s:shard1 x:control_collection_shard1_replica_n1] o.a.s.r.ManagedResourceStorage Configured ZooKeeperStorageIO with znodeBase: /configs/conf1
[junit4] 2> 1905936 INFO (qtp2001109944-36734) [n:127.0.0.1:61605_wj_x%2Fx c:control_collection s:shard1 x:control_collection_shard1_replica_n1] o.a.s.r.ManagedResourceStorage Loaded null at path _rest_managed.json using ZooKeeperStorageIO:path=/configs/conf1
[junit4] 2> 1905937 INFO (qtp2001109944-36734) [n:127.0.0.1:61605_wj_x%2Fx c:control_collection s:shard1 x:control_collection_shard1_replica_n1] o.a.s.h.ReplicationHandler Commits will be reserved for 10000ms.
[junit4] 2> 1905937 INFO (qtp2001109944-36734) [n:127.0.0.1:61605_wj_x%2Fx c:control_collection s:shard1 x:control_collection_shard1_replica_n1] o.a.s.u.UpdateLog Could not find max version in index or recent updates, using new clock 1623339597963460608
[junit4] 2> 1905940 INFO (searcherExecutor-11758-thread-1-processing-n:127.0.0.1:61605_wj_x%2Fx x:control_collection_shard1_replica_n1 c:control_collection s:shard1) [n:127.0.0.1:61605_wj_x%2Fx c:control_collection s:shard1 x:control_collection_shard1_replica_n1] o.a.s.c.SolrCore [control_collection_shard1_replica_n1] Registered new searcher Searcher@1440da1f[control_collection_shard1_replica_n1] main{ExitableDirectoryReader(UninvertingDirectoryReader())}
[junit4] 2> 1905943 INFO (qtp2001109944-36734) [n:127.0.0.1:61605_wj_x%2Fx c:control_collection s:shard1 x:control_collection_shard1_replica_n1] o.a.s.c.ZkShardTerms Successful update of terms at /collections/control_collection/terms/shard1 to Terms{values={core_node2=0}, version=0}
[junit4] 2> 1905943 INFO (qtp2001109944-36734) [n:127.0.0.1:61605_wj_x%2Fx c:control_collection s:shard1 x:control_collection_shard1_replica_n1] o.a.s.c.ShardLeaderElectionContextBase make sure parent is created /collections/control_collection/leaders/shard1
[junit4] 2> 1905946 INFO (qtp2001109944-36734) [n:127.0.0.1:61605_wj_x%2Fx c:control_collection s:shard1 x:control_collection_shard1_replica_n1] o.a.s.c.ShardLeaderElectionContext Enough replicas found to continue.
[junit4] 2> 1905946 INFO (qtp2001109944-36734) [n:127.0.0.1:61605_wj_x%2Fx c:control_collection s:shard1 x:control_collection_shard1_replica_n1] o.a.s.c.ShardLeaderElectionContext I may be the new leader - try and sync
[junit4] 2> 1905946 INFO (qtp2001109944-36734) [n:127.0.0.1:61605_wj_x%2Fx c:control_collection s:shard1 x:control_collection_shard1_replica_n1] o.a.s.c.SyncStrategy Sync replicas to http://127.0.0.1:61605/wj_x/x/control_collection_shard1_replica_n1/
[junit4] 2> 1905947 INFO (qtp2001109944-36734) [n:127.0.0.1:61605_wj_x%2Fx c:control_collection s:shard1 x:control_collection_shard1_replica_n1] o.a.s.c.SyncStrategy Sync Success - now sync replicas to me
[junit4] 2> 1905947 INFO (qtp2001109944-36734) [n:127.0.
[...truncated too long message...]
6_63412204360301002055584.syserr
[junit4] >>> JVM J1 emitted unexpected output (verbatim) ----
[junit4] OpenJDK 64-Bit Server VM warning: Option UseConcMarkSweepGC was deprecated in version 9.0 and will likely be removed in a future release.
[junit4] <<< JVM J1: EOF ----
[...truncated 3 lines...]
[junit4] JVM J0: stderr was not empty, see: C:\Users\jenkins\workspace\Lucene-Solr-master-Windows\solr\build\contrib\solr-analytics\test\temp\junit4-J0-20190122_063506_63415677120168301085368.syserr
[junit4] >>> JVM J0 emitted unexpected output (verbatim) ----
[junit4] OpenJDK 64-Bit Server VM warning: Option UseConcMarkSweepGC was deprecated in version 9.0 and will likely be removed in a future release.
[junit4] <<< JVM J0: EOF ----
[...truncated 572 lines...]
[junit4] JVM J0: stderr was not empty, see: C:\Users\jenkins\workspace\Lucene-Solr-master-Windows\solr\build\contrib\solr-clustering\test\temp\junit4-J0-20190122_063814_60616515770645236611329.syserr
[junit4] >>> JVM J0 emitted unexpected output (verbatim) ----
[junit4] OpenJDK 64-Bit Server VM warning: Option UseConcMarkSweepGC was deprecated in version 9.0 and will likely be removed in a future release.
[junit4] <<< JVM J0: EOF ----
[...truncated 3 lines...]
[junit4] JVM J1: stderr was not empty, see: C:\Users\jenkins\workspace\Lucene-Solr-master-Windows\solr\build\contrib\solr-clustering\test\temp\junit4-J1-20190122_063814_60610738885896921471135.syserr
[junit4] >>> JVM J1 emitted unexpected output (verbatim) ----
[junit4] OpenJDK 64-Bit Server VM warning: Option UseConcMarkSweepGC was deprecated in version 9.0 and will likely be removed in a future release.
[junit4] <<< JVM J1: EOF ----
[...truncated 1301 lines...]
[junit4] JVM J0: stderr was not empty, see: C:\Users\jenkins\workspace\Lucene-Solr-master-Windows\solr\build\contrib\solr-dataimporthandler-extras\test\temp\junit4-J0-20190122_063918_43815663583467223252747.syserr
[junit4] >>> JVM J0 emitted unexpected output (verbatim) ----
[junit4] OpenJDK 64-Bit Server VM warning: Option UseConcMarkSweepGC was deprecated in version 9.0 and will likely be removed in a future release.
[junit4] <<< JVM J0: EOF ----
[...truncated 3 lines...]
[junit4] JVM J1: stderr was not empty, see: C:\Users\jenkins\workspace\Lucene-Solr-master-Windows\solr\build\contrib\solr-dataimporthandler-extras\test\temp\junit4-J1-20190122_063918_43856899569992410930.syserr
[junit4] >>> JVM J1 emitted unexpected output (verbatim) ----
[junit4] OpenJDK 64-Bit Server VM warning: Option UseConcMarkSweepGC was deprecated in version 9.0 and will likely be removed in a future release.
[junit4] <<< JVM J1: EOF ----
[...truncated 667 lines...]
[junit4] JVM J1: stderr was not empty, see: C:\Users\jenkins\workspace\Lucene-Solr-master-Windows\solr\build\contrib\solr-dataimporthandler\test\temp\junit4-J1-20190122_063952_7624350028360164974704.syserr
[junit4] >>> JVM J1 emitted unexpected output (verbatim) ----
[junit4] OpenJDK 64-Bit Server VM warning: Option UseConcMarkSweepGC was deprecated in version 9.0 and will likely be removed in a future release.
[junit4] <<< JVM J1: EOF ----
[...truncated 3 lines...]
[junit4] JVM J0: stderr was not empty, see: C:\Users\jenkins\workspace\Lucene-Solr-master-Windows\solr\build\contrib\solr-dataimporthandler\test\temp\junit4-J0-20190122_063952_76212400603872199453752.syserr
[junit4] >>> JVM J0 emitted unexpected output (verbatim) ----
[junit4] OpenJDK 64-Bit Server VM warning: Option UseConcMarkSweepGC was deprecated in version 9.0 and will likely be removed in a future release.
[junit4] <<< JVM J0: EOF ----
[...truncated 574 lines...]
[junit4] JVM J0: stderr was not empty, see: C:\Users\jenkins\workspace\Lucene-Solr-master-Windows\solr\build\contrib\solr-cell\test\temp\junit4-J0-20190122_064056_06316669972233738705478.syserr
[junit4] >>> JVM J0 emitted unexpected output (verbatim) ----
[junit4] OpenJDK 64-Bit Server VM warning: Option UseConcMarkSweepGC was deprecated in version 9.0 and will likely be removed in a future release.
[junit4] <<< JVM J0: EOF ----
[...truncated 3 lines...]
[junit4] JVM J1: stderr was not empty, see: C:\Users\jenkins\workspace\Lucene-Solr-master-Windows\solr\build\contrib\solr-cell\test\temp\junit4-J1-20190122_064056_06312904144960431189291.syserr
[junit4] >>> JVM J1 emitted unexpected output (verbatim) ----
[junit4] OpenJDK 64-Bit Server VM warning: Option UseConcMarkSweepGC was deprecated in version 9.0 and will likely be removed in a future release.
[junit4] <<< JVM J1: EOF ----
[...truncated 582 lines...]
[junit4] JVM J0: stderr was not empty, see: C:\Users\jenkins\workspace\Lucene-Solr-master-Windows\solr\build\contrib\solr-langid\test\temp\junit4-J0-20190122_064137_1793980766090045221948.syserr
[junit4] >>> JVM J0 emitted unexpected output (verbatim) ----
[junit4] OpenJDK 64-Bit Server VM warning: Option UseConcMarkSweepGC was deprecated in version 9.0 and will likely be removed in a future release.
[junit4] <<< JVM J0: EOF ----
[...truncated 3 lines...]
[junit4] JVM J1: stderr was not empty, see: C:\Users\jenkins\workspace\Lucene-Solr-master-Windows\solr\build\contrib\solr-langid\test\temp\junit4-J1-20190122_064137_1798685805634896523029.syserr
[junit4] >>> JVM J1 emitted unexpected output (verbatim) ----
[junit4] OpenJDK 64-Bit Server VM warning: Option UseConcMarkSweepGC was deprecated in version 9.0 and will likely be removed in a future release.
[junit4] <<< JVM J1: EOF ----
[...truncated 681 lines...]
[junit4] JVM J1: stderr was not empty, see: C:\Users\jenkins\workspace\Lucene-Solr-master-Windows\solr\build\contrib\solr-ltr\test\temp\junit4-J1-20190122_064218_35914292031298902812057.syserr
[junit4] >>> JVM J1 emitted unexpected output (verbatim) ----
[junit4] OpenJDK 64-Bit Server VM warning: Option UseConcMarkSweepGC was deprecated in version 9.0 and will likely be removed in a future release.
[junit4] <<< JVM J1: EOF ----
[...truncated 3 lines...]
[junit4] JVM J0: stderr was not empty, see: C:\Users\jenkins\workspace\Lucene-Solr-master-Windows\solr\build\contrib\solr-ltr\test\temp\junit4-J0-20190122_064218_3634466772517521590858.syserr
[junit4] >>> JVM J0 emitted unexpected output (verbatim) ----
[junit4] OpenJDK 64-Bit Server VM warning: Option UseConcMarkSweepGC was deprecated in version 9.0 and will likely be removed in a future release.
[junit4] <<< JVM J0: EOF ----
[...truncated 575 lines...]
[junit4] JVM J1: stderr was not empty, see: C:\Users\jenkins\workspace\Lucene-Solr-master-Windows\solr\build\contrib\solr-prometheus-exporter\test\temp\junit4-J1-20190122_064408_27815605666457767601255.syserr
[junit4] >>> JVM J1 emitted unexpected output (verbatim) ----
[junit4] OpenJDK 64-Bit Server VM warning: Option UseConcMarkSweepGC was deprecated in version 9.0 and will likely be removed in a future release.
[junit4] <<< JVM J1: EOF ----
[...truncated 3 lines...]
[junit4] JVM J0: stderr was not empty, see: C:\Users\jenkins\workspace\Lucene-Solr-master-Windows\solr\build\contrib\solr-prometheus-exporter\test\temp\junit4-J0-20190122_064408_2763148090220418362198.syserr
[junit4] >>> JVM J0 emitted unexpected output (verbatim) ----
[junit4] OpenJDK 64-Bit Server VM warning: Option UseConcMarkSweepGC was deprecated in version 9.0 and will likely be removed in a future release.
[junit4] <<< JVM J0: EOF ----
[...truncated 567 lines...]
[junit4] JVM J0: stderr was not empty, see: C:\Users\jenkins\workspace\Lucene-Solr-master-Windows\solr\build\contrib\solr-velocity\test\temp\junit4-J0-20190122_064458_9048518496856874051702.syserr
[junit4] >>> JVM J0 emitted unexpected output (verbatim) ----
[junit4] OpenJDK 64-Bit Server VM warning: Option UseConcMarkSweepGC was deprecated in version 9.0 and will likely be removed in a future release.
[junit4] <<< JVM J0: EOF ----
[...truncated 33469 lines...]
[repro] Jenkins log URL: https://jenkins.thetaphi.de/job/Lucene-Solr-master-Windows/7706/consoleText
[repro] Revision: 2aa2c16b88ddeed9db6d4ffce024b35c0b41824b
[repro] Ant options: "-Dargs=-XX:-UseCompressedOops -XX:+UseConcMarkSweepGC"
[repro] ant clean
[...truncated 6 lines...]
[repro] Test suites by module:
[repro] solr\core
[repro] ChaosMonkeySafeLeaderWithPullReplicasTest
[repro] ant compile-test
[...truncated 3595 lines...]
[repro] ant test-nocompile -Dtests.dups=5 -Dtests.maxfailures=5 -Dtests.class="*.ChaosMonkeySafeLeaderWithPullReplicasTest" -Dtests.showOutput=onerror "-Dargs=-XX:-UseCompressedOops -XX:+UseConcMarkSweepGC" -Dtests.seed=5BBB19AABF618A34 -Dtests.slow=true -Dtests.locale=kn -Dtests.timezone=America/Montserrat -Dtests.asserts=true -Dtests.file.encoding=UTF-8
[...truncated 48 lines...]
[junit4] JVM J1: stderr was not empty, see: C:\Users\jenkins\workspace\Lucene-Solr-master-Windows\solr\build\solr-core\test\temp\junit4-J1-20190122_065228_21015612873500815972381.syserr
[junit4] >>> JVM J1 emitted unexpected output (verbatim) ----
[junit4] OpenJDK 64-Bit Server VM warning: Option UseConcMarkSweepGC was deprecated in version 9.0 and will likely be removed in a future release.
[junit4] <<< JVM J1: EOF ----
[...truncated 4 lines...]
[junit4] JVM J0: stderr was not empty, see: C:\Users\jenkins\workspace\Lucene-Solr-master-Windows\solr\build\solr-core\test\temp\junit4-J0-20190122_065228_2118754876042293871717.syserr
[junit4] >>> JVM J0 emitted unexpected output (verbatim) ----
[junit4] OpenJDK 64-Bit Server VM warning: Option UseConcMarkSweepGC was deprecated in version 9.0 and will likely be removed in a future release.
[junit4] <<< JVM J0: EOF ----
[...truncated 21 lines...]
[repro] Failures:
[repro] 0/5 failed: org.apache.solr.cloud.ChaosMonkeySafeLeaderWithPullReplicasTest
[repro] Exiting with code 0
[...truncated 75 lines...]