You are viewing a plain text version of this content. The canonical link for it is here.
Posted to dev@lucene.apache.org by Apache Jenkins Server <je...@builds.apache.org> on 2017/09/28 15:04:53 UTC

[JENKINS] Solr-reference-guide-master - Build # 2215 - Still Failing

Build: https://builds.apache.org/job/Solr-reference-guide-master/2215/

Log: 
Started by timer
[EnvInject] - Loading node environment variables.
Building remotely on H19 (git-websites) in workspace /home/jenkins/jenkins-slave/workspace/Solr-reference-guide-master
 > git rev-parse --is-inside-work-tree # timeout=10
Fetching changes from the remote Git repository
 > git config remote.origin.url git://git.apache.org/lucene-solr.git # timeout=10
Cleaning workspace
 > git rev-parse --verify HEAD # timeout=10
Resetting working tree
 > git reset --hard # timeout=10
 > git clean -fdx # timeout=10
Fetching upstream changes from git://git.apache.org/lucene-solr.git
 > git --version # timeout=10
 > git fetch --tags --progress git://git.apache.org/lucene-solr.git +refs/heads/*:refs/remotes/origin/*
 > git rev-parse refs/remotes/origin/master^{commit} # timeout=10
 > git rev-parse refs/remotes/origin/origin/master^{commit} # timeout=10
Checking out Revision 790533da124ab10b52fad35372ed09e5f0bd57d5 (refs/remotes/origin/master)
Commit message: "SOLR-11401: Add zipFDistribution Stream Evaluator"
 > git config core.sparsecheckout # timeout=10
 > git checkout -f 790533da124ab10b52fad35372ed09e5f0bd57d5
 > git rev-list 790533da124ab10b52fad35372ed09e5f0bd57d5 # timeout=10
No emails were triggered.
[Solr-reference-guide-master] $ /usr/bin/env bash /tmp/jenkins3309079419098014944.sh
+ set -e
+ RVM_PATH=/home/jenkins/.rvm
+ RUBY_VERSION=ruby-2.3.3
+ GEMSET=solr-refguide-gemset
+ curl -sSL https://get.rvm.io
+ bash -s -- --ignore-dotfiles stable
Turning on ignore dotfiles mode.
Downloading https://github.com/rvm/rvm/archive/1.29.3.tar.gz
Downloading https://github.com/rvm/rvm/releases/download/1.29.3/1.29.3.tar.gz.asc
gpg: Signature made Sun 10 Sep 2017 08:59:21 PM UTC using RSA key ID BF04FF17
gpg: Good signature from "Michal Papis (RVM signing) <mp...@gmail.com>"
gpg:                 aka "Michal Papis <mi...@toptal.com>"
gpg:                 aka "[jpeg image of size 5015]"
gpg: WARNING: This key is not certified with a trusted signature!
gpg:          There is no indication that the signature belongs to the owner.
Primary key fingerprint: 409B 6B17 96C2 7546 2A17  0311 3804 BB82 D39D C0E3
     Subkey fingerprint: 62C9 E5F4 DA30 0D94 AC36  166B E206 C29F BF04 FF17
GPG verified '/home/jenkins/.rvm/archives/rvm-1.29.3.tgz'

Upgrading the RVM installation in /home/jenkins/.rvm/
Upgrade of RVM in /home/jenkins/.rvm/ is complete.

Upgrade Notes:

  * No new notes to display.

+ set +x
Running 'source /home/jenkins/.rvm/scripts/rvm'
Running 'rvm autolibs disable'
Running 'rvm install ruby-2.3.3'
Already installed ruby-2.3.3.
To reinstall use:

    rvm reinstall ruby-2.3.3

Running 'rvm gemset create solr-refguide-gemset'
ruby-2.3.3 - #gemset created /home/jenkins/.rvm/gems/ruby-2.3.3@solr-refguide-gemset
ruby-2.3.3 - #generating solr-refguide-gemset wrappers........
Running 'rvm ruby-2.3.3@solr-refguide-gemset'
Using /home/jenkins/.rvm/gems/ruby-2.3.3 with gemset solr-refguide-gemset
Running 'gem install --force --version 3.5.0 jekyll'
Successfully installed jekyll-3.5.0
Parsing documentation for jekyll-3.5.0
Done installing documentation for jekyll after 2 seconds
1 gem installed
Running 'gem install --force --version 2.1.0 jekyll-asciidoc'
Successfully installed jekyll-asciidoc-2.1.0
Parsing documentation for jekyll-asciidoc-2.1.0
Done installing documentation for jekyll-asciidoc after 0 seconds
1 gem installed
Running 'gem install --force --version 1.1.2 pygments.rb'
Successfully installed pygments.rb-1.1.2
Parsing documentation for pygments.rb-1.1.2
Done installing documentation for pygments.rb after 0 seconds
1 gem installed
+ ant clean build-site build-pdf
Buildfile: /home/jenkins/jenkins-slave/workspace/Solr-reference-guide-master/solr/solr-ref-guide/build.xml

clean:

build-init:
    [mkdir] Created dir: /home/jenkins/jenkins-slave/workspace/Solr-reference-guide-master/solr/build/solr-ref-guide/content
     [echo] Copying all non template files from src ...
     [copy] Copying 370 files to /home/jenkins/jenkins-slave/workspace/Solr-reference-guide-master/solr/build/solr-ref-guide/content
     [echo] Copy (w/prop replacement) any template files from src...
     [copy] Copying 1 file to /home/jenkins/jenkins-slave/workspace/Solr-reference-guide-master/solr/build/solr-ref-guide/content

ivy-availability-check:
[loadresource] Do not set property disallowed.ivy.jars.list as its length is 0.

-ivy-fail-disallowed-ivy-version:

ivy-fail:

ivy-configure:
[ivy:configure] :: Apache Ivy 2.3.0 - 20130110142753 :: http://ant.apache.org/ivy/ ::
[ivy:configure] :: loading settings :: file = /home/jenkins/jenkins-slave/workspace/Solr-reference-guide-master/lucene/top-level-ivy-settings.xml

resolve:
[ivy:retrieve] 
[ivy:retrieve] :: problems summary ::
[ivy:retrieve] :::: ERRORS
[ivy:retrieve] 	unknown resolver null
[ivy:retrieve] 	unknown resolver null
[ivy:retrieve] 	unknown resolver null
[ivy:retrieve] 	unknown resolver null
[ivy:retrieve] 	unknown resolver null
[ivy:retrieve] 	unknown resolver null
[ivy:retrieve] 
[ivy:retrieve] :: USE VERBOSE OR DEBUG MESSAGE LEVEL FOR MORE DETAILS

build-tools-jar:
    [mkdir] Created dir: /home/jenkins/jenkins-slave/workspace/Solr-reference-guide-master/solr/build/solr-ref-guide/classes
    [javac] Compiling 3 source files to /home/jenkins/jenkins-slave/workspace/Solr-reference-guide-master/solr/build/solr-ref-guide/classes
      [jar] Building jar: /home/jenkins/jenkins-slave/workspace/Solr-reference-guide-master/solr/build/solr-ref-guide/solr-ref-guide-tools.jar

build-nav-data-files:
     [java] Building up tree of all known pages
     [java] Creating /home/jenkins/jenkins-slave/workspace/Solr-reference-guide-master/solr/build/solr-ref-guide/content/_data/pdf-main-body.adoc
     [java] Creating /home/jenkins/jenkins-slave/workspace/Solr-reference-guide-master/solr/build/solr-ref-guide/content/_data/scrollnav.json
     [java] Creating /home/jenkins/jenkins-slave/workspace/Solr-reference-guide-master/solr/build/solr-ref-guide/content/_data/sidebar.json

-build-site:
     [echo] Running Jekyll...
     [exec] Configuration file: /home/jenkins/jenkins-slave/workspace/Solr-reference-guide-master/solr/build/solr-ref-guide/content/_config.yml       Deprecation: The 'gems' configuration option has been renamed to 'plugins'. Please update your config file accordingly.
     [exec] 
     [exec]             Source: /home/jenkins/jenkins-slave/workspace/Solr-reference-guide-master/solr/build/solr-ref-guide/content
     [exec]        Destination: ../html-site
     [exec]  Incremental build: disabled. Enable with --incremental
     [exec]       Generating... 
     [exec]                     done in 16.864 seconds.
     [exec]  Auto-regeneration: disabled. Use --watch to enable.

check-links-and-anchors:
     [java] Relative link points at id that doesn't exist in dest: solrcloud-autoscaling-policy-preferences.html#defining-collection-specific-policies
     [java]  ... source: file:/home/jenkins/jenkins-slave/workspace/Solr-reference-guide-master/solr/build/solr-ref-guide/html-site/solrcloud-autoscaling-overview.html
     [java] Total of 1 problems found

BUILD FAILED
/home/jenkins/jenkins-slave/workspace/Solr-reference-guide-master/solr/solr-ref-guide/build.xml:165: Java returned: 255

Total time: 30 seconds
Build step 'Execute shell' marked build as failure
Archiving artifacts
Publishing Javadoc
Email was triggered for: Failure - Any
Sending email for trigger: Failure - Any

[JENKINS] Solr-reference-guide-master - Build # 2233 - Still Failing

Posted by Apache Jenkins Server <je...@builds.apache.org>.
Build: https://builds.apache.org/job/Solr-reference-guide-master/2233/

Log: 
Started by timer
[EnvInject] - Loading node environment variables.
Building remotely on H19 (git-websites) in workspace /home/jenkins/jenkins-slave/workspace/Solr-reference-guide-master
 > git rev-parse --is-inside-work-tree # timeout=10
Fetching changes from the remote Git repository
 > git config remote.origin.url git://git.apache.org/lucene-solr.git # timeout=10
Cleaning workspace
 > git rev-parse --verify HEAD # timeout=10
Resetting working tree
 > git reset --hard # timeout=10
 > git clean -fdx # timeout=10
Fetching upstream changes from git://git.apache.org/lucene-solr.git
 > git --version # timeout=10
 > git fetch --tags --progress git://git.apache.org/lucene-solr.git +refs/heads/*:refs/remotes/origin/*
 > git rev-parse refs/remotes/origin/master^{commit} # timeout=10
 > git rev-parse refs/remotes/origin/origin/master^{commit} # timeout=10
Checking out Revision 86fa1cf11bf45e8ca4e78d653d2ef2ceeb584194 (refs/remotes/origin/master)
Commit message: "SOLR-11418: Allow comments in Streaming Expressions"
 > git config core.sparsecheckout # timeout=10
 > git checkout -f 86fa1cf11bf45e8ca4e78d653d2ef2ceeb584194
 > git rev-list 86fa1cf11bf45e8ca4e78d653d2ef2ceeb584194 # timeout=10
No emails were triggered.
[Solr-reference-guide-master] $ /usr/bin/env bash /tmp/jenkins5976034481893530797.sh
+ set -e
+ RVM_PATH=/home/jenkins/.rvm
+ RUBY_VERSION=ruby-2.3.3
+ GEMSET=solr-refguide-gemset
+ curl -sSL https://get.rvm.io
+ bash -s -- --ignore-dotfiles stable
Turning on ignore dotfiles mode.
Downloading https://github.com/rvm/rvm/archive/1.29.3.tar.gz
Downloading https://github.com/rvm/rvm/releases/download/1.29.3/1.29.3.tar.gz.asc
gpg: Signature made Sun 10 Sep 2017 08:59:21 PM UTC using RSA key ID BF04FF17
gpg: Good signature from "Michal Papis (RVM signing) <mp...@gmail.com>"
gpg:                 aka "Michal Papis <mi...@toptal.com>"
gpg:                 aka "[jpeg image of size 5015]"
gpg: WARNING: This key is not certified with a trusted signature!
gpg:          There is no indication that the signature belongs to the owner.
Primary key fingerprint: 409B 6B17 96C2 7546 2A17  0311 3804 BB82 D39D C0E3
     Subkey fingerprint: 62C9 E5F4 DA30 0D94 AC36  166B E206 C29F BF04 FF17
GPG verified '/home/jenkins/.rvm/archives/rvm-1.29.3.tgz'

Upgrading the RVM installation in /home/jenkins/.rvm/
Upgrade of RVM in /home/jenkins/.rvm/ is complete.

Upgrade Notes:

  * No new notes to display.

+ set +x
Running 'source /home/jenkins/.rvm/scripts/rvm'
Running 'rvm autolibs disable'
Running 'rvm install ruby-2.3.3'
Already installed ruby-2.3.3.
To reinstall use:

    rvm reinstall ruby-2.3.3

Running 'rvm gemset create solr-refguide-gemset'
ruby-2.3.3 - #gemset created /home/jenkins/.rvm/gems/ruby-2.3.3@solr-refguide-gemset
ruby-2.3.3 - #generating solr-refguide-gemset wrappers........
Running 'rvm ruby-2.3.3@solr-refguide-gemset'
Using /home/jenkins/.rvm/gems/ruby-2.3.3 with gemset solr-refguide-gemset
Running 'gem install --force --version 3.5.0 jekyll'
Successfully installed jekyll-3.5.0
Parsing documentation for jekyll-3.5.0
Done installing documentation for jekyll after 2 seconds
1 gem installed
Running 'gem install --force --version 2.1.0 jekyll-asciidoc'
Successfully installed jekyll-asciidoc-2.1.0
Parsing documentation for jekyll-asciidoc-2.1.0
Done installing documentation for jekyll-asciidoc after 0 seconds
1 gem installed
Running 'gem install --force --version 1.1.2 pygments.rb'
Successfully installed pygments.rb-1.1.2
Parsing documentation for pygments.rb-1.1.2
Done installing documentation for pygments.rb after 0 seconds
1 gem installed
+ ant clean build-site build-pdf
Buildfile: /home/jenkins/jenkins-slave/workspace/Solr-reference-guide-master/solr/solr-ref-guide/build.xml

clean:

build-init:
    [mkdir] Created dir: /home/jenkins/jenkins-slave/workspace/Solr-reference-guide-master/solr/build/solr-ref-guide/content
     [echo] Copying all non template files from src ...
     [copy] Copying 370 files to /home/jenkins/jenkins-slave/workspace/Solr-reference-guide-master/solr/build/solr-ref-guide/content
     [echo] Copy (w/prop replacement) any template files from src...
     [copy] Copying 1 file to /home/jenkins/jenkins-slave/workspace/Solr-reference-guide-master/solr/build/solr-ref-guide/content

ivy-availability-check:
[loadresource] Do not set property disallowed.ivy.jars.list as its length is 0.

-ivy-fail-disallowed-ivy-version:

ivy-fail:

ivy-configure:
[ivy:configure] :: Apache Ivy 2.3.0 - 20130110142753 :: http://ant.apache.org/ivy/ ::
[ivy:configure] :: loading settings :: file = /home/jenkins/jenkins-slave/workspace/Solr-reference-guide-master/lucene/top-level-ivy-settings.xml

resolve:
[ivy:retrieve] 
[ivy:retrieve] :: problems summary ::
[ivy:retrieve] :::: ERRORS
[ivy:retrieve] 	unknown resolver null
[ivy:retrieve] 	unknown resolver null
[ivy:retrieve] 	unknown resolver null
[ivy:retrieve] 	unknown resolver null
[ivy:retrieve] 	unknown resolver null
[ivy:retrieve] 	unknown resolver null
[ivy:retrieve] 
[ivy:retrieve] :: USE VERBOSE OR DEBUG MESSAGE LEVEL FOR MORE DETAILS

build-tools-jar:
    [mkdir] Created dir: /home/jenkins/jenkins-slave/workspace/Solr-reference-guide-master/solr/build/solr-ref-guide/classes
    [javac] Compiling 3 source files to /home/jenkins/jenkins-slave/workspace/Solr-reference-guide-master/solr/build/solr-ref-guide/classes
      [jar] Building jar: /home/jenkins/jenkins-slave/workspace/Solr-reference-guide-master/solr/build/solr-ref-guide/solr-ref-guide-tools.jar

build-nav-data-files:
     [java] Building up tree of all known pages
     [java] Creating /home/jenkins/jenkins-slave/workspace/Solr-reference-guide-master/solr/build/solr-ref-guide/content/_data/pdf-main-body.adoc
     [java] Creating /home/jenkins/jenkins-slave/workspace/Solr-reference-guide-master/solr/build/solr-ref-guide/content/_data/scrollnav.json
     [java] Creating /home/jenkins/jenkins-slave/workspace/Solr-reference-guide-master/solr/build/solr-ref-guide/content/_data/sidebar.json

-build-site:
     [echo] Running Jekyll...
     [exec] Configuration file: /home/jenkins/jenkins-slave/workspace/Solr-reference-guide-master/solr/build/solr-ref-guide/content/_config.yml
     [exec]             Source: /home/jenkins/jenkins-slave/workspace/Solr-reference-guide-master/solr/build/solr-ref-guide/content       Deprecation: The 'gems' configuration option has been renamed to 'plugins'. Please update your config file accordingly.
     [exec] 
     [exec]        Destination: ../html-site
     [exec]  Incremental build: disabled. Enable with --incremental
     [exec]       Generating... 
     [exec]                     done in 16.598 seconds.
     [exec]  Auto-regeneration: disabled. Use --watch to enable.

check-links-and-anchors:
     [java] Relative link points at id that doesn't exist in dest: solrcloud-autoscaling-policy-preferences.html#defining-collection-specific-policies
     [java]  ... source: file:/home/jenkins/jenkins-slave/workspace/Solr-reference-guide-master/solr/build/solr-ref-guide/html-site/solrcloud-autoscaling-overview.html
     [java] Total of 1 problems found

BUILD FAILED
/home/jenkins/jenkins-slave/workspace/Solr-reference-guide-master/solr/solr-ref-guide/build.xml:165: Java returned: 255

Total time: 30 seconds
Build step 'Execute shell' marked build as failure
Archiving artifacts
Publishing Javadoc
Email was triggered for: Failure - Any
Sending email for trigger: Failure - Any

[JENKINS] Solr-reference-guide-master - Build # 2232 - Still Failing

Posted by Apache Jenkins Server <je...@builds.apache.org>.
Build: https://builds.apache.org/job/Solr-reference-guide-master/2232/

Log: 
Started by timer
[EnvInject] - Loading node environment variables.
Building remotely on H20 (git-websites) in workspace /home/jenkins/jenkins-slave/workspace/Solr-reference-guide-master
 > git rev-parse --is-inside-work-tree # timeout=10
Fetching changes from the remote Git repository
 > git config remote.origin.url git://git.apache.org/lucene-solr.git # timeout=10
Cleaning workspace
 > git rev-parse --verify HEAD # timeout=10
Resetting working tree
 > git reset --hard # timeout=10
 > git clean -fdx # timeout=10
Fetching upstream changes from git://git.apache.org/lucene-solr.git
 > git --version # timeout=10
 > git fetch --tags --progress git://git.apache.org/lucene-solr.git +refs/heads/*:refs/remotes/origin/*
 > git rev-parse refs/remotes/origin/master^{commit} # timeout=10
 > git rev-parse refs/remotes/origin/origin/master^{commit} # timeout=10
Checking out Revision 86fa1cf11bf45e8ca4e78d653d2ef2ceeb584194 (refs/remotes/origin/master)
Commit message: "SOLR-11418: Allow comments in Streaming Expressions"
 > git config core.sparsecheckout # timeout=10
 > git checkout -f 86fa1cf11bf45e8ca4e78d653d2ef2ceeb584194
 > git rev-list 86fa1cf11bf45e8ca4e78d653d2ef2ceeb584194 # timeout=10
No emails were triggered.
[Solr-reference-guide-master] $ /usr/bin/env bash /tmp/jenkins4895381018693688511.sh
+ set -e
+ RVM_PATH=/home/jenkins/.rvm
+ RUBY_VERSION=ruby-2.3.3
+ GEMSET=solr-refguide-gemset
+ curl -sSL https://get.rvm.io
+ bash -s -- --ignore-dotfiles stable
Turning on ignore dotfiles mode.
Downloading https://github.com/rvm/rvm/archive/1.29.3.tar.gz
Downloading https://github.com/rvm/rvm/releases/download/1.29.3/1.29.3.tar.gz.asc
gpg: Signature made Sun 10 Sep 2017 08:59:21 PM UTC using RSA key ID BF04FF17
gpg: Good signature from "Michal Papis (RVM signing) <mp...@gmail.com>"
gpg:                 aka "Michal Papis <mi...@toptal.com>"
gpg:                 aka "[jpeg image of size 5015]"
gpg: WARNING: This key is not certified with a trusted signature!
gpg:          There is no indication that the signature belongs to the owner.
Primary key fingerprint: 409B 6B17 96C2 7546 2A17  0311 3804 BB82 D39D C0E3
     Subkey fingerprint: 62C9 E5F4 DA30 0D94 AC36  166B E206 C29F BF04 FF17
GPG verified '/home/jenkins/.rvm/archives/rvm-1.29.3.tgz'

Upgrading the RVM installation in /home/jenkins/.rvm/
Upgrade of RVM in /home/jenkins/.rvm/ is complete.

Upgrade Notes:

  * No new notes to display.

+ set +x
Running 'source /home/jenkins/.rvm/scripts/rvm'
Running 'rvm autolibs disable'
Running 'rvm install ruby-2.3.3'
Already installed ruby-2.3.3.
To reinstall use:

    rvm reinstall ruby-2.3.3

Running 'rvm gemset create solr-refguide-gemset'
ruby-2.3.3 - #gemset created /home/jenkins/.rvm/gems/ruby-2.3.3@solr-refguide-gemset
ruby-2.3.3 - #generating solr-refguide-gemset wrappers........
Running 'rvm ruby-2.3.3@solr-refguide-gemset'
Using /home/jenkins/.rvm/gems/ruby-2.3.3 with gemset solr-refguide-gemset
Running 'gem install --force --version 3.5.0 jekyll'
Successfully installed jekyll-3.5.0
Parsing documentation for jekyll-3.5.0
Done installing documentation for jekyll after 2 seconds
1 gem installed
Running 'gem install --force --version 2.1.0 jekyll-asciidoc'
Successfully installed jekyll-asciidoc-2.1.0
Parsing documentation for jekyll-asciidoc-2.1.0
Done installing documentation for jekyll-asciidoc after 0 seconds
1 gem installed
Running 'gem install --force --version 1.1.2 pygments.rb'
Successfully installed pygments.rb-1.1.2
Parsing documentation for pygments.rb-1.1.2
Done installing documentation for pygments.rb after 0 seconds
1 gem installed
+ ant clean build-site build-pdf
Buildfile: /home/jenkins/jenkins-slave/workspace/Solr-reference-guide-master/solr/solr-ref-guide/build.xml

clean:

build-init:
    [mkdir] Created dir: /home/jenkins/jenkins-slave/workspace/Solr-reference-guide-master/solr/build/solr-ref-guide/content
     [echo] Copying all non template files from src ...
     [copy] Copying 370 files to /home/jenkins/jenkins-slave/workspace/Solr-reference-guide-master/solr/build/solr-ref-guide/content
     [echo] Copy (w/prop replacement) any template files from src...
     [copy] Copying 1 file to /home/jenkins/jenkins-slave/workspace/Solr-reference-guide-master/solr/build/solr-ref-guide/content

ivy-availability-check:
[loadresource] Do not set property disallowed.ivy.jars.list as its length is 0.

-ivy-fail-disallowed-ivy-version:

ivy-fail:

ivy-configure:
[ivy:configure] :: Apache Ivy 2.3.0 - 20130110142753 :: http://ant.apache.org/ivy/ ::
[ivy:configure] :: loading settings :: file = /home/jenkins/jenkins-slave/workspace/Solr-reference-guide-master/lucene/top-level-ivy-settings.xml

resolve:
[ivy:retrieve] 
[ivy:retrieve] :: problems summary ::
[ivy:retrieve] :::: ERRORS
[ivy:retrieve] 	unknown resolver null
[ivy:retrieve] 	unknown resolver null
[ivy:retrieve] 	unknown resolver null
[ivy:retrieve] 	unknown resolver null
[ivy:retrieve] 	unknown resolver null
[ivy:retrieve] 	unknown resolver null
[ivy:retrieve] 
[ivy:retrieve] :: USE VERBOSE OR DEBUG MESSAGE LEVEL FOR MORE DETAILS

build-tools-jar:
    [mkdir] Created dir: /home/jenkins/jenkins-slave/workspace/Solr-reference-guide-master/solr/build/solr-ref-guide/classes
    [javac] Compiling 3 source files to /home/jenkins/jenkins-slave/workspace/Solr-reference-guide-master/solr/build/solr-ref-guide/classes
      [jar] Building jar: /home/jenkins/jenkins-slave/workspace/Solr-reference-guide-master/solr/build/solr-ref-guide/solr-ref-guide-tools.jar

build-nav-data-files:
     [java] Building up tree of all known pages
     [java] Creating /home/jenkins/jenkins-slave/workspace/Solr-reference-guide-master/solr/build/solr-ref-guide/content/_data/pdf-main-body.adoc
     [java] Creating /home/jenkins/jenkins-slave/workspace/Solr-reference-guide-master/solr/build/solr-ref-guide/content/_data/scrollnav.json
     [java] Creating /home/jenkins/jenkins-slave/workspace/Solr-reference-guide-master/solr/build/solr-ref-guide/content/_data/sidebar.json

-build-site:
     [echo] Running Jekyll...
     [exec] Configuration file: /home/jenkins/jenkins-slave/workspace/Solr-reference-guide-master/solr/build/solr-ref-guide/content/_config.yml
     [exec]             Source: /home/jenkins/jenkins-slave/workspace/Solr-reference-guide-master/solr/build/solr-ref-guide/content       Deprecation: The 'gems' configuration option has been renamed to 'plugins'. Please update your config file accordingly.
     [exec] 
     [exec]        Destination: ../html-site
     [exec]  Incremental build: disabled. Enable with --incremental
     [exec]       Generating... 
     [exec]                     done in 16.617 seconds.
     [exec]  Auto-regeneration: disabled. Use --watch to enable.

check-links-and-anchors:
     [java] Relative link points at id that doesn't exist in dest: solrcloud-autoscaling-policy-preferences.html#defining-collection-specific-policies
     [java]  ... source: file:/home/jenkins/jenkins-slave/workspace/Solr-reference-guide-master/solr/build/solr-ref-guide/html-site/solrcloud-autoscaling-overview.html
     [java] Total of 1 problems found

BUILD FAILED
/home/jenkins/jenkins-slave/workspace/Solr-reference-guide-master/solr/solr-ref-guide/build.xml:165: Java returned: 255

Total time: 30 seconds
Build step 'Execute shell' marked build as failure
Archiving artifacts
Publishing Javadoc
Email was triggered for: Failure - Any
Sending email for trigger: Failure - Any

[JENKINS] Solr-reference-guide-master - Build # 2231 - Still Failing

Posted by Apache Jenkins Server <je...@builds.apache.org>.
Build: https://builds.apache.org/job/Solr-reference-guide-master/2231/

Log: 
Started by timer
[EnvInject] - Loading node environment variables.
Building remotely on H19 (git-websites) in workspace /home/jenkins/jenkins-slave/workspace/Solr-reference-guide-master
 > git rev-parse --is-inside-work-tree # timeout=10
Fetching changes from the remote Git repository
 > git config remote.origin.url git://git.apache.org/lucene-solr.git # timeout=10
Cleaning workspace
 > git rev-parse --verify HEAD # timeout=10
Resetting working tree
 > git reset --hard # timeout=10
 > git clean -fdx # timeout=10
Fetching upstream changes from git://git.apache.org/lucene-solr.git
 > git --version # timeout=10
 > git fetch --tags --progress git://git.apache.org/lucene-solr.git +refs/heads/*:refs/remotes/origin/*
 > git rev-parse refs/remotes/origin/master^{commit} # timeout=10
 > git rev-parse refs/remotes/origin/origin/master^{commit} # timeout=10
Checking out Revision 86fa1cf11bf45e8ca4e78d653d2ef2ceeb584194 (refs/remotes/origin/master)
Commit message: "SOLR-11418: Allow comments in Streaming Expressions"
 > git config core.sparsecheckout # timeout=10
 > git checkout -f 86fa1cf11bf45e8ca4e78d653d2ef2ceeb584194
 > git rev-list 86fa1cf11bf45e8ca4e78d653d2ef2ceeb584194 # timeout=10
No emails were triggered.
[Solr-reference-guide-master] $ /usr/bin/env bash /tmp/jenkins8087707536711240465.sh
+ set -e
+ RVM_PATH=/home/jenkins/.rvm
+ RUBY_VERSION=ruby-2.3.3
+ GEMSET=solr-refguide-gemset
+ curl -sSL https://get.rvm.io
+ bash -s -- --ignore-dotfiles stable
Turning on ignore dotfiles mode.
Downloading https://github.com/rvm/rvm/archive/1.29.3.tar.gz
Downloading https://github.com/rvm/rvm/releases/download/1.29.3/1.29.3.tar.gz.asc
gpg: Signature made Sun 10 Sep 2017 08:59:21 PM UTC using RSA key ID BF04FF17
gpg: Good signature from "Michal Papis (RVM signing) <mp...@gmail.com>"
gpg:                 aka "Michal Papis <mi...@toptal.com>"
gpg:                 aka "[jpeg image of size 5015]"
gpg: WARNING: This key is not certified with a trusted signature!
gpg:          There is no indication that the signature belongs to the owner.
Primary key fingerprint: 409B 6B17 96C2 7546 2A17  0311 3804 BB82 D39D C0E3
     Subkey fingerprint: 62C9 E5F4 DA30 0D94 AC36  166B E206 C29F BF04 FF17
GPG verified '/home/jenkins/.rvm/archives/rvm-1.29.3.tgz'

Upgrading the RVM installation in /home/jenkins/.rvm/
Upgrade of RVM in /home/jenkins/.rvm/ is complete.

Upgrade Notes:

  * No new notes to display.

+ set +x
Running 'source /home/jenkins/.rvm/scripts/rvm'
Running 'rvm autolibs disable'
Running 'rvm install ruby-2.3.3'
Already installed ruby-2.3.3.
To reinstall use:

    rvm reinstall ruby-2.3.3

Running 'rvm gemset create solr-refguide-gemset'
ruby-2.3.3 - #gemset created /home/jenkins/.rvm/gems/ruby-2.3.3@solr-refguide-gemset
ruby-2.3.3 - #generating solr-refguide-gemset wrappers........
Running 'rvm ruby-2.3.3@solr-refguide-gemset'
Using /home/jenkins/.rvm/gems/ruby-2.3.3 with gemset solr-refguide-gemset
Running 'gem install --force --version 3.5.0 jekyll'
Successfully installed jekyll-3.5.0
Parsing documentation for jekyll-3.5.0
Done installing documentation for jekyll after 2 seconds
1 gem installed
Running 'gem install --force --version 2.1.0 jekyll-asciidoc'
Successfully installed jekyll-asciidoc-2.1.0
Parsing documentation for jekyll-asciidoc-2.1.0
Done installing documentation for jekyll-asciidoc after 0 seconds
1 gem installed
Running 'gem install --force --version 1.1.2 pygments.rb'
Successfully installed pygments.rb-1.1.2
Parsing documentation for pygments.rb-1.1.2
Done installing documentation for pygments.rb after 0 seconds
1 gem installed
+ ant clean build-site build-pdf
Buildfile: /home/jenkins/jenkins-slave/workspace/Solr-reference-guide-master/solr/solr-ref-guide/build.xml

clean:

build-init:
    [mkdir] Created dir: /home/jenkins/jenkins-slave/workspace/Solr-reference-guide-master/solr/build/solr-ref-guide/content
     [echo] Copying all non template files from src ...
     [copy] Copying 370 files to /home/jenkins/jenkins-slave/workspace/Solr-reference-guide-master/solr/build/solr-ref-guide/content
     [echo] Copy (w/prop replacement) any template files from src...
     [copy] Copying 1 file to /home/jenkins/jenkins-slave/workspace/Solr-reference-guide-master/solr/build/solr-ref-guide/content

ivy-availability-check:
[loadresource] Do not set property disallowed.ivy.jars.list as its length is 0.

-ivy-fail-disallowed-ivy-version:

ivy-fail:

ivy-configure:
[ivy:configure] :: Apache Ivy 2.3.0 - 20130110142753 :: http://ant.apache.org/ivy/ ::
[ivy:configure] :: loading settings :: file = /home/jenkins/jenkins-slave/workspace/Solr-reference-guide-master/lucene/top-level-ivy-settings.xml

resolve:
[ivy:retrieve] 
[ivy:retrieve] :: problems summary ::
[ivy:retrieve] :::: ERRORS
[ivy:retrieve] 	unknown resolver null
[ivy:retrieve] 	unknown resolver null
[ivy:retrieve] 	unknown resolver null
[ivy:retrieve] 	unknown resolver null
[ivy:retrieve] 	unknown resolver null
[ivy:retrieve] 	unknown resolver null
[ivy:retrieve] 
[ivy:retrieve] :: USE VERBOSE OR DEBUG MESSAGE LEVEL FOR MORE DETAILS

build-tools-jar:
    [mkdir] Created dir: /home/jenkins/jenkins-slave/workspace/Solr-reference-guide-master/solr/build/solr-ref-guide/classes
    [javac] Compiling 3 source files to /home/jenkins/jenkins-slave/workspace/Solr-reference-guide-master/solr/build/solr-ref-guide/classes
      [jar] Building jar: /home/jenkins/jenkins-slave/workspace/Solr-reference-guide-master/solr/build/solr-ref-guide/solr-ref-guide-tools.jar

build-nav-data-files:
     [java] Building up tree of all known pages
     [java] Creating /home/jenkins/jenkins-slave/workspace/Solr-reference-guide-master/solr/build/solr-ref-guide/content/_data/pdf-main-body.adoc
     [java] Creating /home/jenkins/jenkins-slave/workspace/Solr-reference-guide-master/solr/build/solr-ref-guide/content/_data/scrollnav.json
     [java] Creating /home/jenkins/jenkins-slave/workspace/Solr-reference-guide-master/solr/build/solr-ref-guide/content/_data/sidebar.json

-build-site:
     [echo] Running Jekyll...
     [exec] Configuration file: /home/jenkins/jenkins-slave/workspace/Solr-reference-guide-master/solr/build/solr-ref-guide/content/_config.yml
     [exec]             Source: /home/jenkins/jenkins-slave/workspace/Solr-reference-guide-master/solr/build/solr-ref-guide/content
     [exec]        Destination: ../html-site
     [exec]  Incremental build: disabled. Enable with --incremental
     [exec]       Generating... 
     [exec]        Deprecation: The 'gems' configuration option has been renamed to 'plugins'. Please update your config file accordingly.
     [exec]                     done in 16.471 seconds.
     [exec]  Auto-regeneration: disabled. Use --watch to enable.

check-links-and-anchors:
     [java] Relative link points at id that doesn't exist in dest: solrcloud-autoscaling-policy-preferences.html#defining-collection-specific-policies
     [java]  ... source: file:/home/jenkins/jenkins-slave/workspace/Solr-reference-guide-master/solr/build/solr-ref-guide/html-site/solrcloud-autoscaling-overview.html
     [java] Total of 1 problems found

BUILD FAILED
/home/jenkins/jenkins-slave/workspace/Solr-reference-guide-master/solr/solr-ref-guide/build.xml:165: Java returned: 255

Total time: 29 seconds
Build step 'Execute shell' marked build as failure
Archiving artifacts
Publishing Javadoc
Email was triggered for: Failure - Any
Sending email for trigger: Failure - Any

[JENKINS] Solr-reference-guide-master - Build # 2230 - Still Failing

Posted by Apache Jenkins Server <je...@builds.apache.org>.
Build: https://builds.apache.org/job/Solr-reference-guide-master/2230/

Log: 
Started by timer
[EnvInject] - Loading node environment variables.
Building remotely on H19 (git-websites) in workspace /home/jenkins/jenkins-slave/workspace/Solr-reference-guide-master
 > git rev-parse --is-inside-work-tree # timeout=10
Fetching changes from the remote Git repository
 > git config remote.origin.url git://git.apache.org/lucene-solr.git # timeout=10
Cleaning workspace
 > git rev-parse --verify HEAD # timeout=10
Resetting working tree
 > git reset --hard # timeout=10
 > git clean -fdx # timeout=10
Fetching upstream changes from git://git.apache.org/lucene-solr.git
 > git --version # timeout=10
 > git fetch --tags --progress git://git.apache.org/lucene-solr.git +refs/heads/*:refs/remotes/origin/*
 > git rev-parse refs/remotes/origin/master^{commit} # timeout=10
 > git rev-parse refs/remotes/origin/origin/master^{commit} # timeout=10
Checking out Revision 86fa1cf11bf45e8ca4e78d653d2ef2ceeb584194 (refs/remotes/origin/master)
Commit message: "SOLR-11418: Allow comments in Streaming Expressions"
 > git config core.sparsecheckout # timeout=10
 > git checkout -f 86fa1cf11bf45e8ca4e78d653d2ef2ceeb584194
 > git rev-list 86fa1cf11bf45e8ca4e78d653d2ef2ceeb584194 # timeout=10
No emails were triggered.
[Solr-reference-guide-master] $ /usr/bin/env bash /tmp/jenkins5005281646186320410.sh
+ set -e
+ RVM_PATH=/home/jenkins/.rvm
+ RUBY_VERSION=ruby-2.3.3
+ GEMSET=solr-refguide-gemset
+ curl -sSL https://get.rvm.io
+ bash -s -- --ignore-dotfiles stable
Turning on ignore dotfiles mode.
Downloading https://github.com/rvm/rvm/archive/1.29.3.tar.gz
Downloading https://github.com/rvm/rvm/releases/download/1.29.3/1.29.3.tar.gz.asc
gpg: Signature made Sun 10 Sep 2017 08:59:21 PM UTC using RSA key ID BF04FF17
gpg: Good signature from "Michal Papis (RVM signing) <mp...@gmail.com>"
gpg:                 aka "Michal Papis <mi...@toptal.com>"
gpg:                 aka "[jpeg image of size 5015]"
gpg: WARNING: This key is not certified with a trusted signature!
gpg:          There is no indication that the signature belongs to the owner.
Primary key fingerprint: 409B 6B17 96C2 7546 2A17  0311 3804 BB82 D39D C0E3
     Subkey fingerprint: 62C9 E5F4 DA30 0D94 AC36  166B E206 C29F BF04 FF17
GPG verified '/home/jenkins/.rvm/archives/rvm-1.29.3.tgz'

Upgrading the RVM installation in /home/jenkins/.rvm/
Upgrade of RVM in /home/jenkins/.rvm/ is complete.

Upgrade Notes:

  * No new notes to display.

+ set +x
Running 'source /home/jenkins/.rvm/scripts/rvm'
Running 'rvm autolibs disable'
Running 'rvm install ruby-2.3.3'
Already installed ruby-2.3.3.
To reinstall use:

    rvm reinstall ruby-2.3.3

Running 'rvm gemset create solr-refguide-gemset'
ruby-2.3.3 - #gemset created /home/jenkins/.rvm/gems/ruby-2.3.3@solr-refguide-gemset
ruby-2.3.3 - #generating solr-refguide-gemset wrappers........
Running 'rvm ruby-2.3.3@solr-refguide-gemset'
Using /home/jenkins/.rvm/gems/ruby-2.3.3 with gemset solr-refguide-gemset
Running 'gem install --force --version 3.5.0 jekyll'
Successfully installed jekyll-3.5.0
Parsing documentation for jekyll-3.5.0
Done installing documentation for jekyll after 2 seconds
1 gem installed
Running 'gem install --force --version 2.1.0 jekyll-asciidoc'
Successfully installed jekyll-asciidoc-2.1.0
Parsing documentation for jekyll-asciidoc-2.1.0
Done installing documentation for jekyll-asciidoc after 0 seconds
1 gem installed
Running 'gem install --force --version 1.1.2 pygments.rb'
Successfully installed pygments.rb-1.1.2
Parsing documentation for pygments.rb-1.1.2
Done installing documentation for pygments.rb after 0 seconds
1 gem installed
+ ant clean build-site build-pdf
Buildfile: /home/jenkins/jenkins-slave/workspace/Solr-reference-guide-master/solr/solr-ref-guide/build.xml

clean:

build-init:
    [mkdir] Created dir: /home/jenkins/jenkins-slave/workspace/Solr-reference-guide-master/solr/build/solr-ref-guide/content
     [echo] Copying all non template files from src ...
     [copy] Copying 370 files to /home/jenkins/jenkins-slave/workspace/Solr-reference-guide-master/solr/build/solr-ref-guide/content
     [echo] Copy (w/prop replacement) any template files from src...
     [copy] Copying 1 file to /home/jenkins/jenkins-slave/workspace/Solr-reference-guide-master/solr/build/solr-ref-guide/content

ivy-availability-check:
[loadresource] Do not set property disallowed.ivy.jars.list as its length is 0.

-ivy-fail-disallowed-ivy-version:

ivy-fail:

ivy-configure:
[ivy:configure] :: Apache Ivy 2.3.0 - 20130110142753 :: http://ant.apache.org/ivy/ ::
[ivy:configure] :: loading settings :: file = /home/jenkins/jenkins-slave/workspace/Solr-reference-guide-master/lucene/top-level-ivy-settings.xml

resolve:
[ivy:retrieve] 
[ivy:retrieve] :: problems summary ::
[ivy:retrieve] :::: ERRORS
[ivy:retrieve] 	unknown resolver null
[ivy:retrieve] 	unknown resolver null
[ivy:retrieve] 	unknown resolver null
[ivy:retrieve] 	unknown resolver null
[ivy:retrieve] 	unknown resolver null
[ivy:retrieve] 	unknown resolver null
[ivy:retrieve] 
[ivy:retrieve] :: USE VERBOSE OR DEBUG MESSAGE LEVEL FOR MORE DETAILS

build-tools-jar:
    [mkdir] Created dir: /home/jenkins/jenkins-slave/workspace/Solr-reference-guide-master/solr/build/solr-ref-guide/classes
    [javac] Compiling 3 source files to /home/jenkins/jenkins-slave/workspace/Solr-reference-guide-master/solr/build/solr-ref-guide/classes
      [jar] Building jar: /home/jenkins/jenkins-slave/workspace/Solr-reference-guide-master/solr/build/solr-ref-guide/solr-ref-guide-tools.jar

build-nav-data-files:
     [java] Building up tree of all known pages
     [java] Creating /home/jenkins/jenkins-slave/workspace/Solr-reference-guide-master/solr/build/solr-ref-guide/content/_data/pdf-main-body.adoc
     [java] Creating /home/jenkins/jenkins-slave/workspace/Solr-reference-guide-master/solr/build/solr-ref-guide/content/_data/scrollnav.json
     [java] Creating /home/jenkins/jenkins-slave/workspace/Solr-reference-guide-master/solr/build/solr-ref-guide/content/_data/sidebar.json

-build-site:
     [echo] Running Jekyll...
     [exec] Configuration file: /home/jenkins/jenkins-slave/workspace/Solr-reference-guide-master/solr/build/solr-ref-guide/content/_config.yml
     [exec]             Source: /home/jenkins/jenkins-slave/workspace/Solr-reference-guide-master/solr/build/solr-ref-guide/content       Deprecation: The 'gems' configuration option has been renamed to 'plugins'. Please update your config file accordingly.
     [exec] 
     [exec]        Destination: ../html-site
     [exec]  Incremental build: disabled. Enable with --incremental
     [exec]       Generating... 
     [exec]                     done in 16.579 seconds.
     [exec]  Auto-regeneration: disabled. Use --watch to enable.

check-links-and-anchors:
     [java] Relative link points at id that doesn't exist in dest: solrcloud-autoscaling-policy-preferences.html#defining-collection-specific-policies
     [java]  ... source: file:/home/jenkins/jenkins-slave/workspace/Solr-reference-guide-master/solr/build/solr-ref-guide/html-site/solrcloud-autoscaling-overview.html
     [java] Total of 1 problems found

BUILD FAILED
/home/jenkins/jenkins-slave/workspace/Solr-reference-guide-master/solr/solr-ref-guide/build.xml:165: Java returned: 255

Total time: 29 seconds
Build step 'Execute shell' marked build as failure
Archiving artifacts
Publishing Javadoc
Email was triggered for: Failure - Any
Sending email for trigger: Failure - Any

[JENKINS] Solr-reference-guide-master - Build # 2229 - Still Failing

Posted by Apache Jenkins Server <je...@builds.apache.org>.
Build: https://builds.apache.org/job/Solr-reference-guide-master/2229/

Log: 
Started by timer
[EnvInject] - Loading node environment variables.
Building remotely on H19 (git-websites) in workspace /home/jenkins/jenkins-slave/workspace/Solr-reference-guide-master
 > git rev-parse --is-inside-work-tree # timeout=10
Fetching changes from the remote Git repository
 > git config remote.origin.url git://git.apache.org/lucene-solr.git # timeout=10
Cleaning workspace
 > git rev-parse --verify HEAD # timeout=10
Resetting working tree
 > git reset --hard # timeout=10
 > git clean -fdx # timeout=10
Fetching upstream changes from git://git.apache.org/lucene-solr.git
 > git --version # timeout=10
 > git fetch --tags --progress git://git.apache.org/lucene-solr.git +refs/heads/*:refs/remotes/origin/*
 > git rev-parse refs/remotes/origin/master^{commit} # timeout=10
 > git rev-parse refs/remotes/origin/origin/master^{commit} # timeout=10
Checking out Revision 86fa1cf11bf45e8ca4e78d653d2ef2ceeb584194 (refs/remotes/origin/master)
Commit message: "SOLR-11418: Allow comments in Streaming Expressions"
 > git config core.sparsecheckout # timeout=10
 > git checkout -f 86fa1cf11bf45e8ca4e78d653d2ef2ceeb584194
 > git rev-list 86fa1cf11bf45e8ca4e78d653d2ef2ceeb584194 # timeout=10
No emails were triggered.
[Solr-reference-guide-master] $ /usr/bin/env bash /tmp/jenkins766894475251358058.sh
+ set -e
+ RVM_PATH=/home/jenkins/.rvm
+ RUBY_VERSION=ruby-2.3.3
+ GEMSET=solr-refguide-gemset
+ curl -sSL https://get.rvm.io
+ bash -s -- --ignore-dotfiles stable
Turning on ignore dotfiles mode.
Downloading https://github.com/rvm/rvm/archive/1.29.3.tar.gz
Downloading https://github.com/rvm/rvm/releases/download/1.29.3/1.29.3.tar.gz.asc
gpg: Signature made Sun 10 Sep 2017 08:59:21 PM UTC using RSA key ID BF04FF17
gpg: Good signature from "Michal Papis (RVM signing) <mp...@gmail.com>"
gpg:                 aka "Michal Papis <mi...@toptal.com>"
gpg:                 aka "[jpeg image of size 5015]"
gpg: WARNING: This key is not certified with a trusted signature!
gpg:          There is no indication that the signature belongs to the owner.
Primary key fingerprint: 409B 6B17 96C2 7546 2A17  0311 3804 BB82 D39D C0E3
     Subkey fingerprint: 62C9 E5F4 DA30 0D94 AC36  166B E206 C29F BF04 FF17
GPG verified '/home/jenkins/.rvm/archives/rvm-1.29.3.tgz'

Upgrading the RVM installation in /home/jenkins/.rvm/
Upgrade of RVM in /home/jenkins/.rvm/ is complete.

Upgrade Notes:

  * No new notes to display.

+ set +x
Running 'source /home/jenkins/.rvm/scripts/rvm'
Running 'rvm autolibs disable'
Running 'rvm install ruby-2.3.3'
Already installed ruby-2.3.3.
To reinstall use:

    rvm reinstall ruby-2.3.3

Running 'rvm gemset create solr-refguide-gemset'
ruby-2.3.3 - #gemset created /home/jenkins/.rvm/gems/ruby-2.3.3@solr-refguide-gemset
ruby-2.3.3 - #generating solr-refguide-gemset wrappers........
Running 'rvm ruby-2.3.3@solr-refguide-gemset'
Using /home/jenkins/.rvm/gems/ruby-2.3.3 with gemset solr-refguide-gemset
Running 'gem install --force --version 3.5.0 jekyll'
Successfully installed jekyll-3.5.0
Parsing documentation for jekyll-3.5.0
Done installing documentation for jekyll after 2 seconds
1 gem installed
Running 'gem install --force --version 2.1.0 jekyll-asciidoc'
Successfully installed jekyll-asciidoc-2.1.0
Parsing documentation for jekyll-asciidoc-2.1.0
Done installing documentation for jekyll-asciidoc after 0 seconds
1 gem installed
Running 'gem install --force --version 1.1.2 pygments.rb'
Successfully installed pygments.rb-1.1.2
Parsing documentation for pygments.rb-1.1.2
Done installing documentation for pygments.rb after 0 seconds
1 gem installed
+ ant clean build-site build-pdf
Buildfile: /home/jenkins/jenkins-slave/workspace/Solr-reference-guide-master/solr/solr-ref-guide/build.xml

clean:

build-init:
    [mkdir] Created dir: /home/jenkins/jenkins-slave/workspace/Solr-reference-guide-master/solr/build/solr-ref-guide/content
     [echo] Copying all non template files from src ...
     [copy] Copying 370 files to /home/jenkins/jenkins-slave/workspace/Solr-reference-guide-master/solr/build/solr-ref-guide/content
     [echo] Copy (w/prop replacement) any template files from src...
     [copy] Copying 1 file to /home/jenkins/jenkins-slave/workspace/Solr-reference-guide-master/solr/build/solr-ref-guide/content

ivy-availability-check:
[loadresource] Do not set property disallowed.ivy.jars.list as its length is 0.

-ivy-fail-disallowed-ivy-version:

ivy-fail:

ivy-configure:
[ivy:configure] :: Apache Ivy 2.3.0 - 20130110142753 :: http://ant.apache.org/ivy/ ::
[ivy:configure] :: loading settings :: file = /home/jenkins/jenkins-slave/workspace/Solr-reference-guide-master/lucene/top-level-ivy-settings.xml

resolve:
[ivy:retrieve] 
[ivy:retrieve] :: problems summary ::
[ivy:retrieve] :::: ERRORS
[ivy:retrieve] 	unknown resolver null
[ivy:retrieve] 	unknown resolver null
[ivy:retrieve] 	unknown resolver null
[ivy:retrieve] 	unknown resolver null
[ivy:retrieve] 	unknown resolver null
[ivy:retrieve] 	unknown resolver null
[ivy:retrieve] 
[ivy:retrieve] :: USE VERBOSE OR DEBUG MESSAGE LEVEL FOR MORE DETAILS

build-tools-jar:
    [mkdir] Created dir: /home/jenkins/jenkins-slave/workspace/Solr-reference-guide-master/solr/build/solr-ref-guide/classes
    [javac] Compiling 3 source files to /home/jenkins/jenkins-slave/workspace/Solr-reference-guide-master/solr/build/solr-ref-guide/classes
      [jar] Building jar: /home/jenkins/jenkins-slave/workspace/Solr-reference-guide-master/solr/build/solr-ref-guide/solr-ref-guide-tools.jar

build-nav-data-files:
     [java] Building up tree of all known pages
     [java] Creating /home/jenkins/jenkins-slave/workspace/Solr-reference-guide-master/solr/build/solr-ref-guide/content/_data/pdf-main-body.adoc
     [java] Creating /home/jenkins/jenkins-slave/workspace/Solr-reference-guide-master/solr/build/solr-ref-guide/content/_data/scrollnav.json
     [java] Creating /home/jenkins/jenkins-slave/workspace/Solr-reference-guide-master/solr/build/solr-ref-guide/content/_data/sidebar.json

-build-site:
     [echo] Running Jekyll...
     [exec] Configuration file: /home/jenkins/jenkins-slave/workspace/Solr-reference-guide-master/solr/build/solr-ref-guide/content/_config.yml
     [exec]             Source: /home/jenkins/jenkins-slave/workspace/Solr-reference-guide-master/solr/build/solr-ref-guide/content
     [exec]        Destination: ../html-site
     [exec]  Incremental build: disabled. Enable with --incremental
     [exec]       Generating... 
     [exec]        Deprecation: The 'gems' configuration option has been renamed to 'plugins'. Please update your config file accordingly.
     [exec]                     done in 16.502 seconds.
     [exec]  Auto-regeneration: disabled. Use --watch to enable.

check-links-and-anchors:
     [java] Relative link points at id that doesn't exist in dest: solrcloud-autoscaling-policy-preferences.html#defining-collection-specific-policies
     [java]  ... source: file:/home/jenkins/jenkins-slave/workspace/Solr-reference-guide-master/solr/build/solr-ref-guide/html-site/solrcloud-autoscaling-overview.html
     [java] Total of 1 problems found

BUILD FAILED
/home/jenkins/jenkins-slave/workspace/Solr-reference-guide-master/solr/solr-ref-guide/build.xml:165: Java returned: 255

Total time: 29 seconds
Build step 'Execute shell' marked build as failure
Archiving artifacts
Publishing Javadoc
Email was triggered for: Failure - Any
Sending email for trigger: Failure - Any

[JENKINS] Solr-reference-guide-master - Build # 2228 - Still Failing

Posted by Apache Jenkins Server <je...@builds.apache.org>.
Build: https://builds.apache.org/job/Solr-reference-guide-master/2228/

Log: 
Started by timer
[EnvInject] - Loading node environment variables.
Building remotely on H19 (git-websites) in workspace /home/jenkins/jenkins-slave/workspace/Solr-reference-guide-master
 > git rev-parse --is-inside-work-tree # timeout=10
Fetching changes from the remote Git repository
 > git config remote.origin.url git://git.apache.org/lucene-solr.git # timeout=10
Cleaning workspace
 > git rev-parse --verify HEAD # timeout=10
Resetting working tree
 > git reset --hard # timeout=10
 > git clean -fdx # timeout=10
Fetching upstream changes from git://git.apache.org/lucene-solr.git
 > git --version # timeout=10
 > git fetch --tags --progress git://git.apache.org/lucene-solr.git +refs/heads/*:refs/remotes/origin/*
 > git rev-parse refs/remotes/origin/master^{commit} # timeout=10
 > git rev-parse refs/remotes/origin/origin/master^{commit} # timeout=10
Checking out Revision 86fa1cf11bf45e8ca4e78d653d2ef2ceeb584194 (refs/remotes/origin/master)
Commit message: "SOLR-11418: Allow comments in Streaming Expressions"
 > git config core.sparsecheckout # timeout=10
 > git checkout -f 86fa1cf11bf45e8ca4e78d653d2ef2ceeb584194
 > git rev-list 86fa1cf11bf45e8ca4e78d653d2ef2ceeb584194 # timeout=10
No emails were triggered.
[Solr-reference-guide-master] $ /usr/bin/env bash /tmp/jenkins4737058075620433337.sh
+ set -e
+ RVM_PATH=/home/jenkins/.rvm
+ RUBY_VERSION=ruby-2.3.3
+ GEMSET=solr-refguide-gemset
+ curl -sSL https://get.rvm.io
+ bash -s -- --ignore-dotfiles stable
Turning on ignore dotfiles mode.
Downloading https://github.com/rvm/rvm/archive/1.29.3.tar.gz
Downloading https://github.com/rvm/rvm/releases/download/1.29.3/1.29.3.tar.gz.asc
gpg: Signature made Sun 10 Sep 2017 08:59:21 PM UTC using RSA key ID BF04FF17
gpg: Good signature from "Michal Papis (RVM signing) <mp...@gmail.com>"
gpg:                 aka "Michal Papis <mi...@toptal.com>"
gpg:                 aka "[jpeg image of size 5015]"
gpg: WARNING: This key is not certified with a trusted signature!
gpg:          There is no indication that the signature belongs to the owner.
Primary key fingerprint: 409B 6B17 96C2 7546 2A17  0311 3804 BB82 D39D C0E3
     Subkey fingerprint: 62C9 E5F4 DA30 0D94 AC36  166B E206 C29F BF04 FF17
GPG verified '/home/jenkins/.rvm/archives/rvm-1.29.3.tgz'

Upgrading the RVM installation in /home/jenkins/.rvm/
Upgrade of RVM in /home/jenkins/.rvm/ is complete.

Upgrade Notes:

  * No new notes to display.

+ set +x
Running 'source /home/jenkins/.rvm/scripts/rvm'
Running 'rvm autolibs disable'
Running 'rvm install ruby-2.3.3'
Already installed ruby-2.3.3.
To reinstall use:

    rvm reinstall ruby-2.3.3

Running 'rvm gemset create solr-refguide-gemset'
ruby-2.3.3 - #gemset created /home/jenkins/.rvm/gems/ruby-2.3.3@solr-refguide-gemset
ruby-2.3.3 - #generating solr-refguide-gemset wrappers........
Running 'rvm ruby-2.3.3@solr-refguide-gemset'
Using /home/jenkins/.rvm/gems/ruby-2.3.3 with gemset solr-refguide-gemset
Running 'gem install --force --version 3.5.0 jekyll'
Successfully installed jekyll-3.5.0
Parsing documentation for jekyll-3.5.0
Done installing documentation for jekyll after 2 seconds
1 gem installed
Running 'gem install --force --version 2.1.0 jekyll-asciidoc'
Successfully installed jekyll-asciidoc-2.1.0
Parsing documentation for jekyll-asciidoc-2.1.0
Done installing documentation for jekyll-asciidoc after 0 seconds
1 gem installed
Running 'gem install --force --version 1.1.2 pygments.rb'
Successfully installed pygments.rb-1.1.2
Parsing documentation for pygments.rb-1.1.2
Done installing documentation for pygments.rb after 0 seconds
1 gem installed
+ ant clean build-site build-pdf
Buildfile: /home/jenkins/jenkins-slave/workspace/Solr-reference-guide-master/solr/solr-ref-guide/build.xml

clean:

build-init:
    [mkdir] Created dir: /home/jenkins/jenkins-slave/workspace/Solr-reference-guide-master/solr/build/solr-ref-guide/content
     [echo] Copying all non template files from src ...
     [copy] Copying 370 files to /home/jenkins/jenkins-slave/workspace/Solr-reference-guide-master/solr/build/solr-ref-guide/content
     [echo] Copy (w/prop replacement) any template files from src...
     [copy] Copying 1 file to /home/jenkins/jenkins-slave/workspace/Solr-reference-guide-master/solr/build/solr-ref-guide/content

ivy-availability-check:
[loadresource] Do not set property disallowed.ivy.jars.list as its length is 0.

-ivy-fail-disallowed-ivy-version:

ivy-fail:

ivy-configure:
[ivy:configure] :: Apache Ivy 2.3.0 - 20130110142753 :: http://ant.apache.org/ivy/ ::
[ivy:configure] :: loading settings :: file = /home/jenkins/jenkins-slave/workspace/Solr-reference-guide-master/lucene/top-level-ivy-settings.xml

resolve:
[ivy:retrieve] 
[ivy:retrieve] :: problems summary ::
[ivy:retrieve] :::: ERRORS
[ivy:retrieve] 	unknown resolver null
[ivy:retrieve] 	unknown resolver null
[ivy:retrieve] 	unknown resolver null
[ivy:retrieve] 	unknown resolver null
[ivy:retrieve] 	unknown resolver null
[ivy:retrieve] 	unknown resolver null
[ivy:retrieve] 
[ivy:retrieve] :: USE VERBOSE OR DEBUG MESSAGE LEVEL FOR MORE DETAILS

build-tools-jar:
    [mkdir] Created dir: /home/jenkins/jenkins-slave/workspace/Solr-reference-guide-master/solr/build/solr-ref-guide/classes
    [javac] Compiling 3 source files to /home/jenkins/jenkins-slave/workspace/Solr-reference-guide-master/solr/build/solr-ref-guide/classes
      [jar] Building jar: /home/jenkins/jenkins-slave/workspace/Solr-reference-guide-master/solr/build/solr-ref-guide/solr-ref-guide-tools.jar

build-nav-data-files:
     [java] Building up tree of all known pages
     [java] Creating /home/jenkins/jenkins-slave/workspace/Solr-reference-guide-master/solr/build/solr-ref-guide/content/_data/pdf-main-body.adoc
     [java] Creating /home/jenkins/jenkins-slave/workspace/Solr-reference-guide-master/solr/build/solr-ref-guide/content/_data/scrollnav.json
     [java] Creating /home/jenkins/jenkins-slave/workspace/Solr-reference-guide-master/solr/build/solr-ref-guide/content/_data/sidebar.json

-build-site:
     [echo] Running Jekyll...
     [exec] Configuration file: /home/jenkins/jenkins-slave/workspace/Solr-reference-guide-master/solr/build/solr-ref-guide/content/_config.yml
     [exec]             Source: /home/jenkins/jenkins-slave/workspace/Solr-reference-guide-master/solr/build/solr-ref-guide/content
     [exec]        Destination: ../html-site
     [exec]  Incremental build: disabled. Enable with --incremental
     [exec]       Generating... 
     [exec]        Deprecation: The 'gems' configuration option has been renamed to 'plugins'. Please update your config file accordingly.
     [exec]                     done in 16.568 seconds.
     [exec]  Auto-regeneration: disabled. Use --watch to enable.

check-links-and-anchors:
     [java] Relative link points at id that doesn't exist in dest: solrcloud-autoscaling-policy-preferences.html#defining-collection-specific-policies
     [java]  ... source: file:/home/jenkins/jenkins-slave/workspace/Solr-reference-guide-master/solr/build/solr-ref-guide/html-site/solrcloud-autoscaling-overview.html
     [java] Total of 1 problems found

BUILD FAILED
/home/jenkins/jenkins-slave/workspace/Solr-reference-guide-master/solr/solr-ref-guide/build.xml:165: Java returned: 255

Total time: 29 seconds
Build step 'Execute shell' marked build as failure
Archiving artifacts
Publishing Javadoc
Email was triggered for: Failure - Any
Sending email for trigger: Failure - Any

[JENKINS] Solr-reference-guide-master - Build # 2227 - Still Failing

Posted by Apache Jenkins Server <je...@builds.apache.org>.
Build: https://builds.apache.org/job/Solr-reference-guide-master/2227/

Log: 
Started by timer
[EnvInject] - Loading node environment variables.
Building remotely on H19 (git-websites) in workspace /home/jenkins/jenkins-slave/workspace/Solr-reference-guide-master
 > git rev-parse --is-inside-work-tree # timeout=10
Fetching changes from the remote Git repository
 > git config remote.origin.url git://git.apache.org/lucene-solr.git # timeout=10
Cleaning workspace
 > git rev-parse --verify HEAD # timeout=10
Resetting working tree
 > git reset --hard # timeout=10
 > git clean -fdx # timeout=10
Fetching upstream changes from git://git.apache.org/lucene-solr.git
 > git --version # timeout=10
 > git fetch --tags --progress git://git.apache.org/lucene-solr.git +refs/heads/*:refs/remotes/origin/*
 > git rev-parse refs/remotes/origin/master^{commit} # timeout=10
 > git rev-parse refs/remotes/origin/origin/master^{commit} # timeout=10
Checking out Revision 86fa1cf11bf45e8ca4e78d653d2ef2ceeb584194 (refs/remotes/origin/master)
Commit message: "SOLR-11418: Allow comments in Streaming Expressions"
 > git config core.sparsecheckout # timeout=10
 > git checkout -f 86fa1cf11bf45e8ca4e78d653d2ef2ceeb584194
 > git rev-list 86fa1cf11bf45e8ca4e78d653d2ef2ceeb584194 # timeout=10
No emails were triggered.
[Solr-reference-guide-master] $ /usr/bin/env bash /tmp/jenkins3906309338388320433.sh
+ set -e
+ RVM_PATH=/home/jenkins/.rvm
+ RUBY_VERSION=ruby-2.3.3
+ GEMSET=solr-refguide-gemset
+ curl -sSL https://get.rvm.io
+ bash -s -- --ignore-dotfiles stable
Turning on ignore dotfiles mode.
Downloading https://github.com/rvm/rvm/archive/1.29.3.tar.gz
Downloading https://github.com/rvm/rvm/releases/download/1.29.3/1.29.3.tar.gz.asc
gpg: Signature made Sun 10 Sep 2017 08:59:21 PM UTC using RSA key ID BF04FF17
gpg: Good signature from "Michal Papis (RVM signing) <mp...@gmail.com>"
gpg:                 aka "Michal Papis <mi...@toptal.com>"
gpg:                 aka "[jpeg image of size 5015]"
gpg: WARNING: This key is not certified with a trusted signature!
gpg:          There is no indication that the signature belongs to the owner.
Primary key fingerprint: 409B 6B17 96C2 7546 2A17  0311 3804 BB82 D39D C0E3
     Subkey fingerprint: 62C9 E5F4 DA30 0D94 AC36  166B E206 C29F BF04 FF17
GPG verified '/home/jenkins/.rvm/archives/rvm-1.29.3.tgz'

Upgrading the RVM installation in /home/jenkins/.rvm/
Upgrade of RVM in /home/jenkins/.rvm/ is complete.

Upgrade Notes:

  * No new notes to display.

+ set +x
Running 'source /home/jenkins/.rvm/scripts/rvm'
Running 'rvm autolibs disable'
Running 'rvm install ruby-2.3.3'
Already installed ruby-2.3.3.
To reinstall use:

    rvm reinstall ruby-2.3.3

Running 'rvm gemset create solr-refguide-gemset'
ruby-2.3.3 - #gemset created /home/jenkins/.rvm/gems/ruby-2.3.3@solr-refguide-gemset
ruby-2.3.3 - #generating solr-refguide-gemset wrappers........
Running 'rvm ruby-2.3.3@solr-refguide-gemset'
Using /home/jenkins/.rvm/gems/ruby-2.3.3 with gemset solr-refguide-gemset
Running 'gem install --force --version 3.5.0 jekyll'
Successfully installed jekyll-3.5.0
Parsing documentation for jekyll-3.5.0
Done installing documentation for jekyll after 2 seconds
1 gem installed
Running 'gem install --force --version 2.1.0 jekyll-asciidoc'
Successfully installed jekyll-asciidoc-2.1.0
Parsing documentation for jekyll-asciidoc-2.1.0
Done installing documentation for jekyll-asciidoc after 0 seconds
1 gem installed
Running 'gem install --force --version 1.1.2 pygments.rb'
Successfully installed pygments.rb-1.1.2
Parsing documentation for pygments.rb-1.1.2
Done installing documentation for pygments.rb after 0 seconds
1 gem installed
+ ant clean build-site build-pdf
Buildfile: /home/jenkins/jenkins-slave/workspace/Solr-reference-guide-master/solr/solr-ref-guide/build.xml

clean:

build-init:
    [mkdir] Created dir: /home/jenkins/jenkins-slave/workspace/Solr-reference-guide-master/solr/build/solr-ref-guide/content
     [echo] Copying all non template files from src ...
     [copy] Copying 370 files to /home/jenkins/jenkins-slave/workspace/Solr-reference-guide-master/solr/build/solr-ref-guide/content
     [echo] Copy (w/prop replacement) any template files from src...
     [copy] Copying 1 file to /home/jenkins/jenkins-slave/workspace/Solr-reference-guide-master/solr/build/solr-ref-guide/content

ivy-availability-check:
[loadresource] Do not set property disallowed.ivy.jars.list as its length is 0.

-ivy-fail-disallowed-ivy-version:

ivy-fail:

ivy-configure:
[ivy:configure] :: Apache Ivy 2.3.0 - 20130110142753 :: http://ant.apache.org/ivy/ ::
[ivy:configure] :: loading settings :: file = /home/jenkins/jenkins-slave/workspace/Solr-reference-guide-master/lucene/top-level-ivy-settings.xml

resolve:
[ivy:retrieve] 
[ivy:retrieve] :: problems summary ::
[ivy:retrieve] :::: ERRORS
[ivy:retrieve] 	unknown resolver null
[ivy:retrieve] 	unknown resolver null
[ivy:retrieve] 	unknown resolver null
[ivy:retrieve] 	unknown resolver null
[ivy:retrieve] 	unknown resolver null
[ivy:retrieve] 	unknown resolver null
[ivy:retrieve] 
[ivy:retrieve] :: USE VERBOSE OR DEBUG MESSAGE LEVEL FOR MORE DETAILS

build-tools-jar:
    [mkdir] Created dir: /home/jenkins/jenkins-slave/workspace/Solr-reference-guide-master/solr/build/solr-ref-guide/classes
    [javac] Compiling 3 source files to /home/jenkins/jenkins-slave/workspace/Solr-reference-guide-master/solr/build/solr-ref-guide/classes
      [jar] Building jar: /home/jenkins/jenkins-slave/workspace/Solr-reference-guide-master/solr/build/solr-ref-guide/solr-ref-guide-tools.jar

build-nav-data-files:
     [java] Building up tree of all known pages
     [java] Creating /home/jenkins/jenkins-slave/workspace/Solr-reference-guide-master/solr/build/solr-ref-guide/content/_data/pdf-main-body.adoc
     [java] Creating /home/jenkins/jenkins-slave/workspace/Solr-reference-guide-master/solr/build/solr-ref-guide/content/_data/scrollnav.json
     [java] Creating /home/jenkins/jenkins-slave/workspace/Solr-reference-guide-master/solr/build/solr-ref-guide/content/_data/sidebar.json

-build-site:
     [echo] Running Jekyll...
     [exec] Configuration file: /home/jenkins/jenkins-slave/workspace/Solr-reference-guide-master/solr/build/solr-ref-guide/content/_config.yml
     [exec]        Deprecation: The 'gems' configuration option has been renamed to 'plugins'. Please update your config file accordingly.
     [exec]             Source: /home/jenkins/jenkins-slave/workspace/Solr-reference-guide-master/solr/build/solr-ref-guide/content
     [exec]        Destination: ../html-site
     [exec]  Incremental build: disabled. Enable with --incremental
     [exec]       Generating... 
     [exec]                     done in 16.599 seconds.
     [exec]  Auto-regeneration: disabled. Use --watch to enable.

check-links-and-anchors:
     [java] Relative link points at id that doesn't exist in dest: solrcloud-autoscaling-policy-preferences.html#defining-collection-specific-policies
     [java]  ... source: file:/home/jenkins/jenkins-slave/workspace/Solr-reference-guide-master/solr/build/solr-ref-guide/html-site/solrcloud-autoscaling-overview.html
     [java] Total of 1 problems found

BUILD FAILED
/home/jenkins/jenkins-slave/workspace/Solr-reference-guide-master/solr/solr-ref-guide/build.xml:165: Java returned: 255

Total time: 29 seconds
Build step 'Execute shell' marked build as failure
Archiving artifacts
Publishing Javadoc
Email was triggered for: Failure - Any
Sending email for trigger: Failure - Any

[JENKINS] Solr-reference-guide-master - Build # 2226 - Still Failing

Posted by Apache Jenkins Server <je...@builds.apache.org>.
Build: https://builds.apache.org/job/Solr-reference-guide-master/2226/

Log: 
Started by timer
[EnvInject] - Loading node environment variables.
Building remotely on H20 (git-websites) in workspace /home/jenkins/jenkins-slave/workspace/Solr-reference-guide-master
 > git rev-parse --is-inside-work-tree # timeout=10
Fetching changes from the remote Git repository
 > git config remote.origin.url git://git.apache.org/lucene-solr.git # timeout=10
Cleaning workspace
 > git rev-parse --verify HEAD # timeout=10
Resetting working tree
 > git reset --hard # timeout=10
 > git clean -fdx # timeout=10
Fetching upstream changes from git://git.apache.org/lucene-solr.git
 > git --version # timeout=10
 > git fetch --tags --progress git://git.apache.org/lucene-solr.git +refs/heads/*:refs/remotes/origin/*
 > git rev-parse refs/remotes/origin/master^{commit} # timeout=10
 > git rev-parse refs/remotes/origin/origin/master^{commit} # timeout=10
Checking out Revision 86fa1cf11bf45e8ca4e78d653d2ef2ceeb584194 (refs/remotes/origin/master)
Commit message: "SOLR-11418: Allow comments in Streaming Expressions"
 > git config core.sparsecheckout # timeout=10
 > git checkout -f 86fa1cf11bf45e8ca4e78d653d2ef2ceeb584194
 > git rev-list 3f94f2ed4cd3e0126a588952946855337c940959 # timeout=10
No emails were triggered.
[Solr-reference-guide-master] $ /usr/bin/env bash /tmp/jenkins7444167183653243626.sh
+ set -e
+ RVM_PATH=/home/jenkins/.rvm
+ RUBY_VERSION=ruby-2.3.3
+ GEMSET=solr-refguide-gemset
+ curl -sSL https://get.rvm.io
+ bash -s -- --ignore-dotfiles stable
Turning on ignore dotfiles mode.
Downloading https://github.com/rvm/rvm/archive/1.29.3.tar.gz
Downloading https://github.com/rvm/rvm/releases/download/1.29.3/1.29.3.tar.gz.asc
gpg: Signature made Sun 10 Sep 2017 08:59:21 PM UTC using RSA key ID BF04FF17
gpg: Good signature from "Michal Papis (RVM signing) <mp...@gmail.com>"
gpg:                 aka "Michal Papis <mi...@toptal.com>"
gpg:                 aka "[jpeg image of size 5015]"
gpg: WARNING: This key is not certified with a trusted signature!
gpg:          There is no indication that the signature belongs to the owner.
Primary key fingerprint: 409B 6B17 96C2 7546 2A17  0311 3804 BB82 D39D C0E3
     Subkey fingerprint: 62C9 E5F4 DA30 0D94 AC36  166B E206 C29F BF04 FF17
GPG verified '/home/jenkins/.rvm/archives/rvm-1.29.3.tgz'

Upgrading the RVM installation in /home/jenkins/.rvm/
Upgrade of RVM in /home/jenkins/.rvm/ is complete.

Upgrade Notes:

  * No new notes to display.

+ set +x
Running 'source /home/jenkins/.rvm/scripts/rvm'
Running 'rvm autolibs disable'
Running 'rvm install ruby-2.3.3'
Already installed ruby-2.3.3.
To reinstall use:

    rvm reinstall ruby-2.3.3

Running 'rvm gemset create solr-refguide-gemset'
ruby-2.3.3 - #gemset created /home/jenkins/.rvm/gems/ruby-2.3.3@solr-refguide-gemset
ruby-2.3.3 - #generating solr-refguide-gemset wrappers........
Running 'rvm ruby-2.3.3@solr-refguide-gemset'
Using /home/jenkins/.rvm/gems/ruby-2.3.3 with gemset solr-refguide-gemset
Running 'gem install --force --version 3.5.0 jekyll'
Successfully installed jekyll-3.5.0
Parsing documentation for jekyll-3.5.0
Done installing documentation for jekyll after 2 seconds
1 gem installed
Running 'gem install --force --version 2.1.0 jekyll-asciidoc'
Successfully installed jekyll-asciidoc-2.1.0
Parsing documentation for jekyll-asciidoc-2.1.0
Done installing documentation for jekyll-asciidoc after 0 seconds
1 gem installed
Running 'gem install --force --version 1.1.2 pygments.rb'
Successfully installed pygments.rb-1.1.2
Parsing documentation for pygments.rb-1.1.2
Done installing documentation for pygments.rb after 0 seconds
1 gem installed
+ ant clean build-site build-pdf
Buildfile: /home/jenkins/jenkins-slave/workspace/Solr-reference-guide-master/solr/solr-ref-guide/build.xml

clean:

build-init:
    [mkdir] Created dir: /home/jenkins/jenkins-slave/workspace/Solr-reference-guide-master/solr/build/solr-ref-guide/content
     [echo] Copying all non template files from src ...
     [copy] Copying 370 files to /home/jenkins/jenkins-slave/workspace/Solr-reference-guide-master/solr/build/solr-ref-guide/content
     [echo] Copy (w/prop replacement) any template files from src...
     [copy] Copying 1 file to /home/jenkins/jenkins-slave/workspace/Solr-reference-guide-master/solr/build/solr-ref-guide/content

ivy-availability-check:
[loadresource] Do not set property disallowed.ivy.jars.list as its length is 0.

-ivy-fail-disallowed-ivy-version:

ivy-fail:

ivy-configure:
[ivy:configure] :: Apache Ivy 2.3.0 - 20130110142753 :: http://ant.apache.org/ivy/ ::
[ivy:configure] :: loading settings :: file = /home/jenkins/jenkins-slave/workspace/Solr-reference-guide-master/lucene/top-level-ivy-settings.xml

resolve:
[ivy:retrieve] 
[ivy:retrieve] :: problems summary ::
[ivy:retrieve] :::: ERRORS
[ivy:retrieve] 	unknown resolver null
[ivy:retrieve] 	unknown resolver null
[ivy:retrieve] 	unknown resolver null
[ivy:retrieve] 	unknown resolver null
[ivy:retrieve] 	unknown resolver null
[ivy:retrieve] 	unknown resolver null
[ivy:retrieve] 
[ivy:retrieve] :: USE VERBOSE OR DEBUG MESSAGE LEVEL FOR MORE DETAILS

build-tools-jar:
    [mkdir] Created dir: /home/jenkins/jenkins-slave/workspace/Solr-reference-guide-master/solr/build/solr-ref-guide/classes
    [javac] Compiling 3 source files to /home/jenkins/jenkins-slave/workspace/Solr-reference-guide-master/solr/build/solr-ref-guide/classes
      [jar] Building jar: /home/jenkins/jenkins-slave/workspace/Solr-reference-guide-master/solr/build/solr-ref-guide/solr-ref-guide-tools.jar

build-nav-data-files:
     [java] Building up tree of all known pages
     [java] Creating /home/jenkins/jenkins-slave/workspace/Solr-reference-guide-master/solr/build/solr-ref-guide/content/_data/pdf-main-body.adoc
     [java] Creating /home/jenkins/jenkins-slave/workspace/Solr-reference-guide-master/solr/build/solr-ref-guide/content/_data/scrollnav.json
     [java] Creating /home/jenkins/jenkins-slave/workspace/Solr-reference-guide-master/solr/build/solr-ref-guide/content/_data/sidebar.json

-build-site:
     [echo] Running Jekyll...
     [exec] Configuration file: /home/jenkins/jenkins-slave/workspace/Solr-reference-guide-master/solr/build/solr-ref-guide/content/_config.yml       Deprecation: The 'gems' configuration option has been renamed to 'plugins'. Please update your config file accordingly.
     [exec] 
     [exec]             Source: /home/jenkins/jenkins-slave/workspace/Solr-reference-guide-master/solr/build/solr-ref-guide/content
     [exec]        Destination: ../html-site
     [exec]  Incremental build: disabled. Enable with --incremental
     [exec]       Generating... 
     [exec]                     done in 16.457 seconds.
     [exec]  Auto-regeneration: disabled. Use --watch to enable.

check-links-and-anchors:
     [java] Relative link points at id that doesn't exist in dest: solrcloud-autoscaling-policy-preferences.html#defining-collection-specific-policies
     [java]  ... source: file:/home/jenkins/jenkins-slave/workspace/Solr-reference-guide-master/solr/build/solr-ref-guide/html-site/solrcloud-autoscaling-overview.html
     [java] Total of 1 problems found

BUILD FAILED
/home/jenkins/jenkins-slave/workspace/Solr-reference-guide-master/solr/solr-ref-guide/build.xml:165: Java returned: 255

Total time: 29 seconds
Build step 'Execute shell' marked build as failure
Archiving artifacts
Publishing Javadoc
Email was triggered for: Failure - Any
Sending email for trigger: Failure - Any

[JENKINS] Solr-reference-guide-master - Build # 2225 - Still Failing

Posted by Apache Jenkins Server <je...@builds.apache.org>.
Build: https://builds.apache.org/job/Solr-reference-guide-master/2225/

Log: 
Started by timer
[EnvInject] - Loading node environment variables.
Building remotely on H19 (git-websites) in workspace /home/jenkins/jenkins-slave/workspace/Solr-reference-guide-master
 > git rev-parse --is-inside-work-tree # timeout=10
Fetching changes from the remote Git repository
 > git config remote.origin.url git://git.apache.org/lucene-solr.git # timeout=10
Cleaning workspace
 > git rev-parse --verify HEAD # timeout=10
Resetting working tree
 > git reset --hard # timeout=10
 > git clean -fdx # timeout=10
Fetching upstream changes from git://git.apache.org/lucene-solr.git
 > git --version # timeout=10
 > git fetch --tags --progress git://git.apache.org/lucene-solr.git +refs/heads/*:refs/remotes/origin/*
 > git rev-parse refs/remotes/origin/master^{commit} # timeout=10
 > git rev-parse refs/remotes/origin/origin/master^{commit} # timeout=10
Checking out Revision 3f94f2ed4cd3e0126a588952946855337c940959 (refs/remotes/origin/master)
Commit message: "SOLR-11414: Add gammaDistribution Stream Evaluator"
 > git config core.sparsecheckout # timeout=10
 > git checkout -f 3f94f2ed4cd3e0126a588952946855337c940959
 > git rev-list 3f94f2ed4cd3e0126a588952946855337c940959 # timeout=10
No emails were triggered.
[Solr-reference-guide-master] $ /usr/bin/env bash /tmp/jenkins4424018144202043220.sh
+ set -e
+ RVM_PATH=/home/jenkins/.rvm
+ RUBY_VERSION=ruby-2.3.3
+ GEMSET=solr-refguide-gemset
+ curl -sSL https://get.rvm.io
+ bash -s -- --ignore-dotfiles stable
Turning on ignore dotfiles mode.
Downloading https://github.com/rvm/rvm/archive/1.29.3.tar.gz
Downloading https://github.com/rvm/rvm/releases/download/1.29.3/1.29.3.tar.gz.asc
gpg: Signature made Sun 10 Sep 2017 08:59:21 PM UTC using RSA key ID BF04FF17
gpg: Good signature from "Michal Papis (RVM signing) <mp...@gmail.com>"
gpg:                 aka "Michal Papis <mi...@toptal.com>"
gpg:                 aka "[jpeg image of size 5015]"
gpg: WARNING: This key is not certified with a trusted signature!
gpg:          There is no indication that the signature belongs to the owner.
Primary key fingerprint: 409B 6B17 96C2 7546 2A17  0311 3804 BB82 D39D C0E3
     Subkey fingerprint: 62C9 E5F4 DA30 0D94 AC36  166B E206 C29F BF04 FF17
GPG verified '/home/jenkins/.rvm/archives/rvm-1.29.3.tgz'

Upgrading the RVM installation in /home/jenkins/.rvm/
Upgrade of RVM in /home/jenkins/.rvm/ is complete.

Upgrade Notes:

  * No new notes to display.

+ set +x
Running 'source /home/jenkins/.rvm/scripts/rvm'
Running 'rvm autolibs disable'
Running 'rvm install ruby-2.3.3'
Already installed ruby-2.3.3.
To reinstall use:

    rvm reinstall ruby-2.3.3

Running 'rvm gemset create solr-refguide-gemset'
ruby-2.3.3 - #gemset created /home/jenkins/.rvm/gems/ruby-2.3.3@solr-refguide-gemset
ruby-2.3.3 - #generating solr-refguide-gemset wrappers........
Running 'rvm ruby-2.3.3@solr-refguide-gemset'
Using /home/jenkins/.rvm/gems/ruby-2.3.3 with gemset solr-refguide-gemset
Running 'gem install --force --version 3.5.0 jekyll'
Successfully installed jekyll-3.5.0
Parsing documentation for jekyll-3.5.0
Done installing documentation for jekyll after 2 seconds
1 gem installed
Running 'gem install --force --version 2.1.0 jekyll-asciidoc'
Successfully installed jekyll-asciidoc-2.1.0
Parsing documentation for jekyll-asciidoc-2.1.0
Done installing documentation for jekyll-asciidoc after 0 seconds
1 gem installed
Running 'gem install --force --version 1.1.2 pygments.rb'
Successfully installed pygments.rb-1.1.2
Parsing documentation for pygments.rb-1.1.2
Done installing documentation for pygments.rb after 0 seconds
1 gem installed
+ ant clean build-site build-pdf
Buildfile: /home/jenkins/jenkins-slave/workspace/Solr-reference-guide-master/solr/solr-ref-guide/build.xml

clean:

build-init:
    [mkdir] Created dir: /home/jenkins/jenkins-slave/workspace/Solr-reference-guide-master/solr/build/solr-ref-guide/content
     [echo] Copying all non template files from src ...
     [copy] Copying 370 files to /home/jenkins/jenkins-slave/workspace/Solr-reference-guide-master/solr/build/solr-ref-guide/content
     [echo] Copy (w/prop replacement) any template files from src...
     [copy] Copying 1 file to /home/jenkins/jenkins-slave/workspace/Solr-reference-guide-master/solr/build/solr-ref-guide/content

ivy-availability-check:
[loadresource] Do not set property disallowed.ivy.jars.list as its length is 0.

-ivy-fail-disallowed-ivy-version:

ivy-fail:

ivy-configure:
[ivy:configure] :: Apache Ivy 2.3.0 - 20130110142753 :: http://ant.apache.org/ivy/ ::
[ivy:configure] :: loading settings :: file = /home/jenkins/jenkins-slave/workspace/Solr-reference-guide-master/lucene/top-level-ivy-settings.xml

resolve:
[ivy:retrieve] 
[ivy:retrieve] :: problems summary ::
[ivy:retrieve] :::: ERRORS
[ivy:retrieve] 	unknown resolver null
[ivy:retrieve] 	unknown resolver null
[ivy:retrieve] 	unknown resolver null
[ivy:retrieve] 	unknown resolver null
[ivy:retrieve] 	unknown resolver null
[ivy:retrieve] 	unknown resolver null
[ivy:retrieve] 
[ivy:retrieve] :: USE VERBOSE OR DEBUG MESSAGE LEVEL FOR MORE DETAILS

build-tools-jar:
    [mkdir] Created dir: /home/jenkins/jenkins-slave/workspace/Solr-reference-guide-master/solr/build/solr-ref-guide/classes
    [javac] Compiling 3 source files to /home/jenkins/jenkins-slave/workspace/Solr-reference-guide-master/solr/build/solr-ref-guide/classes
      [jar] Building jar: /home/jenkins/jenkins-slave/workspace/Solr-reference-guide-master/solr/build/solr-ref-guide/solr-ref-guide-tools.jar

build-nav-data-files:
     [java] Building up tree of all known pages
     [java] Creating /home/jenkins/jenkins-slave/workspace/Solr-reference-guide-master/solr/build/solr-ref-guide/content/_data/pdf-main-body.adoc
     [java] Creating /home/jenkins/jenkins-slave/workspace/Solr-reference-guide-master/solr/build/solr-ref-guide/content/_data/scrollnav.json
     [java] Creating /home/jenkins/jenkins-slave/workspace/Solr-reference-guide-master/solr/build/solr-ref-guide/content/_data/sidebar.json

-build-site:
     [echo] Running Jekyll...
     [exec] Configuration file: /home/jenkins/jenkins-slave/workspace/Solr-reference-guide-master/solr/build/solr-ref-guide/content/_config.yml
     [exec]             Source: /home/jenkins/jenkins-slave/workspace/Solr-reference-guide-master/solr/build/solr-ref-guide/content
     [exec]        Deprecation: The 'gems' configuration option has been renamed to 'plugins'. Please update your config file accordingly.
     [exec]        Destination: ../html-site
     [exec]  Incremental build: disabled. Enable with --incremental
     [exec]       Generating... 
     [exec]                     done in 16.572 seconds.
     [exec]  Auto-regeneration: disabled. Use --watch to enable.

check-links-and-anchors:
     [java] Relative link points at id that doesn't exist in dest: solrcloud-autoscaling-policy-preferences.html#defining-collection-specific-policies
     [java]  ... source: file:/home/jenkins/jenkins-slave/workspace/Solr-reference-guide-master/solr/build/solr-ref-guide/html-site/solrcloud-autoscaling-overview.html
     [java] Total of 1 problems found

BUILD FAILED
/home/jenkins/jenkins-slave/workspace/Solr-reference-guide-master/solr/solr-ref-guide/build.xml:165: Java returned: 255

Total time: 29 seconds
Build step 'Execute shell' marked build as failure
Archiving artifacts
Publishing Javadoc
Email was triggered for: Failure - Any
Sending email for trigger: Failure - Any

[JENKINS] Solr-reference-guide-master - Build # 2224 - Still Failing

Posted by Apache Jenkins Server <je...@builds.apache.org>.
Build: https://builds.apache.org/job/Solr-reference-guide-master/2224/

Log: 
Started by timer
[EnvInject] - Loading node environment variables.
Building remotely on H19 (git-websites) in workspace /home/jenkins/jenkins-slave/workspace/Solr-reference-guide-master
 > git rev-parse --is-inside-work-tree # timeout=10
Fetching changes from the remote Git repository
 > git config remote.origin.url git://git.apache.org/lucene-solr.git # timeout=10
Cleaning workspace
 > git rev-parse --verify HEAD # timeout=10
Resetting working tree
 > git reset --hard # timeout=10
 > git clean -fdx # timeout=10
Fetching upstream changes from git://git.apache.org/lucene-solr.git
 > git --version # timeout=10
 > git fetch --tags --progress git://git.apache.org/lucene-solr.git +refs/heads/*:refs/remotes/origin/*
 > git rev-parse refs/remotes/origin/master^{commit} # timeout=10
 > git rev-parse refs/remotes/origin/origin/master^{commit} # timeout=10
Checking out Revision 3f94f2ed4cd3e0126a588952946855337c940959 (refs/remotes/origin/master)
Commit message: "SOLR-11414: Add gammaDistribution Stream Evaluator"
 > git config core.sparsecheckout # timeout=10
 > git checkout -f 3f94f2ed4cd3e0126a588952946855337c940959
 > git rev-list 3f94f2ed4cd3e0126a588952946855337c940959 # timeout=10
No emails were triggered.
[Solr-reference-guide-master] $ /usr/bin/env bash /tmp/jenkins754260596697082632.sh
+ set -e
+ RVM_PATH=/home/jenkins/.rvm
+ RUBY_VERSION=ruby-2.3.3
+ GEMSET=solr-refguide-gemset
+ curl -sSL https://get.rvm.io
+ bash -s -- --ignore-dotfiles stable
Turning on ignore dotfiles mode.
Downloading https://github.com/rvm/rvm/archive/1.29.3.tar.gz
Downloading https://github.com/rvm/rvm/releases/download/1.29.3/1.29.3.tar.gz.asc
gpg: Signature made Sun 10 Sep 2017 08:59:21 PM UTC using RSA key ID BF04FF17
gpg: Good signature from "Michal Papis (RVM signing) <mp...@gmail.com>"
gpg:                 aka "Michal Papis <mi...@toptal.com>"
gpg:                 aka "[jpeg image of size 5015]"
gpg: WARNING: This key is not certified with a trusted signature!
gpg:          There is no indication that the signature belongs to the owner.
Primary key fingerprint: 409B 6B17 96C2 7546 2A17  0311 3804 BB82 D39D C0E3
     Subkey fingerprint: 62C9 E5F4 DA30 0D94 AC36  166B E206 C29F BF04 FF17
GPG verified '/home/jenkins/.rvm/archives/rvm-1.29.3.tgz'

Upgrading the RVM installation in /home/jenkins/.rvm/
Upgrade of RVM in /home/jenkins/.rvm/ is complete.

Upgrade Notes:

  * No new notes to display.

+ set +x
Running 'source /home/jenkins/.rvm/scripts/rvm'
Running 'rvm autolibs disable'
Running 'rvm install ruby-2.3.3'
Already installed ruby-2.3.3.
To reinstall use:

    rvm reinstall ruby-2.3.3

Running 'rvm gemset create solr-refguide-gemset'
ruby-2.3.3 - #gemset created /home/jenkins/.rvm/gems/ruby-2.3.3@solr-refguide-gemset
ruby-2.3.3 - #generating solr-refguide-gemset wrappers........
Running 'rvm ruby-2.3.3@solr-refguide-gemset'
Using /home/jenkins/.rvm/gems/ruby-2.3.3 with gemset solr-refguide-gemset
Running 'gem install --force --version 3.5.0 jekyll'
Successfully installed jekyll-3.5.0
Parsing documentation for jekyll-3.5.0
Done installing documentation for jekyll after 2 seconds
1 gem installed
Running 'gem install --force --version 2.1.0 jekyll-asciidoc'
Successfully installed jekyll-asciidoc-2.1.0
Parsing documentation for jekyll-asciidoc-2.1.0
Done installing documentation for jekyll-asciidoc after 0 seconds
1 gem installed
Running 'gem install --force --version 1.1.2 pygments.rb'
Successfully installed pygments.rb-1.1.2
Parsing documentation for pygments.rb-1.1.2
Done installing documentation for pygments.rb after 0 seconds
1 gem installed
+ ant clean build-site build-pdf
Buildfile: /home/jenkins/jenkins-slave/workspace/Solr-reference-guide-master/solr/solr-ref-guide/build.xml

clean:

build-init:
    [mkdir] Created dir: /home/jenkins/jenkins-slave/workspace/Solr-reference-guide-master/solr/build/solr-ref-guide/content
     [echo] Copying all non template files from src ...
     [copy] Copying 370 files to /home/jenkins/jenkins-slave/workspace/Solr-reference-guide-master/solr/build/solr-ref-guide/content
     [echo] Copy (w/prop replacement) any template files from src...
     [copy] Copying 1 file to /home/jenkins/jenkins-slave/workspace/Solr-reference-guide-master/solr/build/solr-ref-guide/content

ivy-availability-check:
[loadresource] Do not set property disallowed.ivy.jars.list as its length is 0.

-ivy-fail-disallowed-ivy-version:

ivy-fail:

ivy-configure:
[ivy:configure] :: Apache Ivy 2.3.0 - 20130110142753 :: http://ant.apache.org/ivy/ ::
[ivy:configure] :: loading settings :: file = /home/jenkins/jenkins-slave/workspace/Solr-reference-guide-master/lucene/top-level-ivy-settings.xml

resolve:
[ivy:retrieve] 
[ivy:retrieve] :: problems summary ::
[ivy:retrieve] :::: ERRORS
[ivy:retrieve] 	unknown resolver null
[ivy:retrieve] 	unknown resolver null
[ivy:retrieve] 	unknown resolver null
[ivy:retrieve] 	unknown resolver null
[ivy:retrieve] 	unknown resolver null
[ivy:retrieve] 	unknown resolver null
[ivy:retrieve] 
[ivy:retrieve] :: USE VERBOSE OR DEBUG MESSAGE LEVEL FOR MORE DETAILS

build-tools-jar:
    [mkdir] Created dir: /home/jenkins/jenkins-slave/workspace/Solr-reference-guide-master/solr/build/solr-ref-guide/classes
    [javac] Compiling 3 source files to /home/jenkins/jenkins-slave/workspace/Solr-reference-guide-master/solr/build/solr-ref-guide/classes
      [jar] Building jar: /home/jenkins/jenkins-slave/workspace/Solr-reference-guide-master/solr/build/solr-ref-guide/solr-ref-guide-tools.jar

build-nav-data-files:
     [java] Building up tree of all known pages
     [java] Creating /home/jenkins/jenkins-slave/workspace/Solr-reference-guide-master/solr/build/solr-ref-guide/content/_data/pdf-main-body.adoc
     [java] Creating /home/jenkins/jenkins-slave/workspace/Solr-reference-guide-master/solr/build/solr-ref-guide/content/_data/scrollnav.json
     [java] Creating /home/jenkins/jenkins-slave/workspace/Solr-reference-guide-master/solr/build/solr-ref-guide/content/_data/sidebar.json

-build-site:
     [echo] Running Jekyll...
     [exec] Configuration file: /home/jenkins/jenkins-slave/workspace/Solr-reference-guide-master/solr/build/solr-ref-guide/content/_config.yml
     [exec]             Source: /home/jenkins/jenkins-slave/workspace/Solr-reference-guide-master/solr/build/solr-ref-guide/content
     [exec]        Destination: ../html-site
     [exec]  Incremental build: disabled. Enable with --incremental
     [exec]       Generating... 
     [exec]        Deprecation: The 'gems' configuration option has been renamed to 'plugins'. Please update your config file accordingly.
     [exec]                     done in 16.548 seconds.
     [exec]  Auto-regeneration: disabled. Use --watch to enable.

check-links-and-anchors:
     [java] Relative link points at id that doesn't exist in dest: solrcloud-autoscaling-policy-preferences.html#defining-collection-specific-policies
     [java]  ... source: file:/home/jenkins/jenkins-slave/workspace/Solr-reference-guide-master/solr/build/solr-ref-guide/html-site/solrcloud-autoscaling-overview.html
     [java] Total of 1 problems found

BUILD FAILED
/home/jenkins/jenkins-slave/workspace/Solr-reference-guide-master/solr/solr-ref-guide/build.xml:165: Java returned: 255

Total time: 29 seconds
Build step 'Execute shell' marked build as failure
Archiving artifacts
Publishing Javadoc
Email was triggered for: Failure - Any
Sending email for trigger: Failure - Any

[JENKINS] Solr-reference-guide-master - Build # 2223 - Still Failing

Posted by Apache Jenkins Server <je...@builds.apache.org>.
Build: https://builds.apache.org/job/Solr-reference-guide-master/2223/

Log: 
Started by timer
[EnvInject] - Loading node environment variables.
Building remotely on H19 (git-websites) in workspace /home/jenkins/jenkins-slave/workspace/Solr-reference-guide-master
 > git rev-parse --is-inside-work-tree # timeout=10
Fetching changes from the remote Git repository
 > git config remote.origin.url git://git.apache.org/lucene-solr.git # timeout=10
Cleaning workspace
 > git rev-parse --verify HEAD # timeout=10
Resetting working tree
 > git reset --hard # timeout=10
 > git clean -fdx # timeout=10
Fetching upstream changes from git://git.apache.org/lucene-solr.git
 > git --version # timeout=10
 > git fetch --tags --progress git://git.apache.org/lucene-solr.git +refs/heads/*:refs/remotes/origin/*
 > git rev-parse refs/remotes/origin/master^{commit} # timeout=10
 > git rev-parse refs/remotes/origin/origin/master^{commit} # timeout=10
Checking out Revision 3f94f2ed4cd3e0126a588952946855337c940959 (refs/remotes/origin/master)
Commit message: "SOLR-11414: Add gammaDistribution Stream Evaluator"
 > git config core.sparsecheckout # timeout=10
 > git checkout -f 3f94f2ed4cd3e0126a588952946855337c940959
 > git rev-list 3f94f2ed4cd3e0126a588952946855337c940959 # timeout=10
No emails were triggered.
[Solr-reference-guide-master] $ /usr/bin/env bash /tmp/jenkins4673014261195906938.sh
+ set -e
+ RVM_PATH=/home/jenkins/.rvm
+ RUBY_VERSION=ruby-2.3.3
+ GEMSET=solr-refguide-gemset
+ curl -sSL https://get.rvm.io
+ bash -s -- --ignore-dotfiles stable
Turning on ignore dotfiles mode.
Downloading https://github.com/rvm/rvm/archive/1.29.3.tar.gz
Downloading https://github.com/rvm/rvm/releases/download/1.29.3/1.29.3.tar.gz.asc
gpg: Signature made Sun 10 Sep 2017 08:59:21 PM UTC using RSA key ID BF04FF17
gpg: Good signature from "Michal Papis (RVM signing) <mp...@gmail.com>"
gpg:                 aka "Michal Papis <mi...@toptal.com>"
gpg:                 aka "[jpeg image of size 5015]"
gpg: WARNING: This key is not certified with a trusted signature!
gpg:          There is no indication that the signature belongs to the owner.
Primary key fingerprint: 409B 6B17 96C2 7546 2A17  0311 3804 BB82 D39D C0E3
     Subkey fingerprint: 62C9 E5F4 DA30 0D94 AC36  166B E206 C29F BF04 FF17
GPG verified '/home/jenkins/.rvm/archives/rvm-1.29.3.tgz'

Upgrading the RVM installation in /home/jenkins/.rvm/
Upgrade of RVM in /home/jenkins/.rvm/ is complete.

Upgrade Notes:

  * No new notes to display.

+ set +x
Running 'source /home/jenkins/.rvm/scripts/rvm'
Running 'rvm autolibs disable'
Running 'rvm install ruby-2.3.3'
Already installed ruby-2.3.3.
To reinstall use:

    rvm reinstall ruby-2.3.3

Running 'rvm gemset create solr-refguide-gemset'
ruby-2.3.3 - #gemset created /home/jenkins/.rvm/gems/ruby-2.3.3@solr-refguide-gemset
ruby-2.3.3 - #generating solr-refguide-gemset wrappers........
Running 'rvm ruby-2.3.3@solr-refguide-gemset'
Using /home/jenkins/.rvm/gems/ruby-2.3.3 with gemset solr-refguide-gemset
Running 'gem install --force --version 3.5.0 jekyll'
Successfully installed jekyll-3.5.0
Parsing documentation for jekyll-3.5.0
Done installing documentation for jekyll after 2 seconds
1 gem installed
Running 'gem install --force --version 2.1.0 jekyll-asciidoc'
Successfully installed jekyll-asciidoc-2.1.0
Parsing documentation for jekyll-asciidoc-2.1.0
Done installing documentation for jekyll-asciidoc after 0 seconds
1 gem installed
Running 'gem install --force --version 1.1.2 pygments.rb'
Successfully installed pygments.rb-1.1.2
Parsing documentation for pygments.rb-1.1.2
Done installing documentation for pygments.rb after 0 seconds
1 gem installed
+ ant clean build-site build-pdf
Buildfile: /home/jenkins/jenkins-slave/workspace/Solr-reference-guide-master/solr/solr-ref-guide/build.xml

clean:

build-init:
    [mkdir] Created dir: /home/jenkins/jenkins-slave/workspace/Solr-reference-guide-master/solr/build/solr-ref-guide/content
     [echo] Copying all non template files from src ...
     [copy] Copying 370 files to /home/jenkins/jenkins-slave/workspace/Solr-reference-guide-master/solr/build/solr-ref-guide/content
     [echo] Copy (w/prop replacement) any template files from src...
     [copy] Copying 1 file to /home/jenkins/jenkins-slave/workspace/Solr-reference-guide-master/solr/build/solr-ref-guide/content

ivy-availability-check:
[loadresource] Do not set property disallowed.ivy.jars.list as its length is 0.

-ivy-fail-disallowed-ivy-version:

ivy-fail:

ivy-configure:
[ivy:configure] :: Apache Ivy 2.3.0 - 20130110142753 :: http://ant.apache.org/ivy/ ::
[ivy:configure] :: loading settings :: file = /home/jenkins/jenkins-slave/workspace/Solr-reference-guide-master/lucene/top-level-ivy-settings.xml

resolve:
[ivy:retrieve] 
[ivy:retrieve] :: problems summary ::
[ivy:retrieve] :::: ERRORS
[ivy:retrieve] 	unknown resolver null
[ivy:retrieve] 	unknown resolver null
[ivy:retrieve] 	unknown resolver null
[ivy:retrieve] 	unknown resolver null
[ivy:retrieve] 	unknown resolver null
[ivy:retrieve] 	unknown resolver null
[ivy:retrieve] 
[ivy:retrieve] :: USE VERBOSE OR DEBUG MESSAGE LEVEL FOR MORE DETAILS

build-tools-jar:
    [mkdir] Created dir: /home/jenkins/jenkins-slave/workspace/Solr-reference-guide-master/solr/build/solr-ref-guide/classes
    [javac] Compiling 3 source files to /home/jenkins/jenkins-slave/workspace/Solr-reference-guide-master/solr/build/solr-ref-guide/classes
      [jar] Building jar: /home/jenkins/jenkins-slave/workspace/Solr-reference-guide-master/solr/build/solr-ref-guide/solr-ref-guide-tools.jar

build-nav-data-files:
     [java] Building up tree of all known pages
     [java] Creating /home/jenkins/jenkins-slave/workspace/Solr-reference-guide-master/solr/build/solr-ref-guide/content/_data/pdf-main-body.adoc
     [java] Creating /home/jenkins/jenkins-slave/workspace/Solr-reference-guide-master/solr/build/solr-ref-guide/content/_data/scrollnav.json
     [java] Creating /home/jenkins/jenkins-slave/workspace/Solr-reference-guide-master/solr/build/solr-ref-guide/content/_data/sidebar.json

-build-site:
     [echo] Running Jekyll...
     [exec]        Deprecation: The 'gems' configuration option has been renamed to 'plugins'. Please update your config file accordingly.Configuration file: /home/jenkins/jenkins-slave/workspace/Solr-reference-guide-master/solr/build/solr-ref-guide/content/_config.yml
     [exec]             Source: /home/jenkins/jenkins-slave/workspace/Solr-reference-guide-master/solr/build/solr-ref-guide/content
     [exec]        Destination: ../html-site
     [exec]  Incremental build: disabled. Enable with --incremental
     [exec]       Generating... 
     [exec] 
     [exec]                     done in 16.594 seconds.
     [exec]  Auto-regeneration: disabled. Use --watch to enable.

check-links-and-anchors:
     [java] Relative link points at id that doesn't exist in dest: solrcloud-autoscaling-policy-preferences.html#defining-collection-specific-policies
     [java]  ... source: file:/home/jenkins/jenkins-slave/workspace/Solr-reference-guide-master/solr/build/solr-ref-guide/html-site/solrcloud-autoscaling-overview.html
     [java] Total of 1 problems found

BUILD FAILED
/home/jenkins/jenkins-slave/workspace/Solr-reference-guide-master/solr/solr-ref-guide/build.xml:165: Java returned: 255

Total time: 29 seconds
Build step 'Execute shell' marked build as failure
Archiving artifacts
Publishing Javadoc
Email was triggered for: Failure - Any
Sending email for trigger: Failure - Any

[JENKINS] Solr-reference-guide-master - Build # 2222 - Still Failing

Posted by Apache Jenkins Server <je...@builds.apache.org>.
Build: https://builds.apache.org/job/Solr-reference-guide-master/2222/

Log: 
Started by timer
[EnvInject] - Loading node environment variables.
Building remotely on H19 (git-websites) in workspace /home/jenkins/jenkins-slave/workspace/Solr-reference-guide-master
 > git rev-parse --is-inside-work-tree # timeout=10
Fetching changes from the remote Git repository
 > git config remote.origin.url git://git.apache.org/lucene-solr.git # timeout=10
Cleaning workspace
 > git rev-parse --verify HEAD # timeout=10
Resetting working tree
 > git reset --hard # timeout=10
 > git clean -fdx # timeout=10
Fetching upstream changes from git://git.apache.org/lucene-solr.git
 > git --version # timeout=10
 > git fetch --tags --progress git://git.apache.org/lucene-solr.git +refs/heads/*:refs/remotes/origin/*
 > git rev-parse refs/remotes/origin/master^{commit} # timeout=10
 > git rev-parse refs/remotes/origin/origin/master^{commit} # timeout=10
Checking out Revision 3f94f2ed4cd3e0126a588952946855337c940959 (refs/remotes/origin/master)
Commit message: "SOLR-11414: Add gammaDistribution Stream Evaluator"
 > git config core.sparsecheckout # timeout=10
 > git checkout -f 3f94f2ed4cd3e0126a588952946855337c940959
 > git rev-list 3f94f2ed4cd3e0126a588952946855337c940959 # timeout=10
No emails were triggered.
[Solr-reference-guide-master] $ /usr/bin/env bash /tmp/jenkins479125809487625519.sh
+ set -e
+ RVM_PATH=/home/jenkins/.rvm
+ RUBY_VERSION=ruby-2.3.3
+ GEMSET=solr-refguide-gemset
+ curl -sSL https://get.rvm.io
+ bash -s -- --ignore-dotfiles stable
Turning on ignore dotfiles mode.
Downloading https://github.com/rvm/rvm/archive/1.29.3.tar.gz
Downloading https://github.com/rvm/rvm/releases/download/1.29.3/1.29.3.tar.gz.asc
gpg: Signature made Sun 10 Sep 2017 08:59:21 PM UTC using RSA key ID BF04FF17
gpg: Good signature from "Michal Papis (RVM signing) <mp...@gmail.com>"
gpg:                 aka "Michal Papis <mi...@toptal.com>"
gpg:                 aka "[jpeg image of size 5015]"
gpg: WARNING: This key is not certified with a trusted signature!
gpg:          There is no indication that the signature belongs to the owner.
Primary key fingerprint: 409B 6B17 96C2 7546 2A17  0311 3804 BB82 D39D C0E3
     Subkey fingerprint: 62C9 E5F4 DA30 0D94 AC36  166B E206 C29F BF04 FF17
GPG verified '/home/jenkins/.rvm/archives/rvm-1.29.3.tgz'

Upgrading the RVM installation in /home/jenkins/.rvm/
Upgrade of RVM in /home/jenkins/.rvm/ is complete.

Upgrade Notes:

  * No new notes to display.

+ set +x
Running 'source /home/jenkins/.rvm/scripts/rvm'
Running 'rvm autolibs disable'
Running 'rvm install ruby-2.3.3'
Already installed ruby-2.3.3.
To reinstall use:

    rvm reinstall ruby-2.3.3

Running 'rvm gemset create solr-refguide-gemset'
ruby-2.3.3 - #gemset created /home/jenkins/.rvm/gems/ruby-2.3.3@solr-refguide-gemset
ruby-2.3.3 - #generating solr-refguide-gemset wrappers........
Running 'rvm ruby-2.3.3@solr-refguide-gemset'
Using /home/jenkins/.rvm/gems/ruby-2.3.3 with gemset solr-refguide-gemset
Running 'gem install --force --version 3.5.0 jekyll'
Successfully installed jekyll-3.5.0
Parsing documentation for jekyll-3.5.0
Done installing documentation for jekyll after 2 seconds
1 gem installed
Running 'gem install --force --version 2.1.0 jekyll-asciidoc'
Successfully installed jekyll-asciidoc-2.1.0
Parsing documentation for jekyll-asciidoc-2.1.0
Done installing documentation for jekyll-asciidoc after 0 seconds
1 gem installed
Running 'gem install --force --version 1.1.2 pygments.rb'
Successfully installed pygments.rb-1.1.2
Parsing documentation for pygments.rb-1.1.2
Done installing documentation for pygments.rb after 0 seconds
1 gem installed
+ ant clean build-site build-pdf
Buildfile: /home/jenkins/jenkins-slave/workspace/Solr-reference-guide-master/solr/solr-ref-guide/build.xml

clean:

build-init:
    [mkdir] Created dir: /home/jenkins/jenkins-slave/workspace/Solr-reference-guide-master/solr/build/solr-ref-guide/content
     [echo] Copying all non template files from src ...
     [copy] Copying 370 files to /home/jenkins/jenkins-slave/workspace/Solr-reference-guide-master/solr/build/solr-ref-guide/content
     [echo] Copy (w/prop replacement) any template files from src...
     [copy] Copying 1 file to /home/jenkins/jenkins-slave/workspace/Solr-reference-guide-master/solr/build/solr-ref-guide/content

ivy-availability-check:
[loadresource] Do not set property disallowed.ivy.jars.list as its length is 0.

-ivy-fail-disallowed-ivy-version:

ivy-fail:

ivy-configure:
[ivy:configure] :: Apache Ivy 2.3.0 - 20130110142753 :: http://ant.apache.org/ivy/ ::
[ivy:configure] :: loading settings :: file = /home/jenkins/jenkins-slave/workspace/Solr-reference-guide-master/lucene/top-level-ivy-settings.xml

resolve:
[ivy:retrieve] 
[ivy:retrieve] :: problems summary ::
[ivy:retrieve] :::: ERRORS
[ivy:retrieve] 	unknown resolver null
[ivy:retrieve] 	unknown resolver null
[ivy:retrieve] 	unknown resolver null
[ivy:retrieve] 	unknown resolver null
[ivy:retrieve] 	unknown resolver null
[ivy:retrieve] 	unknown resolver null
[ivy:retrieve] 
[ivy:retrieve] :: USE VERBOSE OR DEBUG MESSAGE LEVEL FOR MORE DETAILS

build-tools-jar:
    [mkdir] Created dir: /home/jenkins/jenkins-slave/workspace/Solr-reference-guide-master/solr/build/solr-ref-guide/classes
    [javac] Compiling 3 source files to /home/jenkins/jenkins-slave/workspace/Solr-reference-guide-master/solr/build/solr-ref-guide/classes
      [jar] Building jar: /home/jenkins/jenkins-slave/workspace/Solr-reference-guide-master/solr/build/solr-ref-guide/solr-ref-guide-tools.jar

build-nav-data-files:
     [java] Building up tree of all known pages
     [java] Creating /home/jenkins/jenkins-slave/workspace/Solr-reference-guide-master/solr/build/solr-ref-guide/content/_data/pdf-main-body.adoc
     [java] Creating /home/jenkins/jenkins-slave/workspace/Solr-reference-guide-master/solr/build/solr-ref-guide/content/_data/scrollnav.json
     [java] Creating /home/jenkins/jenkins-slave/workspace/Solr-reference-guide-master/solr/build/solr-ref-guide/content/_data/sidebar.json

-build-site:
     [echo] Running Jekyll...
     [exec] Configuration file: /home/jenkins/jenkins-slave/workspace/Solr-reference-guide-master/solr/build/solr-ref-guide/content/_config.yml
     [exec]             Source: /home/jenkins/jenkins-slave/workspace/Solr-reference-guide-master/solr/build/solr-ref-guide/content
     [exec]        Destination: ../html-site
     [exec]  Incremental build: disabled. Enable with --incremental
     [exec]       Generating... 
     [exec]        Deprecation: The 'gems' configuration option has been renamed to 'plugins'. Please update your config file accordingly.
     [exec]                     done in 16.433 seconds.
     [exec]  Auto-regeneration: disabled. Use --watch to enable.

check-links-and-anchors:
     [java] Relative link points at id that doesn't exist in dest: solrcloud-autoscaling-policy-preferences.html#defining-collection-specific-policies
     [java]  ... source: file:/home/jenkins/jenkins-slave/workspace/Solr-reference-guide-master/solr/build/solr-ref-guide/html-site/solrcloud-autoscaling-overview.html
     [java] Total of 1 problems found

BUILD FAILED
/home/jenkins/jenkins-slave/workspace/Solr-reference-guide-master/solr/solr-ref-guide/build.xml:165: Java returned: 255

Total time: 29 seconds
Build step 'Execute shell' marked build as failure
Archiving artifacts
Publishing Javadoc
Email was triggered for: Failure - Any
Sending email for trigger: Failure - Any

[JENKINS] Solr-reference-guide-master - Build # 2221 - Still Failing

Posted by Apache Jenkins Server <je...@builds.apache.org>.
Build: https://builds.apache.org/job/Solr-reference-guide-master/2221/

Log: 
Started by timer
[EnvInject] - Loading node environment variables.
Building remotely on H19 (git-websites) in workspace /home/jenkins/jenkins-slave/workspace/Solr-reference-guide-master
 > git rev-parse --is-inside-work-tree # timeout=10
Fetching changes from the remote Git repository
 > git config remote.origin.url git://git.apache.org/lucene-solr.git # timeout=10
Cleaning workspace
 > git rev-parse --verify HEAD # timeout=10
Resetting working tree
 > git reset --hard # timeout=10
 > git clean -fdx # timeout=10
Fetching upstream changes from git://git.apache.org/lucene-solr.git
 > git --version # timeout=10
 > git fetch --tags --progress git://git.apache.org/lucene-solr.git +refs/heads/*:refs/remotes/origin/*
 > git rev-parse refs/remotes/origin/master^{commit} # timeout=10
 > git rev-parse refs/remotes/origin/origin/master^{commit} # timeout=10
Checking out Revision 3f94f2ed4cd3e0126a588952946855337c940959 (refs/remotes/origin/master)
Commit message: "SOLR-11414: Add gammaDistribution Stream Evaluator"
 > git config core.sparsecheckout # timeout=10
 > git checkout -f 3f94f2ed4cd3e0126a588952946855337c940959
 > git rev-list 3f94f2ed4cd3e0126a588952946855337c940959 # timeout=10
No emails were triggered.
[Solr-reference-guide-master] $ /usr/bin/env bash /tmp/jenkins8564389051754888526.sh
+ set -e
+ RVM_PATH=/home/jenkins/.rvm
+ RUBY_VERSION=ruby-2.3.3
+ GEMSET=solr-refguide-gemset
+ curl -sSL https://get.rvm.io
+ bash -s -- --ignore-dotfiles stable
Turning on ignore dotfiles mode.
Downloading https://github.com/rvm/rvm/archive/1.29.3.tar.gz
Downloading https://github.com/rvm/rvm/releases/download/1.29.3/1.29.3.tar.gz.asc
gpg: Signature made Sun 10 Sep 2017 08:59:21 PM UTC using RSA key ID BF04FF17
gpg: Good signature from "Michal Papis (RVM signing) <mp...@gmail.com>"
gpg:                 aka "Michal Papis <mi...@toptal.com>"
gpg:                 aka "[jpeg image of size 5015]"
gpg: WARNING: This key is not certified with a trusted signature!
gpg:          There is no indication that the signature belongs to the owner.
Primary key fingerprint: 409B 6B17 96C2 7546 2A17  0311 3804 BB82 D39D C0E3
     Subkey fingerprint: 62C9 E5F4 DA30 0D94 AC36  166B E206 C29F BF04 FF17
GPG verified '/home/jenkins/.rvm/archives/rvm-1.29.3.tgz'

Upgrading the RVM installation in /home/jenkins/.rvm/
Upgrade of RVM in /home/jenkins/.rvm/ is complete.

Upgrade Notes:

  * No new notes to display.

+ set +x
Running 'source /home/jenkins/.rvm/scripts/rvm'
Running 'rvm autolibs disable'
Running 'rvm install ruby-2.3.3'
Already installed ruby-2.3.3.
To reinstall use:

    rvm reinstall ruby-2.3.3

Running 'rvm gemset create solr-refguide-gemset'
ruby-2.3.3 - #gemset created /home/jenkins/.rvm/gems/ruby-2.3.3@solr-refguide-gemset
ruby-2.3.3 - #generating solr-refguide-gemset wrappers........
Running 'rvm ruby-2.3.3@solr-refguide-gemset'
Using /home/jenkins/.rvm/gems/ruby-2.3.3 with gemset solr-refguide-gemset
Running 'gem install --force --version 3.5.0 jekyll'
Successfully installed jekyll-3.5.0
Parsing documentation for jekyll-3.5.0
Done installing documentation for jekyll after 2 seconds
1 gem installed
Running 'gem install --force --version 2.1.0 jekyll-asciidoc'
Successfully installed jekyll-asciidoc-2.1.0
Parsing documentation for jekyll-asciidoc-2.1.0
Done installing documentation for jekyll-asciidoc after 0 seconds
1 gem installed
Running 'gem install --force --version 1.1.2 pygments.rb'
Successfully installed pygments.rb-1.1.2
Parsing documentation for pygments.rb-1.1.2
Done installing documentation for pygments.rb after 0 seconds
1 gem installed
+ ant clean build-site build-pdf
Buildfile: /home/jenkins/jenkins-slave/workspace/Solr-reference-guide-master/solr/solr-ref-guide/build.xml

clean:

build-init:
    [mkdir] Created dir: /home/jenkins/jenkins-slave/workspace/Solr-reference-guide-master/solr/build/solr-ref-guide/content
     [echo] Copying all non template files from src ...
     [copy] Copying 370 files to /home/jenkins/jenkins-slave/workspace/Solr-reference-guide-master/solr/build/solr-ref-guide/content
     [echo] Copy (w/prop replacement) any template files from src...
     [copy] Copying 1 file to /home/jenkins/jenkins-slave/workspace/Solr-reference-guide-master/solr/build/solr-ref-guide/content

ivy-availability-check:
[loadresource] Do not set property disallowed.ivy.jars.list as its length is 0.

-ivy-fail-disallowed-ivy-version:

ivy-fail:

ivy-configure:
[ivy:configure] :: Apache Ivy 2.3.0 - 20130110142753 :: http://ant.apache.org/ivy/ ::
[ivy:configure] :: loading settings :: file = /home/jenkins/jenkins-slave/workspace/Solr-reference-guide-master/lucene/top-level-ivy-settings.xml

resolve:
[ivy:retrieve] 
[ivy:retrieve] :: problems summary ::
[ivy:retrieve] :::: ERRORS
[ivy:retrieve] 	unknown resolver null
[ivy:retrieve] 	unknown resolver null
[ivy:retrieve] 	unknown resolver null
[ivy:retrieve] 	unknown resolver null
[ivy:retrieve] 	unknown resolver null
[ivy:retrieve] 	unknown resolver null
[ivy:retrieve] 
[ivy:retrieve] :: USE VERBOSE OR DEBUG MESSAGE LEVEL FOR MORE DETAILS

build-tools-jar:
    [mkdir] Created dir: /home/jenkins/jenkins-slave/workspace/Solr-reference-guide-master/solr/build/solr-ref-guide/classes
    [javac] Compiling 3 source files to /home/jenkins/jenkins-slave/workspace/Solr-reference-guide-master/solr/build/solr-ref-guide/classes
      [jar] Building jar: /home/jenkins/jenkins-slave/workspace/Solr-reference-guide-master/solr/build/solr-ref-guide/solr-ref-guide-tools.jar

build-nav-data-files:
     [java] Building up tree of all known pages
     [java] Creating /home/jenkins/jenkins-slave/workspace/Solr-reference-guide-master/solr/build/solr-ref-guide/content/_data/pdf-main-body.adoc
     [java] Creating /home/jenkins/jenkins-slave/workspace/Solr-reference-guide-master/solr/build/solr-ref-guide/content/_data/scrollnav.json
     [java] Creating /home/jenkins/jenkins-slave/workspace/Solr-reference-guide-master/solr/build/solr-ref-guide/content/_data/sidebar.json

-build-site:
     [echo] Running Jekyll...
     [exec] Configuration file: /home/jenkins/jenkins-slave/workspace/Solr-reference-guide-master/solr/build/solr-ref-guide/content/_config.yml
     [exec]             Source: /home/jenkins/jenkins-slave/workspace/Solr-reference-guide-master/solr/build/solr-ref-guide/content
     [exec]        Deprecation: The 'gems' configuration option has been renamed to 'plugins'. Please update your config file accordingly.
     [exec]        Destination: ../html-site
     [exec]  Incremental build: disabled. Enable with --incremental
     [exec]       Generating... 
     [exec]                     done in 16.689 seconds.
     [exec]  Auto-regeneration: disabled. Use --watch to enable.

check-links-and-anchors:
     [java] Relative link points at id that doesn't exist in dest: solrcloud-autoscaling-policy-preferences.html#defining-collection-specific-policies
     [java]  ... source: file:/home/jenkins/jenkins-slave/workspace/Solr-reference-guide-master/solr/build/solr-ref-guide/html-site/solrcloud-autoscaling-overview.html
     [java] Total of 1 problems found

BUILD FAILED
/home/jenkins/jenkins-slave/workspace/Solr-reference-guide-master/solr/solr-ref-guide/build.xml:165: Java returned: 255

Total time: 30 seconds
Build step 'Execute shell' marked build as failure
Archiving artifacts
Publishing Javadoc
Email was triggered for: Failure - Any
Sending email for trigger: Failure - Any

[JENKINS] Solr-reference-guide-master - Build # 2220 - Still Failing

Posted by Apache Jenkins Server <je...@builds.apache.org>.
Build: https://builds.apache.org/job/Solr-reference-guide-master/2220/

Log: 
Started by timer
[EnvInject] - Loading node environment variables.
Building remotely on H19 (git-websites) in workspace /home/jenkins/jenkins-slave/workspace/Solr-reference-guide-master
 > git rev-parse --is-inside-work-tree # timeout=10
Fetching changes from the remote Git repository
 > git config remote.origin.url git://git.apache.org/lucene-solr.git # timeout=10
Cleaning workspace
 > git rev-parse --verify HEAD # timeout=10
Resetting working tree
 > git reset --hard # timeout=10
 > git clean -fdx # timeout=10
Fetching upstream changes from git://git.apache.org/lucene-solr.git
 > git --version # timeout=10
 > git fetch --tags --progress git://git.apache.org/lucene-solr.git +refs/heads/*:refs/remotes/origin/*
 > git rev-parse refs/remotes/origin/master^{commit} # timeout=10
 > git rev-parse refs/remotes/origin/origin/master^{commit} # timeout=10
Checking out Revision 3f94f2ed4cd3e0126a588952946855337c940959 (refs/remotes/origin/master)
Commit message: "SOLR-11414: Add gammaDistribution Stream Evaluator"
 > git config core.sparsecheckout # timeout=10
 > git checkout -f 3f94f2ed4cd3e0126a588952946855337c940959
 > git rev-list 3f94f2ed4cd3e0126a588952946855337c940959 # timeout=10
No emails were triggered.
[Solr-reference-guide-master] $ /usr/bin/env bash /tmp/jenkins191253310009301459.sh
+ set -e
+ RVM_PATH=/home/jenkins/.rvm
+ RUBY_VERSION=ruby-2.3.3
+ GEMSET=solr-refguide-gemset
+ curl -sSL https://get.rvm.io
+ bash -s -- --ignore-dotfiles stable
Turning on ignore dotfiles mode.
Downloading https://github.com/rvm/rvm/archive/1.29.3.tar.gz
Downloading https://github.com/rvm/rvm/releases/download/1.29.3/1.29.3.tar.gz.asc
gpg: Signature made Sun 10 Sep 2017 08:59:21 PM UTC using RSA key ID BF04FF17
gpg: Good signature from "Michal Papis (RVM signing) <mp...@gmail.com>"
gpg:                 aka "Michal Papis <mi...@toptal.com>"
gpg:                 aka "[jpeg image of size 5015]"
gpg: WARNING: This key is not certified with a trusted signature!
gpg:          There is no indication that the signature belongs to the owner.
Primary key fingerprint: 409B 6B17 96C2 7546 2A17  0311 3804 BB82 D39D C0E3
     Subkey fingerprint: 62C9 E5F4 DA30 0D94 AC36  166B E206 C29F BF04 FF17
GPG verified '/home/jenkins/.rvm/archives/rvm-1.29.3.tgz'

Upgrading the RVM installation in /home/jenkins/.rvm/
Upgrade of RVM in /home/jenkins/.rvm/ is complete.

Upgrade Notes:

  * No new notes to display.

+ set +x
Running 'source /home/jenkins/.rvm/scripts/rvm'
Running 'rvm autolibs disable'
Running 'rvm install ruby-2.3.3'
Already installed ruby-2.3.3.
To reinstall use:

    rvm reinstall ruby-2.3.3

Running 'rvm gemset create solr-refguide-gemset'
ruby-2.3.3 - #gemset created /home/jenkins/.rvm/gems/ruby-2.3.3@solr-refguide-gemset
ruby-2.3.3 - #generating solr-refguide-gemset wrappers........
Running 'rvm ruby-2.3.3@solr-refguide-gemset'
Using /home/jenkins/.rvm/gems/ruby-2.3.3 with gemset solr-refguide-gemset
Running 'gem install --force --version 3.5.0 jekyll'
Successfully installed jekyll-3.5.0
Parsing documentation for jekyll-3.5.0
Done installing documentation for jekyll after 2 seconds
1 gem installed
Running 'gem install --force --version 2.1.0 jekyll-asciidoc'
Successfully installed jekyll-asciidoc-2.1.0
Parsing documentation for jekyll-asciidoc-2.1.0
Done installing documentation for jekyll-asciidoc after 0 seconds
1 gem installed
Running 'gem install --force --version 1.1.2 pygments.rb'
Successfully installed pygments.rb-1.1.2
Parsing documentation for pygments.rb-1.1.2
Done installing documentation for pygments.rb after 0 seconds
1 gem installed
+ ant clean build-site build-pdf
Buildfile: /home/jenkins/jenkins-slave/workspace/Solr-reference-guide-master/solr/solr-ref-guide/build.xml

clean:

build-init:
    [mkdir] Created dir: /home/jenkins/jenkins-slave/workspace/Solr-reference-guide-master/solr/build/solr-ref-guide/content
     [echo] Copying all non template files from src ...
     [copy] Copying 370 files to /home/jenkins/jenkins-slave/workspace/Solr-reference-guide-master/solr/build/solr-ref-guide/content
     [echo] Copy (w/prop replacement) any template files from src...
     [copy] Copying 1 file to /home/jenkins/jenkins-slave/workspace/Solr-reference-guide-master/solr/build/solr-ref-guide/content

ivy-availability-check:
[loadresource] Do not set property disallowed.ivy.jars.list as its length is 0.

-ivy-fail-disallowed-ivy-version:

ivy-fail:

ivy-configure:
[ivy:configure] :: Apache Ivy 2.3.0 - 20130110142753 :: http://ant.apache.org/ivy/ ::
[ivy:configure] :: loading settings :: file = /home/jenkins/jenkins-slave/workspace/Solr-reference-guide-master/lucene/top-level-ivy-settings.xml

resolve:
[ivy:retrieve] 
[ivy:retrieve] :: problems summary ::
[ivy:retrieve] :::: ERRORS
[ivy:retrieve] 	unknown resolver null
[ivy:retrieve] 	unknown resolver null
[ivy:retrieve] 	unknown resolver null
[ivy:retrieve] 	unknown resolver null
[ivy:retrieve] 	unknown resolver null
[ivy:retrieve] 	unknown resolver null
[ivy:retrieve] 
[ivy:retrieve] :: USE VERBOSE OR DEBUG MESSAGE LEVEL FOR MORE DETAILS

build-tools-jar:
    [mkdir] Created dir: /home/jenkins/jenkins-slave/workspace/Solr-reference-guide-master/solr/build/solr-ref-guide/classes
    [javac] Compiling 3 source files to /home/jenkins/jenkins-slave/workspace/Solr-reference-guide-master/solr/build/solr-ref-guide/classes
      [jar] Building jar: /home/jenkins/jenkins-slave/workspace/Solr-reference-guide-master/solr/build/solr-ref-guide/solr-ref-guide-tools.jar

build-nav-data-files:
     [java] Building up tree of all known pages
     [java] Creating /home/jenkins/jenkins-slave/workspace/Solr-reference-guide-master/solr/build/solr-ref-guide/content/_data/pdf-main-body.adoc
     [java] Creating /home/jenkins/jenkins-slave/workspace/Solr-reference-guide-master/solr/build/solr-ref-guide/content/_data/scrollnav.json
     [java] Creating /home/jenkins/jenkins-slave/workspace/Solr-reference-guide-master/solr/build/solr-ref-guide/content/_data/sidebar.json

-build-site:
     [echo] Running Jekyll...
     [exec] Configuration file: /home/jenkins/jenkins-slave/workspace/Solr-reference-guide-master/solr/build/solr-ref-guide/content/_config.yml
     [exec]             Source: /home/jenkins/jenkins-slave/workspace/Solr-reference-guide-master/solr/build/solr-ref-guide/content
     [exec]        Deprecation: The 'gems' configuration option has been renamed to 'plugins'. Please update your config file accordingly.
     [exec]        Destination: ../html-site
     [exec]  Incremental build: disabled. Enable with --incremental
     [exec]       Generating... 
     [exec]                     done in 16.683 seconds.
     [exec]  Auto-regeneration: disabled. Use --watch to enable.

check-links-and-anchors:
     [java] Relative link points at id that doesn't exist in dest: solrcloud-autoscaling-policy-preferences.html#defining-collection-specific-policies
     [java]  ... source: file:/home/jenkins/jenkins-slave/workspace/Solr-reference-guide-master/solr/build/solr-ref-guide/html-site/solrcloud-autoscaling-overview.html
     [java] Total of 1 problems found

BUILD FAILED
/home/jenkins/jenkins-slave/workspace/Solr-reference-guide-master/solr/solr-ref-guide/build.xml:165: Java returned: 255

Total time: 29 seconds
Build step 'Execute shell' marked build as failure
Archiving artifacts
Publishing Javadoc
Email was triggered for: Failure - Any
Sending email for trigger: Failure - Any

[JENKINS] Solr-reference-guide-master - Build # 2219 - Still Failing

Posted by Apache Jenkins Server <je...@builds.apache.org>.
Build: https://builds.apache.org/job/Solr-reference-guide-master/2219/

Log: 
Started by timer
[EnvInject] - Loading node environment variables.
Building remotely on H19 (git-websites) in workspace /home/jenkins/jenkins-slave/workspace/Solr-reference-guide-master
 > git rev-parse --is-inside-work-tree # timeout=10
Fetching changes from the remote Git repository
 > git config remote.origin.url git://git.apache.org/lucene-solr.git # timeout=10
Cleaning workspace
 > git rev-parse --verify HEAD # timeout=10
Resetting working tree
 > git reset --hard # timeout=10
 > git clean -fdx # timeout=10
Fetching upstream changes from git://git.apache.org/lucene-solr.git
 > git --version # timeout=10
 > git fetch --tags --progress git://git.apache.org/lucene-solr.git +refs/heads/*:refs/remotes/origin/*
 > git rev-parse refs/remotes/origin/master^{commit} # timeout=10
 > git rev-parse refs/remotes/origin/origin/master^{commit} # timeout=10
Checking out Revision 3f94f2ed4cd3e0126a588952946855337c940959 (refs/remotes/origin/master)
Commit message: "SOLR-11414: Add gammaDistribution Stream Evaluator"
 > git config core.sparsecheckout # timeout=10
 > git checkout -f 3f94f2ed4cd3e0126a588952946855337c940959
 > git rev-list 790533da124ab10b52fad35372ed09e5f0bd57d5 # timeout=10
No emails were triggered.
[Solr-reference-guide-master] $ /usr/bin/env bash /tmp/jenkins9304536518423987.sh
+ set -e
+ RVM_PATH=/home/jenkins/.rvm
+ RUBY_VERSION=ruby-2.3.3
+ GEMSET=solr-refguide-gemset
+ curl -sSL https://get.rvm.io
+ bash -s -- --ignore-dotfiles stable
Turning on ignore dotfiles mode.
Downloading https://github.com/rvm/rvm/archive/1.29.3.tar.gz
Downloading https://github.com/rvm/rvm/releases/download/1.29.3/1.29.3.tar.gz.asc
gpg: Signature made Sun 10 Sep 2017 08:59:21 PM UTC using RSA key ID BF04FF17
gpg: Good signature from "Michal Papis (RVM signing) <mp...@gmail.com>"
gpg:                 aka "Michal Papis <mi...@toptal.com>"
gpg:                 aka "[jpeg image of size 5015]"
gpg: WARNING: This key is not certified with a trusted signature!
gpg:          There is no indication that the signature belongs to the owner.
Primary key fingerprint: 409B 6B17 96C2 7546 2A17  0311 3804 BB82 D39D C0E3
     Subkey fingerprint: 62C9 E5F4 DA30 0D94 AC36  166B E206 C29F BF04 FF17
GPG verified '/home/jenkins/.rvm/archives/rvm-1.29.3.tgz'

Upgrading the RVM installation in /home/jenkins/.rvm/
Upgrade of RVM in /home/jenkins/.rvm/ is complete.

Upgrade Notes:

  * No new notes to display.

+ set +x
Running 'source /home/jenkins/.rvm/scripts/rvm'
Running 'rvm autolibs disable'
Running 'rvm install ruby-2.3.3'
Already installed ruby-2.3.3.
To reinstall use:

    rvm reinstall ruby-2.3.3

Running 'rvm gemset create solr-refguide-gemset'
ruby-2.3.3 - #gemset created /home/jenkins/.rvm/gems/ruby-2.3.3@solr-refguide-gemset
ruby-2.3.3 - #generating solr-refguide-gemset wrappers........
Running 'rvm ruby-2.3.3@solr-refguide-gemset'
Using /home/jenkins/.rvm/gems/ruby-2.3.3 with gemset solr-refguide-gemset
Running 'gem install --force --version 3.5.0 jekyll'
Successfully installed jekyll-3.5.0
Parsing documentation for jekyll-3.5.0
Done installing documentation for jekyll after 2 seconds
1 gem installed
Running 'gem install --force --version 2.1.0 jekyll-asciidoc'
Successfully installed jekyll-asciidoc-2.1.0
Parsing documentation for jekyll-asciidoc-2.1.0
Done installing documentation for jekyll-asciidoc after 0 seconds
1 gem installed
Running 'gem install --force --version 1.1.2 pygments.rb'
Successfully installed pygments.rb-1.1.2
Parsing documentation for pygments.rb-1.1.2
Done installing documentation for pygments.rb after 0 seconds
1 gem installed
+ ant clean build-site build-pdf
Buildfile: /home/jenkins/jenkins-slave/workspace/Solr-reference-guide-master/solr/solr-ref-guide/build.xml

clean:

build-init:
    [mkdir] Created dir: /home/jenkins/jenkins-slave/workspace/Solr-reference-guide-master/solr/build/solr-ref-guide/content
     [echo] Copying all non template files from src ...
     [copy] Copying 370 files to /home/jenkins/jenkins-slave/workspace/Solr-reference-guide-master/solr/build/solr-ref-guide/content
     [echo] Copy (w/prop replacement) any template files from src...
     [copy] Copying 1 file to /home/jenkins/jenkins-slave/workspace/Solr-reference-guide-master/solr/build/solr-ref-guide/content

ivy-availability-check:
[loadresource] Do not set property disallowed.ivy.jars.list as its length is 0.

-ivy-fail-disallowed-ivy-version:

ivy-fail:

ivy-configure:
[ivy:configure] :: Apache Ivy 2.3.0 - 20130110142753 :: http://ant.apache.org/ivy/ ::
[ivy:configure] :: loading settings :: file = /home/jenkins/jenkins-slave/workspace/Solr-reference-guide-master/lucene/top-level-ivy-settings.xml

resolve:
[ivy:retrieve] 
[ivy:retrieve] :: problems summary ::
[ivy:retrieve] :::: ERRORS
[ivy:retrieve] 	unknown resolver null
[ivy:retrieve] 	unknown resolver null
[ivy:retrieve] 	unknown resolver null
[ivy:retrieve] 	unknown resolver null
[ivy:retrieve] 	unknown resolver null
[ivy:retrieve] 	unknown resolver null
[ivy:retrieve] 
[ivy:retrieve] :: USE VERBOSE OR DEBUG MESSAGE LEVEL FOR MORE DETAILS

build-tools-jar:
    [mkdir] Created dir: /home/jenkins/jenkins-slave/workspace/Solr-reference-guide-master/solr/build/solr-ref-guide/classes
    [javac] Compiling 3 source files to /home/jenkins/jenkins-slave/workspace/Solr-reference-guide-master/solr/build/solr-ref-guide/classes
      [jar] Building jar: /home/jenkins/jenkins-slave/workspace/Solr-reference-guide-master/solr/build/solr-ref-guide/solr-ref-guide-tools.jar

build-nav-data-files:
     [java] Building up tree of all known pages
     [java] Creating /home/jenkins/jenkins-slave/workspace/Solr-reference-guide-master/solr/build/solr-ref-guide/content/_data/pdf-main-body.adoc
     [java] Creating /home/jenkins/jenkins-slave/workspace/Solr-reference-guide-master/solr/build/solr-ref-guide/content/_data/scrollnav.json
     [java] Creating /home/jenkins/jenkins-slave/workspace/Solr-reference-guide-master/solr/build/solr-ref-guide/content/_data/sidebar.json

-build-site:
     [echo] Running Jekyll...
     [exec] Configuration file: /home/jenkins/jenkins-slave/workspace/Solr-reference-guide-master/solr/build/solr-ref-guide/content/_config.yml
     [exec]        Deprecation: The 'gems' configuration option has been renamed to 'plugins'. Please update your config file accordingly.
     [exec]             Source: /home/jenkins/jenkins-slave/workspace/Solr-reference-guide-master/solr/build/solr-ref-guide/content
     [exec]        Destination: ../html-site
     [exec]  Incremental build: disabled. Enable with --incremental
     [exec]       Generating... 
     [exec]                     done in 16.563 seconds.
     [exec]  Auto-regeneration: disabled. Use --watch to enable.

check-links-and-anchors:
     [java] Relative link points at id that doesn't exist in dest: solrcloud-autoscaling-policy-preferences.html#defining-collection-specific-policies
     [java]  ... source: file:/home/jenkins/jenkins-slave/workspace/Solr-reference-guide-master/solr/build/solr-ref-guide/html-site/solrcloud-autoscaling-overview.html
     [java] Total of 1 problems found

BUILD FAILED
/home/jenkins/jenkins-slave/workspace/Solr-reference-guide-master/solr/solr-ref-guide/build.xml:165: Java returned: 255

Total time: 30 seconds
Build step 'Execute shell' marked build as failure
Archiving artifacts
Publishing Javadoc
Email was triggered for: Failure - Any
Sending email for trigger: Failure - Any

[JENKINS] Solr-reference-guide-master - Build # 2218 - Still Failing

Posted by Apache Jenkins Server <je...@builds.apache.org>.
Build: https://builds.apache.org/job/Solr-reference-guide-master/2218/

Log: 
Started by timer
[EnvInject] - Loading node environment variables.
Building remotely on H19 (git-websites) in workspace /home/jenkins/jenkins-slave/workspace/Solr-reference-guide-master
 > git rev-parse --is-inside-work-tree # timeout=10
Fetching changes from the remote Git repository
 > git config remote.origin.url git://git.apache.org/lucene-solr.git # timeout=10
Cleaning workspace
 > git rev-parse --verify HEAD # timeout=10
Resetting working tree
 > git reset --hard # timeout=10
 > git clean -fdx # timeout=10
Fetching upstream changes from git://git.apache.org/lucene-solr.git
 > git --version # timeout=10
 > git fetch --tags --progress git://git.apache.org/lucene-solr.git +refs/heads/*:refs/remotes/origin/*
 > git rev-parse refs/remotes/origin/master^{commit} # timeout=10
 > git rev-parse refs/remotes/origin/origin/master^{commit} # timeout=10
Checking out Revision 790533da124ab10b52fad35372ed09e5f0bd57d5 (refs/remotes/origin/master)
Commit message: "SOLR-11401: Add zipFDistribution Stream Evaluator"
 > git config core.sparsecheckout # timeout=10
 > git checkout -f 790533da124ab10b52fad35372ed09e5f0bd57d5
 > git rev-list 790533da124ab10b52fad35372ed09e5f0bd57d5 # timeout=10
No emails were triggered.
[Solr-reference-guide-master] $ /usr/bin/env bash /tmp/jenkins5837324050719916850.sh
+ set -e
+ RVM_PATH=/home/jenkins/.rvm
+ RUBY_VERSION=ruby-2.3.3
+ GEMSET=solr-refguide-gemset
+ curl -sSL https://get.rvm.io
+ bash -s -- --ignore-dotfiles stable
Turning on ignore dotfiles mode.
Downloading https://github.com/rvm/rvm/archive/1.29.3.tar.gz
Downloading https://github.com/rvm/rvm/releases/download/1.29.3/1.29.3.tar.gz.asc
gpg: Signature made Sun 10 Sep 2017 08:59:21 PM UTC using RSA key ID BF04FF17
gpg: Good signature from "Michal Papis (RVM signing) <mp...@gmail.com>"
gpg:                 aka "Michal Papis <mi...@toptal.com>"
gpg:                 aka "[jpeg image of size 5015]"
gpg: WARNING: This key is not certified with a trusted signature!
gpg:          There is no indication that the signature belongs to the owner.
Primary key fingerprint: 409B 6B17 96C2 7546 2A17  0311 3804 BB82 D39D C0E3
     Subkey fingerprint: 62C9 E5F4 DA30 0D94 AC36  166B E206 C29F BF04 FF17
GPG verified '/home/jenkins/.rvm/archives/rvm-1.29.3.tgz'

Upgrading the RVM installation in /home/jenkins/.rvm/
Upgrade of RVM in /home/jenkins/.rvm/ is complete.

Upgrade Notes:

  * No new notes to display.

+ set +x
Running 'source /home/jenkins/.rvm/scripts/rvm'
Running 'rvm autolibs disable'
Running 'rvm install ruby-2.3.3'
Already installed ruby-2.3.3.
To reinstall use:

    rvm reinstall ruby-2.3.3

Running 'rvm gemset create solr-refguide-gemset'
ruby-2.3.3 - #gemset created /home/jenkins/.rvm/gems/ruby-2.3.3@solr-refguide-gemset
ruby-2.3.3 - #generating solr-refguide-gemset wrappers........
Running 'rvm ruby-2.3.3@solr-refguide-gemset'
Using /home/jenkins/.rvm/gems/ruby-2.3.3 with gemset solr-refguide-gemset
Running 'gem install --force --version 3.5.0 jekyll'
Successfully installed jekyll-3.5.0
Parsing documentation for jekyll-3.5.0
Done installing documentation for jekyll after 2 seconds
1 gem installed
Running 'gem install --force --version 2.1.0 jekyll-asciidoc'
Successfully installed jekyll-asciidoc-2.1.0
Parsing documentation for jekyll-asciidoc-2.1.0
Done installing documentation for jekyll-asciidoc after 0 seconds
1 gem installed
Running 'gem install --force --version 1.1.2 pygments.rb'
Successfully installed pygments.rb-1.1.2
Parsing documentation for pygments.rb-1.1.2
Done installing documentation for pygments.rb after 0 seconds
1 gem installed
+ ant clean build-site build-pdf
Buildfile: /home/jenkins/jenkins-slave/workspace/Solr-reference-guide-master/solr/solr-ref-guide/build.xml

clean:

build-init:
    [mkdir] Created dir: /home/jenkins/jenkins-slave/workspace/Solr-reference-guide-master/solr/build/solr-ref-guide/content
     [echo] Copying all non template files from src ...
     [copy] Copying 370 files to /home/jenkins/jenkins-slave/workspace/Solr-reference-guide-master/solr/build/solr-ref-guide/content
     [echo] Copy (w/prop replacement) any template files from src...
     [copy] Copying 1 file to /home/jenkins/jenkins-slave/workspace/Solr-reference-guide-master/solr/build/solr-ref-guide/content

ivy-availability-check:
[loadresource] Do not set property disallowed.ivy.jars.list as its length is 0.

-ivy-fail-disallowed-ivy-version:

ivy-fail:

ivy-configure:
[ivy:configure] :: Apache Ivy 2.3.0 - 20130110142753 :: http://ant.apache.org/ivy/ ::
[ivy:configure] :: loading settings :: file = /home/jenkins/jenkins-slave/workspace/Solr-reference-guide-master/lucene/top-level-ivy-settings.xml

resolve:
[ivy:retrieve] 
[ivy:retrieve] :: problems summary ::
[ivy:retrieve] :::: ERRORS
[ivy:retrieve] 	unknown resolver null
[ivy:retrieve] 	unknown resolver null
[ivy:retrieve] 	SERVER ERROR: Bad Gateway url=https://oss.sonatype.org/content/repositories/releases/org/apache/pdfbox/pdfbox-parent/2.0.1/pdfbox-parent-2.0.1.jar
[ivy:retrieve] 	unknown resolver null
[ivy:retrieve] 	unknown resolver null
[ivy:retrieve] 	unknown resolver null
[ivy:retrieve] 	unknown resolver null
[ivy:retrieve] 
[ivy:retrieve] :: USE VERBOSE OR DEBUG MESSAGE LEVEL FOR MORE DETAILS

build-tools-jar:
    [mkdir] Created dir: /home/jenkins/jenkins-slave/workspace/Solr-reference-guide-master/solr/build/solr-ref-guide/classes
    [javac] Compiling 3 source files to /home/jenkins/jenkins-slave/workspace/Solr-reference-guide-master/solr/build/solr-ref-guide/classes
      [jar] Building jar: /home/jenkins/jenkins-slave/workspace/Solr-reference-guide-master/solr/build/solr-ref-guide/solr-ref-guide-tools.jar

build-nav-data-files:
     [java] Building up tree of all known pages
     [java] Creating /home/jenkins/jenkins-slave/workspace/Solr-reference-guide-master/solr/build/solr-ref-guide/content/_data/pdf-main-body.adoc
     [java] Creating /home/jenkins/jenkins-slave/workspace/Solr-reference-guide-master/solr/build/solr-ref-guide/content/_data/scrollnav.json
     [java] Creating /home/jenkins/jenkins-slave/workspace/Solr-reference-guide-master/solr/build/solr-ref-guide/content/_data/sidebar.json

-build-site:
     [echo] Running Jekyll...
     [exec] Configuration file: /home/jenkins/jenkins-slave/workspace/Solr-reference-guide-master/solr/build/solr-ref-guide/content/_config.yml
     [exec]        Deprecation: The 'gems' configuration option has been renamed to 'plugins'. Please update your config file accordingly.
     [exec]             Source: /home/jenkins/jenkins-slave/workspace/Solr-reference-guide-master/solr/build/solr-ref-guide/content
     [exec]        Destination: ../html-site
     [exec]  Incremental build: disabled. Enable with --incremental
     [exec]       Generating... 
     [exec]                     done in 16.476 seconds.
     [exec]  Auto-regeneration: disabled. Use --watch to enable.

check-links-and-anchors:
     [java] Relative link points at id that doesn't exist in dest: solrcloud-autoscaling-policy-preferences.html#defining-collection-specific-policies
     [java]  ... source: file:/home/jenkins/jenkins-slave/workspace/Solr-reference-guide-master/solr/build/solr-ref-guide/html-site/solrcloud-autoscaling-overview.html
     [java] Total of 1 problems found

BUILD FAILED
/home/jenkins/jenkins-slave/workspace/Solr-reference-guide-master/solr/solr-ref-guide/build.xml:165: Java returned: 255

Total time: 30 seconds
Build step 'Execute shell' marked build as failure
Archiving artifacts
Publishing Javadoc
Email was triggered for: Failure - Any
Sending email for trigger: Failure - Any

[JENKINS] Solr-reference-guide-master - Build # 2217 - Still Failing

Posted by Apache Jenkins Server <je...@builds.apache.org>.
Build: https://builds.apache.org/job/Solr-reference-guide-master/2217/

Log: 
Started by timer
[EnvInject] - Loading node environment variables.
Building remotely on H19 (git-websites) in workspace /home/jenkins/jenkins-slave/workspace/Solr-reference-guide-master
 > git rev-parse --is-inside-work-tree # timeout=10
Fetching changes from the remote Git repository
 > git config remote.origin.url git://git.apache.org/lucene-solr.git # timeout=10
Cleaning workspace
 > git rev-parse --verify HEAD # timeout=10
Resetting working tree
 > git reset --hard # timeout=10
 > git clean -fdx # timeout=10
Fetching upstream changes from git://git.apache.org/lucene-solr.git
 > git --version # timeout=10
 > git fetch --tags --progress git://git.apache.org/lucene-solr.git +refs/heads/*:refs/remotes/origin/*
 > git rev-parse refs/remotes/origin/master^{commit} # timeout=10
 > git rev-parse refs/remotes/origin/origin/master^{commit} # timeout=10
Checking out Revision 790533da124ab10b52fad35372ed09e5f0bd57d5 (refs/remotes/origin/master)
Commit message: "SOLR-11401: Add zipFDistribution Stream Evaluator"
 > git config core.sparsecheckout # timeout=10
 > git checkout -f 790533da124ab10b52fad35372ed09e5f0bd57d5
 > git rev-list 790533da124ab10b52fad35372ed09e5f0bd57d5 # timeout=10
No emails were triggered.
[Solr-reference-guide-master] $ /usr/bin/env bash /tmp/jenkins2431624241519815841.sh
+ set -e
+ RVM_PATH=/home/jenkins/.rvm
+ RUBY_VERSION=ruby-2.3.3
+ GEMSET=solr-refguide-gemset
+ curl -sSL https://get.rvm.io
+ bash -s -- --ignore-dotfiles stable
Turning on ignore dotfiles mode.
Downloading https://github.com/rvm/rvm/archive/1.29.3.tar.gz
Downloading https://github.com/rvm/rvm/releases/download/1.29.3/1.29.3.tar.gz.asc
gpg: Signature made Sun 10 Sep 2017 08:59:21 PM UTC using RSA key ID BF04FF17
gpg: Good signature from "Michal Papis (RVM signing) <mp...@gmail.com>"
gpg:                 aka "Michal Papis <mi...@toptal.com>"
gpg:                 aka "[jpeg image of size 5015]"
gpg: WARNING: This key is not certified with a trusted signature!
gpg:          There is no indication that the signature belongs to the owner.
Primary key fingerprint: 409B 6B17 96C2 7546 2A17  0311 3804 BB82 D39D C0E3
     Subkey fingerprint: 62C9 E5F4 DA30 0D94 AC36  166B E206 C29F BF04 FF17
GPG verified '/home/jenkins/.rvm/archives/rvm-1.29.3.tgz'

Upgrading the RVM installation in /home/jenkins/.rvm/
Upgrade of RVM in /home/jenkins/.rvm/ is complete.

Upgrade Notes:

  * No new notes to display.

+ set +x
Running 'source /home/jenkins/.rvm/scripts/rvm'
Running 'rvm autolibs disable'
Running 'rvm install ruby-2.3.3'
Already installed ruby-2.3.3.
To reinstall use:

    rvm reinstall ruby-2.3.3

Running 'rvm gemset create solr-refguide-gemset'
ruby-2.3.3 - #gemset created /home/jenkins/.rvm/gems/ruby-2.3.3@solr-refguide-gemset
ruby-2.3.3 - #generating solr-refguide-gemset wrappers........
Running 'rvm ruby-2.3.3@solr-refguide-gemset'
Using /home/jenkins/.rvm/gems/ruby-2.3.3 with gemset solr-refguide-gemset
Running 'gem install --force --version 3.5.0 jekyll'
Successfully installed jekyll-3.5.0
Parsing documentation for jekyll-3.5.0
Done installing documentation for jekyll after 2 seconds
1 gem installed
Running 'gem install --force --version 2.1.0 jekyll-asciidoc'
Successfully installed jekyll-asciidoc-2.1.0
Parsing documentation for jekyll-asciidoc-2.1.0
Done installing documentation for jekyll-asciidoc after 0 seconds
1 gem installed
Running 'gem install --force --version 1.1.2 pygments.rb'
Successfully installed pygments.rb-1.1.2
Parsing documentation for pygments.rb-1.1.2
Done installing documentation for pygments.rb after 0 seconds
1 gem installed
+ ant clean build-site build-pdf
Buildfile: /home/jenkins/jenkins-slave/workspace/Solr-reference-guide-master/solr/solr-ref-guide/build.xml

clean:

build-init:
    [mkdir] Created dir: /home/jenkins/jenkins-slave/workspace/Solr-reference-guide-master/solr/build/solr-ref-guide/content
     [echo] Copying all non template files from src ...
     [copy] Copying 370 files to /home/jenkins/jenkins-slave/workspace/Solr-reference-guide-master/solr/build/solr-ref-guide/content
     [echo] Copy (w/prop replacement) any template files from src...
     [copy] Copying 1 file to /home/jenkins/jenkins-slave/workspace/Solr-reference-guide-master/solr/build/solr-ref-guide/content

ivy-availability-check:
[loadresource] Do not set property disallowed.ivy.jars.list as its length is 0.

-ivy-fail-disallowed-ivy-version:

ivy-fail:

ivy-configure:
[ivy:configure] :: Apache Ivy 2.3.0 - 20130110142753 :: http://ant.apache.org/ivy/ ::
[ivy:configure] :: loading settings :: file = /home/jenkins/jenkins-slave/workspace/Solr-reference-guide-master/lucene/top-level-ivy-settings.xml

resolve:
[ivy:retrieve] 
[ivy:retrieve] :: problems summary ::
[ivy:retrieve] :::: ERRORS
[ivy:retrieve] 	unknown resolver null
[ivy:retrieve] 	unknown resolver null
[ivy:retrieve] 	unknown resolver null
[ivy:retrieve] 	unknown resolver null
[ivy:retrieve] 	unknown resolver null
[ivy:retrieve] 	unknown resolver null
[ivy:retrieve] 
[ivy:retrieve] :: USE VERBOSE OR DEBUG MESSAGE LEVEL FOR MORE DETAILS

build-tools-jar:
    [mkdir] Created dir: /home/jenkins/jenkins-slave/workspace/Solr-reference-guide-master/solr/build/solr-ref-guide/classes
    [javac] Compiling 3 source files to /home/jenkins/jenkins-slave/workspace/Solr-reference-guide-master/solr/build/solr-ref-guide/classes
      [jar] Building jar: /home/jenkins/jenkins-slave/workspace/Solr-reference-guide-master/solr/build/solr-ref-guide/solr-ref-guide-tools.jar

build-nav-data-files:
     [java] Building up tree of all known pages
     [java] Creating /home/jenkins/jenkins-slave/workspace/Solr-reference-guide-master/solr/build/solr-ref-guide/content/_data/pdf-main-body.adoc
     [java] Creating /home/jenkins/jenkins-slave/workspace/Solr-reference-guide-master/solr/build/solr-ref-guide/content/_data/scrollnav.json
     [java] Creating /home/jenkins/jenkins-slave/workspace/Solr-reference-guide-master/solr/build/solr-ref-guide/content/_data/sidebar.json

-build-site:
     [echo] Running Jekyll...
     [exec] Configuration file: /home/jenkins/jenkins-slave/workspace/Solr-reference-guide-master/solr/build/solr-ref-guide/content/_config.yml
     [exec]             Source: /home/jenkins/jenkins-slave/workspace/Solr-reference-guide-master/solr/build/solr-ref-guide/content       Deprecation: The 'gems' configuration option has been renamed to 'plugins'. Please update your config file accordingly.
     [exec] 
     [exec]        Destination: ../html-site
     [exec]  Incremental build: disabled. Enable with --incremental
     [exec]       Generating... 
     [exec]                     done in 16.339 seconds.
     [exec]  Auto-regeneration: disabled. Use --watch to enable.

check-links-and-anchors:
     [java] Relative link points at id that doesn't exist in dest: solrcloud-autoscaling-policy-preferences.html#defining-collection-specific-policies
     [java]  ... source: file:/home/jenkins/jenkins-slave/workspace/Solr-reference-guide-master/solr/build/solr-ref-guide/html-site/solrcloud-autoscaling-overview.html
     [java] Total of 1 problems found

BUILD FAILED
/home/jenkins/jenkins-slave/workspace/Solr-reference-guide-master/solr/solr-ref-guide/build.xml:165: Java returned: 255

Total time: 29 seconds
Build step 'Execute shell' marked build as failure
Archiving artifacts
Publishing Javadoc
Email was triggered for: Failure - Any
Sending email for trigger: Failure - Any

[JENKINS] Solr-reference-guide-master - Build # 2216 - Still Failing

Posted by Apache Jenkins Server <je...@builds.apache.org>.
Build: https://builds.apache.org/job/Solr-reference-guide-master/2216/

Log: 
Started by timer
[EnvInject] - Loading node environment variables.
Building remotely on H19 (git-websites) in workspace /home/jenkins/jenkins-slave/workspace/Solr-reference-guide-master
 > git rev-parse --is-inside-work-tree # timeout=10
Fetching changes from the remote Git repository
 > git config remote.origin.url git://git.apache.org/lucene-solr.git # timeout=10
Cleaning workspace
 > git rev-parse --verify HEAD # timeout=10
Resetting working tree
 > git reset --hard # timeout=10
 > git clean -fdx # timeout=10
Fetching upstream changes from git://git.apache.org/lucene-solr.git
 > git --version # timeout=10
 > git fetch --tags --progress git://git.apache.org/lucene-solr.git +refs/heads/*:refs/remotes/origin/*
 > git rev-parse refs/remotes/origin/master^{commit} # timeout=10
 > git rev-parse refs/remotes/origin/origin/master^{commit} # timeout=10
Checking out Revision 790533da124ab10b52fad35372ed09e5f0bd57d5 (refs/remotes/origin/master)
Commit message: "SOLR-11401: Add zipFDistribution Stream Evaluator"
 > git config core.sparsecheckout # timeout=10
 > git checkout -f 790533da124ab10b52fad35372ed09e5f0bd57d5
 > git rev-list 790533da124ab10b52fad35372ed09e5f0bd57d5 # timeout=10
No emails were triggered.
[Solr-reference-guide-master] $ /usr/bin/env bash /tmp/jenkins4302026676434459509.sh
+ set -e
+ RVM_PATH=/home/jenkins/.rvm
+ RUBY_VERSION=ruby-2.3.3
+ GEMSET=solr-refguide-gemset
+ curl -sSL https://get.rvm.io
+ bash -s -- --ignore-dotfiles stable
Turning on ignore dotfiles mode.
Downloading https://github.com/rvm/rvm/archive/1.29.3.tar.gz
Downloading https://github.com/rvm/rvm/releases/download/1.29.3/1.29.3.tar.gz.asc
gpg: Signature made Sun 10 Sep 2017 08:59:21 PM UTC using RSA key ID BF04FF17
gpg: Good signature from "Michal Papis (RVM signing) <mp...@gmail.com>"
gpg:                 aka "Michal Papis <mi...@toptal.com>"
gpg:                 aka "[jpeg image of size 5015]"
gpg: WARNING: This key is not certified with a trusted signature!
gpg:          There is no indication that the signature belongs to the owner.
Primary key fingerprint: 409B 6B17 96C2 7546 2A17  0311 3804 BB82 D39D C0E3
     Subkey fingerprint: 62C9 E5F4 DA30 0D94 AC36  166B E206 C29F BF04 FF17
GPG verified '/home/jenkins/.rvm/archives/rvm-1.29.3.tgz'

Upgrading the RVM installation in /home/jenkins/.rvm/
Upgrade of RVM in /home/jenkins/.rvm/ is complete.

Upgrade Notes:

  * No new notes to display.

+ set +x
Running 'source /home/jenkins/.rvm/scripts/rvm'
Running 'rvm autolibs disable'
Running 'rvm install ruby-2.3.3'
Already installed ruby-2.3.3.
To reinstall use:

    rvm reinstall ruby-2.3.3

Running 'rvm gemset create solr-refguide-gemset'
ruby-2.3.3 - #gemset created /home/jenkins/.rvm/gems/ruby-2.3.3@solr-refguide-gemset
ruby-2.3.3 - #generating solr-refguide-gemset wrappers........
Running 'rvm ruby-2.3.3@solr-refguide-gemset'
Using /home/jenkins/.rvm/gems/ruby-2.3.3 with gemset solr-refguide-gemset
Running 'gem install --force --version 3.5.0 jekyll'
Successfully installed jekyll-3.5.0
Parsing documentation for jekyll-3.5.0
Done installing documentation for jekyll after 2 seconds
1 gem installed
Running 'gem install --force --version 2.1.0 jekyll-asciidoc'
Successfully installed jekyll-asciidoc-2.1.0
Parsing documentation for jekyll-asciidoc-2.1.0
Done installing documentation for jekyll-asciidoc after 0 seconds
1 gem installed
Running 'gem install --force --version 1.1.2 pygments.rb'
Successfully installed pygments.rb-1.1.2
Parsing documentation for pygments.rb-1.1.2
Done installing documentation for pygments.rb after 0 seconds
1 gem installed
+ ant clean build-site build-pdf
Buildfile: /home/jenkins/jenkins-slave/workspace/Solr-reference-guide-master/solr/solr-ref-guide/build.xml

clean:

build-init:
    [mkdir] Created dir: /home/jenkins/jenkins-slave/workspace/Solr-reference-guide-master/solr/build/solr-ref-guide/content
     [echo] Copying all non template files from src ...
     [copy] Copying 370 files to /home/jenkins/jenkins-slave/workspace/Solr-reference-guide-master/solr/build/solr-ref-guide/content
     [echo] Copy (w/prop replacement) any template files from src...
     [copy] Copying 1 file to /home/jenkins/jenkins-slave/workspace/Solr-reference-guide-master/solr/build/solr-ref-guide/content

ivy-availability-check:
[loadresource] Do not set property disallowed.ivy.jars.list as its length is 0.

-ivy-fail-disallowed-ivy-version:

ivy-fail:

ivy-configure:
[ivy:configure] :: Apache Ivy 2.3.0 - 20130110142753 :: http://ant.apache.org/ivy/ ::
[ivy:configure] :: loading settings :: file = /home/jenkins/jenkins-slave/workspace/Solr-reference-guide-master/lucene/top-level-ivy-settings.xml

resolve:
[ivy:retrieve] 
[ivy:retrieve] :: problems summary ::
[ivy:retrieve] :::: ERRORS
[ivy:retrieve] 	unknown resolver null
[ivy:retrieve] 	unknown resolver null
[ivy:retrieve] 	unknown resolver null
[ivy:retrieve] 	unknown resolver null
[ivy:retrieve] 	unknown resolver null
[ivy:retrieve] 	unknown resolver null
[ivy:retrieve] 
[ivy:retrieve] :: USE VERBOSE OR DEBUG MESSAGE LEVEL FOR MORE DETAILS

build-tools-jar:
    [mkdir] Created dir: /home/jenkins/jenkins-slave/workspace/Solr-reference-guide-master/solr/build/solr-ref-guide/classes
    [javac] Compiling 3 source files to /home/jenkins/jenkins-slave/workspace/Solr-reference-guide-master/solr/build/solr-ref-guide/classes
      [jar] Building jar: /home/jenkins/jenkins-slave/workspace/Solr-reference-guide-master/solr/build/solr-ref-guide/solr-ref-guide-tools.jar

build-nav-data-files:
     [java] Building up tree of all known pages
     [java] Creating /home/jenkins/jenkins-slave/workspace/Solr-reference-guide-master/solr/build/solr-ref-guide/content/_data/pdf-main-body.adoc
     [java] Creating /home/jenkins/jenkins-slave/workspace/Solr-reference-guide-master/solr/build/solr-ref-guide/content/_data/scrollnav.json
     [java] Creating /home/jenkins/jenkins-slave/workspace/Solr-reference-guide-master/solr/build/solr-ref-guide/content/_data/sidebar.json

-build-site:
     [echo] Running Jekyll...
     [exec] Configuration file: /home/jenkins/jenkins-slave/workspace/Solr-reference-guide-master/solr/build/solr-ref-guide/content/_config.yml
     [exec]             Source: /home/jenkins/jenkins-slave/workspace/Solr-reference-guide-master/solr/build/solr-ref-guide/content
     [exec]        Destination: ../html-site
     [exec]  Incremental build: disabled. Enable with --incremental
     [exec]       Generating... 
     [exec]        Deprecation: The 'gems' configuration option has been renamed to 'plugins'. Please update your config file accordingly.
     [exec]                     done in 16.641 seconds.
     [exec]  Auto-regeneration: disabled. Use --watch to enable.

check-links-and-anchors:
     [java] Relative link points at id that doesn't exist in dest: solrcloud-autoscaling-policy-preferences.html#defining-collection-specific-policies
     [java]  ... source: file:/home/jenkins/jenkins-slave/workspace/Solr-reference-guide-master/solr/build/solr-ref-guide/html-site/solrcloud-autoscaling-overview.html
     [java] Total of 1 problems found

BUILD FAILED
/home/jenkins/jenkins-slave/workspace/Solr-reference-guide-master/solr/solr-ref-guide/build.xml:165: Java returned: 255

Total time: 29 seconds
Build step 'Execute shell' marked build as failure
Archiving artifacts
Publishing Javadoc
Email was triggered for: Failure - Any
Sending email for trigger: Failure - Any