You are viewing a plain text version of this content. The canonical link for it is here.
Posted to yarn-dev@hadoop.apache.org by Apache Jenkins Server <je...@builds.apache.org> on 2013/10/17 20:48:17 UTC
Failed: YARN-891 PreCommit Build #2203
Jira: https://issues.apache.org/jira/browse/YARN-891
Build: https://builds.apache.org/job/PreCommit-YARN-Build/2203/
###################################################################################
########################## LAST 60 LINES OF THE CONSOLE ###########################
[...truncated 3100 lines...]
NOP
{color:red}-1 overall{color}. Here are the results of testing the latest attachment
http://issues.apache.org/jira/secure/attachment/12608991/YARN-891.patch
against trunk revision .
{color:green}+1 @author{color}. The patch does not contain any @author tags.
{color:green}+1 tests included{color}. The patch appears to include 8 new or modified test files.
{color:green}+1 javac{color}. The applied patch does not increase the total number of javac compiler warnings.
{color:red}-1 javadoc{color}. The javadoc tool appears to have generated 1 warning messages.
{color:green}+1 eclipse:eclipse{color}. The patch built with eclipse:eclipse.
{color:green}+1 findbugs{color}. The patch does not introduce any new Findbugs (version 1.3.9) warnings.
{color:green}+1 release audit{color}. The applied patch does not increase the total number of release audit warnings.
{color:red}-1 core tests{color}. The patch failed these unit tests in hadoop-yarn-project/hadoop-yarn/hadoop-yarn-api hadoop-yarn-project/hadoop-yarn/hadoop-yarn-server/hadoop-yarn-server-resourcemanager:
org.apache.hadoop.yarn.server.resourcemanager.recovery.TestRMStateStore
{color:green}+1 contrib tests{color}. The patch passed contrib unit tests.
Test results: https://builds.apache.org/job/PreCommit-YARN-Build/2203//testReport/
Console output: https://builds.apache.org/job/PreCommit-YARN-Build/2203//console
This message is automatically generated.
======================================================================
======================================================================
Adding comment to Jira.
======================================================================
======================================================================
Comment added.
50f153a77ad922bdee93156803487419eebb8be8 logged out
======================================================================
======================================================================
Finished build.
======================================================================
======================================================================
Build step 'Execute shell' marked build as failure
Archiving artifacts
[description-setter] Could not determine description.
Recording test results
Email was triggered for: Failure
Sending email for trigger: Failure
###################################################################################
############################## FAILED TESTS (if any) ##############################
2 tests failed.
FAILED: org.apache.hadoop.yarn.server.resourcemanager.recovery.TestRMStateStore.testZKRMStateStoreRealZK
Error Message:
expected: org.apache.hadoop.yarn.api.records.YarnApplicationState<FINISHED> but was: org.apache.hadoop.yarn.server.resourcemanager.rmapp.RMAppState<FINISHED>
Stack Trace:
java.lang.AssertionError: expected: org.apache.hadoop.yarn.api.records.YarnApplicationState<FINISHED> but was: org.apache.hadoop.yarn.server.resourcemanager.rmapp.RMAppState<FINISHED>
at org.junit.Assert.fail(Assert.java:93)
at org.junit.Assert.failNotEquals(Assert.java:647)
at org.junit.Assert.assertEquals(Assert.java:128)
at org.junit.Assert.assertEquals(Assert.java:147)
at org.apache.hadoop.yarn.server.resourcemanager.recovery.TestRMStateStore.testRMAppStateStore(TestRMStateStore.java:357)
at org.apache.hadoop.yarn.server.resourcemanager.recovery.TestRMStateStore.testZKRMStateStoreRealZK(TestRMStateStore.java:123)
FAILED: org.apache.hadoop.yarn.server.resourcemanager.recovery.TestRMStateStore.testFSRMStateStore
Error Message:
expected: org.apache.hadoop.yarn.api.records.YarnApplicationState<FINISHED> but was: org.apache.hadoop.yarn.server.resourcemanager.rmapp.RMAppState<FINISHED>
Stack Trace:
java.lang.AssertionError: expected: org.apache.hadoop.yarn.api.records.YarnApplicationState<FINISHED> but was: org.apache.hadoop.yarn.server.resourcemanager.rmapp.RMAppState<FINISHED>
at org.junit.Assert.fail(Assert.java:93)
at org.junit.Assert.failNotEquals(Assert.java:647)
at org.junit.Assert.assertEquals(Assert.java:128)
at org.junit.Assert.assertEquals(Assert.java:147)
at org.apache.hadoop.yarn.server.resourcemanager.recovery.TestRMStateStore.testRMAppStateStore(TestRMStateStore.java:357)
at org.apache.hadoop.yarn.server.resourcemanager.recovery.TestRMStateStore.testFSRMStateStore(TestRMStateStore.java:134)
Success: YARN-1303 PreCommit Build #2206
Posted by Apache Jenkins Server <je...@builds.apache.org>.
Jira: https://issues.apache.org/jira/browse/YARN-1303
Build: https://builds.apache.org/job/PreCommit-YARN-Build/2206/
###################################################################################
########################## LAST 60 LINES OF THE CONSOLE ###########################
[...truncated 2872 lines...]
/bin/kill -9 25793
kill: No such process
NOP
{color:green}+1 overall{color}. Here are the results of testing the latest attachment
http://issues.apache.org/jira/secure/attachment/12609003/YARN-1303.6.patch
against trunk revision .
{color:green}+1 @author{color}. The patch does not contain any @author tags.
{color:green}+1 tests included{color}. The patch appears to include 1 new or modified test files.
{color:green}+1 javac{color}. The applied patch does not increase the total number of javac compiler warnings.
{color:green}+1 javadoc{color}. The javadoc tool did not generate any warning messages.
{color:green}+1 eclipse:eclipse{color}. The patch built with eclipse:eclipse.
{color:green}+1 findbugs{color}. The patch does not introduce any new Findbugs (version 1.3.9) warnings.
{color:green}+1 release audit{color}. The applied patch does not increase the total number of release audit warnings.
{color:green}+1 core tests{color}. The patch passed unit tests in hadoop-yarn-project/hadoop-yarn/hadoop-yarn-applications/hadoop-yarn-applications-distributedshell.
{color:green}+1 contrib tests{color}. The patch passed contrib unit tests.
Test results: https://builds.apache.org/job/PreCommit-YARN-Build/2206//testReport/
Console output: https://builds.apache.org/job/PreCommit-YARN-Build/2206//console
This message is automatically generated.
======================================================================
======================================================================
Adding comment to Jira.
======================================================================
======================================================================
Comment added.
69afc45b38b1ce1b4661d74092908d06b9f7fa93 logged out
======================================================================
======================================================================
Finished build.
======================================================================
======================================================================
Archiving artifacts
Description set: YARN-1303
Recording test results
Email was triggered for: Success
Sending email for trigger: Success
###################################################################################
############################## FAILED TESTS (if any) ##############################
All tests passed
Failed: YARN-891 PreCommit Build #2205
Posted by Apache Jenkins Server <je...@builds.apache.org>.
Jira: https://issues.apache.org/jira/browse/YARN-891
Build: https://builds.apache.org/job/PreCommit-YARN-Build/2205/
###################################################################################
########################## LAST 60 LINES OF THE CONSOLE ###########################
[...truncated 3074 lines...]
/bin/kill -9 31952
kill: No such process
NOP
{color:red}-1 overall{color}. Here are the results of testing the latest attachment
http://issues.apache.org/jira/secure/attachment/12608998/YARN-891.patch
against trunk revision .
{color:green}+1 @author{color}. The patch does not contain any @author tags.
{color:green}+1 tests included{color}. The patch appears to include 8 new or modified test files.
{color:green}+1 javac{color}. The applied patch does not increase the total number of javac compiler warnings.
{color:red}-1 javadoc{color}. The javadoc tool appears to have generated 1 warning messages.
{color:green}+1 eclipse:eclipse{color}. The patch built with eclipse:eclipse.
{color:green}+1 findbugs{color}. The patch does not introduce any new Findbugs (version 1.3.9) warnings.
{color:green}+1 release audit{color}. The applied patch does not increase the total number of release audit warnings.
{color:green}+1 core tests{color}. The patch passed unit tests in hadoop-yarn-project/hadoop-yarn/hadoop-yarn-api hadoop-yarn-project/hadoop-yarn/hadoop-yarn-server/hadoop-yarn-server-resourcemanager.
{color:green}+1 contrib tests{color}. The patch passed contrib unit tests.
Test results: https://builds.apache.org/job/PreCommit-YARN-Build/2205//testReport/
Console output: https://builds.apache.org/job/PreCommit-YARN-Build/2205//console
This message is automatically generated.
======================================================================
======================================================================
Adding comment to Jira.
======================================================================
======================================================================
Comment added.
fb83383a0707e0ca2f5d3349e12a02fb84f341dc logged out
======================================================================
======================================================================
Finished build.
======================================================================
======================================================================
Build step 'Execute shell' marked build as failure
Archiving artifacts
[description-setter] Could not determine description.
Recording test results
Email was triggered for: Failure
Sending email for trigger: Failure
###################################################################################
############################## FAILED TESTS (if any) ##############################
All tests passed
Failed: YARN-891 PreCommit Build #2204
Posted by Apache Jenkins Server <je...@builds.apache.org>.
Jira: https://issues.apache.org/jira/browse/YARN-891
Build: https://builds.apache.org/job/PreCommit-YARN-Build/2204/
###################################################################################
########################## LAST 60 LINES OF THE CONSOLE ###########################
[...truncated 3102 lines...]
NOP
{color:red}-1 overall{color}. Here are the results of testing the latest attachment
http://issues.apache.org/jira/secure/attachment/12608993/YARN-891.patch
against trunk revision .
{color:green}+1 @author{color}. The patch does not contain any @author tags.
{color:green}+1 tests included{color}. The patch appears to include 8 new or modified test files.
{color:green}+1 javac{color}. The applied patch does not increase the total number of javac compiler warnings.
{color:red}-1 javadoc{color}. The javadoc tool appears to have generated 1 warning messages.
{color:green}+1 eclipse:eclipse{color}. The patch built with eclipse:eclipse.
{color:green}+1 findbugs{color}. The patch does not introduce any new Findbugs (version 1.3.9) warnings.
{color:green}+1 release audit{color}. The applied patch does not increase the total number of release audit warnings.
{color:red}-1 core tests{color}. The patch failed these unit tests in hadoop-yarn-project/hadoop-yarn/hadoop-yarn-api hadoop-yarn-project/hadoop-yarn/hadoop-yarn-server/hadoop-yarn-server-resourcemanager:
org.apache.hadoop.yarn.server.resourcemanager.recovery.TestRMStateStore
{color:green}+1 contrib tests{color}. The patch passed contrib unit tests.
Test results: https://builds.apache.org/job/PreCommit-YARN-Build/2204//testReport/
Console output: https://builds.apache.org/job/PreCommit-YARN-Build/2204//console
This message is automatically generated.
======================================================================
======================================================================
Adding comment to Jira.
======================================================================
======================================================================
Comment added.
2ae420984dff767003f9d19f17c3d9828345420d logged out
======================================================================
======================================================================
Finished build.
======================================================================
======================================================================
Build step 'Execute shell' marked build as failure
Archiving artifacts
[description-setter] Could not determine description.
Recording test results
Email was triggered for: Failure
Sending email for trigger: Failure
###################################################################################
############################## FAILED TESTS (if any) ##############################
2 tests failed.
FAILED: org.apache.hadoop.yarn.server.resourcemanager.recovery.TestRMStateStore.testZKRMStateStoreRealZK
Error Message:
expected: org.apache.hadoop.yarn.api.records.YarnApplicationState<FINISHED> but was: org.apache.hadoop.yarn.server.resourcemanager.rmapp.RMAppState<FINISHED>
Stack Trace:
java.lang.AssertionError: expected: org.apache.hadoop.yarn.api.records.YarnApplicationState<FINISHED> but was: org.apache.hadoop.yarn.server.resourcemanager.rmapp.RMAppState<FINISHED>
at org.junit.Assert.fail(Assert.java:93)
at org.junit.Assert.failNotEquals(Assert.java:647)
at org.junit.Assert.assertEquals(Assert.java:128)
at org.junit.Assert.assertEquals(Assert.java:147)
at org.apache.hadoop.yarn.server.resourcemanager.recovery.TestRMStateStore.testRMAppStateStore(TestRMStateStore.java:357)
at org.apache.hadoop.yarn.server.resourcemanager.recovery.TestRMStateStore.testZKRMStateStoreRealZK(TestRMStateStore.java:123)
FAILED: org.apache.hadoop.yarn.server.resourcemanager.recovery.TestRMStateStore.testFSRMStateStore
Error Message:
expected: org.apache.hadoop.yarn.api.records.YarnApplicationState<FINISHED> but was: org.apache.hadoop.yarn.server.resourcemanager.rmapp.RMAppState<FINISHED>
Stack Trace:
java.lang.AssertionError: expected: org.apache.hadoop.yarn.api.records.YarnApplicationState<FINISHED> but was: org.apache.hadoop.yarn.server.resourcemanager.rmapp.RMAppState<FINISHED>
at org.junit.Assert.fail(Assert.java:93)
at org.junit.Assert.failNotEquals(Assert.java:647)
at org.junit.Assert.assertEquals(Assert.java:128)
at org.junit.Assert.assertEquals(Assert.java:147)
at org.apache.hadoop.yarn.server.resourcemanager.recovery.TestRMStateStore.testRMAppStateStore(TestRMStateStore.java:357)
at org.apache.hadoop.yarn.server.resourcemanager.recovery.TestRMStateStore.testFSRMStateStore(TestRMStateStore.java:134)