You are viewing a plain text version of this content. The canonical link for it is here.
Posted to dev@poi.apache.org by Apache Jenkins Server <je...@builds.apache.org> on 2016/05/17 00:32:46 UTC
Build failed in Jenkins: POI-JDK8 #983
See <https://builds.apache.org/job/POI-JDK8/983/changes>
Changes:
[kiwiwings] Move reflection-equals to POITestCase
------------------------------------------
[...truncated 7398 lines...]
[junit] Running org.apache.poi.xssf.extractor.TestXSSFImportFromXML
[junit] Tests run: 5, Failures: 0, Errors: 0, Skipped: 0, Time elapsed: 0.123 sec
[junit] Running org.apache.poi.xssf.io.TestLoadSaveXSSF
[junit] Tests run: 3, Failures: 0, Errors: 0, Skipped: 0, Time elapsed: 0.047 sec
[junit] Running org.apache.poi.xssf.model.TestCalculationChain
[junit] Tests run: 1, Failures: 0, Errors: 0, Skipped: 0, Time elapsed: 0.333 sec
[junit] Running org.apache.poi.xssf.model.TestCommentsTable
[junit] Tests run: 7, Failures: 0, Errors: 0, Skipped: 0, Time elapsed: 0.119 sec
[junit] Running org.apache.poi.xssf.model.TestExternalLinksTable
[junit] Tests run: 4, Failures: 0, Errors: 0, Skipped: 0, Time elapsed: 0.039 sec
[junit] Running org.apache.poi.xssf.model.TestMapInfo
[junit] Tests run: 1, Failures: 0, Errors: 0, Skipped: 0, Time elapsed: 0.006 sec
[junit] Running org.apache.poi.xssf.model.TestSharedStringsTable
[junit] Tests run: 3, Failures: 0, Errors: 0, Skipped: 0, Time elapsed: 0.068 sec
[junit] Running org.apache.poi.xssf.model.TestStylesTable
[junit] Tests run: 11, Failures: 0, Errors: 0, Skipped: 0, Time elapsed: 0.117 sec
[junit] Running org.apache.poi.xssf.model.TestThemesTable
[junit] Tests run: 3, Failures: 0, Errors: 0, Skipped: 0, Time elapsed: 0.072 sec
[junit] Running org.apache.poi.xssf.streaming.TestAutoSizeColumnTracker
[junit] Tests run: 7, Failures: 0, Errors: 0, Skipped: 0, Time elapsed: 0.06 sec
[junit] Running org.apache.poi.xssf.streaming.TestOutlining
[junit] Tests run: 6, Failures: 0, Errors: 0, Skipped: 0, Time elapsed: 0.062 sec
[junit] Running org.apache.poi.xssf.streaming.TestSXSSFCell
[junit] Tests run: 30, Failures: 0, Errors: 0, Skipped: 0, Time elapsed: 0.43 sec
[junit] Running org.apache.poi.xssf.streaming.TestSXSSFDataValidation
[junit] Tests run: 2, Failures: 0, Errors: 0, Skipped: 0, Time elapsed: 0.115 sec
[junit] Running org.apache.poi.xssf.streaming.TestSXSSFFormulaEvaluation
[junit] Tests run: 5, Failures: 0, Errors: 0, Skipped: 0, Time elapsed: 0.033 sec
[junit] Running org.apache.poi.xssf.streaming.TestSXSSFHyperlink
[junit] Tests run: 2, Failures: 0, Errors: 0, Skipped: 0, Time elapsed: 0.024 sec
[junit] Running org.apache.poi.xssf.streaming.TestSXSSFRow
[junit] Tests run: 10, Failures: 0, Errors: 0, Skipped: 0, Time elapsed: 0.222 sec
[junit] Running org.apache.poi.xssf.streaming.TestSXSSFSheet
[junit] Tests run: 46, Failures: 0, Errors: 0, Skipped: 0, Time elapsed: 0.845 sec
[junit] Running org.apache.poi.xssf.streaming.TestSXSSFSheetAutoSizeColumn
[junit] Tests run: 26, Failures: 0, Errors: 0, Skipped: 0, Time elapsed: 0.221 sec
[junit] Running org.apache.poi.xssf.streaming.TestSXSSFWorkbook
[junit] Tests run: 33, Failures: 0, Errors: 0, Skipped: 4, Time elapsed: 1.097 sec
[junit] Running org.apache.poi.xssf.usermodel.TestFormulaEvaluatorOnXSSF
[junit] Tests run: 369, Failures: 0, Errors: 0, Skipped: 90, Time elapsed: 3.208 sec
[junit] Running org.apache.poi.xssf.usermodel.TestMissingWorkbookOnXSSF
[junit] Tests run: 3, Failures: 0, Errors: 0, Skipped: 0, Time elapsed: 0.024 sec
[junit] Running org.apache.poi.xssf.usermodel.TestMultiSheetFormulaEvaluatorOnXSSF
[junit] Tests run: 2, Failures: 0, Errors: 0, Skipped: 0, Time elapsed: 0.012 sec
[junit] Running org.apache.poi.xssf.usermodel.TestSXSSFBugs
[junit] Tests run: 33, Failures: 0, Errors: 0, Skipped: 8, Time elapsed: 7.583 sec
[junit] Running org.apache.poi.xssf.usermodel.TestSheetHiding
[junit] Tests run: 5, Failures: 0, Errors: 0, Skipped: 0, Time elapsed: 0.058 sec
[junit] Running org.apache.poi.xssf.usermodel.TestXSSFBugs
[junit] Tests run: 124, Failures: 0, Errors: 0, Skipped: 8, Time elapsed: 15.945 sec
[junit] Running org.apache.poi.xssf.usermodel.TestXSSFCell
[junit] Tests run: 49, Failures: 0, Errors: 0, Skipped: 0, Time elapsed: 0.876 sec
[junit] Running org.apache.poi.xssf.usermodel.TestXSSFCellStyle
[junit] Tests run: 42, Failures: 0, Errors: 0, Skipped: 0, Time elapsed: 0.402 sec
[junit] Running org.apache.poi.xssf.usermodel.TestXSSFChart
[junit] Tests run: 3, Failures: 0, Errors: 0, Skipped: 0, Time elapsed: 0.072 sec
[junit] Running org.apache.poi.xssf.usermodel.TestXSSFChartSheet
[junit] Tests run: 3, Failures: 0, Errors: 0, Skipped: 0, Time elapsed: 0.02 sec
[junit] Running org.apache.poi.xssf.usermodel.TestXSSFColGrouping
[junit] Tests run: 6, Failures: 0, Errors: 0, Skipped: 0, Time elapsed: 0.048 sec
[junit] Running org.apache.poi.xssf.usermodel.TestXSSFColor
[junit] Tests run: 3, Failures: 0, Errors: 0, Skipped: 0, Time elapsed: 0.042 sec
[junit] Running org.apache.poi.xssf.usermodel.TestXSSFComment
[junit] Tests run: 17, Failures: 0, Errors: 0, Skipped: 1, Time elapsed: 0.203 sec
[junit] Running org.apache.poi.xssf.usermodel.TestXSSFConditionalFormatting
[junit] Tests run: 18, Failures: 0, Errors: 0, Skipped: 0, Time elapsed: 0.167 sec
[junit] Running org.apache.poi.xssf.usermodel.TestXSSFDataFormat
[junit] Tests run: 7, Failures: 0, Errors: 0, Skipped: 0, Time elapsed: 0.056 sec
[junit] Running org.apache.poi.xssf.usermodel.TestXSSFDataValidation
[junit] Tests run: 6, Failures: 0, Errors: 0, Skipped: 0, Time elapsed: 0.187 sec
[junit] Running org.apache.poi.xssf.usermodel.TestXSSFDialogSheet
[junit] Tests run: 14, Failures: 0, Errors: 0, Skipped: 0, Time elapsed: 0.137 sec
[junit] Running org.apache.poi.xssf.usermodel.TestXSSFDrawing
[junit] Tests run: 18, Failures: 0, Errors: 0, Skipped: 0, Time elapsed: 0.284 sec
[junit] Running org.apache.poi.xssf.usermodel.TestXSSFExternalFunctions
[junit] Tests run: 2, Failures: 0, Errors: 0, Skipped: 0, Time elapsed: 0.009 sec
[junit] Running org.apache.poi.xssf.usermodel.TestXSSFFont
[junit] Tests run: 21, Failures: 0, Errors: 0, Skipped: 0, Time elapsed: 0.206 sec
[junit] Running org.apache.poi.xssf.usermodel.TestXSSFFormulaEvaluation
[junit] Tests run: 25, Failures: 0, Errors: 0, Skipped: 1, Time elapsed: 0.691 sec
[junit] Running org.apache.poi.xssf.usermodel.TestXSSFFormulaParser
[junit] Tests run: 11, Failures: 0, Errors: 0, Skipped: 0, Time elapsed: 0.087 sec
[junit] Running org.apache.poi.xssf.usermodel.TestXSSFHeaderFooter
[junit] Tests run: 2, Failures: 0, Errors: 0, Skipped: 0, Time elapsed: 0.013 sec
[junit] Running org.apache.poi.xssf.usermodel.TestXSSFHyperlink
[junit] Tests run: 10, Failures: 0, Errors: 0, Skipped: 0, Time elapsed: 0.143 sec
[junit] Running org.apache.poi.xssf.usermodel.TestXSSFName
[junit] Tests run: 21, Failures: 0, Errors: 0, Skipped: 0, Time elapsed: 0.177 sec
[junit] Running org.apache.poi.xssf.usermodel.TestXSSFPicture
[junit] Tests run: 6, Failures: 0, Errors: 0, Skipped: 0, Time elapsed: 0.053 sec
[junit] Running org.apache.poi.xssf.usermodel.TestXSSFPictureData
[junit] Tests run: 3, Failures: 0, Errors: 0, Skipped: 0, Time elapsed: 0.083 sec
[junit] Running org.apache.poi.xssf.usermodel.TestXSSFPivotTable
[junit] Tests run: 13, Failures: 0, Errors: 0, Skipped: 0, Time elapsed: 0.136 sec
[junit] Running org.apache.poi.xssf.usermodel.TestXSSFPrintSetup
[junit] Tests run: 18, Failures: 0, Errors: 0, Skipped: 0, Time elapsed: 0.141 sec
[junit] Running org.apache.poi.xssf.usermodel.TestXSSFRichTextString
[junit] Tests run: 17, Failures: 0, Errors: 0, Skipped: 0, Time elapsed: 0.166 sec
[junit] Running org.apache.poi.xssf.usermodel.TestXSSFRow
[junit] Tests run: 13, Failures: 0, Errors: 0, Skipped: 0, Time elapsed: 2.52 sec
[junit] Running org.apache.poi.xssf.usermodel.TestXSSFSheet
[junit] Tests run: 87, Failures: 0, Errors: 0, Skipped: 0, Time elapsed: 3.889 sec
[junit] Running org.apache.poi.xssf.usermodel.TestXSSFSheetAutosizeColumn
[junit] Tests run: 7, Failures: 0, Errors: 0, Skipped: 0, Time elapsed: 0.056 sec
[junit] Running org.apache.poi.xssf.usermodel.TestXSSFSheetMergeRegions
[junit] Tests run: 1, Failures: 0, Errors: 0, Skipped: 0, Time elapsed: 2.101 sec
[junit] Running org.apache.poi.xssf.usermodel.TestXSSFSheetRowGrouping
[junit] Tests run: 6, Failures: 0, Errors: 0, Skipped: 0, Time elapsed: 0.219 sec
[junit] Running org.apache.poi.xssf.usermodel.TestXSSFSheetShiftRows
[junit] Tests run: 23, Failures: 0, Errors: 0, Skipped: 1, Time elapsed: 16.602 sec
[junit] Running org.apache.poi.xssf.usermodel.TestXSSFSheetUpdateArrayFormulas
[junit] Tests run: 16, Failures: 0, Errors: 0, Skipped: 0, Time elapsed: 0.123 sec
[junit] Running org.apache.poi.xssf.usermodel.TestXSSFSimpleShape
[junit] Tests run: 1, Failures: 0, Errors: 0, Skipped: 0, Time elapsed: 0.013 sec
[junit] Running org.apache.poi.xssf.usermodel.TestXSSFTable
[junit] Tests run: 2, Failures: 0, Errors: 0, Skipped: 0, Time elapsed: 0.049 sec
[junit] Running org.apache.poi.xssf.usermodel.TestXSSFTextParagraph
[junit] Tests run: 1, Failures: 0, Errors: 0, Skipped: 0, Time elapsed: 0.009 sec
[junit] Running org.apache.poi.xssf.usermodel.TestXSSFTextRun
[junit] Tests run: 1, Failures: 0, Errors: 0, Skipped: 0, Time elapsed: 0.006 sec
[junit] Running org.apache.poi.xssf.usermodel.TestXSSFVMLDrawing
[junit] Tests run: 3, Failures: 0, Errors: 0, Skipped: 0, Time elapsed: 0.013 sec
[junit] Running org.apache.poi.xssf.usermodel.TestXSSFWorkbook
[junit] Tests run: 55, Failures: 0, Errors: 0, Skipped: 0, Time elapsed: 0.852 sec
[junit] Running org.apache.poi.xssf.usermodel.charts.TestXSSFCategoryAxis
[junit] Tests run: 1, Failures: 0, Errors: 0, Skipped: 0, Time elapsed: 0.026 sec
[junit] Running org.apache.poi.xssf.usermodel.charts.TestXSSFChartAxis
[junit] Tests run: 8, Failures: 0, Errors: 0, Skipped: 0, Time elapsed: 0.057 sec
[junit] Running org.apache.poi.xssf.usermodel.charts.TestXSSFChartLegend
[junit] Tests run: 3, Failures: 0, Errors: 0, Skipped: 0, Time elapsed: 0.025 sec
[junit] Running org.apache.poi.xssf.usermodel.charts.TestXSSFChartTitle
[junit] Tests run: 3, Failures: 0, Errors: 0, Skipped: 0, Time elapsed: 0.037 sec
[junit] Running org.apache.poi.xssf.usermodel.charts.TestXSSFLineChartData
[junit] Tests run: 1, Failures: 0, Errors: 0, Skipped: 0, Time elapsed: 0.006 sec
[junit] Running org.apache.poi.xssf.usermodel.charts.TestXSSFManualLayout
[junit] Tests run: 2, Failures: 0, Errors: 0, Skipped: 0, Time elapsed: 0.013 sec
[junit] Running org.apache.poi.xssf.usermodel.charts.TestXSSFScatterChartData
[junit] Tests run: 1, Failures: 0, Errors: 0, Skipped: 0, Time elapsed: 0.013 sec
[junit] Running org.apache.poi.xssf.usermodel.charts.TestXSSFValueAxis
[junit] Tests run: 1, Failures: 0, Errors: 0, Skipped: 0, Time elapsed: 0.003 sec
[junit] Running org.apache.poi.xssf.usermodel.extensions.TestXSSFBorder
[junit] Tests run: 1, Failures: 0, Errors: 0, Skipped: 0, Time elapsed: 0.008 sec
[junit] Running org.apache.poi.xssf.usermodel.extensions.TestXSSFCellFill
[junit] Tests run: 5, Failures: 0, Errors: 0, Skipped: 0, Time elapsed: 0.038 sec
[junit] Running org.apache.poi.xssf.usermodel.extensions.TestXSSFSheetComments
[junit] Tests run: 1, Failures: 0, Errors: 0, Skipped: 0, Time elapsed: 0.003 sec
[junit] Running org.apache.poi.xssf.usermodel.helpers.TestColumnHelper
[junit] Tests run: 15, Failures: 0, Errors: 0, Skipped: 0, Time elapsed: 0.128 sec
[junit] Running org.apache.poi.xssf.usermodel.helpers.TestHeaderFooterHelper
[junit] Tests run: 2, Failures: 0, Errors: 0, Skipped: 0, Time elapsed: 0.013 sec
[junit] Running org.apache.poi.xssf.util.TestCTColComparator
[junit] Tests run: 2, Failures: 0, Errors: 0, Skipped: 0, Time elapsed: 0.013 sec
[junit] Running org.apache.poi.xssf.util.TestEvilUnclosedBRFixingInputStream
[junit] Tests run: 3, Failures: 0, Errors: 0, Skipped: 0, Time elapsed: 0.021 sec
[junit] Running org.apache.poi.xssf.util.TestNumericRanges
[junit] Tests run: 2, Failures: 0, Errors: 0, Skipped: 0, Time elapsed: 0.007 sec
[junit] Running org.apache.poi.xwpf.TestAllExtendedProperties
[junit] Tests run: 1, Failures: 0, Errors: 0, Skipped: 0, Time elapsed: 0.028 sec
[junit] Running org.apache.poi.xwpf.TestDocumentProtection
[junit] Tests run: 10, Failures: 0, Errors: 0, Skipped: 0, Time elapsed: 0.405 sec
[junit] Running org.apache.poi.xwpf.TestPackageCorePropertiesGetKeywords
[junit] Tests run: 1, Failures: 0, Errors: 0, Skipped: 0, Time elapsed: 0.015 sec
[junit] Running org.apache.poi.xwpf.TestXWPFBugs
[junit] Tests run: 3, Failures: 0, Errors: 0, Skipped: 1, Time elapsed: 0.209 sec
[junit] Running org.apache.poi.xwpf.extractor.TestExternalEntities
[junit] Tests run: 1, Failures: 0, Errors: 0, Skipped: 0, Time elapsed: 0.006 sec
[junit] Running org.apache.poi.xwpf.extractor.TestXWPFWordExtractor
[junit] Tests run: 18, Failures: 0, Errors: 0, Skipped: 0, Time elapsed: 0.449 sec
[junit] Running org.apache.poi.xwpf.model.TestXWPFDecorators
[junit] Tests run: 2, Failures: 0, Errors: 0, Skipped: 0, Time elapsed: 0.047 sec
[junit] Running org.apache.poi.xwpf.model.TestXWPFHeaderFooterPolicy
[junit] Tests run: 3, Failures: 0, Errors: 0, Skipped: 0, Time elapsed: 0.112 sec
[junit] Running org.apache.poi.xwpf.usermodel.TestChangeTracking
[junit] Tests run: 3, Failures: 0, Errors: 0, Skipped: 0, Time elapsed: 0.044 sec
[junit] Running org.apache.poi.xwpf.usermodel.TestXWPFBugs
[junit] Tests run: 8, Failures: 0, Errors: 0, Skipped: 0, Time elapsed: 0.069 sec
[junit] Running org.apache.poi.xwpf.usermodel.TestXWPFDocument
[junit] Tests run: 19, Failures: 0, Errors: 0, Skipped: 0, Time elapsed: 0.24 sec
[junit] Running org.apache.poi.xwpf.usermodel.TestXWPFFootnotes
[junit] Tests run: 2, Failures: 0, Errors: 0, Skipped: 0, Time elapsed: 0.019 sec
[junit] Running org.apache.poi.xwpf.usermodel.TestXWPFHeader
[junit] Tests run: 8, Failures: 0, Errors: 0, Skipped: 0, Time elapsed: 0.085 sec
[junit] Running org.apache.poi.xwpf.usermodel.TestXWPFHeadings
[junit] Tests run: 1, Failures: 0, Errors: 0, Skipped: 0, Time elapsed: 0.032 sec
[junit] Running org.apache.poi.xwpf.usermodel.TestXWPFNumbering
[junit] Tests run: 6, Failures: 0, Errors: 0, Skipped: 0, Time elapsed: 0.058 sec
[junit] Running org.apache.poi.xwpf.usermodel.TestXWPFParagraph
[junit] Tests run: 21, Failures: 0, Errors: 0, Skipped: 0, Time elapsed: 0.171 sec
[junit] Running org.apache.poi.xwpf.usermodel.TestXWPFPictureData
[junit] Tests run: 5, Failures: 0, Errors: 0, Skipped: 0, Time elapsed: 0.083 sec
[junit] Running org.apache.poi.xwpf.usermodel.TestXWPFRun
[junit] Tests run: 21, Failures: 0, Errors: 0, Skipped: 0, Time elapsed: 0.204 sec
[junit] Running org.apache.poi.xwpf.usermodel.TestXWPFSDT
[junit] Tests run: 4, Failures: 0, Errors: 0, Skipped: 0, Time elapsed: 0.082 sec
[junit] Running org.apache.poi.xwpf.usermodel.TestXWPFSmartTag
[junit] Tests run: 1, Failures: 0, Errors: 0, Skipped: 0, Time elapsed: 0.008 sec
[junit] Running org.apache.poi.xwpf.usermodel.TestXWPFStyles
[junit] Tests run: 8, Failures: 0, Errors: 0, Skipped: 0, Time elapsed: 0.091 sec
[junit] Running org.apache.poi.xwpf.usermodel.TestXWPFTable
[junit] Tests run: 12, Failures: 0, Errors: 0, Skipped: 0, Time elapsed: 0.095 sec
[junit] Running org.apache.poi.xwpf.usermodel.TestXWPFTableCell
[junit] Tests run: 4, Failures: 0, Errors: 0, Skipped: 0, Time elapsed: 0.032 sec
[junit] Running org.apache.poi.xwpf.usermodel.TestXWPFTableRow
[junit] Tests run: 3, Failures: 0, Errors: 0, Skipped: 0, Time elapsed: 0.018 sec
[jacoco:coverage] Enhancing junit with coverage
[junit] Running org.apache.poi.poifs.crypt.TestSignatureInfo
[junit] Tests run: 12, Failures: 0, Errors: 0, Skipped: 1, Time elapsed: 8.383 sec
testcoveragereport:
[mkdir] Created dir: <https://builds.apache.org/job/POI-JDK8/983/artifact/build/coverage>
[jacoco:report] Loading execution data file <https://builds.apache.org/job/POI-JDK8/ws/build/jacoco-excelant.exec>
[jacoco:report] Loading execution data file <https://builds.apache.org/job/POI-JDK8/ws/build/jacoco-main.exec>
[jacoco:report] Loading execution data file <https://builds.apache.org/job/POI-JDK8/ws/build/jacoco-ooxml-lite-xmlsec.exec>
[jacoco:report] Loading execution data file <https://builds.apache.org/job/POI-JDK8/ws/build/jacoco-ooxml-lite.exec>
[jacoco:report] Loading execution data file <https://builds.apache.org/job/POI-JDK8/ws/build/jacoco-ooxml-xmlsec.exec>
[jacoco:report] Loading execution data file <https://builds.apache.org/job/POI-JDK8/ws/build/jacoco-ooxml.exec>
[jacoco:report] Loading execution data file <https://builds.apache.org/job/POI-JDK8/ws/build/jacoco-scratchpad.exec>
[jacoco:report] Writing bundle 'Main' with 1476 classes
[jacoco:report] Writing bundle 'Scratchpad' with 608 classes
[jacoco:report] Writing bundle 'OOXML' with 555 classes
[jacoco:report] Writing bundle 'Excelant' with 13 classes
[echo] Coverage results are available at build/coverage/index.html, build/coverage/coverage.xml
test-all:
compile-integration:
[javac] Compiling 21 source files to <https://builds.apache.org/job/POI-JDK8/ws/build/integration-test-classes>
[javac] warning: [options] bootstrap class path not set in conjunction with -source 1.6
[javac] 1 warning
-test-integration-check:
test-integration:
[jacoco:coverage] Enhancing junit with coverage
[junit] Handling 1134 files
[junit] Running org.apache.poi.TestAllFiles
[junit] Failed: slideshow/bug54570.pptx
[junit] Tests run: 1518, Failures: 0, Errors: 1, Skipped: 0, Time elapsed: 304.215 sec
BUILD FAILED
<https://builds.apache.org/job/POI-JDK8/ws/build.xml>:1465: Test org.apache.poi.TestAllFiles failed
Total time: 19 minutes 10 seconds
Build step 'Invoke Ant' marked build as failure
[FINDBUGS] Skipping publisher since build result is FAILURE
[WARNINGS] Skipping publisher since build result is FAILURE
Archiving artifacts
Compressed 55.19 MB of artifacts by 97.1% relative to #981
Recording test results
---------------------------------------------------------------------
To unsubscribe, e-mail: dev-unsubscribe@poi.apache.org
For additional commands, e-mail: dev-help@poi.apache.org
Jenkins build is back to normal : POI-JDK8 #984
Posted by Apache Jenkins Server <je...@builds.apache.org>.
See <https://builds.apache.org/job/POI-JDK8/984/changes>
---------------------------------------------------------------------
To unsubscribe, e-mail: dev-unsubscribe@poi.apache.org
For additional commands, e-mail: dev-help@poi.apache.org