You are viewing a plain text version of this content. The canonical link for it is here.
Posted to builds@mesos.apache.org by Apache Jenkins Server <je...@builds.apache.org> on 2017/05/24 00:19:46 UTC

Build failed in Jenkins: Mesos-Buildbot » cmake,gcc,--verbose --enable-libevent --enable-ssl,GLOG_v=1 MESOS_VERBOSE=1,ubuntu:14.04,(docker||Hadoop)&&(!ubuntu-us1)&&(!ubuntu-eu2) #3714

See <https://builds.apache.org/job/Mesos-Buildbot/BUILDTOOL=cmake,COMPILER=gcc,CONFIGURATION=--verbose%20--enable-libevent%20--enable-ssl,ENVIRONMENT=GLOG_v=1%20MESOS_VERBOSE=1,OS=ubuntu%3A14.04,label_exp=(docker%7C%7CHadoop)&&(!ubuntu-us1)&&(!ubuntu-eu2)/3714/display/redirect?page=changes>

Changes:

[neil.conway] Added MESOS-7538 to 1.3.0 CHANGELOG.

------------------------------------------
[...truncated 1.78 MB...]
E0524 00:19:33.765079 27088 process.cpp:950] Failed to accept socket: future discarded
I0524 00:19:33.766320 26230 process.cpp:1266] libprocess is initialized on 172.17.0.2:35178 with 16 worker threads
[       OK ] Scheme/HTTPTest.PipeEOF/0 (217 ms)
[ RUN      ] Scheme/HTTPTest.PipeEOF/1
I0524 00:19:33.781654 26230 process.cpp:1266] libprocess is initialized on 172.17.0.2:36698 with 16 worker threads
[       OK ] Scheme/HTTPTest.PipeEOF/1 (7 ms)
[ RUN      ] Scheme/HTTPTest.PipeFailure/0
I0524 00:19:34.303161 26230 openssl.cpp:419] CA file path is unspecified! NOTE: Set CA file path with LIBPROCESS_SSL_CA_FILE=<filepath>
I0524 00:19:34.303184 26230 openssl.cpp:424] CA directory path unspecified! NOTE: Set CA directory path with LIBPROCESS_SSL_CA_DIR=<dirpath>
I0524 00:19:34.303187 26230 openssl.cpp:429] Will not verify peer certificate!
NOTE: Set LIBPROCESS_SSL_VERIFY_CERT=1 to enable peer certificate verification
I0524 00:19:34.303190 26230 openssl.cpp:435] Will only verify peer certificate if presented!
NOTE: Set LIBPROCESS_SSL_REQUIRE_CERT=1 to require peer certificate verification
E0524 00:19:34.303556 27122 process.cpp:950] Failed to accept socket: future discarded
I0524 00:19:34.306645 26230 process.cpp:1266] libprocess is initialized on 172.17.0.2:45683 with 16 worker threads
[       OK ] Scheme/HTTPTest.PipeFailure/0 (526 ms)
[ RUN      ] Scheme/HTTPTest.PipeFailure/1
I0524 00:19:34.308496 26230 process.cpp:1266] libprocess is initialized on 172.17.0.2:54708 with 16 worker threads
[       OK ] Scheme/HTTPTest.PipeFailure/1 (1 ms)
[ RUN      ] Scheme/HTTPTest.PipeReaderCloses/0
I0524 00:19:34.665246 26230 openssl.cpp:419] CA file path is unspecified! NOTE: Set CA file path with LIBPROCESS_SSL_CA_FILE=<filepath>
I0524 00:19:34.665266 26230 openssl.cpp:424] CA directory path unspecified! NOTE: Set CA directory path with LIBPROCESS_SSL_CA_DIR=<dirpath>
I0524 00:19:34.665271 26230 openssl.cpp:429] Will not verify peer certificate!
NOTE: Set LIBPROCESS_SSL_VERIFY_CERT=1 to enable peer certificate verification
I0524 00:19:34.665274 26230 openssl.cpp:435] Will only verify peer certificate if presented!
NOTE: Set LIBPROCESS_SSL_REQUIRE_CERT=1 to require peer certificate verification
E0524 00:19:34.665668 27156 process.cpp:950] Failed to accept socket: future discarded
I0524 00:19:34.666622 26230 process.cpp:1266] libprocess is initialized on 172.17.0.2:41864 with 16 worker threads
[       OK ] Scheme/HTTPTest.PipeReaderCloses/0 (358 ms)
[ RUN      ] Scheme/HTTPTest.PipeReaderCloses/1
I0524 00:19:34.668303 26230 process.cpp:1266] libprocess is initialized on 172.17.0.2:35782 with 16 worker threads
[       OK ] Scheme/HTTPTest.PipeReaderCloses/1 (1 ms)
[ RUN      ] Scheme/HTTPTest.Encode/0
I0524 00:19:35.591837 26230 openssl.cpp:419] CA file path is unspecified! NOTE: Set CA file path with LIBPROCESS_SSL_CA_FILE=<filepath>
I0524 00:19:35.591861 26230 openssl.cpp:424] CA directory path unspecified! NOTE: Set CA directory path with LIBPROCESS_SSL_CA_DIR=<dirpath>
I0524 00:19:35.591867 26230 openssl.cpp:429] Will not verify peer certificate!
NOTE: Set LIBPROCESS_SSL_VERIFY_CERT=1 to enable peer certificate verification
I0524 00:19:35.591872 26230 openssl.cpp:435] Will only verify peer certificate if presented!
NOTE: Set LIBPROCESS_SSL_REQUIRE_CERT=1 to require peer certificate verification
E0524 00:19:35.592278 27190 process.cpp:950] Failed to accept socket: future discarded
I0524 00:19:35.603144 26230 process.cpp:1266] libprocess is initialized on 172.17.0.2:47142 with 16 worker threads
[       OK ] Scheme/HTTPTest.Encode/0 (935 ms)
[ RUN      ] Scheme/HTTPTest.Encode/1
I0524 00:19:35.605267 26230 process.cpp:1266] libprocess is initialized on 172.17.0.2:35475 with 16 worker threads
[       OK ] Scheme/HTTPTest.Encode/1 (2 ms)
[ RUN      ] Scheme/HTTPTest.PathParse/0
I0524 00:19:35.825134 26230 openssl.cpp:419] CA file path is unspecified! NOTE: Set CA file path with LIBPROCESS_SSL_CA_FILE=<filepath>
I0524 00:19:35.825156 26230 openssl.cpp:424] CA directory path unspecified! NOTE: Set CA directory path with LIBPROCESS_SSL_CA_DIR=<dirpath>
I0524 00:19:35.825160 26230 openssl.cpp:429] Will not verify peer certificate!
NOTE: Set LIBPROCESS_SSL_VERIFY_CERT=1 to enable peer certificate verification
I0524 00:19:35.825165 26230 openssl.cpp:435] Will only verify peer certificate if presented!
NOTE: Set LIBPROCESS_SSL_REQUIRE_CERT=1 to require peer certificate verification
E0524 00:19:35.825702 27224 process.cpp:950] Failed to accept socket: future discarded
I0524 00:19:35.827029 26230 process.cpp:1266] libprocess is initialized on 172.17.0.2:36371 with 16 worker threads
[       OK ] Scheme/HTTPTest.PathParse/0 (222 ms)
[ RUN      ] Scheme/HTTPTest.PathParse/1
I0524 00:19:35.834332 26230 process.cpp:1266] libprocess is initialized on 172.17.0.2:36782 with 16 worker threads
[       OK ] Scheme/HTTPTest.PathParse/1 (7 ms)
[ RUN      ] Scheme/HTTPTest.Get/0
I0524 00:19:36.137822 26230 openssl.cpp:419] CA file path is unspecified! NOTE: Set CA file path with LIBPROCESS_SSL_CA_FILE=<filepath>
I0524 00:19:36.137845 26230 openssl.cpp:424] CA directory path unspecified! NOTE: Set CA directory path with LIBPROCESS_SSL_CA_DIR=<dirpath>
I0524 00:19:36.137851 26230 openssl.cpp:429] Will not verify peer certificate!
NOTE: Set LIBPROCESS_SSL_VERIFY_CERT=1 to enable peer certificate verification
I0524 00:19:36.137857 26230 openssl.cpp:435] Will only verify peer certificate if presented!
NOTE: Set LIBPROCESS_SSL_REQUIRE_CERT=1 to require peer certificate verification
E0524 00:19:36.138216 27258 process.cpp:950] Failed to accept socket: future discarded
I0524 00:19:36.139734 26230 process.cpp:1266] libprocess is initialized on 172.17.0.2:55831 with 16 worker threads
I0524 00:19:36.144966 27260 process.cpp:3730] Handling HTTP event for process '(83)' with path: '/(83)/get'
I0524 00:19:36.149684 27270 process.cpp:3730] Handling HTTP event for process '(83)' with path: '/(83)/get'
[       OK ] Scheme/HTTPTest.Get/0 (319 ms)
[ RUN      ] Scheme/HTTPTest.Get/1
I0524 00:19:36.162899 26230 process.cpp:1266] libprocess is initialized on 172.17.0.2:55632 with 16 worker threads
I0524 00:19:36.163625 27282 process.cpp:3730] Handling HTTP event for process '(84)' with path: '/(84)/get'
I0524 00:19:36.164933 27291 process.cpp:3730] Handling HTTP event for process '(84)' with path: '/(84)/get'
[       OK ] Scheme/HTTPTest.Get/1 (19 ms)
[ RUN      ] Scheme/HTTPTest.NestedGet/0
I0524 00:19:36.679435 26230 openssl.cpp:419] CA file path is unspecified! NOTE: Set CA file path with LIBPROCESS_SSL_CA_FILE=<filepath>
I0524 00:19:36.679464 26230 openssl.cpp:424] CA directory path unspecified! NOTE: Set CA directory path with LIBPROCESS_SSL_CA_DIR=<dirpath>
I0524 00:19:36.679471 26230 openssl.cpp:429] Will not verify peer certificate!
NOTE: Set LIBPROCESS_SSL_VERIFY_CERT=1 to enable peer certificate verification
I0524 00:19:36.679476 26230 openssl.cpp:435] Will only verify peer certificate if presented!
NOTE: Set LIBPROCESS_SSL_REQUIRE_CERT=1 to require peer certificate verification
E0524 00:19:36.679930 27292 process.cpp:950] Failed to accept socket: future discarded
I0524 00:19:36.682976 26230 process.cpp:1266] libprocess is initialized on 172.17.0.2:57558 with 16 worker threads
I0524 00:19:36.688663 27301 process.cpp:3730] Handling HTTP event for process '(85)' with path: '/(85)//a/b/c'
I0524 00:19:36.697062 27303 process.cpp:3730] Handling HTTP event for process '(85)' with path: '/(85)//a/b'
[       OK ] Scheme/HTTPTest.NestedGet/0 (533 ms)
[ RUN      ] Scheme/HTTPTest.NestedGet/1
I0524 00:19:36.714395 26230 process.cpp:1266] libprocess is initialized on 172.17.0.2:55173 with 16 worker threads
I0524 00:19:36.716074 27318 process.cpp:3730] Handling HTTP event for process '(86)' with path: '/(86)//a/b/c'
I0524 00:19:36.718521 27322 process.cpp:3730] Handling HTTP event for process '(86)' with path: '/(86)//a/b'
[       OK ] Scheme/HTTPTest.NestedGet/1 (14 ms)
[ RUN      ] Scheme/HTTPTest.StreamingGetComplete/0
I0524 00:19:36.852918 26230 openssl.cpp:419] CA file path is unspecified! NOTE: Set CA file path with LIBPROCESS_SSL_CA_FILE=<filepath>
I0524 00:19:36.852942 26230 openssl.cpp:424] CA directory path unspecified! NOTE: Set CA directory path with LIBPROCESS_SSL_CA_DIR=<dirpath>
I0524 00:19:36.852947 26230 openssl.cpp:429] Will not verify peer certificate!
NOTE: Set LIBPROCESS_SSL_VERIFY_CERT=1 to enable peer certificate verification
I0524 00:19:36.852952 26230 openssl.cpp:435] Will only verify peer certificate if presented!
NOTE: Set LIBPROCESS_SSL_REQUIRE_CERT=1 to require peer certificate verification
E0524 00:19:36.853365 27326 process.cpp:950] Failed to accept socket: future discarded
I0524 00:19:36.863420 26230 process.cpp:1266] libprocess is initialized on 172.17.0.2:34743 with 16 worker threads
I0524 00:19:36.871646 27334 process.cpp:3730] Handling HTTP event for process '(87)' with path: '/(87)/pipe'
[       OK ] Scheme/HTTPTest.StreamingGetComplete/0 (195 ms)
[ RUN      ] Scheme/HTTPTest.StreamingGetComplete/1
I0524 00:19:36.918649 26230 process.cpp:1266] libprocess is initialized on 172.17.0.2:33666 with 16 worker threads
I0524 00:19:36.919315 27345 process.cpp:3730] Handling HTTP event for process '(88)' with path: '/(88)/pipe'
[       OK ] Scheme/HTTPTest.StreamingGetComplete/1 (6 ms)
[ RUN      ] Scheme/HTTPTest.StreamingGetFailure/0
I0524 00:19:37.092761 26230 openssl.cpp:419] CA file path is unspecified! NOTE: Set CA file path with LIBPROCESS_SSL_CA_FILE=<filepath>
I0524 00:19:37.092782 26230 openssl.cpp:424] CA directory path unspecified! NOTE: Set CA directory path with LIBPROCESS_SSL_CA_DIR=<dirpath>
I0524 00:19:37.092787 26230 openssl.cpp:429] Will not verify peer certificate!
NOTE: Set LIBPROCESS_SSL_VERIFY_CERT=1 to enable peer certificate verification
I0524 00:19:37.092790 26230 openssl.cpp:435] Will only verify peer certificate if presented!
NOTE: Set LIBPROCESS_SSL_REQUIRE_CERT=1 to require peer certificate verification
E0524 00:19:37.093163 27360 process.cpp:950] Failed to accept socket: future discarded
I0524 00:19:37.102916 26230 process.cpp:1266] libprocess is initialized on 172.17.0.2:40786 with 16 worker threads
I0524 00:19:37.111722 27375 process.cpp:3730] Handling HTTP event for process '(89)' with path: '/(89)/pipe'
I0524 00:19:37.150290 27368 process.cpp:1624] Failed to read from stream: oops
[       OK ] Scheme/HTTPTest.StreamingGetFailure/0 (231 ms)
[ RUN      ] Scheme/HTTPTest.StreamingGetFailure/1
I0524 00:19:37.153235 26230 process.cpp:1266] libprocess is initialized on 172.17.0.2:52869 with 16 worker threads
I0524 00:19:37.153944 27383 process.cpp:3730] Handling HTTP event for process '(90)' with path: '/(90)/pipe'
I0524 00:19:37.154981 27384 process.cpp:1624] Failed to read from stream: oops
[       OK ] Scheme/HTTPTest.StreamingGetFailure/1 (4 ms)
[ RUN      ] Scheme/HTTPTest.PipeEquality/0
I0524 00:19:37.446372 26230 openssl.cpp:419] CA file path is unspecified! NOTE: Set CA file path with LIBPROCESS_SSL_CA_FILE=<filepath>
I0524 00:19:37.446393 26230 openssl.cpp:424] CA directory path unspecified! NOTE: Set CA directory path with LIBPROCESS_SSL_CA_DIR=<dirpath>
I0524 00:19:37.446398 26230 openssl.cpp:429] Will not verify peer certificate!
NOTE: Set LIBPROCESS_SSL_VERIFY_CERT=1 to enable peer certificate verification
I0524 00:19:37.446401 26230 openssl.cpp:435] Will only verify peer certificate if presented!
NOTE: Set LIBPROCESS_SSL_REQUIRE_CERT=1 to require peer certificate verification
E0524 00:19:37.446940 27394 process.cpp:950] Failed to accept socket: future discarded
I0524 00:19:37.450700 26230 process.cpp:1266] libprocess is initialized on 172.17.0.2:34936 with 16 worker threads
[       OK ] Scheme/HTTPTest.PipeEquality/0 (296 ms)
[ RUN      ] Scheme/HTTPTest.PipeEquality/1
I0524 00:19:37.452342 26230 process.cpp:1266] libprocess is initialized on 172.17.0.2:47869 with 16 worker threads
[       OK ] Scheme/HTTPTest.PipeEquality/1 (1 ms)
[ RUN      ] Scheme/HTTPTest.Post/0
I0524 00:19:38.057289 26230 openssl.cpp:419] CA file path is unspecified! NOTE: Set CA file path with LIBPROCESS_SSL_CA_FILE=<filepath>
I0524 00:19:38.057313 26230 openssl.cpp:424] CA directory path unspecified! NOTE: Set CA directory path with LIBPROCESS_SSL_CA_DIR=<dirpath>
I0524 00:19:38.057320 26230 openssl.cpp:429] Will not verify peer certificate!
NOTE: Set LIBPROCESS_SSL_VERIFY_CERT=1 to enable peer certificate verification
I0524 00:19:38.057325 26230 openssl.cpp:435] Will only verify peer certificate if presented!
NOTE: Set LIBPROCESS_SSL_REQUIRE_CERT=1 to require peer certificate verification
E0524 00:19:38.057668 27428 process.cpp:950] Failed to accept socket: future discarded
I0524 00:19:38.066850 26230 process.cpp:1266] libprocess is initialized on 172.17.0.2:34419 with 16 worker threads
I0524 00:19:38.072165 27442 process.cpp:3730] Handling HTTP event for process '(91)' with path: '/(91)/post'
I0524 00:19:38.114672 27431 process.cpp:3730] Handling HTTP event for process '(91)' with path: '/(91)/post'
[       OK ] Scheme/HTTPTest.Post/0 (703 ms)
[ RUN      ] Scheme/HTTPTest.Post/1
I0524 00:19:38.156488 26230 process.cpp:1266] libprocess is initialized on 172.17.0.2:39621 with 16 worker threads
I0524 00:19:38.157449 27453 process.cpp:3730] Handling HTTP event for process '(92)' with path: '/(92)/post'
I0524 00:19:38.158663 27461 process.cpp:3730] Handling HTTP event for process '(92)' with path: '/(92)/post'
[       OK ] Scheme/HTTPTest.Post/1 (4 ms)
[ RUN      ] Scheme/HTTPTest.Delete/0
I0524 00:19:38.295483 26230 openssl.cpp:419] CA file path is unspecified! NOTE: Set CA file path with LIBPROCESS_SSL_CA_FILE=<filepath>
I0524 00:19:38.295507 26230 openssl.cpp:424] CA directory path unspecified! NOTE: Set CA directory path with LIBPROCESS_SSL_CA_DIR=<dirpath>
I0524 00:19:38.295513 26230 openssl.cpp:429] Will not verify peer certificate!
NOTE: Set LIBPROCESS_SSL_VERIFY_CERT=1 to enable peer certificate verification
I0524 00:19:38.295518 26230 openssl.cpp:435] Will only verify peer certificate if presented!
NOTE: Set LIBPROCESS_SSL_REQUIRE_CERT=1 to require peer certificate verification
E0524 00:19:38.296089 27462 process.cpp:950] Failed to accept socket: future discarded
I0524 00:19:38.298481 26230 process.cpp:1266] libprocess is initialized on 172.17.0.2:55615 with 16 worker threads
I0524 00:19:38.303499 27474 process.cpp:3730] Handling HTTP event for process '(93)' with path: '/(93)/delete'
[       OK ] Scheme/HTTPTest.Delete/0 (145 ms)
[ RUN      ] Scheme/HTTPTest.Delete/1
I0524 00:19:38.307210 26230 process.cpp:1266] libprocess is initialized on 172.17.0.2:36578 with 16 worker threads
I0524 00:19:38.307777 27493 process.cpp:3730] Handling HTTP event for process '(94)' with path: '/(94)/delete'
[       OK ] Scheme/HTTPTest.Delete/1 (4 ms)
[ RUN      ] Scheme/HTTPTest.Request/0
I0524 00:19:39.286504 26230 openssl.cpp:419] CA file path is unspecified! NOTE: Set CA file path with LIBPROCESS_SSL_CA_FILE=<filepath>
I0524 00:19:39.286523 26230 openssl.cpp:424] CA directory path unspecified! NOTE: Set CA directory path with LIBPROCESS_SSL_CA_DIR=<dirpath>
I0524 00:19:39.286528 26230 openssl.cpp:429] Will not verify peer certificate!
NOTE: Set LIBPROCESS_SSL_VERIFY_CERT=1 to enable peer certificate verification
I0524 00:19:39.286531 26230 openssl.cpp:435] Will only verify peer certificate if presented!
NOTE: Set LIBPROCESS_SSL_REQUIRE_CERT=1 to require peer certificate verification
E0524 00:19:39.286862 27496 process.cpp:950] Failed to accept socket: future discarded
I0524 00:19:39.290796 26230 process.cpp:1266] libprocess is initialized on 172.17.0.2:48170 with 16 worker threads
I0524 00:19:39.295630 27499 process.cpp:3730] Handling HTTP event for process '(95)' with path: '/(95)/request'
[       OK ] Scheme/HTTPTest.Request/0 (988 ms)
[ RUN      ] Scheme/HTTPTest.Request/1
I0524 00:19:39.302690 26230 process.cpp:1266] libprocess is initialized on 172.17.0.2:50574 with 16 worker threads
I0524 00:19:39.303263 27528 process.cpp:3730] Handling HTTP event for process '(96)' with path: '/(96)/request'
[       OK ] Scheme/HTTPTest.Request/1 (13 ms)
[ RUN      ] Scheme/HTTPTest.QueryEncodeDecode/0
I0524 00:19:39.597695 26230 openssl.cpp:419] CA file path is unspecified! NOTE: Set CA file path with LIBPROCESS_SSL_CA_FILE=<filepath>
I0524 00:19:39.597718 26230 openssl.cpp:424] CA directory path unspecified! NOTE: Set CA directory path with LIBPROCESS_SSL_CA_DIR=<dirpath>
I0524 00:19:39.597723 26230 openssl.cpp:429] Will not verify peer certificate!
NOTE: Set LIBPROCESS_SSL_VERIFY_CERT=1 to enable peer certificate verification
I0524 00:19:39.597728 26230 openssl.cpp:435] Will only verify peer certificate if presented!
NOTE: Set LIBPROCESS_SSL_REQUIRE_CERT=1 to require peer certificate verification
E0524 00:19:39.598034 27530 process.cpp:950] Failed to accept socket: future discarded
I0524 00:19:39.606956 26230 process.cpp:1266] libprocess is initialized on 172.17.0.2:34927 with 16 worker threads
[       OK ] Scheme/HTTPTest.QueryEncodeDecode/0 (298 ms)
[ RUN      ] Scheme/HTTPTest.QueryEncodeDecode/1
*** Aborted at 1495585179 (unix time) try "date -d @1495585179" if you are using GNU date ***
PC: @     0x2ab9e872d64e (unknown)
I0524 00:19:39.608775 26230 process.cpp:1266] libprocess is initialized on 172.17.0.2:43410 with 16 worker threads
[       OK ] Scheme/HTTPTest.QueryEncodeDecode/1 (2 ms)
[ RUN      ] Scheme/HTTPTest.Headers/0
*** SIGSEGV (@0x1c8d838) received by PID 26230 (TID 0x2ab9e90be700) from PID 29939768; stack trace: ***
    @     0x2ab9e7c65330 (unknown)
    @     0x2ab9e872d64e (unknown)
    @     0x2ab9e7f2de30 (unknown)
    @     0x2ab9e7f2e48c (unknown)
    @     0x2ab9e6e979d2 process::internal::dispatch()
    @     0x2ab9e6ede6c6 process::dispatch<>()
    @     0x2ab9e6e9bc50 process::ProcessBase::route()
    @     0x2ab9e6dcd021 process::Help::initialize()
    @     0x2ab9e6e98a51 process::ProcessManager::resume()
    @     0x2ab9e6ea1de7 _ZNSt6thread5_ImplISt12_Bind_simpleIFZN7process14ProcessManager12init_threadsEvEUt_vEEE6_M_runEv
    @     0x2ab9e7f24a60 (unknown)
    @     0x2ab9e7c5d184 start_thread
    @     0x2ab9e8790bed (unknown)
make[3]: *** [CMakeFiles/check] Segmentation fault
make[3]: Leaving directory `/mesos/build'
make[2]: *** [CMakeFiles/check.dir/all] Error 2
make[2]: Leaving directory `/mesos/build'
make[1]: *** [CMakeFiles/check.dir/rule] Error 2
make[1]: Leaving directory `/mesos/build'
make: *** [check] Error 2
+ docker rmi mesos-1495581669-25492
Untagged: mesos-1495581669-25492:latest
Deleted: sha256:38c35c5cbaadf64a88a913444c3a3cce5af59e947a47d24d3e8b68ce8eff4de2
Deleted: sha256:d89b3f5f481b124b7aa92bdb315ecdd7ea7c225624a9c343ac97ca19df170471
Deleted: sha256:e19c0d1e2685e6df118d3c717df7cb03ceb2d306581cf4e1af4f32acffefba2d
Deleted: sha256:ee715538de54c26f08ed92dcd0d12edff2cf0947626ecd6344c2f5e3c2ab71ca
Deleted: sha256:a86e05ec0ea691cd94a66397cb0a0a87dd8fdf06d1db592c06fd0b11229e9580
Deleted: sha256:8bf38ddc9b0112e43afad07d70b6021b4b6773a551bea838befb818ab19e2a84
Deleted: sha256:43a7ad13491e0c5a566d03ab48b9cd4faed9c7954358ebc0654bd7211d7ab417
Deleted: sha256:ed1160754bd87296d45e96f173c7115eabba2da6b985c223037b08d786344a46
Deleted: sha256:209257e6845127e9153e9a3ac7ce9702597e7baefef6640b562ff4ae3d47bce1
Deleted: sha256:8951526b534316c85094630641fca8e0e53699b14f91551ebe9a23e2b6bfbff9
Deleted: sha256:c47f447963d9f359f93b76f1615c22f0680c0ab8542c75332259a381d2ea535c
Deleted: sha256:4b68ee7cc2b43fc638f415cbc00d696c6bd693d89f910f4855aebb635312aab7
Deleted: sha256:b334adba73d8e5b410bbadeb08df3ee5bfcd5808c2fdf60fc33f96002259702e
Deleted: sha256:f269adde27d78b3b9c051040647eb74ccd393752dc9d0b37321a8fdf42a481f9
Deleted: sha256:3e9c8db1b8a53e6dcaedbdfafe74d7cf708c616fcf24efff6dd06d66e8f3c3e6
Deleted: sha256:a1844b4db1d42db41953183afef2405df69104d86f6951cc53c724079026aed4
Deleted: sha256:03bba7611fd7dce87c7cbdb52cb9ac807c22d51e52feee67954b57025d4e47f2
Deleted: sha256:081952df76f8229aaa1c0c7f6b892b2e06b7aedaa1104c8f2397a623c794a481
Deleted: sha256:baf2c519bc5503998b96401e7c7463e94109adb893474bc12102849e5b474f56
Deleted: sha256:4f583032a08159749b51692f6b5548af3e053a95adaad3d0c4e60bb424225e1e
Deleted: sha256:f14d2daffd9e699c7b65170259994779487929a075ec6a53e7fa541626e4c08a
Deleted: sha256:6a98dc62b97424910318a68a3ef59881b08ae350dce8d6bedcc5dd2d03c4a121
Deleted: sha256:51e116dd4a432236c9bc20a2d1363673499520e52971a2d6bcced0dab9830edd
Deleted: sha256:3f23ccd7f53b4955e8a886c6df72bb3ff2ac3780db06fd6fbfd5a79c18a48882
Build step 'Execute shell' marked build as failure
Not sending mail to unregistered user neil.conway@gmail.com

Jenkins build is back to normal : Mesos-Buildbot » cmake,gcc,--verbose --enable-libevent --enable-ssl,GLOG_v=1 MESOS_VERBOSE=1,ubuntu:14.04,(docker||Hadoop)&&(!ubuntu-us1)&&(!ubuntu-eu2) #3716

Posted by Apache Jenkins Server <je...@builds.apache.org>.
See <https://builds.apache.org/job/Mesos-Buildbot/BUILDTOOL=cmake,COMPILER=gcc,CONFIGURATION=--verbose%20--enable-libevent%20--enable-ssl,ENVIRONMENT=GLOG_v=1%20MESOS_VERBOSE=1,OS=ubuntu%3A14.04,label_exp=(docker%7C%7CHadoop)&&(!ubuntu-us1)&&(!ubuntu-eu2)/3716/display/redirect?page=changes>


Build failed in Jenkins: Mesos-Buildbot » cmake,gcc,--verbose --enable-libevent --enable-ssl,GLOG_v=1 MESOS_VERBOSE=1,ubuntu:14.04,(docker||Hadoop)&&(!ubuntu-us1)&&(!ubuntu-eu2) #3715

Posted by Apache Jenkins Server <je...@builds.apache.org>.
See <https://builds.apache.org/job/Mesos-Buildbot/BUILDTOOL=cmake,COMPILER=gcc,CONFIGURATION=--verbose%20--enable-libevent%20--enable-ssl,ENVIRONMENT=GLOG_v=1%20MESOS_VERBOSE=1,OS=ubuntu%3A14.04,label_exp=(docker%7C%7CHadoop)&&(!ubuntu-us1)&&(!ubuntu-eu2)/3715/display/redirect?page=changes>

Changes:

[bmahler] Added new agent flag 'executor_reregistration_timeout'.

[bmahler] Added 'executor_reregister_timeout' agent flag to the tests.

[neil.conway] Fixed a few variable names in tests.

[xujyan] Metric in the allocator to track latency in running allocations.

------------------------------------------
[...truncated 1.79 MB...]
[       OK ] Scheme/HTTPTest.Post/0 (412 ms)
[ RUN      ] Scheme/HTTPTest.Post/1
I0524 01:38:51.852208 26228 process.cpp:1266] libprocess is initialized on 172.17.0.3:34391 with 16 worker threads
I0524 01:38:51.852885 27457 process.cpp:3730] Handling HTTP event for process '(92)' with path: '/(92)/post'
I0524 01:38:51.853945 27452 process.cpp:3730] Handling HTTP event for process '(92)' with path: '/(92)/post'
[       OK ] Scheme/HTTPTest.Post/1 (4 ms)
[ RUN      ] Scheme/HTTPTest.Delete/0
I0524 01:38:52.311249 26228 openssl.cpp:419] CA file path is unspecified! NOTE: Set CA file path with LIBPROCESS_SSL_CA_FILE=<filepath>
I0524 01:38:52.311275 26228 openssl.cpp:424] CA directory path unspecified! NOTE: Set CA directory path with LIBPROCESS_SSL_CA_DIR=<dirpath>
I0524 01:38:52.311280 26228 openssl.cpp:429] Will not verify peer certificate!
NOTE: Set LIBPROCESS_SSL_VERIFY_CERT=1 to enable peer certificate verification
I0524 01:38:52.311285 26228 openssl.cpp:435] Will only verify peer certificate if presented!
NOTE: Set LIBPROCESS_SSL_REQUIRE_CERT=1 to require peer certificate verification
E0524 01:38:52.311735 27460 process.cpp:950] Failed to accept socket: future discarded
I0524 01:38:52.318668 26228 process.cpp:1266] libprocess is initialized on 172.17.0.3:46008 with 16 worker threads
I0524 01:38:52.323907 27463 process.cpp:3730] Handling HTTP event for process '(93)' with path: '/(93)/delete'
[       OK ] Scheme/HTTPTest.Delete/0 (470 ms)
[ RUN      ] Scheme/HTTPTest.Delete/1
I0524 01:38:52.326314 26228 process.cpp:1266] libprocess is initialized on 172.17.0.3:50794 with 16 worker threads
I0524 01:38:52.326941 27481 process.cpp:3730] Handling HTTP event for process '(94)' with path: '/(94)/delete'
[       OK ] Scheme/HTTPTest.Delete/1 (2 ms)
[ RUN      ] Scheme/HTTPTest.Request/0
I0524 01:38:52.507630 26228 openssl.cpp:419] CA file path is unspecified! NOTE: Set CA file path with LIBPROCESS_SSL_CA_FILE=<filepath>
I0524 01:38:52.507654 26228 openssl.cpp:424] CA directory path unspecified! NOTE: Set CA directory path with LIBPROCESS_SSL_CA_DIR=<dirpath>
I0524 01:38:52.507660 26228 openssl.cpp:429] Will not verify peer certificate!
NOTE: Set LIBPROCESS_SSL_VERIFY_CERT=1 to enable peer certificate verification
I0524 01:38:52.507665 26228 openssl.cpp:435] Will only verify peer certificate if presented!
NOTE: Set LIBPROCESS_SSL_REQUIRE_CERT=1 to require peer certificate verification
E0524 01:38:52.508378 27494 process.cpp:950] Failed to accept socket: future discarded
I0524 01:38:52.509341 26228 process.cpp:1266] libprocess is initialized on 172.17.0.3:46268 with 16 worker threads
I0524 01:38:52.514309 27497 process.cpp:3730] Handling HTTP event for process '(95)' with path: '/(95)/request'
[       OK ] Scheme/HTTPTest.Request/0 (188 ms)
[ RUN      ] Scheme/HTTPTest.Request/1
I0524 01:38:52.518395 26228 process.cpp:1266] libprocess is initialized on 172.17.0.3:52020 with 16 worker threads
I0524 01:38:52.519062 27516 process.cpp:3730] Handling HTTP event for process '(96)' with path: '/(96)/request'
[       OK ] Scheme/HTTPTest.Request/1 (5 ms)
[ RUN      ] Scheme/HTTPTest.QueryEncodeDecode/0
I0524 01:38:52.773035 26228 openssl.cpp:419] CA file path is unspecified! NOTE: Set CA file path with LIBPROCESS_SSL_CA_FILE=<filepath>
I0524 01:38:52.773058 26228 openssl.cpp:424] CA directory path unspecified! NOTE: Set CA directory path with LIBPROCESS_SSL_CA_DIR=<dirpath>
I0524 01:38:52.773064 26228 openssl.cpp:429] Will not verify peer certificate!
NOTE: Set LIBPROCESS_SSL_VERIFY_CERT=1 to enable peer certificate verification
I0524 01:38:52.773069 26228 openssl.cpp:435] Will only verify peer certificate if presented!
NOTE: Set LIBPROCESS_SSL_REQUIRE_CERT=1 to require peer certificate verification
E0524 01:38:52.773705 27528 process.cpp:950] Failed to accept socket: future discarded
I0524 01:38:52.774705 26228 process.cpp:1266] libprocess is initialized on 172.17.0.3:54931 with 16 worker threads
[       OK ] Scheme/HTTPTest.QueryEncodeDecode/0 (255 ms)
[ RUN      ] Scheme/HTTPTest.QueryEncodeDecode/1
I0524 01:38:52.784850 26228 process.cpp:1266] libprocess is initialized on 172.17.0.3:59450 with 16 worker threads
[       OK ] Scheme/HTTPTest.QueryEncodeDecode/1 (10 ms)
[ RUN      ] Scheme/HTTPTest.Headers/0
I0524 01:38:53.026850 26228 openssl.cpp:419] CA file path is unspecified! NOTE: Set CA file path with LIBPROCESS_SSL_CA_FILE=<filepath>
I0524 01:38:53.026873 26228 openssl.cpp:424] CA directory path unspecified! NOTE: Set CA directory path with LIBPROCESS_SSL_CA_DIR=<dirpath>
I0524 01:38:53.026880 26228 openssl.cpp:429] Will not verify peer certificate!
NOTE: Set LIBPROCESS_SSL_VERIFY_CERT=1 to enable peer certificate verification
I0524 01:38:53.026885 26228 openssl.cpp:435] Will only verify peer certificate if presented!
NOTE: Set LIBPROCESS_SSL_REQUIRE_CERT=1 to require peer certificate verification
E0524 01:38:53.027495 27562 process.cpp:950] Failed to accept socket: future discarded
I0524 01:38:53.028774 26228 process.cpp:1266] libprocess is initialized on 172.17.0.3:48731 with 16 worker threads
[       OK ] Scheme/HTTPTest.Headers/0 (244 ms)
[ RUN      ] Scheme/HTTPTest.Headers/1
I0524 01:38:53.046411 26228 process.cpp:1266] libprocess is initialized on 172.17.0.3:52121 with 16 worker threads
[       OK ] Scheme/HTTPTest.Headers/1 (17 ms)
[ RUN      ] Scheme/HTTPTest.CaseInsensitiveHeaders/0
I0524 01:38:53.345366 26228 openssl.cpp:419] CA file path is unspecified! NOTE: Set CA file path with LIBPROCESS_SSL_CA_FILE=<filepath>
I0524 01:38:53.345396 26228 openssl.cpp:424] CA directory path unspecified! NOTE: Set CA directory path with LIBPROCESS_SSL_CA_DIR=<dirpath>
I0524 01:38:53.345403 26228 openssl.cpp:429] Will not verify peer certificate!
NOTE: Set LIBPROCESS_SSL_VERIFY_CERT=1 to enable peer certificate verification
I0524 01:38:53.345408 26228 openssl.cpp:435] Will only verify peer certificate if presented!
NOTE: Set LIBPROCESS_SSL_REQUIRE_CERT=1 to require peer certificate verification
E0524 01:38:53.345949 27596 process.cpp:950] Failed to accept socket: future discarded
I0524 01:38:53.355731 26228 process.cpp:1266] libprocess is initialized on 172.17.0.3:59977 with 16 worker threads
[       OK ] Scheme/HTTPTest.CaseInsensitiveHeaders/0 (310 ms)
[ RUN      ] Scheme/HTTPTest.CaseInsensitiveHeaders/1
I0524 01:38:53.362606 26228 process.cpp:1266] libprocess is initialized on 172.17.0.3:50661 with 16 worker threads
[       OK ] Scheme/HTTPTest.CaseInsensitiveHeaders/1 (6 ms)
[ RUN      ] Scheme/HTTPTest.WWWAuthenticateHeader/0
I0524 01:38:53.704962 26228 openssl.cpp:419] CA file path is unspecified! NOTE: Set CA file path with LIBPROCESS_SSL_CA_FILE=<filepath>
I0524 01:38:53.704987 26228 openssl.cpp:424] CA directory path unspecified! NOTE: Set CA directory path with LIBPROCESS_SSL_CA_DIR=<dirpath>
I0524 01:38:53.704993 26228 openssl.cpp:429] Will not verify peer certificate!
NOTE: Set LIBPROCESS_SSL_VERIFY_CERT=1 to enable peer certificate verification
I0524 01:38:53.704998 26228 openssl.cpp:435] Will only verify peer certificate if presented!
NOTE: Set LIBPROCESS_SSL_REQUIRE_CERT=1 to require peer certificate verification
E0524 01:38:53.705469 27630 process.cpp:950] Failed to accept socket: future discarded
I0524 01:38:53.710947 26228 process.cpp:1266] libprocess is initialized on 172.17.0.3:34503 with 16 worker threads
[       OK ] Scheme/HTTPTest.WWWAuthenticateHeader/0 (348 ms)
[ RUN      ] Scheme/HTTPTest.WWWAuthenticateHeader/1
I0524 01:38:53.714417 26228 process.cpp:1266] libprocess is initialized on 172.17.0.3:43315 with 16 worker threads
[       OK ] Scheme/HTTPTest.WWWAuthenticateHeader/1 (3 ms)
[ RUN      ] Scheme/HTTPTest.Accepts/0
I0524 01:38:54.150130 26228 openssl.cpp:419] CA file path is unspecified! NOTE: Set CA file path with LIBPROCESS_SSL_CA_FILE=<filepath>
I0524 01:38:54.150151 26228 openssl.cpp:424] CA directory path unspecified! NOTE: Set CA directory path with LIBPROCESS_SSL_CA_DIR=<dirpath>
I0524 01:38:54.150156 26228 openssl.cpp:429] Will not verify peer certificate!
NOTE: Set LIBPROCESS_SSL_VERIFY_CERT=1 to enable peer certificate verification
I0524 01:38:54.150159 26228 openssl.cpp:435] Will only verify peer certificate if presented!
NOTE: Set LIBPROCESS_SSL_REQUIRE_CERT=1 to require peer certificate verification
E0524 01:38:54.150838 27664 process.cpp:950] Failed to accept socket: future discarded
I0524 01:38:54.158265 26228 process.cpp:1266] libprocess is initialized on 172.17.0.3:49770 with 16 worker threads
[       OK ] Scheme/HTTPTest.Accepts/0 (444 ms)
[ RUN      ] Scheme/HTTPTest.Accepts/1
I0524 01:38:54.160193 26228 process.cpp:1266] libprocess is initialized on 172.17.0.3:40023 with 16 worker threads
[       OK ] Scheme/HTTPTest.Accepts/1 (2 ms)
E0524 01:38:54.160787 27698 process.cpp:950] Failed to accept socket: future discarded
I0524 01:38:54.174464 26228 process.cpp:1266] libprocess is initialized on 172.17.0.3:57607 with 16 worker threads
[----------] 42 tests from Scheme/HTTPTest (7481 ms total)

[----------] 4 tests from Encryption/NetSocketTest
[ RUN      ] Encryption/NetSocketTest.EOFBeforeRecv/0
I0524 01:38:54.748922 26228 openssl.cpp:419] CA file path is unspecified! NOTE: Set CA file path with LIBPROCESS_SSL_CA_FILE=<filepath>
I0524 01:38:54.748946 26228 openssl.cpp:424] CA directory path unspecified! NOTE: Set CA directory path with LIBPROCESS_SSL_CA_DIR=<dirpath>
I0524 01:38:54.748952 26228 openssl.cpp:429] Will not verify peer certificate!
NOTE: Set LIBPROCESS_SSL_VERIFY_CERT=1 to enable peer certificate verification
I0524 01:38:54.748957 26228 openssl.cpp:435] Will only verify peer certificate if presented!
NOTE: Set LIBPROCESS_SSL_REQUIRE_CERT=1 to require peer certificate verification
E0524 01:38:54.749382 27715 process.cpp:950] Failed to accept socket: future discarded
I0524 01:38:54.770843 26228 process.cpp:1266] libprocess is initialized on 172.17.0.3:41330 with 16 worker threads
/mesos/3rdparty/libprocess/src/tests/socket_tests.cpp:196: Failure
Failed to wait 15secs for client->recv()
[  FAILED  ] Encryption/NetSocketTest.EOFBeforeRecv/0, where GetParam() = "SSL" (15641 ms)
[ RUN      ] Encryption/NetSocketTest.EOFBeforeRecv/1
I0524 01:39:09.817085 26228 process.cpp:1266] libprocess is initialized on 172.17.0.3:56948 with 16 worker threads
[       OK ] Encryption/NetSocketTest.EOFBeforeRecv/1 (3 ms)
[ RUN      ] Encryption/NetSocketTest.EOFAfterRecv/0
I0524 01:39:10.708719 26228 openssl.cpp:419] CA file path is unspecified! NOTE: Set CA file path with LIBPROCESS_SSL_CA_FILE=<filepath>
I0524 01:39:10.708740 26228 openssl.cpp:424] CA directory path unspecified! NOTE: Set CA directory path with LIBPROCESS_SSL_CA_DIR=<dirpath>
I0524 01:39:10.708745 26228 openssl.cpp:429] Will not verify peer certificate!
NOTE: Set LIBPROCESS_SSL_VERIFY_CERT=1 to enable peer certificate verification
I0524 01:39:10.708748 26228 openssl.cpp:435] Will only verify peer certificate if presented!
NOTE: Set LIBPROCESS_SSL_REQUIRE_CERT=1 to require peer certificate verification
E0524 01:39:10.709153 27749 process.cpp:950] Failed to accept socket: future discarded
I0524 01:39:10.718996 26228 process.cpp:1266] libprocess is initialized on 172.17.0.3:57686 with 16 worker threads
[       OK ] Encryption/NetSocketTest.EOFAfterRecv/0 (944 ms)
[ RUN      ] Encryption/NetSocketTest.EOFAfterRecv/1
I0524 01:39:10.764221 26228 process.cpp:1266] libprocess is initialized on 172.17.0.3:33678 with 16 worker threads
[       OK ] Encryption/NetSocketTest.EOFAfterRecv/1 (3 ms)
E0524 01:39:10.765434 27783 process.cpp:950] Failed to accept socket: future discarded
I0524 01:39:10.766540 26228 process.cpp:1266] libprocess is initialized on 172.17.0.3:60965 with 16 worker threads
[----------] 4 tests from Encryption/NetSocketTest (16591 ms total)

[----------] 6 tests from SSLVerifyIPAdd/SSLTest
[ RUN      ] SSLVerifyIPAdd/SSLTest.BasicSameProcess/0
I0524 01:39:11.038794 26228 openssl.cpp:429] Will not verify peer certificate!
NOTE: Set LIBPROCESS_SSL_VERIFY_CERT=1 to enable peer certificate verification
I0524 01:39:11.038815 26228 openssl.cpp:449] LIBPROCESS_SSL_REQUIRE_CERT implies peer certificate verification.
LIBPROCESS_SSL_VERIFY_CERT set to true
I0524 01:39:11.038921 26228 openssl.cpp:478] Using CA file: /tmp/syM6VP/cert.pem
I0524 01:39:11.038931 26228 openssl.cpp:481] Using CA dir: /tmp/syM6VP
[       OK ] SSLVerifyIPAdd/SSLTest.BasicSameProcess/0 (281 ms)
[ RUN      ] SSLVerifyIPAdd/SSLTest.BasicSameProcess/1
I0524 01:39:11.779523 26228 openssl.cpp:429] Will not verify peer certificate!
NOTE: Set LIBPROCESS_SSL_VERIFY_CERT=1 to enable peer certificate verification
I0524 01:39:11.779549 26228 openssl.cpp:441] Will use IP address verification in subject alternative name certificate extension.
I0524 01:39:11.779553 26228 openssl.cpp:449] LIBPROCESS_SSL_REQUIRE_CERT implies peer certificate verification.
LIBPROCESS_SSL_VERIFY_CERT set to true
I0524 01:39:11.779656 26228 openssl.cpp:478] Using CA file: /tmp/m8ucaI/cert.pem
I0524 01:39:11.779667 26228 openssl.cpp:481] Using CA dir: /tmp/m8ucaI
[       OK ] SSLVerifyIPAdd/SSLTest.BasicSameProcess/1 (741 ms)
[ RUN      ] SSLVerifyIPAdd/SSLTest.BasicSameProcessUnix/0
I0524 01:39:12.268997 26228 openssl.cpp:429] Will not verify peer certificate!
NOTE: Set LIBPROCESS_SSL_VERIFY_CERT=1 to enable peer certificate verification
I0524 01:39:12.269022 26228 openssl.cpp:435] Will only verify peer certificate if presented!
NOTE: Set LIBPROCESS_SSL_REQUIRE_CERT=1 to require peer certificate verification
[       OK ] SSLVerifyIPAdd/SSLTest.BasicSameProcessUnix/0 (486 ms)
[ RUN      ] SSLVerifyIPAdd/SSLTest.BasicSameProcessUnix/1
I0524 01:39:12.691284 26228 openssl.cpp:429] Will not verify peer certificate!
NOTE: Set LIBPROCESS_SSL_VERIFY_CERT=1 to enable peer certificate verification
I0524 01:39:12.691305 26228 openssl.cpp:435] Will only verify peer certificate if presented!
NOTE: Set LIBPROCESS_SSL_REQUIRE_CERT=1 to require peer certificate verification
I0524 01:39:12.691309 26228 openssl.cpp:441] Will use IP address verification in subject alternative name certificate extension.
[       OK ] SSLVerifyIPAdd/SSLTest.BasicSameProcessUnix/1 (422 ms)
[ RUN      ] SSLVerifyIPAdd/SSLTest.RequireCertificate/0
I0524 01:39:12.897249 26228 openssl.cpp:424] CA directory path unspecified! NOTE: Set CA directory path with LIBPROCESS_SSL_CA_DIR=<dirpath>
I0524 01:39:12.897269 26228 openssl.cpp:429] Will not verify peer certificate!
NOTE: Set LIBPROCESS_SSL_VERIFY_CERT=1 to enable peer certificate verification
I0524 01:39:12.897272 26228 openssl.cpp:449] LIBPROCESS_SSL_REQUIRE_CERT implies peer certificate verification.
LIBPROCESS_SSL_VERIFY_CERT set to true
I0524 01:39:12.897378 26228 openssl.cpp:478] Using CA file: /tmp/ToU4ju/cert.pem
WARNING: Logging before InitGoogleLogging() is written to STDERR
I0524 01:39:12.916127 27801 openssl.cpp:424] CA directory path unspecified! NOTE: Set CA directory path with LIBPROCESS_SSL_CA_DIR=<dirpath>
I0524 01:39:12.916242 27801 openssl.cpp:429] Will not verify peer certificate!
NOTE: Set LIBPROCESS_SSL_VERIFY_CERT=1 to enable peer certificate verification
I0524 01:39:12.916250 27801 openssl.cpp:449] LIBPROCESS_SSL_REQUIRE_CERT implies peer certificate verification.
LIBPROCESS_SSL_VERIFY_CERT set to true
I0524 01:39:12.916447 27801 openssl.cpp:478] Using CA file: /tmp/ToU4ju/cert.pem
[       OK ] SSLVerifyIPAdd/SSLTest.RequireCertificate/0 (282 ms)
[ RUN      ] SSLVerifyIPAdd/SSLTest.RequireCertificate/1
I0524 01:39:13.661502 26228 openssl.cpp:424] CA directory path unspecified! NOTE: Set CA directory path with LIBPROCESS_SSL_CA_DIR=<dirpath>
I0524 01:39:13.661553 26228 openssl.cpp:429] Will not verify peer certificate!
NOTE: Set LIBPROCESS_SSL_VERIFY_CERT=1 to enable peer certificate verification
I0524 01:39:13.661561 26228 openssl.cpp:441] Will use IP address verification in subject alternative name certificate extension.
I0524 01:39:13.661567 26228 openssl.cpp:449] LIBPROCESS_SSL_REQUIRE_CERT implies peer certificate verification.
LIBPROCESS_SSL_VERIFY_CERT set to true
I0524 01:39:13.661677 26228 openssl.cpp:478] Using CA file: /tmp/FinRBr/cert.pem
WARNING: Logging before InitGoogleLogging() is written to STDERR
I0524 01:39:13.670554 27819 openssl.cpp:424] CA directory path unspecified! NOTE: Set CA directory path with LIBPROCESS_SSL_CA_DIR=<dirpath>
I0524 01:39:13.670640 27819 openssl.cpp:429] Will not verify peer certificate!
NOTE: Set LIBPROCESS_SSL_VERIFY_CERT=1 to enable peer certificate verification
I0524 01:39:13.670645 27819 openssl.cpp:441] Will use IP address verification in subject alternative name certificate extension.
I0524 01:39:13.670648 27819 openssl.cpp:449] LIBPROCESS_SSL_REQUIRE_CERT implies peer certificate verification.
LIBPROCESS_SSL_VERIFY_CERT set to true
I0524 01:39:13.670778 27819 openssl.cpp:478] Using CA file: /tmp/FinRBr/cert.pem
[       OK ] SSLVerifyIPAdd/SSLTest.RequireCertificate/1 (710 ms)
[----------] 6 tests from SSLVerifyIPAdd/SSLTest (2922 ms total)

[----------] Global test environment tear-down
[==========] 240 tests from 36 test cases ran. (38293 ms total)
[  PASSED  ] 239 tests.
[  FAILED  ] 1 test, listed below:
[  FAILED  ] Encryption/NetSocketTest.EOFBeforeRecv/0, where GetParam() = "SSL"

 1 FAILED TEST
  YOU HAVE 2 DISABLED TESTS

E0524 01:39:13.696024 27800 process.cpp:950] Failed to accept socket: future discarded
make[3]: *** [CMakeFiles/check] Error 1
make[3]: Leaving directory `/mesos/build'
make[2]: *** [CMakeFiles/check.dir/all] Error 2
make[2]: Leaving directory `/mesos/build'
make[1]: *** [CMakeFiles/check.dir/rule] Error 2
make[1]: Leaving directory `/mesos/build'
make: *** [check] Error 2
+ docker rmi mesos-1495586727-17544
Untagged: mesos-1495586727-17544:latest
Deleted: sha256:0405bdc147e5ab62ca1074be3e848bfeb6c6567d485b7b368399ac687564b5a3
Deleted: sha256:5590f246dc4515799e06aa19900809ba758219256390b0142ac465b70bcbf732
Deleted: sha256:362cc79fd4c5f93dd51df708906ec4a5d3de0dacd130a059ebe035504b7693d5
Deleted: sha256:2d2e5e90394b6c13b107073ef8debcbd23888b2418e1c2bab31a7086abbeba67
Deleted: sha256:850d052eb97d68a759fe5a0ce3029606f787594c023cea585b13858a13c6cf4d
Deleted: sha256:f86bdf91a40b5f29c5900a41b189036bb15aac4c90795957fd8e46f04735d00e
Deleted: sha256:f3db1f8fa57595a15e9fafc8735d0de7e36b4c6d27ddb1da687668f221e14d5a
Deleted: sha256:8bf9d00f4d5e368f1822f0cd3368eea7036682e61685a1782bb8356b8ac60bae
Deleted: sha256:099689d40da23186377414842b4cf86a4b59b2b5925bd7421ad5cd2b6d80f024
Deleted: sha256:6597acfd3135085bf658122cec7bb2a03189169a2de9dfe36fd2765c04620c3a
Deleted: sha256:53b0780e4bee537c27d4fde8215c6c1aa844b7bd4e6d3dda47d737719f6659f6
Deleted: sha256:e518a9ebbd71d91a23852a23c05c7b3927fdcc4724169d4723bdb0139c94d846
Deleted: sha256:a1c9b3f863c61a6061c8a411b6357930b6f0b7b882ae41fa591cf20541734742
Deleted: sha256:e46c02b61eb95c0c4969087af7888aaecc2e78e56deb1d00d26c439d60184f10
Deleted: sha256:ef3f9e86381de58dc0f91a5ab308fe4d2cb49325b6839f6ce90faa9c3c393f4c
Deleted: sha256:8ef321af5a263a892b01ffbbd09fc69cfc150136acc1a9ceb80f6be3a0c79b93
Deleted: sha256:f29c24a625d671dbc1cab9864e3be5263565930c7c5392f7dab607f086882d8e
Deleted: sha256:d38a9e2f67629ffc78a5346c799b0dcc387d27a6c48009b01928c56768881280
Deleted: sha256:e460d503210fa15101dbda06e0eb44fa96571ea290c950448825683aa9a26e0e
Deleted: sha256:52dbdd393db059e87cbe500772a9220916036191e4d3592117b8920277d81a10
Deleted: sha256:06f81ad2872284968e12208e01b1a56f527720a0d62c73e00ddd896037c76d5a
Deleted: sha256:b5ca11814d90f6aa82d12d422a24895303d8fb59f2cd3264b326e5d367181fdf
Deleted: sha256:94e5ee424f2707302d1c746f71cc5e758b2fe4868a47a2fc90dc7dd146399f9c
Deleted: sha256:8291c5f3f4a0db6ee0a6051270252cda74935725fc062acc5dfa4109837f3bd6
Build step 'Execute shell' marked build as failure
Not sending mail to unregistered user xujyan@apple.com
Not sending mail to unregistered user neil.conway@gmail.com